Command: /usr/local/sbin/syslog-digest.py
Time : 0.0524s
Status : exited 0
Output :
Syslog digest — 2026-09-18 00:05 EDT
Processed 3,099 lines, filtered 2,635 (85%). 464 unknown (169 distinct) from 24 host(s).
== b0b02.cs.umd.edu (1 distinct, 1 total) ==
Sep 17 23:48:42 b0b02.cs.umd.edu rustdesk[2323599]: cannot open display:
== cmsc436-0101-redis (2 distinct, 2 total) ==
Sep 17 23:06:40 cmsc436-0101-redis krb5_child[3199091]: Client 'admin(a)UMD.EDU' not found in Kerberos database
Sep 17 23:06:42 cmsc436-0101-redis sshd-session[3199087]: error: PAM: Authentication failure for admin from 34.140.48.172
== csfw00a (1 distinct, 134 total) ==
Sep 17 23:04:04 csfw00a kernel: bnxt_en 0000:09:00.0 eth3: NIC Link is Down [x134]
== idm00 (1 distinct, 1 total) ==
Sep 17 23:53:57 idm00 named[4166701]: client @0x7f11a4042778 10.73.240.42#65162: update '73.10.in-addr.arpa/IN' denied
== idmp0 (1 distinct, 1 total) ==
Sep 17 23:37:57 idmp0 named[1598691]: client @0x7f2d38010098 10.73.240.43#55912: update '73.10.in-addr.arpa/IN' denied
== inbound00.cs.umd.edu (1 distinct, 1 total) ==
Sep 17 23:52:17 inbound00.cs.umd.edu krb5_child[1302633]: Client 'admin(a)UMD.EDU' not found in Kerberos database
== inbound01.cs.umd.edu (2 distinct, 2 total) ==
Sep 17 23:07:00 inbound01.cs.umd.edu krb5_child[3513150]: Client 'admin(a)UMD.EDU' not found in Kerberos database
Sep 17 23:07:53 inbound01.cs.umd.edu sshd-session[3513265]: error: Protocol major versions differ: 2 vs. 1
== itmon02 (1 distinct, 7 total) ==
Sep 17 23:13:24 itmon02 sshd[1750555]: error: beginning MaxStartups throttling [x7]
== matrix (1 distinct, 1 total) ==
Sep 18 00:00:25 matrix (nin-node)[1090815]: munin-node.service: Referenced but unset environment variable evaluates to an empty string: DAEMON_ARGS
== mcstic (3 distinct, 6 total) ==
Sep 17 23:15:35 mcstic krb5_child[739926]: Client 'admin(a)UMD.EDU' not found in Kerberos database [x4]
Sep 17 23:15:41 mcstic sshd[739921]: error: PAM: Authentication failure for admin from 34.140.225.163
Sep 17 23:15:50 mcstic sshd[739935]: error: Protocol major versions differ: 2 vs. 1
== munin (2 distinct, 50 total) ==
Sep 17 23:08:10 munin sudo[3649535]: pam_systemd(sudo:session): Failed to stat() runtime directory '/run/user/0': No such file or directory [x25]
Sep 17 23:08:10 munin sudo[3649535]: pam_systemd(sudo:session): Not setting $XDG_RUNTIME_DIR, as the directory is not in order. [x25]
== neo-gizmonic (1 distinct, 1 total) ==
Sep 18 00:00:01 neo-gizmonic (nin-node)[1549130]: munin-node.service: Referenced but unset environment variable evaluates to an empty string: DAEMON_ARGS
== neoavion (1 distinct, 1 total) ==
Sep 18 00:00:04 neoavion (nin-node)[3302685]: munin-node.service: Referenced but unset environment variable evaluates to an empty string: DAEMON_ARGS
== newhonors2 (2 distinct, 25 total) ==
Sep 17 23:13:03 newhonors2 dhcpcd[2788647]: dhcpcd is not running [x24]
Sep 18 00:00:16 newhonors2 (nin-node)[2790189]: munin-node.service: Referenced but unset environment variable evaluates to an empty string: DAEMON_ARGS
== ntop00 (99 distinct, 139 total) ==
Sep 17 23:05:09 ntop00 sfacctd[323304]: INFO ( m1/mysql ): *** Purging cache - END (PID: 58, QN: 5059/5059, ET: 8) ***
Sep 17 23:05:09 ntop00 nfacctd[323381]: INFO ( m1/mysql ): *** Purging cache - END (PID: 58, QN: 55/55, ET: 8) ***
Sep 17 23:06:01 ntop00 sfacctd[323304]: INFO ( p1/print ): *** Purging cache - START (PID: 59) ***
Sep 17 23:06:01 ntop00 sfacctd[323304]: INFO ( p1/print ): *** Purging cache - END (PID: 59, QN: 5216/5216, ET: 0) ***
Sep 17 23:06:01 ntop00 nfacctd[323381]: INFO ( p1/print ): *** Purging cache - START (PID: 59) ***
Sep 17 23:06:01 ntop00 nfacctd[323381]: INFO ( p1/print ): *** Purging cache - END (PID: 59, QN: 56/56, ET: 0) ***
Sep 17 23:06:02 ntop00 setroubleshoot[341544]: SELinux is preventing /usr/local/sbin/sfacctd from append access on the file sflow.json. For complete SELinux messages run: sealert -l 58e35a5d-c7c9-4337-868c-bb9d5ac2e29f [x11]
Sep 17 23:06:02 ntop00 setroubleshoot[341544]: SELinux is preventing /usr/local/sbin/sfacctd from write access on the file sflow.json. For complete SELinux messages run: sealert -l 369b1df3-2c9d-461b-8b1c-2fcd48dc737c [x11]
Sep 17 23:06:02 ntop00 setroubleshoot[341544]: failed to retrieve rpm info for path '/srv/pmacct/sflow.json': [x11]
Sep 17 23:06:02 ntop00 setroubleshoot[341544]: SELinux is preventing /usr/local/sbin/sfacctd from lock access on the file /srv/pmacct/sflow.json. For complete SELinux messages run: sealert -l 481e7e24-3846-4790-b17b-9e44a5f5b5d6 [x11]
Sep 17 23:10:01 ntop00 sfacctd[323304]: INFO ( m1/mysql ): *** Purging cache - START (PID: 60) ***
Sep 17 23:10:01 ntop00 nfacctd[323381]: INFO ( m1/mysql ): *** Purging cache - START (PID: 60) ***
Sep 17 23:10:09 ntop00 sfacctd[323304]: INFO ( m1/mysql ): *** Purging cache - END (PID: 60, QN: 5266/5266, ET: 8) ***
Sep 17 23:10:09 ntop00 nfacctd[323381]: INFO ( m1/mysql ): *** Purging cache - END (PID: 60, QN: 65/65, ET: 8) ***
Sep 17 23:11:01 ntop00 sfacctd[323304]: INFO ( p1/print ): *** Purging cache - START (PID: 61) ***
Sep 17 23:11:01 ntop00 sfacctd[323304]: INFO ( p1/print ): *** Purging cache - END (PID: 61, QN: 5213/5213, ET: 0) ***
Sep 17 23:11:01 ntop00 nfacctd[323381]: INFO ( p1/print ): *** Purging cache - START (PID: 61) ***
Sep 17 23:11:01 ntop00 nfacctd[323381]: INFO ( p1/print ): *** Purging cache - END (PID: 61, QN: 67/67, ET: 0) ***
Sep 17 23:15:01 ntop00 sfacctd[323304]: INFO ( m1/mysql ): *** Purging cache - START (PID: 62) ***
Sep 17 23:15:01 ntop00 nfacctd[323381]: INFO ( m1/mysql ): *** Purging cache - START (PID: 62) ***
Sep 17 23:15:08 ntop00 sfacctd[323304]: INFO ( m1/mysql ): *** Purging cache - END (PID: 62, QN: 5097/5097, ET: 7) ***
Sep 17 23:15:09 ntop00 nfacctd[323381]: INFO ( m1/mysql ): *** Purging cache - END (PID: 62, QN: 45/45, ET: 8) ***
Sep 17 23:16:01 ntop00 sfacctd[323304]: INFO ( p1/print ): *** Purging cache - START (PID: 63) ***
Sep 17 23:16:01 ntop00 sfacctd[323304]: INFO ( p1/print ): *** Purging cache - END (PID: 63, QN: 4992/4992, ET: 0) ***
Sep 17 23:16:01 ntop00 nfacctd[323381]: INFO ( p1/print ): *** Purging cache - START (PID: 63) ***
Sep 17 23:16:01 ntop00 nfacctd[323381]: INFO ( p1/print ): *** Purging cache - END (PID: 63, QN: 47/47, ET: 0) ***
Sep 17 23:20:01 ntop00 sfacctd[323304]: INFO ( m1/mysql ): *** Purging cache - START (PID: 64) ***
Sep 17 23:20:01 ntop00 nfacctd[323381]: INFO ( m1/mysql ): *** Purging cache - START (PID: 64) ***
Sep 17 23:20:08 ntop00 sfacctd[323304]: INFO ( m1/mysql ): *** Purging cache - END (PID: 64, QN: 4927/4927, ET: 7) ***
Sep 17 23:20:08 ntop00 nfacctd[323381]: INFO ( m1/mysql ): *** Purging cache - END (PID: 64, QN: 69/69, ET: 7) ***
... 69 more distinct messages not shown
== outbound00.cs.umd.edu (3 distinct, 8 total) ==
Sep 17 23:09:09 outbound00.cs.umd.edu python3[1167557]: ldapdb [x6]
Sep 17 23:41:48 outbound00.cs.umd.edu krb5_child[1175199]: Client 'admin(a)UMD.EDU' not found in Kerberos database
Sep 17 23:42:42 outbound00.cs.umd.edu sshd-session[1175320]: error: Protocol major versions differ: 2 vs. 1
== outbound01.cs.umd.edu (1 distinct, 6 total) ==
Sep 17 23:13:06 outbound01.cs.umd.edu python3[3427056]: ldapdb [x6]
== sentry-docker00.cs.umd.edu (34 distinct, 34 total) ==
Sep 17 23:12:03 sentry-docker00.cs.umd.edu systemd-udevd[2579895]: link_config: could not get ethtool features for vethf2e81aa
Sep 17 23:12:03 sentry-docker00.cs.umd.edu systemd-udevd[2579895]: Could not set offload features of vethf2e81aa: No such device
Sep 17 23:12:03 sentry-docker00.cs.umd.edu systemd-udevd[2579930]: Could not generate persistent MAC address for veth6f57db6: No such file or directory
Sep 17 23:12:03 sentry-docker00.cs.umd.edu systemd-udevd[2579929]: Could not generate persistent MAC address for vethc6cc4d3: No such file or directory
Sep 17 23:12:03 sentry-docker00.cs.umd.edu systemd-udevd[2579933]: Could not generate persistent MAC address for vethdc13304: No such file or directory
Sep 17 23:12:03 sentry-docker00.cs.umd.edu systemd-udevd[2579934]: Could not generate persistent MAC address for veth7fa8ebe: No such file or directory
Sep 17 23:12:03 sentry-docker00.cs.umd.edu systemd-udevd[2579957]: Could not generate persistent MAC address for veth4a5fe64: No such file or directory
Sep 17 23:12:03 sentry-docker00.cs.umd.edu systemd-udevd[2579958]: Could not generate persistent MAC address for veth8b4a756: No such file or directory
Sep 17 23:12:03 sentry-docker00.cs.umd.edu systemd-udevd[2579976]: Could not generate persistent MAC address for veth0519ffa: No such file or directory
Sep 17 23:12:03 sentry-docker00.cs.umd.edu systemd-udevd[2579962]: Could not generate persistent MAC address for vethb28fe79: No such file or directory
Sep 17 23:12:03 sentry-docker00.cs.umd.edu systemd-udevd[2579985]: Could not generate persistent MAC address for veth0af457d: No such file or directory
Sep 17 23:12:03 sentry-docker00.cs.umd.edu systemd-udevd[2579986]: Could not generate persistent MAC address for veth284e1cf: No such file or directory
Sep 17 23:32:11 sentry-docker00.cs.umd.edu systemd-udevd[2589431]: Could not generate persistent MAC address for veth3d4bb2b: No such file or directory
Sep 17 23:32:11 sentry-docker00.cs.umd.edu systemd-udevd[2589432]: Could not generate persistent MAC address for vethac14ecb: No such file or directory
Sep 17 23:32:11 sentry-docker00.cs.umd.edu systemd-udevd[2589436]: Could not generate persistent MAC address for veth41d3782: No such file or directory
Sep 17 23:32:11 sentry-docker00.cs.umd.edu systemd-udevd[2589435]: Could not generate persistent MAC address for veth68fd72e: No such file or directory
Sep 17 23:32:11 sentry-docker00.cs.umd.edu systemd-udevd[2589459]: Could not generate persistent MAC address for veth4af4d29: No such file or directory
Sep 17 23:32:11 sentry-docker00.cs.umd.edu systemd-udevd[2589460]: Could not generate persistent MAC address for veth96ba4f9: No such file or directory
Sep 17 23:32:11 sentry-docker00.cs.umd.edu systemd-udevd[2589460]: Could not generate persistent MAC address for veth8c7a9e3: No such file or directory
Sep 17 23:32:11 sentry-docker00.cs.umd.edu systemd-udevd[2589482]: Could not generate persistent MAC address for veth65f64e6: No such file or directory
Sep 17 23:32:12 sentry-docker00.cs.umd.edu systemd-udevd[2589481]: Could not generate persistent MAC address for veth89712af: No such file or directory
Sep 17 23:32:12 sentry-docker00.cs.umd.edu systemd-udevd[2589476]: Could not generate persistent MAC address for veth24daed1: No such file or directory
Sep 17 23:52:20 sentry-docker00.cs.umd.edu systemd-udevd[2598750]: link_config: could not get ethtool features for veth65f64e6
Sep 17 23:52:20 sentry-docker00.cs.umd.edu systemd-udevd[2598750]: Could not set offload features of veth65f64e6: No such device
Sep 17 23:52:20 sentry-docker00.cs.umd.edu systemd-udevd[2598787]: Could not generate persistent MAC address for veth29e0b47: No such file or directory
Sep 17 23:52:20 sentry-docker00.cs.umd.edu systemd-udevd[2598788]: Could not generate persistent MAC address for veth3b40815: No such file or directory
Sep 17 23:52:20 sentry-docker00.cs.umd.edu systemd-udevd[2598791]: Could not generate persistent MAC address for veth8fb66b4: No such file or directory
Sep 17 23:52:20 sentry-docker00.cs.umd.edu systemd-udevd[2598792]: Could not generate persistent MAC address for veth0637486: No such file or directory
Sep 17 23:52:20 sentry-docker00.cs.umd.edu systemd-udevd[2598815]: Could not generate persistent MAC address for veth8b15976: No such file or directory
Sep 17 23:52:20 sentry-docker00.cs.umd.edu systemd-udevd[2598816]: Could not generate persistent MAC address for veth3b3725f: No such file or directory
... 4 more distinct messages not shown
== strawberry (7 distinct, 38 total) ==
Sep 17 23:07:03 strawberry kernel: I/O error, dev sda, sector 206848 op 0x0:(READ) flags 0x80700 phys_seg 1 prio class 2 [x6]
Sep 17 23:07:03 strawberry kernel: I/O error, dev sda, sector 206848 op 0x0:(READ) flags 0x0 phys_seg 1 prio class 2 [x6]
Sep 17 23:07:03 strawberry kernel: Buffer I/O error on dev sda2, logical block 0, async page read [x6]
Sep 17 23:07:03 strawberry kernel: I/O error, dev sda, sector 2048 op 0x0:(READ) flags 0x80700 phys_seg 1 prio class 2 [x6]
Sep 17 23:07:03 strawberry kernel: I/O error, dev sda, sector 2048 op 0x0:(READ) flags 0x0 phys_seg 1 prio class 2 [x6]
Sep 17 23:07:03 strawberry kernel: Buffer I/O error on dev sda1, logical block 0, async page read [x6]
Sep 17 23:34:42 strawberry smartd[5314]: Device: /dev/sda [SAT], failed to read SMART Attribute Data [x2]
== submit26-b9-f1 (1 distinct, 2 total) ==
Sep 17 23:08:06 submit26-b9-f1 systemd[1]: user(a)1001.service: Main process exited, code=killed, status=9/KILL [x2]
== submit26-b9-f3 (1 distinct, 1 total) ==
Sep 17 23:28:39 submit26-b9-f3 systemd[1]: user(a)1001.service: Main process exited, code=killed, status=9/KILL
== submit26-b9-f4 (1 distinct, 1 total) ==
Sep 17 23:33:43 submit26-b9-f4 systemd[1]: user(a)1001.service: Main process exited, code=killed, status=9/KILL
== teaching-awards (1 distinct, 1 total) ==
Sep 17 23:45:52 teaching-awards krb5_child[986270]: Client 'admin(a)UMD.EDU' not found in Kerberos database
== wraith (1 distinct, 1 total) ==
Sep 18 00:00:00 wraith (nin-node)[634310]: munin-node.service: Referenced but unset environment variable evaluates to an empty string: DAEMON_ARGS
1
0
Command: /usr/local/sbin/syslog-digest.py
Time : 0.0503s
Status : exited 0
Output :
Syslog digest — 2026-09-17 23:05 EDT
Processed 2,603 lines, filtered 2,156 (82%). 447 unknown (185 distinct) from 20 host(s).
== abadi-computer (2 distinct, 2 total) ==
Sep 17 22:18:33 abadi-computer systemd-tmpfiles[1019068]: Opening file "/tmp/code-61e9f49c-a2ac-4356-823a-010a7b8bc67a" failed, ignoring: No such device or address
Sep 17 22:18:33 abadi-computer systemd-tmpfiles[1019068]: Opening file "/tmp/code-283361a3-25bb-405e-a353-1fa70f26fd43" failed, ignoring: No such device or address
== b0b02.cs.umd.edu (1 distinct, 1 total) ==
Sep 17 22:48:40 b0b02.cs.umd.edu rustdesk[2308400]: cannot open display:
== csfw00a (1 distinct, 119 total) ==
Sep 17 22:04:01 csfw00a kernel: bnxt_en 0000:09:00.0 eth3: NIC Link is Down [x119]
== idm00 (1 distinct, 1 total) ==
Sep 17 22:53:57 idm00 named[4166701]: client @0x7f11a4069dd8 10.73.240.42#62077: update '73.10.in-addr.arpa/IN' denied
== idmp0 (1 distinct, 1 total) ==
Sep 17 22:37:57 idmp0 named[1598691]: client @0x7f2d1c01f278 10.73.240.43#53106: update '73.10.in-addr.arpa/IN' denied
== itmon02 (1 distinct, 6 total) ==
Sep 17 22:08:42 itmon02 sshd[1750555]: error: beginning MaxStartups throttling [x6]
== matrix (2 distinct, 3 total) ==
Sep 17 22:22:38 matrix krb5_child[1034615]: Client 'admin(a)UMD.EDU' not found in Kerberos database [x2]
Sep 17 22:22:40 matrix sshd[1034609]: error: PAM: Authentication failure for admin from 34.140.225.163
== munin (2 distinct, 28 total) ==
Sep 17 22:48:16 munin sudo[3641960]: pam_systemd(sudo:session): Failed to stat() runtime directory '/run/user/0': No such file or directory [x14]
Sep 17 22:48:16 munin sudo[3641960]: pam_systemd(sudo:session): Not setting $XDG_RUNTIME_DIR, as the directory is not in order. [x14]
== newhonors.cs.umd.edu (1 distinct, 1 total) ==
Sep 17 22:57:21 newhonors.cs.umd.edu systemd-tmpfiles: [/usr/lib/tmpfiles.d/var.conf:14] Duplicate line for path "/var/log", ignoring.
== newhonors2 (1 distinct, 24 total) ==
Sep 17 22:13:03 newhonors2 dhcpcd[2786783]: dhcpcd is not running [x24]
== ntop00 (101 distinct, 145 total) ==
Sep 17 22:05:01 ntop00 nfacctd[323381]: INFO ( m1/mysql ): *** Purging cache - START (PID: 34) ***
Sep 17 22:05:09 ntop00 sfacctd[323304]: INFO ( m1/mysql ): *** Purging cache - END (PID: 34, QN: 5158/5158, ET: 8) ***
Sep 17 22:05:09 ntop00 nfacctd[323381]: INFO ( m1/mysql ): *** Purging cache - END (PID: 34, QN: 76/76, ET: 8) ***
Sep 17 22:06:01 ntop00 sfacctd[323304]: INFO ( p1/print ): *** Purging cache - START (PID: 35) ***
Sep 17 22:06:01 ntop00 sfacctd[323304]: INFO ( p1/print ): *** Purging cache - END (PID: 35, QN: 5274/5274, ET: 0) ***
Sep 17 22:06:01 ntop00 nfacctd[323381]: INFO ( p1/print ): *** Purging cache - START (PID: 35) ***
Sep 17 22:06:01 ntop00 nfacctd[323381]: INFO ( p1/print ): *** Purging cache - END (PID: 35, QN: 80/80, ET: 0) ***
Sep 17 22:06:02 ntop00 setroubleshoot[333805]: SELinux is preventing /usr/local/sbin/sfacctd from append access on the file sflow.json. For complete SELinux messages run: sealert -l 58e35a5d-c7c9-4337-868c-bb9d5ac2e29f [x12]
Sep 17 22:06:02 ntop00 setroubleshoot[333805]: SELinux is preventing /usr/local/sbin/sfacctd from write access on the file sflow.json. For complete SELinux messages run: sealert -l 369b1df3-2c9d-461b-8b1c-2fcd48dc737c [x12]
Sep 17 22:06:02 ntop00 setroubleshoot[333805]: failed to retrieve rpm info for path '/srv/pmacct/sflow.json': [x12]
Sep 17 22:06:02 ntop00 setroubleshoot[333805]: SELinux is preventing /usr/local/sbin/sfacctd from lock access on the file /srv/pmacct/sflow.json. For complete SELinux messages run: sealert -l 481e7e24-3846-4790-b17b-9e44a5f5b5d6 [x12]
Sep 17 22:10:01 ntop00 sfacctd[323304]: INFO ( m1/mysql ): *** Purging cache - START (PID: 36) ***
Sep 17 22:10:01 ntop00 nfacctd[323381]: INFO ( m1/mysql ): *** Purging cache - START (PID: 36) ***
Sep 17 22:10:09 ntop00 sfacctd[323304]: INFO ( m1/mysql ): *** Purging cache - END (PID: 36, QN: 5339/5339, ET: 8) ***
Sep 17 22:10:09 ntop00 nfacctd[323381]: INFO ( m1/mysql ): *** Purging cache - END (PID: 36, QN: 66/66, ET: 8) ***
Sep 17 22:11:01 ntop00 sfacctd[323304]: INFO ( p1/print ): *** Purging cache - START (PID: 37) ***
Sep 17 22:11:01 ntop00 sfacctd[323304]: INFO ( p1/print ): *** Purging cache - END (PID: 37, QN: 5216/5216, ET: 0) ***
Sep 17 22:11:01 ntop00 nfacctd[323381]: INFO ( p1/print ): *** Purging cache - START (PID: 37) ***
Sep 17 22:11:01 ntop00 nfacctd[323381]: INFO ( p1/print ): *** Purging cache - END (PID: 37, QN: 62/62, ET: 0) ***
Sep 17 22:15:01 ntop00 sfacctd[323304]: INFO ( m1/mysql ): *** Purging cache - START (PID: 38) ***
Sep 17 22:15:01 ntop00 nfacctd[323381]: INFO ( m1/mysql ): *** Purging cache - START (PID: 38) ***
Sep 17 22:15:09 ntop00 sfacctd[323304]: INFO ( m1/mysql ): *** Purging cache - END (PID: 38, QN: 5262/5262, ET: 8) ***
Sep 17 22:15:09 ntop00 nfacctd[323381]: INFO ( m1/mysql ): *** Purging cache - END (PID: 38, QN: 67/67, ET: 8) ***
Sep 17 22:16:01 ntop00 sfacctd[323304]: INFO ( p1/print ): *** Purging cache - START (PID: 39) ***
Sep 17 22:16:01 ntop00 sfacctd[323304]: INFO ( p1/print ): *** Purging cache - END (PID: 39, QN: 5290/5290, ET: 0) ***
Sep 17 22:16:01 ntop00 nfacctd[323381]: INFO ( p1/print ): *** Purging cache - START (PID: 39) ***
Sep 17 22:16:01 ntop00 nfacctd[323381]: INFO ( p1/print ): *** Purging cache - END (PID: 39, QN: 59/59, ET: 0) ***
Sep 17 22:20:01 ntop00 sfacctd[323304]: INFO ( m1/mysql ): *** Purging cache - START (PID: 40) ***
Sep 17 22:20:01 ntop00 nfacctd[323381]: INFO ( m1/mysql ): *** Purging cache - START (PID: 40) ***
Sep 17 22:20:09 ntop00 sfacctd[323304]: INFO ( m1/mysql ): *** Purging cache - END (PID: 40, QN: 5449/5449, ET: 8) ***
... 71 more distinct messages not shown
== outbound00.cs.umd.edu (1 distinct, 6 total) ==
Sep 17 22:09:09 outbound00.cs.umd.edu python3[1153484]: ldapdb [x6]
== outbound01.cs.umd.edu (1 distinct, 6 total) ==
Sep 17 22:13:06 outbound01.cs.umd.edu python3[3413156]: ldapdb [x6]
== sentry-docker00.cs.umd.edu (36 distinct, 36 total) ==
Sep 17 22:11:38 sentry-docker00.cs.umd.edu systemd-udevd[2551576]: link_config: could not get ethtool features for veth000f232
Sep 17 22:11:38 sentry-docker00.cs.umd.edu systemd-udevd[2551576]: Could not set offload features of veth000f232: No such device
Sep 17 22:11:38 sentry-docker00.cs.umd.edu systemd-udevd[2551605]: Could not generate persistent MAC address for vethb4f824d: No such file or directory
Sep 17 22:11:38 sentry-docker00.cs.umd.edu systemd-udevd[2551606]: Could not generate persistent MAC address for vethc39ee7a: No such file or directory
Sep 17 22:11:38 sentry-docker00.cs.umd.edu systemd-udevd[2551624]: Could not generate persistent MAC address for veth750dd60: No such file or directory
Sep 17 22:11:38 sentry-docker00.cs.umd.edu systemd-udevd[2551610]: Could not generate persistent MAC address for vethc59a6c9: No such file or directory
Sep 17 22:11:38 sentry-docker00.cs.umd.edu systemd-udevd[2551633]: Could not generate persistent MAC address for veth055829d: No such file or directory
Sep 17 22:11:38 sentry-docker00.cs.umd.edu systemd-udevd[2551634]: Could not generate persistent MAC address for veth24b4e90: No such file or directory
Sep 17 22:11:38 sentry-docker00.cs.umd.edu systemd-udevd[2551652]: Could not generate persistent MAC address for veth16d66b2: No such file or directory
Sep 17 22:11:38 sentry-docker00.cs.umd.edu systemd-udevd[2551646]: Could not generate persistent MAC address for veth5a7a7d6: No such file or directory
Sep 17 22:11:38 sentry-docker00.cs.umd.edu systemd-udevd[2551661]: Could not generate persistent MAC address for vethfc3de2f: No such file or directory
Sep 17 22:11:38 sentry-docker00.cs.umd.edu systemd-udevd[2551662]: Could not generate persistent MAC address for veth264599f: No such file or directory
Sep 17 22:31:46 sentry-docker00.cs.umd.edu systemd-udevd[2561044]: link_config: could not get ethtool features for veth16d66b2
Sep 17 22:31:46 sentry-docker00.cs.umd.edu systemd-udevd[2561044]: Could not set offload features of veth16d66b2: No such device
Sep 17 22:31:47 sentry-docker00.cs.umd.edu systemd-udevd[2561069]: Could not generate persistent MAC address for veth6f1682a: No such file or directory
Sep 17 22:31:47 sentry-docker00.cs.umd.edu systemd-udevd[2561068]: Could not generate persistent MAC address for veth017f796: No such file or directory
Sep 17 22:31:47 sentry-docker00.cs.umd.edu systemd-udevd[2561072]: Could not generate persistent MAC address for vethf46a5a3: No such file or directory
Sep 17 22:31:47 sentry-docker00.cs.umd.edu systemd-udevd[2561084]: Could not generate persistent MAC address for veth681e127: No such file or directory
Sep 17 22:31:47 sentry-docker00.cs.umd.edu systemd-udevd[2561079]: Could not generate persistent MAC address for vethb63f6a3: No such file or directory
Sep 17 22:31:47 sentry-docker00.cs.umd.edu systemd-udevd[2561069]: Could not generate persistent MAC address for veth5e6397b: No such file or directory
Sep 17 22:31:47 sentry-docker00.cs.umd.edu systemd-udevd[2561098]: Could not generate persistent MAC address for veth7dc8d3c: No such file or directory
Sep 17 22:31:47 sentry-docker00.cs.umd.edu systemd-udevd[2561099]: Could not generate persistent MAC address for veth5e87b45: No such file or directory
Sep 17 22:31:47 sentry-docker00.cs.umd.edu systemd-udevd[2561149]: Could not generate persistent MAC address for veth3dfdd80: No such file or directory
Sep 17 22:31:47 sentry-docker00.cs.umd.edu systemd-udevd[2561150]: Could not generate persistent MAC address for veth724aafa: No such file or directory
Sep 17 22:51:55 sentry-docker00.cs.umd.edu systemd-udevd[2570401]: link_config: could not set ethtool features for veth3dfdd80
Sep 17 22:51:55 sentry-docker00.cs.umd.edu systemd-udevd[2570401]: Could not set offload features of veth3dfdd80: Operation not permitted
Sep 17 22:51:55 sentry-docker00.cs.umd.edu systemd-udevd[2570475]: Could not generate persistent MAC address for vethd19f062: No such file or directory
Sep 17 22:51:55 sentry-docker00.cs.umd.edu systemd-udevd[2570476]: Could not generate persistent MAC address for veth093863e: No such file or directory
Sep 17 22:51:55 sentry-docker00.cs.umd.edu systemd-udevd[2570494]: Could not generate persistent MAC address for veth2178070: No such file or directory
Sep 17 22:51:55 sentry-docker00.cs.umd.edu systemd-udevd[2570493]: Could not generate persistent MAC address for vethec6b1ee: No such file or directory
... 6 more distinct messages not shown
== strawberry (7 distinct, 38 total) ==
Sep 17 22:07:03 strawberry kernel: I/O error, dev sda, sector 206848 op 0x0:(READ) flags 0x80700 phys_seg 1 prio class 2 [x6]
Sep 17 22:07:03 strawberry kernel: I/O error, dev sda, sector 206848 op 0x0:(READ) flags 0x0 phys_seg 1 prio class 2 [x6]
Sep 17 22:07:03 strawberry kernel: Buffer I/O error on dev sda2, logical block 0, async page read [x6]
Sep 17 22:07:03 strawberry kernel: I/O error, dev sda, sector 2048 op 0x0:(READ) flags 0x80700 phys_seg 1 prio class 2 [x6]
Sep 17 22:07:03 strawberry kernel: I/O error, dev sda, sector 2048 op 0x0:(READ) flags 0x0 phys_seg 1 prio class 2 [x6]
Sep 17 22:07:03 strawberry kernel: Buffer I/O error on dev sda1, logical block 0, async page read [x6]
Sep 17 22:34:42 strawberry smartd[5314]: Device: /dev/sda [SAT], failed to read SMART Attribute Data [x2]
== submit26-b9-f1 (10 distinct, 11 total) ==
Sep 17 22:25:05 submit26-b9-f1 systemd[1]: user(a)1001.service: Main process exited, code=killed, status=9/KILL [x2]
Sep 17 22:25:53 submit26-b9-f1 setroubleshoot[2245450]: SELinux is preventing /usr/bin/python3.9 from create access on the directory /(null). For complete SELinux messages run: sealert -l 3ef7d677-731f-46bf-9c34-c2c55fea665c
Sep 17 22:25:53 submit26-b9-f1 setroubleshoot[2245450]: SELinux is preventing /usr/bin/python3.9 from add_name access on the directory /(null). For complete SELinux messages run: sealert -l aa60e26f-72e1-45f1-bc12-aa8b3b669e36
Sep 17 22:25:53 submit26-b9-f1 setroubleshoot[2245450]: SELinux is preventing /usr/bin/python3.9 from create access on the file /(null). For complete SELinux messages run: sealert -l d088fb43-23ee-4ae8-ae6a-5d1c041ee2d6
Sep 17 22:25:53 submit26-b9-f1 setroubleshoot[2245450]: SELinux is preventing /usr/bin/python3.9 from open access on the file /tmp/libdnf.Kdyimu/repodata/repomd.xml. For complete SELinux messages run: sealert -l 3b0d8c9a-6637-4d6e-a864-f1dd7c00377d
Sep 17 22:25:53 submit26-b9-f1 setroubleshoot[2245450]: SELinux is preventing /usr/bin/python3.9 from setattr access on the file repomd.xml. For complete SELinux messages run: sealert -l 0fd3339f-3ef2-45f3-9e58-65a58b42f3ee
Sep 17 22:25:53 submit26-b9-f1 setroubleshoot[2245450]: SELinux is preventing /usr/bin/python3.9 from read access on the directory libdnf.Kdyimu. For complete SELinux messages run: sealert -l 0d661d88-dc9e-469d-986b-52e29b353aa8
Sep 17 22:25:53 submit26-b9-f1 setroubleshoot[2245450]: SELinux is preventing /usr/bin/python3.9 from remove_name access on the directory repomd.xml. For complete SELinux messages run: sealert -l 405a8556-cf9f-4ef4-8525-0dca18d4259d
Sep 17 22:25:53 submit26-b9-f1 setroubleshoot[2245450]: SELinux is preventing /usr/bin/python3.9 from unlink access on the file repomd.xml. For complete SELinux messages run: sealert -l 3c38e23e-3631-4cb5-81c7-992675c836d9
Sep 17 22:25:53 submit26-b9-f1 setroubleshoot[2245450]: SELinux is preventing /usr/bin/python3.9 from rmdir access on the directory repodata. For complete SELinux messages run: sealert -l a070e9b5-2867-47d6-b2e3-3b7d99725848
== submit26-b9-f2 (10 distinct, 13 total) ==
Sep 17 22:06:48 submit26-b9-f2 setroubleshoot[1379451]: SELinux is preventing /usr/bin/python3.9 from create access on the directory /(null). For complete SELinux messages run: sealert -l 0659d546-3107-4f75-b00f-008c85f41dc6
Sep 17 22:06:48 submit26-b9-f2 setroubleshoot[1379451]: SELinux is preventing /usr/bin/python3.9 from add_name access on the directory /(null). For complete SELinux messages run: sealert -l 156d9270-3466-4356-b86f-1a128825961a
Sep 17 22:06:48 submit26-b9-f2 setroubleshoot[1379451]: SELinux is preventing /usr/bin/python3.9 from create access on the file /(null). For complete SELinux messages run: sealert -l c8a40bf5-2fc4-46b3-b813-8592b3523339 [x2]
Sep 17 22:06:48 submit26-b9-f2 setroubleshoot[1379451]: SELinux is preventing /usr/bin/python3.9 from open access on the file /tmp/libdnf.Qzfdwj/repodata/repomd.xml. For complete SELinux messages run: sealert -l 7f4c3a8e-0f99-47c4-9baf-e1336fe24876
Sep 17 22:06:48 submit26-b9-f2 setroubleshoot[1379451]: SELinux is preventing /usr/bin/python3.9 from setattr access on the file repomd.xml. For complete SELinux messages run: sealert -l 988123da-b724-4e6a-900c-33a2723fdaf1 [x2]
Sep 17 22:06:48 submit26-b9-f2 setroubleshoot[1379451]: SELinux is preventing /usr/bin/python3.9 from read access on the directory libdnf.Qzfdwj. For complete SELinux messages run: sealert -l ca585e2b-d50f-4264-8127-6b3fa04070c8
Sep 17 22:06:48 submit26-b9-f2 setroubleshoot[1379451]: SELinux is preventing /usr/bin/python3.9 from remove_name access on the directory repomd.xml. For complete SELinux messages run: sealert -l 3a749560-1cec-40ca-a4dc-596841be3885
Sep 17 22:06:48 submit26-b9-f2 setroubleshoot[1379451]: SELinux is preventing /usr/bin/python3.9 from unlink access on the file repomd.xml. For complete SELinux messages run: sealert -l 0aa52f08-94f8-474e-96d8-e818846941af [x2]
Sep 17 22:06:48 submit26-b9-f2 setroubleshoot[1379451]: SELinux is preventing /usr/bin/python3.9 from rmdir access on the directory repodata. For complete SELinux messages run: sealert -l de019dc4-408f-439c-902a-676d18dfe8e7
Sep 17 22:06:48 submit26-b9-f2 setroubleshoot[1379451]: SELinux is preventing /usr/bin/python3.9 from open access on the file /tmp/libdnf.jegBcf/repodata/repomd.xml. For complete SELinux messages run: sealert -l 7f4c3a8e-0f99-47c4-9baf-e1336fe24876
== submit26-b9-f3 (1 distinct, 1 total) ==
Sep 17 22:53:34 submit26-b9-f3 systemd[1]: user(a)1001.service: Main process exited, code=killed, status=9/KILL
== submit26-b9-f4 (1 distinct, 1 total) ==
Sep 17 22:45:47 submit26-b9-f4 systemd[1]: user(a)1001.service: Main process exited, code=killed, status=9/KILL
== vacuum.cs.umd.edu (4 distinct, 4 total) ==
Sep 17 22:11:58 vacuum.cs.umd.edu abrt-hook-ccpp[26413]: Process 21992 (driver) of user 33 killed by SIGABRT - dumping core
Sep 17 22:11:58 vacuum.cs.umd.edu abrt-server[26415]: Package 'amanda-backup_server' isn't signed with proper key
Sep 17 22:11:58 vacuum.cs.umd.edu abrt-server[26415]: 'post-create' on '/var/spool/abrt/ccpp-2026-09-17-22:11:58-21992' exited with 1
Sep 17 22:11:58 vacuum.cs.umd.edu abrt-server[26415]: Deleting problem directory '/var/spool/abrt/ccpp-2026-09-17-22:11:58-21992'
1
0
Command: /usr/local/sbin/syslog-digest.py
Time : 0.0510s
Status : exited 0
Output :
Syslog digest — 2026-09-17 22:05 EDT
Processed 2,982 lines, filtered 2,541 (85%). 441 unknown (182 distinct) from 19 host(s).
== amoeba (5 distinct, 5 total) ==
Sep 17 21:55:18 amoeba firefox[1459102]: Couldn't map window 0x7f3d508530a0 as subsurface because its parent is not mapped.
Sep 17 21:55:18 amoeba firefox[1459102]: Couldn't map window 0x7f3d50856160 as subsurface because its parent is not mapped.
Sep 17 21:55:18 amoeba firefox[1459102]: Couldn't map window 0x7f3d50853240 as subsurface because its parent is not mapped.
Sep 17 21:55:18 amoeba firefox[1459102]: Couldn't map window 0x7f3d508533e0 as subsurface because its parent is not mapped.
Sep 17 21:55:18 amoeba firefox[1459102]: Couldn't map window 0x7f3d5deabae0 as subsurface because its parent is not mapped.
== b0b02.cs.umd.edu (1 distinct, 1 total) ==
Sep 17 21:48:36 b0b02.cs.umd.edu rustdesk[2293231]: cannot open display:
== csfw00a (1 distinct, 137 total) ==
Sep 17 21:03:54 csfw00a kernel: bnxt_en 0000:09:00.0 eth3: NIC Link is Down [x137]
== idm00 (1 distinct, 1 total) ==
Sep 17 21:53:57 idm00 named[4166701]: client @0x7f11a42a41d8 10.73.240.42#49603: update '73.10.in-addr.arpa/IN' denied
== idmp0 (1 distinct, 1 total) ==
Sep 17 21:37:57 idmp0 named[1598691]: client @0x7f2d2c017dd8 10.73.240.43#51705: update '73.10.in-addr.arpa/IN' denied
== itmon02 (1 distinct, 3 total) ==
Sep 17 21:23:14 itmon02 sshd[1750555]: error: beginning MaxStartups throttling [x3]
== neoavion (3 distinct, 4 total) ==
Sep 17 22:02:53 neoavion krb5_child[3287739]: Preauthentication failed [x2]
Sep 17 22:02:55 neoavion sshd[3287733]: error: PAM: Authentication failure for reggia from 10.206.2.61
Sep 17 22:03:15 neoavion pipewire[3288008]: mod.jackdbus-detect: Failed to receive jackdbus reply: org.freedesktop.DBus.Error.ServiceUnknown: The name org.jackaudio.service was not provided by any .service files
== netman.cs.umd.edu (1 distinct, 2 total) ==
Sep 17 21:08:12 netman.cs.umd.edu krb5_child[1745825]: Client 'admin(a)UMD.EDU' not found in Kerberos database [x2]
== newhonors2 (1 distinct, 24 total) ==
Sep 17 21:13:02 newhonors2 dhcpcd[2784957]: dhcpcd is not running [x24]
== ntop00 (100 distinct, 144 total) ==
Sep 17 21:05:01 ntop00 nfacctd[323381]: INFO ( m1/mysql ): *** Purging cache - START (PID: 10) ***
Sep 17 21:05:13 ntop00 sfacctd[323304]: INFO ( m1/mysql ): *** Purging cache - END (PID: 10, QN: 9678/9678, ET: 12) ***
Sep 17 21:05:13 ntop00 nfacctd[323381]: INFO ( m1/mysql ): *** Purging cache - END (PID: 10, QN: 64/64, ET: 12) ***
Sep 17 21:06:01 ntop00 sfacctd[323304]: INFO ( p1/print ): *** Purging cache - START (PID: 11) ***
Sep 17 21:06:01 ntop00 sfacctd[323304]: INFO ( p1/print ): *** Purging cache - END (PID: 11, QN: 9499/9499, ET: 0) ***
Sep 17 21:06:01 ntop00 nfacctd[323381]: INFO ( p1/print ): *** Purging cache - START (PID: 11) ***
Sep 17 21:06:01 ntop00 nfacctd[323381]: INFO ( p1/print ): *** Purging cache - END (PID: 11, QN: 62/62, ET: 0) ***
Sep 17 21:06:02 ntop00 setroubleshoot[325970]: SELinux is preventing /usr/local/sbin/sfacctd from append access on the file sflow.json. For complete SELinux messages run: sealert -l 58e35a5d-c7c9-4337-868c-bb9d5ac2e29f [x12]
Sep 17 21:06:02 ntop00 setroubleshoot[325970]: SELinux is preventing /usr/local/sbin/sfacctd from write access on the file sflow.json. For complete SELinux messages run: sealert -l 369b1df3-2c9d-461b-8b1c-2fcd48dc737c [x12]
Sep 17 21:06:02 ntop00 setroubleshoot[325970]: failed to retrieve rpm info for path '/srv/pmacct/sflow.json': [x12]
Sep 17 21:06:02 ntop00 setroubleshoot[325970]: SELinux is preventing /usr/local/sbin/sfacctd from lock access on the file /srv/pmacct/sflow.json. For complete SELinux messages run: sealert -l 481e7e24-3846-4790-b17b-9e44a5f5b5d6 [x12]
Sep 17 21:10:01 ntop00 sfacctd[323304]: INFO ( m1/mysql ): *** Purging cache - START (PID: 12) ***
Sep 17 21:10:01 ntop00 nfacctd[323381]: INFO ( m1/mysql ): *** Purging cache - START (PID: 12) ***
Sep 17 21:10:14 ntop00 sfacctd[323304]: INFO ( m1/mysql ): *** Purging cache - END (PID: 12, QN: 9755/9755, ET: 13) ***
Sep 17 21:10:14 ntop00 nfacctd[323381]: INFO ( m1/mysql ): *** Purging cache - END (PID: 12, QN: 67/67, ET: 13) ***
Sep 17 21:11:01 ntop00 sfacctd[323304]: INFO ( p1/print ): *** Purging cache - START (PID: 13) ***
Sep 17 21:11:01 ntop00 sfacctd[323304]: INFO ( p1/print ): *** Purging cache - END (PID: 13, QN: 9821/9821, ET: 0) ***
Sep 17 21:11:01 ntop00 nfacctd[323381]: INFO ( p1/print ): *** Purging cache - START (PID: 13) ***
Sep 17 21:11:01 ntop00 nfacctd[323381]: INFO ( p1/print ): *** Purging cache - END (PID: 13, QN: 72/72, ET: 0) ***
Sep 17 21:15:01 ntop00 sfacctd[323304]: INFO ( m1/mysql ): *** Purging cache - START (PID: 14) ***
Sep 17 21:15:01 ntop00 nfacctd[323381]: INFO ( m1/mysql ): *** Purging cache - START (PID: 14) ***
Sep 17 21:15:13 ntop00 sfacctd[323304]: INFO ( m1/mysql ): *** Purging cache - END (PID: 14, QN: 9691/9691, ET: 12) ***
Sep 17 21:15:13 ntop00 nfacctd[323381]: INFO ( m1/mysql ): *** Purging cache - END (PID: 14, QN: 71/71, ET: 12) ***
Sep 17 21:16:01 ntop00 sfacctd[323304]: INFO ( p1/print ): *** Purging cache - START (PID: 15) ***
Sep 17 21:16:01 ntop00 sfacctd[323304]: INFO ( p1/print ): *** Purging cache - END (PID: 15, QN: 9659/9659, ET: 0) ***
Sep 17 21:16:01 ntop00 nfacctd[323381]: INFO ( p1/print ): *** Purging cache - START (PID: 15) ***
Sep 17 21:16:01 ntop00 nfacctd[323381]: INFO ( p1/print ): *** Purging cache - END (PID: 15, QN: 63/63, ET: 0) ***
Sep 17 21:20:01 ntop00 sfacctd[323304]: INFO ( m1/mysql ): *** Purging cache - START (PID: 16) ***
Sep 17 21:20:02 ntop00 nfacctd[323381]: INFO ( m1/mysql ): *** Purging cache - START (PID: 16) ***
Sep 17 21:20:12 ntop00 sfacctd[323304]: INFO ( m1/mysql ): *** Purging cache - END (PID: 16, QN: 8812/8812, ET: 11) ***
... 70 more distinct messages not shown
== outbound00.cs.umd.edu (1 distinct, 6 total) ==
Sep 17 21:09:08 outbound00.cs.umd.edu python3[1139573]: ldapdb [x6]
== outbound01.cs.umd.edu (1 distinct, 6 total) ==
Sep 17 21:13:06 outbound01.cs.umd.edu python3[3399026]: ldapdb [x6]
== sentry-docker00.cs.umd.edu (34 distinct, 34 total) ==
Sep 17 21:11:13 sentry-docker00.cs.umd.edu systemd-udevd[2523163]: link_config: could not get ethtool features for veth41fbafe
Sep 17 21:11:13 sentry-docker00.cs.umd.edu systemd-udevd[2523163]: Could not set offload features of veth41fbafe: No such device
Sep 17 21:11:13 sentry-docker00.cs.umd.edu systemd-udevd[2523201]: Could not generate persistent MAC address for vethfbf6c54: No such file or directory
Sep 17 21:11:13 sentry-docker00.cs.umd.edu systemd-udevd[2523202]: Could not generate persistent MAC address for vethded0d0e: No such file or directory
Sep 17 21:11:13 sentry-docker00.cs.umd.edu systemd-udevd[2523213]: Could not generate persistent MAC address for veth821dc8f: No such file or directory
Sep 17 21:11:13 sentry-docker00.cs.umd.edu systemd-udevd[2523218]: Could not generate persistent MAC address for veth01cda39: No such file or directory
Sep 17 21:11:13 sentry-docker00.cs.umd.edu systemd-udevd[2523220]: Could not generate persistent MAC address for veth6e95baf: No such file or directory
Sep 17 21:11:13 sentry-docker00.cs.umd.edu systemd-udevd[2523209]: Could not generate persistent MAC address for vethc8acfc4: No such file or directory
Sep 17 21:11:13 sentry-docker00.cs.umd.edu systemd-udevd[2523213]: Could not generate persistent MAC address for vethe1e39c9: No such file or directory
Sep 17 21:11:13 sentry-docker00.cs.umd.edu systemd-udevd[2523221]: Could not generate persistent MAC address for vethc6bf732: No such file or directory
Sep 17 21:11:13 sentry-docker00.cs.umd.edu systemd-udevd[2523218]: Could not generate persistent MAC address for vetha70f334: No such file or directory
Sep 17 21:11:13 sentry-docker00.cs.umd.edu systemd-udevd[2523221]: Could not generate persistent MAC address for veth79617b6: No such file or directory
Sep 17 21:31:21 sentry-docker00.cs.umd.edu systemd-udevd[2532741]: link_config: could not get ethtool features for vetha70f334
Sep 17 21:31:21 sentry-docker00.cs.umd.edu systemd-udevd[2532741]: Could not set offload features of vetha70f334: No such device
Sep 17 21:31:22 sentry-docker00.cs.umd.edu systemd-udevd[2532799]: Could not generate persistent MAC address for vethe34096b: No such file or directory
Sep 17 21:31:22 sentry-docker00.cs.umd.edu systemd-udevd[2532800]: Could not generate persistent MAC address for veth57bf093: No such file or directory
Sep 17 21:31:22 sentry-docker00.cs.umd.edu systemd-udevd[2532803]: Could not generate persistent MAC address for veth11f067f: No such file or directory
Sep 17 21:31:22 sentry-docker00.cs.umd.edu systemd-udevd[2532804]: Could not generate persistent MAC address for veth9e58bc6: No such file or directory
Sep 17 21:31:22 sentry-docker00.cs.umd.edu systemd-udevd[2532807]: Could not generate persistent MAC address for vethf135be0: No such file or directory
Sep 17 21:31:22 sentry-docker00.cs.umd.edu systemd-udevd[2532818]: Could not generate persistent MAC address for veth41e78eb: No such file or directory
Sep 17 21:31:22 sentry-docker00.cs.umd.edu systemd-udevd[2532829]: Could not generate persistent MAC address for vethe2e3307: No such file or directory
Sep 17 21:31:22 sentry-docker00.cs.umd.edu systemd-udevd[2532830]: Could not generate persistent MAC address for veth41f3a7f: No such file or directory
Sep 17 21:31:22 sentry-docker00.cs.umd.edu systemd-udevd[2532877]: Could not generate persistent MAC address for vethd32015b: No such file or directory
Sep 17 21:31:22 sentry-docker00.cs.umd.edu systemd-udevd[2532842]: Could not generate persistent MAC address for vethd9fdaa4: No such file or directory
Sep 17 21:51:30 sentry-docker00.cs.umd.edu systemd-udevd[2542216]: Could not generate persistent MAC address for vethf8e1045: No such file or directory
Sep 17 21:51:30 sentry-docker00.cs.umd.edu systemd-udevd[2542215]: Could not generate persistent MAC address for vethd2a0738: No such file or directory
Sep 17 21:51:30 sentry-docker00.cs.umd.edu systemd-udevd[2542219]: Could not generate persistent MAC address for veth681e93c: No such file or directory
Sep 17 21:51:30 sentry-docker00.cs.umd.edu systemd-udevd[2542215]: Could not generate persistent MAC address for veth3ac43de: No such file or directory
Sep 17 21:51:30 sentry-docker00.cs.umd.edu systemd-udevd[2542222]: Could not generate persistent MAC address for veth7201447: No such file or directory
Sep 17 21:51:30 sentry-docker00.cs.umd.edu systemd-udevd[2542233]: Could not generate persistent MAC address for veth57c6b9e: No such file or directory
... 4 more distinct messages not shown
== soul (1 distinct, 2 total) ==
Sep 17 21:11:01 soul krb5_child[3171104]: Client 'admin(a)UMD.EDU' not found in Kerberos database [x2]
== strawberry (7 distinct, 38 total) ==
Sep 17 21:07:03 strawberry kernel: I/O error, dev sda, sector 206848 op 0x0:(READ) flags 0x80700 phys_seg 1 prio class 2 [x6]
Sep 17 21:07:03 strawberry kernel: I/O error, dev sda, sector 206848 op 0x0:(READ) flags 0x0 phys_seg 1 prio class 2 [x6]
Sep 17 21:07:03 strawberry kernel: Buffer I/O error on dev sda2, logical block 0, async page read [x6]
Sep 17 21:07:03 strawberry kernel: I/O error, dev sda, sector 2048 op 0x0:(READ) flags 0x80700 phys_seg 1 prio class 2 [x6]
Sep 17 21:07:03 strawberry kernel: I/O error, dev sda, sector 2048 op 0x0:(READ) flags 0x0 phys_seg 1 prio class 2 [x6]
Sep 17 21:07:03 strawberry kernel: Buffer I/O error on dev sda1, logical block 0, async page read [x6]
Sep 17 21:34:42 strawberry smartd[5314]: Device: /dev/sda [SAT], failed to read SMART Attribute Data [x2]
== submit26-b9-f1 (1 distinct, 2 total) ==
Sep 17 21:11:13 submit26-b9-f1 systemd[1]: user(a)1001.service: Main process exited, code=killed, status=9/KILL [x2]
== submit26-b9-f2 (1 distinct, 1 total) ==
Sep 17 21:33:06 submit26-b9-f2 systemd[1]: user(a)1001.service: Main process exited, code=killed, status=9/KILL
== submit26-b9-f3 (10 distinct, 13 total) ==
Sep 17 21:06:42 submit26-b9-f3 setroubleshoot[1680989]: SELinux is preventing /usr/bin/python3.9 from create access on the directory /(null). For complete SELinux messages run: sealert -l a653b772-cbcd-438b-bae5-23c3dc69b31b
Sep 17 21:06:42 submit26-b9-f3 setroubleshoot[1680989]: SELinux is preventing /usr/bin/python3.9 from add_name access on the directory /(null). For complete SELinux messages run: sealert -l 3e904634-6caa-4202-8c92-f139db798859
Sep 17 21:06:42 submit26-b9-f3 setroubleshoot[1680989]: SELinux is preventing /usr/bin/python3.9 from create access on the file /(null). For complete SELinux messages run: sealert -l 580b20e4-ec2c-433d-905c-5bd417fba033 [x2]
Sep 17 21:06:42 submit26-b9-f3 setroubleshoot[1680989]: SELinux is preventing /usr/bin/python3.9 from open access on the file /tmp/libdnf.Ad3ZFZ/repodata/repomd.xml. For complete SELinux messages run: sealert -l 27f29d48-5e7c-4db7-b051-8ac055737d6f
Sep 17 21:06:42 submit26-b9-f3 setroubleshoot[1680989]: SELinux is preventing /usr/bin/python3.9 from setattr access on the file repomd.xml. For complete SELinux messages run: sealert -l bff72452-d40a-430b-9060-dd0a48f5b6ba [x2]
Sep 17 21:06:42 submit26-b9-f3 setroubleshoot[1680989]: SELinux is preventing /usr/bin/python3.9 from read access on the directory libdnf.Ad3ZFZ. For complete SELinux messages run: sealert -l 9638d396-8ce5-4e6a-ae47-45cd3985e1cd
Sep 17 21:06:42 submit26-b9-f3 setroubleshoot[1680989]: SELinux is preventing /usr/bin/python3.9 from remove_name access on the directory repomd.xml. For complete SELinux messages run: sealert -l 6da64b94-7024-45a9-b8c2-3b9812517407
Sep 17 21:06:42 submit26-b9-f3 setroubleshoot[1680989]: SELinux is preventing /usr/bin/python3.9 from unlink access on the file repomd.xml. For complete SELinux messages run: sealert -l 64cbe179-abf1-4d5a-bade-bb164897ee65 [x2]
Sep 17 21:06:42 submit26-b9-f3 setroubleshoot[1680989]: SELinux is preventing /usr/bin/python3.9 from rmdir access on the directory repodata. For complete SELinux messages run: sealert -l d2e35b1a-e27c-4f91-9217-2bb1204e1e68
Sep 17 21:06:42 submit26-b9-f3 setroubleshoot[1680989]: SELinux is preventing /usr/bin/python3.9 from open access on the file /tmp/libdnf.l3CSog/repodata/repomd.xml. For complete SELinux messages run: sealert -l 27f29d48-5e7c-4db7-b051-8ac055737d6f
== submit26-b9-f4 (11 distinct, 17 total) ==
Sep 17 21:23:07 submit26-b9-f4 systemd[1]: user(a)1001.service: Main process exited, code=killed, status=9/KILL [x3]
Sep 17 21:24:47 submit26-b9-f4 setroubleshoot[1236664]: SELinux is preventing /usr/bin/python3.9 from create access on the directory /(null). For complete SELinux messages run: sealert -l ee160f23-b161-4f4a-9985-c4edfd3a5beb [x2]
Sep 17 21:24:47 submit26-b9-f4 setroubleshoot[1236664]: SELinux is preventing /usr/bin/python3.9 from add_name access on the directory /(null). For complete SELinux messages run: sealert -l 89a83821-4b24-4081-9973-0a79ca6ed5b4 [x2]
Sep 17 21:24:47 submit26-b9-f4 setroubleshoot[1236664]: SELinux is preventing /usr/bin/python3.9 from create access on the file /(null). For complete SELinux messages run: sealert -l f73955d6-1416-45f9-bab6-ff1f3ea07e9d
Sep 17 21:24:47 submit26-b9-f4 setroubleshoot[1236664]: SELinux is preventing /usr/bin/python3.9 from open access on the file /tmp/libdnf.Fl3xZF/repodata/repomd.xml. For complete SELinux messages run: sealert -l 9f8f24a0-8fb6-454d-a103-31a8f7a6efa0
Sep 17 21:24:47 submit26-b9-f4 setroubleshoot[1236664]: SELinux is preventing /usr/bin/python3.9 from setattr access on the file repomd.xml. For complete SELinux messages run: sealert -l 20293136-86a3-40ba-a651-cff48d36059e
Sep 17 21:24:47 submit26-b9-f4 setroubleshoot[1236664]: SELinux is preventing /usr/bin/python3.9 from read access on the directory libdnf.Fl3xZF. For complete SELinux messages run: sealert -l 25f86b49-4ee7-4f60-ad1c-73a70032560c
Sep 17 21:24:47 submit26-b9-f4 setroubleshoot[1236664]: SELinux is preventing /usr/bin/python3.9 from remove_name access on the directory repomd.xml. For complete SELinux messages run: sealert -l eec250fb-073f-456d-93bc-f98776fd476d [x2]
Sep 17 21:24:47 submit26-b9-f4 setroubleshoot[1236664]: SELinux is preventing /usr/bin/python3.9 from unlink access on the file repomd.xml. For complete SELinux messages run: sealert -l c9209e04-a349-43d5-8cb2-3e303e48df74
Sep 17 21:24:47 submit26-b9-f4 setroubleshoot[1236664]: SELinux is preventing /usr/bin/python3.9 from rmdir access on the directory repodata. For complete SELinux messages run: sealert -l 3178d5f5-80e9-404b-92b7-9bef397a8915 [x2]
Sep 17 21:24:47 submit26-b9-f4 setroubleshoot[1236664]: SELinux is preventing /usr/bin/python3.9 from read access on the directory libdnf.xQWpXq. For complete SELinux messages run: sealert -l 25f86b49-4ee7-4f60-ad1c-73a70032560c
1
0
Command: /usr/local/sbin/syslog-digest.py
Time : 0.0533s
Status : exited 0
Output :
Syslog digest — 2026-09-17 21:05 EDT
Processed 2,810 lines, filtered 2,290 (81%). 520 unknown (213 distinct) from 22 host(s).
== b0b02.cs.umd.edu (1 distinct, 1 total) ==
Sep 17 20:48:32 b0b02.cs.umd.edu rustdesk[2278036]: cannot open display:
== csfw00a (1 distinct, 124 total) ==
Sep 17 20:04:09 csfw00a kernel: bnxt_en 0000:09:00.0 eth3: NIC Link is Down [x124]
== frozone (2 distinct, 2 total) ==
Sep 17 20:47:42 frozone falcon-sensor-bpf[1052]: CrowdStrike(4): Could not retrieve DisableProxy value: c0000225
Sep 17 20:47:42 frozone falcon-sensor-bpf[1052]: CrowdStrike(4): ConnectWithProxy: Unable to get application proxy host from CsConfig: c0000225
== grosh (2 distinct, 2 total) ==
Sep 17 20:34:33 grosh falcon-sensor-bpf[3220]: CrowdStrike(4): Could not retrieve DisableProxy value: c0000225
Sep 17 20:34:33 grosh falcon-sensor-bpf[3220]: CrowdStrike(4): ConnectWithProxy: Unable to get application proxy host from CsConfig: c0000225
== hackerman (2 distinct, 2 total) ==
Sep 17 20:37:32 hackerman falcon-sensor-bpf[896]: CrowdStrike(4): Could not retrieve DisableProxy value: c0000225
Sep 17 20:37:32 hackerman falcon-sensor-bpf[896]: CrowdStrike(4): ConnectWithProxy: Unable to get application proxy host from CsConfig: c0000225
== haproxy02.cs.umd.edu (2 distinct, 2 total) ==
Sep 17 20:10:51 haproxy02.cs.umd.edu falcon-sensor-bpf[990]: CrowdStrike(4): Could not retrieve DisableProxy value: c0000225
Sep 17 20:10:51 haproxy02.cs.umd.edu falcon-sensor-bpf[990]: CrowdStrike(4): ConnectWithProxy: Unable to get application proxy host from CsConfig: c0000225
== idm00 (1 distinct, 1 total) ==
Sep 17 20:53:57 idm00 named[4166701]: client @0x7f11a4042778 10.73.240.42#55622: update '73.10.in-addr.arpa/IN' denied
== idmp0 (1 distinct, 1 total) ==
Sep 17 20:37:57 idmp0 named[1598691]: client @0x7f2d40000cc8 10.73.240.43#64913: update '73.10.in-addr.arpa/IN' denied
== irb2156 (2 distinct, 2 total) ==
Sep 17 20:18:58 irb2156 falcon-sensor-bpf[3728]: CrowdStrike(4): Could not retrieve DisableProxy value: c0000225
Sep 17 20:18:58 irb2156 falcon-sensor-bpf[3728]: CrowdStrike(4): ConnectWithProxy: Unable to get application proxy host from CsConfig: c0000225
== itmon02 (3 distinct, 5 total) ==
Sep 17 20:08:02 itmon02 sshd[1750555]: error: beginning MaxStartups throttling [x2]
Sep 17 20:46:25 itmon02 SetroubleshootPrivileged.py[2933 failed to retrieve rpm info for path '/var/lib/selinux/targeted/active/modules/200/grafana':
Sep 17 20:46:25 itmon02 setroubleshoot[2933442]: SELinux is preventing /usr/sbin/grafana from name_connect access on the tcp_socket port 3306. For complete SELinux messages run: sealert -l deb40268-1414-43e0-8915-0a3785a3ecd5 [x2]
== munin (2 distinct, 72 total) ==
Sep 17 20:23:04 munin sudo[3589515]: pam_systemd(sudo:session): Failed to stat() runtime directory '/run/user/0': No such file or directory [x36]
Sep 17 20:23:04 munin sudo[3589515]: pam_systemd(sudo:session): Not setting $XDG_RUNTIME_DIR, as the directory is not in order. [x36]
== neodontcare.cs.umd.edu (2 distinct, 2 total) ==
Sep 17 20:08:46 neodontcare.cs.umd.edu falcon-sensor-bpf[951]: CrowdStrike(4): Could not retrieve DisableProxy value: c0000225
Sep 17 20:08:46 neodontcare.cs.umd.edu falcon-sensor-bpf[951]: CrowdStrike(4): ConnectWithProxy: Unable to get application proxy host from CsConfig: c0000225
== netman.cs.umd.edu (2 distinct, 2 total) ==
Sep 17 20:28:18 netman.cs.umd.edu falcon-sensor-bpf[1129]: CrowdStrike(4): Could not retrieve DisableProxy value: c0000225
Sep 17 20:28:18 netman.cs.umd.edu falcon-sensor-bpf[1129]: CrowdStrike(4): ConnectWithProxy: Unable to get application proxy host from CsConfig: c0000225
== newhonors2 (1 distinct, 24 total) ==
Sep 17 20:13:03 newhonors2 dhcpcd[2783104]: dhcpcd is not running [x24]
== ntop00 (132 distinct, 177 total) ==
Sep 17 20:05:01 ntop00 nfacctd[313303]: INFO ( m1/mysql ): *** Purging cache - START (PID: 14) ***
Sep 17 20:05:01 ntop00 nfacctd[313303]: INFO ( p1/print ): *** Purging cache - START (PID: 15) ***
Sep 17 20:05:01 ntop00 nfacctd[313303]: INFO ( p1/print ): *** Purging cache - END (PID: 15, QN: 73/73, ET: 0) ***
Sep 17 20:05:02 ntop00 setroubleshoot[316999]: SELinux is preventing /usr/local/sbin/sfacctd from append access on the file sflow.json. For complete SELinux messages run: sealert -l 9916476b-fb21-444f-b3db-e6c3fcb28735 [x10]
Sep 17 20:05:02 ntop00 setroubleshoot[316999]: SELinux is preventing /usr/local/sbin/sfacctd from write access on the file sflow.json. For complete SELinux messages run: sealert -l 5c164851-02bd-4109-8bc1-a62be4d42c4e [x10]
Sep 17 20:05:02 ntop00 setroubleshoot[316999]: failed to retrieve rpm info for path '/srv/pmacct/sflow.json': [x13]
Sep 17 20:05:02 ntop00 setroubleshoot[316999]: SELinux is preventing /usr/local/sbin/sfacctd from lock access on the file /srv/pmacct/sflow.json. For complete SELinux messages run: sealert -l 322848e7-c44b-4cc2-96d6-933b8aaacb81 [x10]
Sep 17 20:05:38 ntop00 sfacctd[313229]: INFO ( m1/mysql ): *** Purging cache - END (PID: 15, QN: 20461/20461, ET: 37) ***
Sep 17 20:05:38 ntop00 nfacctd[313303]: INFO ( m1/mysql ): *** Purging cache - END (PID: 14, QN: 73/73, ET: 37) ***
Sep 17 20:10:01 ntop00 sfacctd[313229]: INFO ( p1/print ): *** Purging cache - START (PID: 16) ***
Sep 17 20:10:01 ntop00 sfacctd[313229]: INFO ( m1/mysql ): *** Purging cache - START (PID: 17) ***
Sep 17 20:10:01 ntop00 sfacctd[313229]: INFO ( p1/print ): *** Purging cache - END (PID: 16, QN: 14740/14740, ET: 0) ***
Sep 17 20:10:01 ntop00 nfacctd[313303]: INFO ( m1/mysql ): *** Purging cache - START (PID: 16) ***
Sep 17 20:10:02 ntop00 nfacctd[313303]: INFO ( p1/print ): *** Purging cache - START (PID: 17) ***
Sep 17 20:10:02 ntop00 nfacctd[313303]: INFO ( p1/print ): *** Purging cache - END (PID: 17, QN: 76/76, ET: 0) ***
Sep 17 20:10:24 ntop00 sfacctd[313229]: INFO ( m1/mysql ): *** Purging cache - END (PID: 17, QN: 14740/14740, ET: 23) ***
Sep 17 20:10:24 ntop00 nfacctd[313303]: INFO ( m1/mysql ): *** Purging cache - END (PID: 16, QN: 76/76, ET: 23) ***
Sep 17 20:15:01 ntop00 sfacctd[313229]: INFO ( p1/print ): *** Purging cache - START (PID: 18) ***
Sep 17 20:15:01 ntop00 sfacctd[313229]: INFO ( m1/mysql ): *** Purging cache - START (PID: 19) ***
Sep 17 20:15:01 ntop00 nfacctd[313303]: INFO ( p1/print ): *** Purging cache - START (PID: 18) ***
Sep 17 20:15:01 ntop00 nfacctd[313303]: INFO ( p1/print ): *** Purging cache - END (PID: 18, QN: 62/62, ET: 0) ***
Sep 17 20:15:01 ntop00 nfacctd[313303]: INFO ( m1/mysql ): *** Purging cache - START (PID: 19) ***
Sep 17 20:15:01 ntop00 sfacctd[313229]: INFO ( p1/print ): *** Purging cache - END (PID: 18, QN: 10195/10195, ET: 0) ***
Sep 17 20:15:17 ntop00 sfacctd[313229]: INFO ( m1/mysql ): *** Purging cache - END (PID: 19, QN: 10195/10195, ET: 16) ***
Sep 17 20:15:17 ntop00 nfacctd[313303]: INFO ( m1/mysql ): *** Purging cache - END (PID: 19, QN: 62/62, ET: 16) ***
Sep 17 20:20:01 ntop00 sfacctd[313229]: INFO ( p1/print ): *** Purging cache - START (PID: 20) ***
Sep 17 20:20:01 ntop00 sfacctd[313229]: INFO ( m1/mysql ): *** Purging cache - START (PID: 21) ***
Sep 17 20:20:01 ntop00 sfacctd[313229]: INFO ( p1/print ): *** Purging cache - END (PID: 20, QN: 9820/9820, ET: 0) ***
Sep 17 20:20:01 ntop00 nfacctd[313303]: INFO ( p1/print ): *** Purging cache - START (PID: 21) ***
Sep 17 20:20:01 ntop00 nfacctd[313303]: INFO ( p1/print ): *** Purging cache - END (PID: 21, QN: 79/79, ET: 0) ***
... 102 more distinct messages not shown
== outbound00.cs.umd.edu (1 distinct, 6 total) ==
Sep 17 20:09:09 outbound00.cs.umd.edu python3[1125599]: ldapdb [x6]
== outbound01.cs.umd.edu (1 distinct, 6 total) ==
Sep 17 20:13:06 outbound01.cs.umd.edu python3[3385090]: ldapdb [x6]
== sentry-docker00.cs.umd.edu (36 distinct, 36 total) ==
Sep 17 20:10:48 sentry-docker00.cs.umd.edu systemd-udevd[2494632]: link_config: could not get ethtool features for veth148aa14
Sep 17 20:10:48 sentry-docker00.cs.umd.edu systemd-udevd[2494632]: Could not set offload features of veth148aa14: No such device
Sep 17 20:10:48 sentry-docker00.cs.umd.edu systemd-udevd[2494674]: Could not generate persistent MAC address for veth361617d: No such file or directory
Sep 17 20:10:48 sentry-docker00.cs.umd.edu systemd-udevd[2494675]: Could not generate persistent MAC address for veth0e5661f: No such file or directory
Sep 17 20:10:48 sentry-docker00.cs.umd.edu systemd-udevd[2494678]: Could not generate persistent MAC address for veth36c465e: No such file or directory
Sep 17 20:10:48 sentry-docker00.cs.umd.edu systemd-udevd[2494679]: Could not generate persistent MAC address for veth5b1c9f9: No such file or directory
Sep 17 20:10:48 sentry-docker00.cs.umd.edu systemd-udevd[2494690]: Could not generate persistent MAC address for vethf5d9fee: No such file or directory
Sep 17 20:10:48 sentry-docker00.cs.umd.edu systemd-udevd[2494674]: Could not generate persistent MAC address for veth8a42eee: No such file or directory
Sep 17 20:10:48 sentry-docker00.cs.umd.edu systemd-udevd[2494709]: Could not generate persistent MAC address for veth4bb1a72: No such file or directory
Sep 17 20:10:48 sentry-docker00.cs.umd.edu systemd-udevd[2494710]: Could not generate persistent MAC address for vethfe3b7f1: No such file or directory
Sep 17 20:10:48 sentry-docker00.cs.umd.edu systemd-udevd[2494728]: Could not generate persistent MAC address for veth814a2fa: No such file or directory
Sep 17 20:10:48 sentry-docker00.cs.umd.edu systemd-udevd[2494713]: Could not generate persistent MAC address for vethdda09d7: No such file or directory
Sep 17 20:30:56 sentry-docker00.cs.umd.edu systemd-udevd[2504264]: link_config: could not get ethtool features for veth36c465e
Sep 17 20:30:56 sentry-docker00.cs.umd.edu systemd-udevd[2504264]: Could not set offload features of veth36c465e: No such device
Sep 17 20:30:57 sentry-docker00.cs.umd.edu systemd-udevd[2504283]: Could not generate persistent MAC address for vethbeb1f9a: No such file or directory
Sep 17 20:30:57 sentry-docker00.cs.umd.edu systemd-udevd[2504284]: Could not generate persistent MAC address for veth5777127: No such file or directory
Sep 17 20:30:57 sentry-docker00.cs.umd.edu systemd-udevd[2504310]: Could not generate persistent MAC address for vethffc98c1: No such file or directory
Sep 17 20:30:57 sentry-docker00.cs.umd.edu systemd-udevd[2504309]: Could not generate persistent MAC address for veth5a9cf5f: No such file or directory
Sep 17 20:30:57 sentry-docker00.cs.umd.edu systemd-udevd[2504335]: Could not generate persistent MAC address for veth738441a: No such file or directory
Sep 17 20:30:57 sentry-docker00.cs.umd.edu systemd-udevd[2504336]: Could not generate persistent MAC address for veth5d5bae9: No such file or directory
Sep 17 20:30:57 sentry-docker00.cs.umd.edu systemd-udevd[2504354]: Could not generate persistent MAC address for veth5512614: No such file or directory
Sep 17 20:30:57 sentry-docker00.cs.umd.edu systemd-udevd[2504344]: Could not generate persistent MAC address for veth9d8e232: No such file or directory
Sep 17 20:30:57 sentry-docker00.cs.umd.edu systemd-udevd[2504382]: Could not generate persistent MAC address for veth29e45d7: No such file or directory
Sep 17 20:30:57 sentry-docker00.cs.umd.edu systemd-udevd[2504388]: Could not generate persistent MAC address for veth19e8ffa: No such file or directory
Sep 17 20:51:05 sentry-docker00.cs.umd.edu systemd-udevd[2513692]: link_config: could not get ethtool features for vethbeb1f9a
Sep 17 20:51:05 sentry-docker00.cs.umd.edu systemd-udevd[2513692]: Could not set offload features of vethbeb1f9a: No such device
Sep 17 20:51:05 sentry-docker00.cs.umd.edu systemd-udevd[2513728]: Could not generate persistent MAC address for veth4bdc0b1: No such file or directory
Sep 17 20:51:05 sentry-docker00.cs.umd.edu systemd-udevd[2513729]: Could not generate persistent MAC address for veth1802720: No such file or directory
Sep 17 20:51:05 sentry-docker00.cs.umd.edu systemd-udevd[2513733]: Could not generate persistent MAC address for veth9470223: No such file or directory
Sep 17 20:51:05 sentry-docker00.cs.umd.edu systemd-udevd[2513732]: Could not generate persistent MAC address for veth41fbafe: No such file or directory
... 6 more distinct messages not shown
== strawberry (7 distinct, 38 total) ==
Sep 17 20:07:03 strawberry kernel: I/O error, dev sda, sector 206848 op 0x0:(READ) flags 0x80700 phys_seg 1 prio class 2 [x6]
Sep 17 20:07:03 strawberry kernel: I/O error, dev sda, sector 206848 op 0x0:(READ) flags 0x0 phys_seg 1 prio class 2 [x6]
Sep 17 20:07:03 strawberry kernel: Buffer I/O error on dev sda2, logical block 0, async page read [x6]
Sep 17 20:07:03 strawberry kernel: I/O error, dev sda, sector 2048 op 0x0:(READ) flags 0x80700 phys_seg 1 prio class 2 [x6]
Sep 17 20:07:03 strawberry kernel: I/O error, dev sda, sector 2048 op 0x0:(READ) flags 0x0 phys_seg 1 prio class 2 [x6]
Sep 17 20:07:03 strawberry kernel: Buffer I/O error on dev sda1, logical block 0, async page read [x6]
Sep 17 20:34:42 strawberry smartd[5314]: Device: /dev/sda [SAT], failed to read SMART Attribute Data [x2]
== submit26-b9-f4 (1 distinct, 1 total) ==
Sep 17 21:03:03 submit26-b9-f4 systemd[1]: user(a)1001.service: Main process exited, code=killed, status=9/KILL
== submit26-b9-fclone (9 distinct, 12 total) ==
Sep 17 20:21:50 submit26-b9-fclone setroubleshoot[22224]: SELinux is preventing /usr/bin/python3.9 from create access on the directory /(null). For complete SELinux messages run: sealert -l 9355d9d9-a311-48d2-bd37-6c0f6947dfff
Sep 17 20:21:50 submit26-b9-fclone setroubleshoot[22224]: SELinux is preventing /usr/bin/python3.9 from add_name access on the directory /(null). For complete SELinux messages run: sealert -l cc4658d7-9db1-405d-9eee-de0ccee5857f
Sep 17 20:21:50 submit26-b9-fclone setroubleshoot[22224]: SELinux is preventing /usr/bin/python3.9 from create access on the file /(null). For complete SELinux messages run: sealert -l 568a2429-0b1b-49df-af41-49b5cd298ae8 [x2]
Sep 17 20:21:50 submit26-b9-fclone setroubleshoot[22224]: SELinux is preventing /usr/bin/python3.9 from open access on the file /tmp/libdnf.uBK5Q9/repodata/repomd.xml. For complete SELinux messages run: sealert -l 03e2f521-0e7c-481f-8e92-0602c6adeedc [x2]
Sep 17 20:21:50 submit26-b9-fclone setroubleshoot[22224]: SELinux is preventing /usr/bin/python3.9 from setattr access on the file repomd.xml. For complete SELinux messages run: sealert -l 0d6b7b1f-ebe3-4beb-915a-b06b63bf2566 [x2]
Sep 17 20:21:50 submit26-b9-fclone setroubleshoot[22224]: SELinux is preventing /usr/bin/python3.9 from read access on the directory libdnf.uBK5Q9. For complete SELinux messages run: sealert -l 887adbf9-2bb9-4009-b800-36ddf9ba0db5
Sep 17 20:21:50 submit26-b9-fclone setroubleshoot[22224]: SELinux is preventing /usr/bin/python3.9 from remove_name access on the directory repomd.xml. For complete SELinux messages run: sealert -l 092e0644-8373-4017-b77f-1afa6c6da4ac
Sep 17 20:21:50 submit26-b9-fclone setroubleshoot[22224]: SELinux is preventing /usr/bin/python3.9 from unlink access on the file repomd.xml. For complete SELinux messages run: sealert -l ce429a92-56de-4de1-b859-cbfb69ae123c
Sep 17 20:21:50 submit26-b9-fclone setroubleshoot[22224]: SELinux is preventing /usr/bin/python3.9 from rmdir access on the directory repodata. For complete SELinux messages run: sealert -l 99b886eb-497b-406d-8206-afe76a1086b4
== talkhosts9 (2 distinct, 2 total) ==
Sep 17 20:23:27 talkhosts9 falcon-sensor-bpf[714]: CrowdStrike(4): Could not retrieve DisableProxy value: c0000225
Sep 17 20:23:27 talkhosts9 falcon-sensor-bpf[714]: CrowdStrike(4): ConnectWithProxy: Unable to get application proxy host from CsConfig: c0000225
1
0
Command: /usr/local/sbin/syslog-digest.py
Time : 0.0609s
Status : exited 0
Output :
Syslog digest — 2026-09-17 20:05 EDT
Processed 3,127 lines, filtered 2,411 (77%). 716 unknown (327 distinct) from 47 host(s).
== abadi-computer (2 distinct, 2 total) ==
Sep 17 19:52:20 abadi-computer falcon-sensor-bpf[529]: CrowdStrike(4): Could not retrieve DisableProxy value: c0000225
Sep 17 19:52:20 abadi-computer falcon-sensor-bpf[529]: CrowdStrike(4): ConnectWithProxy: Unable to get application proxy host from CsConfig: c0000225
== ai-course (2 distinct, 2 total) ==
Sep 17 19:40:55 ai-course falcon-sensor-bpf[725219]: CrowdStrike(4): Could not retrieve DisableProxy value: c0000225
Sep 17 19:40:55 ai-course falcon-sensor-bpf[725219]: CrowdStrike(4): ConnectWithProxy: Unable to get application proxy host from CsConfig: c0000225
== b0b02.cs.umd.edu (1 distinct, 1 total) ==
Sep 17 19:48:28 b0b02.cs.umd.edu rustdesk[2262649]: cannot open display:
== biggulp.cs.umd.edu (2 distinct, 2 total) ==
Sep 17 19:50:41 biggulp.cs.umd.edu falcon-sensor-bpf[834]: CrowdStrike(4): Could not retrieve DisableProxy value: c0000225
Sep 17 19:50:41 biggulp.cs.umd.edu falcon-sensor-bpf[834]: CrowdStrike(4): ConnectWithProxy: Unable to get application proxy host from CsConfig: c0000225
== bigtuna (2 distinct, 2 total) ==
Sep 17 19:30:05 bigtuna falcon-sensor-bpf[876]: CrowdStrike(4): Could not retrieve DisableProxy value: c0000225
Sep 17 19:30:05 bigtuna falcon-sensor-bpf[876]: CrowdStrike(4): ConnectWithProxy: Unable to get application proxy host from CsConfig: c0000225
== borealis (2 distinct, 2 total) ==
Sep 17 19:56:16 borealis falcon-sensor-bpf[921]: CrowdStrike(4): Could not retrieve DisableProxy value: c0000225
Sep 17 19:56:16 borealis falcon-sensor-bpf[921]: CrowdStrike(4): ConnectWithProxy: Unable to get application proxy host from CsConfig: c0000225
== borogove.cs.umd.edu (2 distinct, 2 total) ==
Sep 17 19:38:15 borogove.cs.umd.edu falcon-sensor-bpf[1404]: CrowdStrike(4): Could not retrieve DisableProxy value: c0000225
Sep 17 19:38:15 borogove.cs.umd.edu falcon-sensor-bpf[1404]: CrowdStrike(4): ConnectWithProxy: Unable to get application proxy host from CsConfig: c0000225
== cheezit.cs.umd.edu (2 distinct, 2 total) ==
Sep 17 19:28:11 cheezit.cs.umd.edu falcon-sensor-bpf[1347]: CrowdStrike(4): Could not retrieve DisableProxy value: c0000225
Sep 17 19:28:11 cheezit.cs.umd.edu falcon-sensor-bpf[1347]: CrowdStrike(4): ConnectWithProxy: Unable to get application proxy host from CsConfig: c0000225
== csfw00a (1 distinct, 125 total) ==
Sep 17 19:04:23 csfw00a kernel: bnxt_en 0000:09:00.0 eth3: NIC Link is Down [x125]
== cskayako (2 distinct, 2 total) ==
Sep 17 19:33:14 cskayako falcon-sensor-bpf[746]: CrowdStrike(4): Could not retrieve DisableProxy value: c0000225
Sep 17 19:33:14 cskayako falcon-sensor-bpf[746]: CrowdStrike(4): ConnectWithProxy: Unable to get application proxy host from CsConfig: c0000225
== defer (2 distinct, 2 total) ==
Sep 17 19:38:39 defer falcon-sensor-bpf[811]: CrowdStrike(4): Could not retrieve DisableProxy value: c0000225
Sep 17 19:38:39 defer falcon-sensor-bpf[811]: CrowdStrike(4): ConnectWithProxy: Unable to get application proxy host from CsConfig: c0000225
== emaar (2 distinct, 2 total) ==
Sep 17 19:43:50 emaar falcon-sensor-bpf[971]: CrowdStrike(4): Could not retrieve DisableProxy value: c0000225
Sep 17 19:43:50 emaar falcon-sensor-bpf[971]: CrowdStrike(4): ConnectWithProxy: Unable to get application proxy host from CsConfig: c0000225
== galahad.cs.umd.edu (2 distinct, 2 total) ==
Sep 17 19:33:06 galahad.cs.umd.edu falcon-sensor-bpf[970]: CrowdStrike(4): Could not retrieve DisableProxy value: c0000225
Sep 17 19:33:06 galahad.cs.umd.edu falcon-sensor-bpf[970]: CrowdStrike(4): ConnectWithProxy: Unable to get application proxy host from CsConfig: c0000225
== gle-dind04 (2 distinct, 2 total) ==
Sep 17 20:03:02 gle-dind04 falcon-sensor-bpf[1017]: CrowdStrike(4): Could not retrieve DisableProxy value: c0000225
Sep 17 20:03:02 gle-dind04 falcon-sensor-bpf[1017]: CrowdStrike(4): ConnectWithProxy: Unable to get application proxy host from CsConfig: c0000225
== gle-omnibus00.cs.umd.edu (2 distinct, 2 total) ==
Sep 17 19:49:30 gle-omnibus00.cs.umd.edu falcon-sensor-bpf[935]: CrowdStrike(4): Could not retrieve DisableProxy value: c0000225
Sep 17 19:49:30 gle-omnibus00.cs.umd.edu falcon-sensor-bpf[935]: CrowdStrike(4): ConnectWithProxy: Unable to get application proxy host from CsConfig: c0000225
== grafana (1 distinct, 1 total) ==
Sep 17 19:14:36 grafana sshd-session[3513067]: error: Refused by certificate options
== haproxy03.cs.umd.edu (2 distinct, 2 total) ==
Sep 17 19:36:00 haproxy03.cs.umd.edu falcon-sensor-bpf[1401]: CrowdStrike(4): Could not retrieve DisableProxy value: c0000225
Sep 17 19:36:00 haproxy03.cs.umd.edu falcon-sensor-bpf[1401]: CrowdStrike(4): ConnectWithProxy: Unable to get application proxy host from CsConfig: c0000225
== hasaraumd (2 distinct, 2 total) ==
Sep 17 19:48:42 hasaraumd falcon-sensor-bpf[730]: CrowdStrike(4): Could not retrieve DisableProxy value: c0000225
Sep 17 19:48:42 hasaraumd falcon-sensor-bpf[730]: CrowdStrike(4): ConnectWithProxy: Unable to get application proxy host from CsConfig: c0000225
== hazfs.cs.umd.edu (11 distinct, 66 total) ==
Sep 17 19:51:43 hazfs.cs.umd.edu snmpd[1431]: send response: Failure in sendto [x6]
Sep 17 19:51:43 hazfs.cs.umd.edu snmpd[1431]: -- NET-SNMP-EXTEND-MIB::nsExtendStatus."userweb" [x6]
Sep 17 19:51:43 hazfs.cs.umd.edu snmpd[1431]: -- NET-SNMP-EXTEND-MIB::nsExtendStatus."zfslist" [x6]
Sep 17 19:51:43 hazfs.cs.umd.edu snmpd[1431]: -- NET-SNMP-EXTEND-MIB::nsExtendStatus."userhome" [x6]
Sep 17 19:51:43 hazfs.cs.umd.edu snmpd[1431]: -- NET-SNMP-EXTEND-MIB::nsExtendOutput1Line."userweb" [x6]
Sep 17 19:51:43 hazfs.cs.umd.edu snmpd[1431]: -- NET-SNMP-EXTEND-MIB::nsExtendOutput1Line."zfslist" [x6]
Sep 17 19:51:43 hazfs.cs.umd.edu snmpd[1431]: -- NET-SNMP-EXTEND-MIB::nsExtendOutput1Line."userhome" [x6]
Sep 17 19:51:43 hazfs.cs.umd.edu snmpd[1431]: -- NET-SNMP-EXTEND-MIB::nsExtendOutputFull."userweb" [x6]
Sep 17 19:51:43 hazfs.cs.umd.edu snmpd[1431]: -- NET-SNMP-EXTEND-MIB::nsExtendOutputFull."zfslist" [x6]
Sep 17 19:51:43 hazfs.cs.umd.edu snmpd[1431]: -- NET-SNMP-EXTEND-MIB::nsExtendOutputFull."userhome" [x6]
Sep 17 19:51:43 hazfs.cs.umd.edu snmpd[1431]: -- NET-SNMP-EXTEND-MIB::nsExtendOutNumLines."userweb" [x6]
== hspc (2 distinct, 2 total) ==
Sep 17 19:39:16 hspc falcon-sensor-bpf[1008]: CrowdStrike(4): Could not retrieve DisableProxy value: c0000225
Sep 17 19:39:16 hspc falcon-sensor-bpf[1008]: CrowdStrike(4): ConnectWithProxy: Unable to get application proxy host from CsConfig: c0000225
== idm00 (1 distinct, 1 total) ==
Sep 17 19:53:57 idm00 named[4166701]: client @0x7f11a0062908 10.73.240.42#56235: update '73.10.in-addr.arpa/IN' denied
== idmp0 (1 distinct, 1 total) ==
Sep 17 19:37:57 idmp0 named[1598691]: client @0x7f2d24019b88 10.73.240.43#59961: update '73.10.in-addr.arpa/IN' denied
== inbound01.cs.umd.edu (1 distinct, 1 total) ==
Sep 17 19:46:44 inbound01.cs.umd.edu sshd-session[3465820]: fatal: userauth_pubkey: parse publickey packet: incomplete message [preauth]
== itmon02 (1 distinct, 3 total) ==
Sep 17 19:13:55 itmon02 sshd[1750555]: error: beginning MaxStartups throttling [x3]
== jaws.cs.umd.edu (2 distinct, 2 total) ==
Sep 17 19:58:32 jaws.cs.umd.edu falcon-sensor-bpf[1192]: CrowdStrike(4): Could not retrieve DisableProxy value: c0000225
Sep 17 19:58:32 jaws.cs.umd.edu falcon-sensor-bpf[1192]: CrowdStrike(4): ConnectWithProxy: Unable to get application proxy host from CsConfig: c0000225
== kadath.cs.umd.edu (2 distinct, 2 total) ==
Sep 17 19:40:33 kadath.cs.umd.edu falcon-sensor-bpf[938]: CrowdStrike(4): Could not retrieve DisableProxy value: c0000225
Sep 17 19:40:33 kadath.cs.umd.edu falcon-sensor-bpf[938]: CrowdStrike(4): ConnectWithProxy: Unable to get application proxy host from CsConfig: c0000225
== krispykreme.cs.umd.edu (2 distinct, 2 total) ==
Sep 17 19:58:16 krispykreme.cs.umd.edu falcon-sensor-bpf[1298]: CrowdStrike(4): Could not retrieve DisableProxy value: c0000225
Sep 17 19:58:16 krispykreme.cs.umd.edu falcon-sensor-bpf[1298]: CrowdStrike(4): ConnectWithProxy: Unable to get application proxy host from CsConfig: c0000225
== mashie (2 distinct, 2 total) ==
Sep 17 19:33:14 mashie falcon-sensor-bpf[786]: CrowdStrike(4): Could not retrieve DisableProxy value: c0000225
Sep 17 19:33:14 mashie falcon-sensor-bpf[786]: CrowdStrike(4): ConnectWithProxy: Unable to get application proxy host from CsConfig: c0000225
== neograd (2 distinct, 2 total) ==
Sep 17 19:32:11 neograd falcon-sensor-bpf[697]: CrowdStrike(4): Could not retrieve DisableProxy value: c0000225
Sep 17 19:32:11 neograd falcon-sensor-bpf[697]: CrowdStrike(4): ConnectWithProxy: Unable to get application proxy host from CsConfig: c0000225
== newhonors2 (1 distinct, 24 total) ==
Sep 17 19:13:03 newhonors2 dhcpcd[2781262]: dhcpcd is not running [x24]
== nightingale (2 distinct, 2 total) ==
Sep 17 20:03:34 nightingale falcon-sensor-bpf[870]: CrowdStrike(4): Could not retrieve DisableProxy value: c0000225
Sep 17 20:03:34 nightingale falcon-sensor-bpf[870]: CrowdStrike(4): ConnectWithProxy: Unable to get application proxy host from CsConfig: c0000225
== ntop00 (195 distinct, 339 total) ==
Sep 17 19:05:01 ntop00 nfacctd[300448]: INFO ( m1/mysql ): *** Purging cache - START (PID: 18) ***
Sep 17 19:05:03 ntop00 nfacctd[300448]: DEBUG ( default/core ): Received NetFlow/IPFIX packet from [129.2.151.198:59129] version [9] seqno [595]
Sep 17 19:05:03 ntop00 nfacctd[300448]: DEBUG ( default/core ): Processing NetFlow/IPFIX flowset [260] from [129.2.151.198:59129] seqno [595] [x6]
Sep 17 19:05:07 ntop00 sfacctd[300274]: INFO ( p1/print ): *** Purging cache - START (PID: 2) *** [x2]
Sep 17 19:05:07 ntop00 sfacctd[300274]: INFO ( m1/mysql ): *** Purging cache - START (PID: 3) *** [x2]
Sep 17 19:05:07 ntop00 sfacctd[300274]: INFO ( p1/print ): *** Purging cache - END (PID: 2, QN: 2258/2258, ET: 0) ***
Sep 17 19:05:07 ntop00 sfacctd[300274]: INFO ( default/core ): OK, Exiting ... [x2]
Sep 17 19:05:07 ntop00 pmacct-mariadb[296457]: 2026-09-17 23:05:07 44 [Warning] Aborted connection 44 to db: 'pmacct' user: 'pmacct_writer' host: '127.0.0.1' (Got an error reading communication packets)
Sep 17 19:05:07 ntop00 nfacctd[300448]: DEBUG ( m1/mysql ): INSERT INTO `acct` (stamp_updated, stamp_inserted, ip_src, ip_dst, peer_ip_src, src_port, dst_port, tcp_flags, ip_proto, packets, bytes) VALUES (FROM_UNIXTIME(1789686301), FROM_UNIXTIME(1789685700), '100.29.192.47', '128.8.128.204', '129.2.151.198', 51793, 26, 2, 'tcp', 0, 44)
Sep 17 19:05:07 ntop00 nfacctd[300448]: [x67]
Sep 17 19:05:07 ntop00 nfacctd[300448]: DEBUG ( m1/mysql ): INSERT INTO `acct` (stamp_updated, stamp_inserted, ip_src, ip_dst, peer_ip_src, src_port, dst_port, tcp_flags, ip_proto, packets, bytes) VALUES (FROM_UNIXTIME(1789686301), FROM_UNIXTIME(1789685700), '128.8.125.229', '111.26.229.54', '129.2.151.198', 53, 37820, 0, 'udp', 0, 106)
Sep 17 19:05:07 ntop00 nfacctd[300448]: DEBUG ( m1/mysql ): INSERT INTO `acct` (stamp_updated, stamp_inserted, ip_src, ip_dst, peer_ip_src, src_port, dst_port, tcp_flags, ip_proto, packets, bytes) VALUES (FROM_UNIXTIME(1789686301), FROM_UNIXTIME(1789685700), '10.73.241.136', '10.227.100.210', '129.2.151.198', 80, 62337, 26, 'tcp', 0, 7443)
Sep 17 19:05:07 ntop00 nfacctd[300448]: DEBUG ( m1/mysql ): INSERT INTO `acct` (stamp_updated, stamp_inserted, ip_src, ip_dst, peer_ip_src, src_port, dst_port, tcp_flags, ip_proto, packets, bytes) VALUES (FROM_UNIXTIME(1789686301), FROM_UNIXTIME(1789685700), '128.8.127.4', '176.211.69.222', '129.2.151.198', 443, 48422, 18, 'tcp', 0, 60)
Sep 17 19:05:07 ntop00 nfacctd[300448]: DEBUG ( m1/mysql ): INSERT INTO `acct` (stamp_updated, stamp_inserted, ip_src, ip_dst, peer_ip_src, src_port, dst_port, tcp_flags, ip_proto, packets, bytes) VALUES (FROM_UNIXTIME(1789686301), FROM_UNIXTIME(1789685700), '2605:880:20:ff54::1', '2406:da1a:daa:f400:8e78:4a36:ce66:764f', '129.2.151.198', 0, 33024, 0, 'ipv6-icmp', 0, 56)
Sep 17 19:05:07 ntop00 nfacctd[300448]: DEBUG ( m1/mysql ): INSERT INTO `acct` (stamp_updated, stamp_inserted, ip_src, ip_dst, peer_ip_src, src_port, dst_port, tcp_flags, ip_proto, packets, bytes) VALUES (FROM_UNIXTIME(1789686301), FROM_UNIXTIME(1789685700), '128.8.76.16', '10.73.235.201', '129.2.151.198', 123, 35158, 0, 'udp', 0, 76)
Sep 17 19:05:07 ntop00 nfacctd[300448]: DEBUG ( m1/mysql ): INSERT INTO `acct` (stamp_updated, stamp_inserted, ip_src, ip_dst, peer_ip_src, src_port, dst_port, tcp_flags, ip_proto, packets, bytes) VALUES (FROM_UNIXTIME(1789686301), FROM_UNIXTIME(1789685700), '10.73.241.136', '10.206.36.179', '129.2.151.198', 80, 49915, 17, 'tcp', 0, 40)
Sep 17 19:05:07 ntop00 nfacctd[300448]: DEBUG ( m1/mysql ): INSERT INTO `acct` (stamp_updated, stamp_inserted, ip_src, ip_dst, peer_ip_src, src_port, dst_port, tcp_flags, ip_proto, packets, bytes) VALUES (FROM_UNIXTIME(1789686301), FROM_UNIXTIME(1789685700), '10.73.241.136', '10.206.36.179', '129.2.151.198', 80, 63662, 26, 'tcp', 0, 7403)
Sep 17 19:05:07 ntop00 nfacctd[300448]: DEBUG ( m1/mysql ): INSERT INTO `acct` (stamp_updated, stamp_inserted, ip_src, ip_dst, peer_ip_src, src_port, dst_port, tcp_flags, ip_proto, packets, bytes) VALUES (FROM_UNIXTIME(1789686301), FROM_UNIXTIME(1789685700), '2605:880:20:ff54::2', '2406:da1c:8d0f:a601:af8b:5b01:5033:cf2', '129.2.151.198', 0, 33024, 0, 'ipv6-icmp', 0, 56)
Sep 17 19:05:07 ntop00 nfacctd[300448]: DEBUG ( m1/mysql ): INSERT INTO `acct` (stamp_updated, stamp_inserted, ip_src, ip_dst, peer_ip_src, src_port, dst_port, tcp_flags, ip_proto, packets, bytes) VALUES (FROM_UNIXTIME(1789686301), FROM_UNIXTIME(1789685700), '10.73.241.136', '10.227.100.210', '129.2.151.198', 80, 62068, 17, 'tcp', 0, 40)
Sep 17 19:05:07 ntop00 nfacctd[300448]: DEBUG ( m1/mysql ): INSERT INTO `acct` (stamp_updated, stamp_inserted, ip_src, ip_dst, peer_ip_src, src_port, dst_port, tcp_flags, ip_proto, packets, bytes) VALUES (FROM_UNIXTIME(1789686301), FROM_UNIXTIME(1789685700), '43.175.243.207', '129.2.151.200', '129.2.151.198', 0, 2048, 0, 'icmp', 0, 99)
Sep 17 19:05:07 ntop00 nfacctd[300448]: DEBUG ( m1/mysql ): INSERT INTO `acct` (stamp_updated, stamp_inserted, ip_src, ip_dst, peer_ip_src, src_port, dst_port, tcp_flags, ip_proto, packets, bytes) VALUES (FROM_UNIXTIME(1789686301), FROM_UNIXTIME(1789685700), '128.8.125.228', '177.155.72.10', '129.2.151.198', 53, 53691, 0, 'udp', 0, 103)
Sep 17 19:05:07 ntop00 nfacctd[300448]: DEBUG ( m1/mysql ): INSERT INTO `acct` (stamp_updated, stamp_inserted, ip_src, ip_dst, peer_ip_src, src_port, dst_port, tcp_flags, ip_proto, packets, bytes) VALUES (FROM_UNIXTIME(1789686301), FROM_UNIXTIME(1789685700), '10.73.241.136', '10.206.36.179', '129.2.151.198', 80, 58124, 26, 'tcp', 0, 9191)
Sep 17 19:05:07 ntop00 nfacctd[300448]: DEBUG ( m1/mysql ): INSERT INTO `acct` (stamp_updated, stamp_inserted, ip_src, ip_dst, peer_ip_src, src_port, dst_port, tcp_flags, ip_proto, packets, bytes) VALUES (FROM_UNIXTIME(1789686301), FROM_UNIXTIME(1789685700), '128.8.127.3', '27.126.177.194', '129.2.151.198', 80, 22150, 18, 'tcp', 0, 44)
Sep 17 19:05:07 ntop00 nfacctd[300448]: DEBUG ( m1/mysql ): INSERT INTO `acct` (stamp_updated, stamp_inserted, ip_src, ip_dst, peer_ip_src, src_port, dst_port, tcp_flags, ip_proto, packets, bytes) VALUES (FROM_UNIXTIME(1789686301), FROM_UNIXTIME(1789685700), '128.8.130.86', '60.188.85.253', '129.2.151.198', 0, 771, 0, 'icmp', 0, 72)
Sep 17 19:05:07 ntop00 nfacctd[300448]: DEBUG ( m1/mysql ): INSERT INTO `acct` (stamp_updated, stamp_inserted, ip_src, ip_dst, peer_ip_src, src_port, dst_port, tcp_flags, ip_proto, packets, bytes) VALUES (FROM_UNIXTIME(1789686301), FROM_UNIXTIME(1789685700), '128.8.127.36', '47.82.201.169', '129.2.151.198', 443, 50353, 27, 'tcp', 0, 67348)
Sep 17 19:05:07 ntop00 nfacctd[300448]: DEBUG ( m1/mysql ): INSERT INTO `acct` (stamp_updated, stamp_inserted, ip_src, ip_dst, peer_ip_src, src_port, dst_port, tcp_flags, ip_proto, packets, bytes) VALUES (FROM_UNIXTIME(1789686301), FROM_UNIXTIME(1789685700), '172.64.193.105', '128.8.125.228', '129.2.151.198', 31274, 53, 0, 'udp', 0, 71)
Sep 17 19:05:07 ntop00 nfacctd[300448]: DEBUG ( m1/mysql ): INSERT INTO `acct` (stamp_updated, stamp_inserted, ip_src, ip_dst, peer_ip_src, src_port, dst_port, tcp_flags, ip_proto, packets, bytes) VALUES (FROM_UNIXTIME(1789686301), FROM_UNIXTIME(1789685700), '128.8.127.36', '43.119.104.180', '129.2.151.198', 443, 49215, 27, 'tcp', 0, 5910)
Sep 17 19:05:07 ntop00 nfacctd[300448]: DEBUG ( m1/mysql ): INSERT INTO `acct` (stamp_updated, stamp_inserted, ip_src, ip_dst, peer_ip_src, src_port, dst_port, tcp_flags, ip_proto, packets, bytes) VALUES (FROM_UNIXTIME(1789686301), FROM_UNIXTIME(1789685700), '2605:880:20:ff40::2', '2600:1f16:668:2000:3c15:c97e:8911:2198', '129.2.151.198', 0, 33024, 0, 'ipv6-icmp', 0, 56)
Sep 17 19:05:07 ntop00 nfacctd[300448]: DEBUG ( m1/mysql ): INSERT INTO `acct` (stamp_updated, stamp_inserted, ip_src, ip_dst, peer_ip_src, src_port, dst_port, tcp_flags, ip_proto, packets, bytes) VALUES (FROM_UNIXTIME(1789686301), FROM_UNIXTIME(1789685700), '100.29.192.87', '128.8.126.141', '129.2.151.198', 56442, 2002, 2, 'tcp', 0, 44)
Sep 17 19:05:07 ntop00 nfacctd[300448]: DEBUG ( m1/mysql ): INSERT INTO `acct` (stamp_updated, stamp_inserted, ip_src, ip_dst, peer_ip_src, src_port, dst_port, tcp_flags, ip_proto, packets, bytes) VALUES (FROM_UNIXTIME(1789686301), FROM_UNIXTIME(1789685700), '10.125.210.104', '128.8.127.44', '129.2.151.198', 9997, 37604, 27, 'tcp', 0, 1912)
... 165 more distinct messages not shown
== orchids (2 distinct, 2 total) ==
Sep 17 19:31:51 orchids falcon-sensor-bpf[1099]: CrowdStrike(4): Could not retrieve DisableProxy value: c0000225
Sep 17 19:31:51 orchids falcon-sensor-bpf[1099]: CrowdStrike(4): ConnectWithProxy: Unable to get application proxy host from CsConfig: c0000225
== outbound00.cs.umd.edu (3 distinct, 8 total) ==
Sep 17 19:09:09 outbound00.cs.umd.edu python3[1111602]: ldapdb [x6]
Sep 17 19:36:44 outbound00.cs.umd.edu krb5_child[1118073]: Client 'backup(a)UMD.EDU' not found in Kerberos database
Sep 17 19:54:12 outbound00.cs.umd.edu krb5_child[1121598]: Client 'admin(a)UMD.EDU' not found in Kerberos database
== outbound01.cs.umd.edu (1 distinct, 6 total) ==
Sep 17 19:13:07 outbound01.cs.umd.edu python3[3371162]: ldapdb [x6]
== portal (2 distinct, 2 total) ==
Sep 17 19:48:29 portal falcon-sensor-bpf[7590]: CrowdStrike(4): Could not retrieve DisableProxy value: c0000225
Sep 17 19:48:29 portal falcon-sensor-bpf[7590]: CrowdStrike(4): ConnectWithProxy: Unable to get application proxy host from CsConfig: c0000225
== quiss (2 distinct, 2 total) ==
Sep 17 19:45:55 quiss falcon-sensor-bpf[1301]: CrowdStrike(4): Could not retrieve DisableProxy value: c0000225
Sep 17 19:45:55 quiss falcon-sensor-bpf[1301]: CrowdStrike(4): ConnectWithProxy: Unable to get application proxy host from CsConfig: c0000225
== sentry-docker00.cs.umd.edu (36 distinct, 36 total) ==
Sep 17 19:10:23 sentry-docker00.cs.umd.edu systemd-udevd[2466243]: link_config: could not get ethtool features for veth8049790
Sep 17 19:10:23 sentry-docker00.cs.umd.edu systemd-udevd[2466243]: Could not set offload features of veth8049790: No such device
Sep 17 19:10:23 sentry-docker00.cs.umd.edu systemd-udevd[2466276]: Could not generate persistent MAC address for veth9a83305: No such file or directory
Sep 17 19:10:23 sentry-docker00.cs.umd.edu systemd-udevd[2466277]: Could not generate persistent MAC address for vethda022b4: No such file or directory
Sep 17 19:10:23 sentry-docker00.cs.umd.edu systemd-udevd[2466280]: Could not generate persistent MAC address for vethd0db6db: No such file or directory
Sep 17 19:10:23 sentry-docker00.cs.umd.edu systemd-udevd[2466281]: Could not generate persistent MAC address for veth1794b2e: No such file or directory
Sep 17 19:10:23 sentry-docker00.cs.umd.edu systemd-udevd[2466281]: Could not generate persistent MAC address for veth2817f29: No such file or directory
Sep 17 19:10:23 sentry-docker00.cs.umd.edu systemd-udevd[2466295]: Could not generate persistent MAC address for vethd1e182f: No such file or directory
Sep 17 19:10:23 sentry-docker00.cs.umd.edu systemd-udevd[2466306]: Could not generate persistent MAC address for vethe9f24d5: No such file or directory
Sep 17 19:10:23 sentry-docker00.cs.umd.edu systemd-udevd[2466307]: Could not generate persistent MAC address for veth26be5f3: No such file or directory
Sep 17 19:10:23 sentry-docker00.cs.umd.edu systemd-udevd[2466319]: Could not generate persistent MAC address for vethd78eb9c: No such file or directory
Sep 17 19:10:23 sentry-docker00.cs.umd.edu systemd-udevd[2466330]: Could not generate persistent MAC address for vethb32c16d: No such file or directory
Sep 17 19:30:31 sentry-docker00.cs.umd.edu systemd-udevd[2476010]: link_config: could not get ethtool features for veth2817f29
Sep 17 19:30:31 sentry-docker00.cs.umd.edu systemd-udevd[2476010]: Could not set offload features of veth2817f29: No such device
Sep 17 19:30:32 sentry-docker00.cs.umd.edu systemd-udevd[2476044]: Could not generate persistent MAC address for vethd90424a: No such file or directory
Sep 17 19:30:32 sentry-docker00.cs.umd.edu systemd-udevd[2476045]: Could not generate persistent MAC address for veth746e92c: No such file or directory
Sep 17 19:30:32 sentry-docker00.cs.umd.edu systemd-udevd[2476048]: Could not generate persistent MAC address for veth62c7778: No such file or directory
Sep 17 19:30:32 sentry-docker00.cs.umd.edu systemd-udevd[2476049]: Could not generate persistent MAC address for veth440ad57: No such file or directory
Sep 17 19:30:32 sentry-docker00.cs.umd.edu systemd-udevd[2476059]: Could not generate persistent MAC address for vethf098595: No such file or directory
Sep 17 19:30:32 sentry-docker00.cs.umd.edu systemd-udevd[2476060]: Could not generate persistent MAC address for veth0c49e49: No such file or directory
Sep 17 19:30:32 sentry-docker00.cs.umd.edu systemd-udevd[2476060]: Could not generate persistent MAC address for veth8cc92b2: No such file or directory
Sep 17 19:30:32 sentry-docker00.cs.umd.edu systemd-udevd[2476064]: Could not generate persistent MAC address for veth439f217: No such file or directory
Sep 17 19:30:32 sentry-docker00.cs.umd.edu systemd-udevd[2476045]: Could not generate persistent MAC address for veth1bce6ae: No such file or directory
Sep 17 19:30:32 sentry-docker00.cs.umd.edu systemd-udevd[2476068]: Could not generate persistent MAC address for veth6b3eeb1: No such file or directory
Sep 17 19:50:40 sentry-docker00.cs.umd.edu systemd-udevd[2485406]: link_config: could not get ethtool features for vethd90424a
Sep 17 19:50:40 sentry-docker00.cs.umd.edu systemd-udevd[2485406]: Could not set offload features of vethd90424a: No such device
Sep 17 19:50:40 sentry-docker00.cs.umd.edu systemd-udevd[2485439]: Could not generate persistent MAC address for veth34037e3: No such file or directory
Sep 17 19:50:40 sentry-docker00.cs.umd.edu systemd-udevd[2485440]: Could not generate persistent MAC address for vethcaf91e3: No such file or directory
Sep 17 19:50:40 sentry-docker00.cs.umd.edu systemd-udevd[2485443]: Could not generate persistent MAC address for vethe20085c: No such file or directory
Sep 17 19:50:40 sentry-docker00.cs.umd.edu systemd-udevd[2485444]: Could not generate persistent MAC address for veth698f21a: No such file or directory
... 6 more distinct messages not shown
== strawberry (9 distinct, 40 total) ==
Sep 17 19:07:03 strawberry kernel: I/O error, dev sda, sector 206848 op 0x0:(READ) flags 0x80700 phys_seg 1 prio class 2 [x6]
Sep 17 19:07:03 strawberry kernel: I/O error, dev sda, sector 206848 op 0x0:(READ) flags 0x0 phys_seg 1 prio class 2 [x6]
Sep 17 19:07:03 strawberry kernel: Buffer I/O error on dev sda2, logical block 0, async page read [x6]
Sep 17 19:07:03 strawberry kernel: I/O error, dev sda, sector 2048 op 0x0:(READ) flags 0x80700 phys_seg 1 prio class 2 [x6]
Sep 17 19:07:03 strawberry kernel: I/O error, dev sda, sector 2048 op 0x0:(READ) flags 0x0 phys_seg 1 prio class 2 [x6]
Sep 17 19:07:03 strawberry kernel: Buffer I/O error on dev sda1, logical block 0, async page read [x6]
Sep 17 19:34:42 strawberry smartd[5314]: Device: /dev/sda [SAT], failed to read SMART Attribute Data [x2]
Sep 17 19:43:13 strawberry falcon-sensor-bpf[808]: CrowdStrike(4): Could not retrieve DisableProxy value: c0000225
Sep 17 19:43:13 strawberry falcon-sensor-bpf[808]: CrowdStrike(4): ConnectWithProxy: Unable to get application proxy host from CsConfig: c0000225
== stuckeys (2 distinct, 2 total) ==
Sep 17 19:21:57 stuckeys falcon-sensor-bpf[1493]: CrowdStrike(4): Could not retrieve DisableProxy value: c0000225
Sep 17 19:21:57 stuckeys falcon-sensor-bpf[1493]: CrowdStrike(4): ConnectWithProxy: Unable to get application proxy host from CsConfig: c0000225
== submit26-b9-f2 (1 distinct, 1 total) ==
Sep 17 19:43:06 submit26-b9-f2 systemd[1]: user(a)1001.service: Main process exited, code=killed, status=9/KILL
== submit26-b9-f3 (1 distinct, 1 total) ==
Sep 17 19:23:05 submit26-b9-f3 systemd[1]: user(a)1001.service: Main process exited, code=killed, status=9/KILL
== teaching-awards (2 distinct, 2 total) ==
Sep 17 19:49:16 teaching-awards falcon-sensor-bpf[782]: CrowdStrike(4): Could not retrieve DisableProxy value: c0000225
Sep 17 19:49:16 teaching-awards falcon-sensor-bpf[782]: CrowdStrike(4): ConnectWithProxy: Unable to get application proxy host from CsConfig: c0000225
== tulgey.cs.umd.edu (2 distinct, 2 total) ==
Sep 17 19:48:23 tulgey.cs.umd.edu falcon-sensor-bpf[1526]: CrowdStrike(4): Could not retrieve DisableProxy value: c0000225
Sep 17 19:48:23 tulgey.cs.umd.edu falcon-sensor-bpf[1526]: CrowdStrike(4): ConnectWithProxy: Unable to get application proxy host from CsConfig: c0000225
== tumtum.cs.umd.edu (2 distinct, 2 total) ==
Sep 17 19:59:32 tumtum.cs.umd.edu falcon-sensor-bpf[1360]: CrowdStrike(4): Could not retrieve DisableProxy value: c0000225
Sep 17 19:59:32 tumtum.cs.umd.edu falcon-sensor-bpf[1360]: CrowdStrike(4): ConnectWithProxy: Unable to get application proxy host from CsConfig: c0000225
== yogurt (2 distinct, 2 total) ==
Sep 17 19:51:11 yogurt falcon-sensor-bpf[947]: CrowdStrike(4): Could not retrieve DisableProxy value: c0000225
Sep 17 19:51:11 yogurt falcon-sensor-bpf[947]: CrowdStrike(4): ConnectWithProxy: Unable to get application proxy host from CsConfig: c0000225
== zwicker-computer (2 distinct, 2 total) ==
Sep 17 19:22:30 zwicker-computer falcon-sensor-bpf[718]: CrowdStrike(4): Could not retrieve DisableProxy value: c0000225
Sep 17 19:22:30 zwicker-computer falcon-sensor-bpf[718]: CrowdStrike(4): ConnectWithProxy: Unable to get application proxy host from CsConfig: c0000225
1
0
Command: /usr/local/sbin/syslog-digest.py
Time : 0.4873s
Status : exited 0
Output :
Syslog digest — 2026-09-17 19:05 EDT
Processed 24,467 lines, filtered 2,397 (9%). 22,070 unknown (902 distinct) from 23 host(s).
== atif01.cs.umd.edu (1 distinct, 1 total) ==
Sep 17 18:32:54 atif01.cs.umd.edu smartd[2697]: Device: /dev/sda [megaraid_disk_03] [SAT], ATA error count increased from 2 to 5
== b0b02.cs.umd.edu (4 distinct, 4 total) ==
Sep 17 18:10:59 b0b02.cs.umd.edu csregistry[5224]: time="2026-09-17T22:10:59.425451153Z" level=info msg="PurgeUploads starting: olderThan=2026-09-10 22:10:59.425378426 +0000 UTC m=+3890220.185306741, actuallyDelete=true"
Sep 17 18:10:59 b0b02.cs.umd.edu csregistry[5224]: time="2026-09-17T22:10:59.42596538Z" level=info msg="Purge uploads finished. Num deleted=0, num errors=1"
Sep 17 18:10:59 b0b02.cs.umd.edu csregistry[5224]: time="2026-09-17T22:10:59.425983116Z" level=info msg="Starting upload purge in 24h0m0s" go.version=go1.11.2 instance.id=68469aa4-7857-4a69-bf12-c2190b4f96d8 service=registry version=v2.7.1
Sep 17 18:48:24 b0b02.cs.umd.edu rustdesk[2247452]: cannot open display:
== bachata (10 distinct, 10 total) ==
Sep 17 18:33:05 bachata smbd[713035]: [2026/09/17 18:33:05.913925, 0] ../../source3/smbd/smb2_service.c:117(chdir_current_service)
Sep 17 18:33:05 bachata smbd[713035]: chdir_current_service: vfs_ChDir(/fs/junkfood/nelson) failed: Permission denied. Current token: uid=20608, gid=20608, 20 groups: 20608 319050000 25274 319000009 25057 30872 25195 30043 25038 15228 31006 15294 15206 15248 25025 30742 25200 319100011 30871 30736
Sep 17 18:33:05 bachata smbd[713035]: [2026/09/17 18:33:05.915085, 0] ../../source3/smbd/smbXsrv_tcon.c:914(smbXsrv_tcon_disconnect)
Sep 17 18:33:05 bachata smbd[713035]: smbXsrv_tcon_disconnect: disconnect(0x6e94e26f, 'nelson'): chdir_current_service() failed: NT_STATUS_INTERNAL_ERROR
Sep 17 18:33:05 bachata smbd[713035]: [2026/09/17 18:33:05.915323, 0] ../../source3/smbd/smbXsrv_tcon.c:1028(smbXsrv_tcon_disconnect_all)
Sep 17 18:33:05 bachata smbd[713035]: smbXsrv_tcon_disconnect_all: count[3] errors[1] first[NT_STATUS_INTERNAL_ERROR]
Sep 17 18:33:05 bachata smbd[713035]: [2026/09/17 18:33:05.915399, 0] ../../source3/smbd/smbXsrv_session.c:1900(smbXsrv_session_logoff)
Sep 17 18:33:05 bachata smbd[713035]: smbXsrv_session_logoff: smbXsrv_session_logoff(0xda66e9d1): smb2srv_tcon_disconnect_all() failed: NT_STATUS_INTERNAL_ERROR
Sep 17 18:33:05 bachata smbd[713035]: [2026/09/17 18:33:05.915471, 0] ../../source3/smbd/smbXsrv_session.c:1728(smbXsrv_session_remove_channel_done)
Sep 17 18:33:05 bachata smbd[713035]: smbXsrv_session_remove_channel_done: smbXsrv_session_logoff(3664177617) failed: NT_STATUS_INTERNAL_ERROR
== biggulp.cs.umd.edu (5 distinct, 5 total) ==
Sep 17 18:20:39 biggulp.cs.umd.edu sshd-session[2106522]: pam_access(sshd:auth): access denied for user `psadeghi' from `173.69.166.58'
Sep 17 18:53:27 biggulp.cs.umd.edu sshd-session[2111741]: error: maximum authentication attempts exceeded for root from 83.182.40.109 port 57270 ssh2 [preauth]
Sep 17 18:53:29 biggulp.cs.umd.edu sshd-session[2111743]: error: maximum authentication attempts exceeded for root from 83.182.40.109 port 57620 ssh2 [preauth]
Sep 17 18:53:31 biggulp.cs.umd.edu sshd-session[2111745]: error: maximum authentication attempts exceeded for root from 83.182.40.109 port 58010 ssh2 [preauth]
Sep 17 18:53:34 biggulp.cs.umd.edu sshd-session[2111755]: error: maximum authentication attempts exceeded for admin from 83.182.40.109 port 58678 ssh2 [preauth]
== csfw00a (1 distinct, 130 total) ==
Sep 17 18:04:08 csfw00a kernel: bnxt_en 0000:09:00.0 eth3: NIC Link is Down [x130]
== idm00 (3 distinct, 3 total) ==
Sep 17 18:39:35 idm00 named[4166701]: zone 73.10.in-addr.arpa/IN: zone_journal_compact: could not get zone size: not found
Sep 17 18:41:50 idm00 named[4166701]: zone cs.umd.edu/IN: zone_journal_compact: could not get zone size: not found
Sep 17 18:53:57 idm00 named[4166701]: client @0x7f11a93e2ef8 10.73.240.42#51181: update '73.10.in-addr.arpa/IN' denied
== idmh1 (2 distinct, 2 total) ==
Sep 17 18:39:59 idmh1 named[3565631]: zone cs.umd.edu/IN: zone_journal_compact: could not get zone size: not found
Sep 17 18:40:59 idmh1 named[3565631]: zone 73.10.in-addr.arpa/IN: zone_journal_compact: could not get zone size: not found
== idmp0 (3 distinct, 3 total) ==
Sep 17 18:37:57 idmp0 named[1598691]: client @0x7f2d2401b378 10.73.240.43#50894: update '73.10.in-addr.arpa/IN' denied
Sep 17 18:42:04 idmp0 named[1598691]: zone 73.10.in-addr.arpa/IN: zone_journal_compact: could not get zone size: not found
Sep 17 18:42:15 idmp0 named[1598691]: zone cs.umd.edu/IN: zone_journal_compact: could not get zone size: not found
== idmv0 (2 distinct, 2 total) ==
Sep 17 18:39:11 idmv0 named[3973338]: zone cs.umd.edu/IN: zone_journal_compact: could not get zone size: not found
Sep 17 18:40:54 idmv0 named[3973338]: zone 73.10.in-addr.arpa/IN: zone_journal_compact: could not get zone size: not found
== itmon02 (1 distinct, 5 total) ==
Sep 17 18:33:02 itmon02 sshd[1750555]: error: beginning MaxStartups throttling [x5]
== munin (2 distinct, 16 total) ==
Sep 17 18:13:42 munin sudo[3541863]: pam_systemd(sudo:session): Failed to stat() runtime directory '/run/user/0': No such file or directory [x8]
Sep 17 18:13:42 munin sudo[3541863]: pam_systemd(sudo:session): Not setting $XDG_RUNTIME_DIR, as the directory is not in order. [x8]
== networkvm02 (52 distinct, 307 total) ==
Sep 17 18:32:56 networkvm02 systemd[1]: iscsi.service: Unit cannot be reloaded because it is inactive. [x3]
Sep 17 18:36:10 networkvm02 virtqemud[2452]: Domain id=4 name='csfw01b-dryrun-test' uuid=7150536b-6962-4a75-87f8-0a95cbeab188 is tainted: deprecated-config (machine type 'pc-i440fx-rhel10.0.0')
Sep 17 18:36:12 networkvm02 setroubleshoot[3424270]: SELinux is preventing /usr/sbin/virtqemud from execute access on the file /usr/bin/udevadm. For complete SELinux messages run: sealert -l 02a5db74-fc40-4faf-ba56-71791c3ad557 [x10]
Sep 17 18:36:12 networkvm02 setroubleshoot[3424270]: SELinux is preventing /usr/bin/udevadm from execute_no_trans access on the file /usr/bin/udevadm. For complete SELinux messages run: sealert -l cd1df23e-67db-4dbc-a1d0-165d762d5fe7 [x10]
Sep 17 18:36:12 networkvm02 setroubleshoot[3424270]: SELinux is preventing /usr/bin/udevadm from map access on the file /usr/bin/udevadm. For complete SELinux messages run: sealert -l f90872cc-d913-4b9f-8ab5-1a62338d66f2 [x10]
Sep 17 18:36:12 networkvm02 setroubleshoot[3424270]: failed to retrieve rpm info for path '/sys/fs/selinux/status': [x10]
Sep 17 18:36:12 networkvm02 setroubleshoot[3424270]: SELinux is preventing /usr/bin/udevadm from map access on the file /sys/fs/selinux/status. For complete SELinux messages run: sealert -l 9aea9927-e617-46bc-898f-ac908d527cf6 [x10]
Sep 17 18:36:12 networkvm02 setroubleshoot[3424270]: SELinux is preventing /usr/bin/udevadm from read access on the lnk_file /proc/<pid>/root. For complete SELinux messages run: sealert -l 84fd72be-335e-4dde-a3e9-adcda617d487 [x10]
Sep 17 18:36:12 networkvm02 setroubleshoot[3424270]: SELinux is preventing /usr/bin/udevadm from write access on the sock_file control. For complete SELinux messages run: sealert -l d5ec459e-918d-4b1f-ae2a-059afe2b8644 [x10]
Sep 17 18:36:12 networkvm02 setroubleshoot[3424270]: failed to retrieve rpm info for path '/run/udev/control': [x10]
Sep 17 18:36:12 networkvm02 setroubleshoot[3424270]: SELinux is preventing /usr/bin/udevadm from connectto access on the unix_stream_socket /run/udev/control. For complete SELinux messages run: sealert -l 37644791-9f67-4fc8-b6be-25d574b13ce7 [x10]
Sep 17 18:36:12 networkvm02 setroubleshoot[3424270]: failed to retrieve rpm info for path '/run/udev': [x10]
Sep 17 18:36:12 networkvm02 setroubleshoot[3424270]: SELinux is preventing /usr/bin/udevadm from watch access on the directory /run/udev. For complete SELinux messages run: sealert -l 8a9f2907-47a3-4ac1-bf81-cf4f85be5704 [x10]
Sep 17 18:36:12 networkvm02 kernel: vfio-pci 0000:17:00.0: resetting [x20]
Sep 17 18:36:12 networkvm02 kernel: vfio-pci 0000:17:00.0: reset done [x20]
Sep 17 18:36:12 networkvm02 kernel: vfio-pci 0000:17:00.1: resetting [x20]
Sep 17 18:36:12 networkvm02 kernel: vfio-pci 0000:17:00.1: reset done [x20]
Sep 17 18:36:12 networkvm02 kernel: vfio-pci 0000:ab:00.0: resetting [x20]
Sep 17 18:36:12 networkvm02 kernel: vfio-pci 0000:ab:00.0: reset done [x20]
Sep 17 18:36:12 networkvm02 kernel: vfio-pci 0000:ab:00.1: resetting [x20]
Sep 17 18:36:13 networkvm02 kernel: vfio-pci 0000:ab:00.1: reset done [x20]
Sep 17 18:36:13 networkvm02 virtqemud[2452]: operation failed: guest CPU doesn't match specification: extra features: hypervisor,pku,arch-capabilities,rdctl-no,ibrs-all,skip-l1dfl-vmentry,mds-no [x2]
Sep 17 18:36:34 networkvm02 virtqemud[2452]: operation failed: domain 'csfw01b-dryrun-test' already exists with uuid 7150536b-6962-4a75-87f8-0a95cbeab188
Sep 17 18:36:35 networkvm02 virtqemud[2452]: Domain id=5 name='csfw01b-dryrun-test' uuid=7150536b-6962-4a75-87f8-0a95cbeab188 is tainted: deprecated-config (machine type 'pc-i440fx-rhel10.0.0')
Sep 17 18:36:47 networkvm02 virtqemud[2452]: Domain id=6 name='csfw01b-dryrun-test' uuid=d80e4ca8-fc15-4b6c-95f7-d20272849de0 is tainted: deprecated-config (machine type 'pc-i440fx-rhel10.0.0')
Sep 17 18:39:25 networkvm02 virtqemud[2452]: Domain id=7 name='csfw01b-dryrun-test' uuid=d80e4ca8-fc15-4b6c-95f7-d20272849de0 is tainted: deprecated-config (machine type 'pc-i440fx-rhel10.0.0')
Sep 17 18:41:52 networkvm02 virtqemud[2452]: Domain id=8 name='csfw01b-dryrun-test' uuid=d80e4ca8-fc15-4b6c-95f7-d20272849de0 is tainted: deprecated-config (machine type 'pc-i440fx-rhel10.0.0')
Sep 17 18:44:34 networkvm02 virtqemud[2452]: Domain id=9 name='csfw01b-dryrun-test' uuid=e7a0e326-7646-4063-b687-67a11d8dad5e is tainted: deprecated-config (machine type 'pc-i440fx-rhel10.0.0')
Sep 17 18:46:58 networkvm02 virtqemud[2452]: Domain id=10 name='guestfs-ojgx8dmkcka4if8x' uuid=8bc12886-bd4b-44a3-a48e-11fdc49ee88c is tainted: custom-argv
Sep 17 18:47:09 networkvm02 virtqemud[2452]: Domain id=11 name='guestfs-mlgyrkfbur9w2q1c' uuid=edf3f49c-3c01-4eff-b9c1-a68cf6def92e is tainted: custom-argv
... 22 more distinct messages not shown
== newhonors2 (1 distinct, 24 total) ==
Sep 17 18:13:03 newhonors2 dhcpcd[2779416]: dhcpcd is not running [x24]
== ntop00 (724 distinct, 21418 total) ==
Sep 17 18:06:01 ntop00 sfacctd[199410]: INFO ( default_print/print ): *** Purging cache - START (PID: 97) ***
Sep 17 18:06:01 ntop00 sfacctd[199410]: INFO ( default_print/print ): *** Purging cache - END (PID: 97, QN: 4512/4512, ET: 0) ***
Sep 17 18:06:02 ntop00 setroubleshoot[294792]: SELinux is preventing /usr/local/sbin/sfacctd from append access on the file sflow.json. For complete SELinux messages run: sealert -l 539d53cf-5c9e-4ce3-8be1-3107489dd267 [x3]
Sep 17 18:06:02 ntop00 setroubleshoot[294792]: SELinux is preventing /usr/local/sbin/sfacctd from write access on the file sflow.json. For complete SELinux messages run: sealert -l 4a31fdf6-45fc-4da3-a3a4-03f8ff60af3d [x3]
Sep 17 18:06:02 ntop00 setroubleshoot[294792]: failed to retrieve rpm info for path '/srv/pmacct/sflow.json': [x13]
Sep 17 18:06:02 ntop00 setroubleshoot[294792]: SELinux is preventing /usr/local/sbin/sfacctd from lock access on the file /srv/pmacct/sflow.json. For complete SELinux messages run: sealert -l a19c0db5-f585-4fb9-a34e-811b7321a145 [x3]
Sep 17 18:07:01 ntop00 nfacctd[199535]: INFO ( default_print/print ): *** Purging cache - START (PID: 97) ***
Sep 17 18:07:01 ntop00 nfacctd[199535]: INFO ( default_print/print ): *** Purging cache - END (PID: 97, QN: 68/68, ET: 0) ***
Sep 17 18:07:04 ntop00 setroubleshoot[294879]: SELinux is preventing /usr/local/sbin/nfacctd from append access on the file netflow.json. For complete SELinux messages run: sealert -l 41a326dc-aacd-478a-8da5-fdde097995a3 [x2]
Sep 17 18:07:04 ntop00 setroubleshoot[294879]: failed to retrieve rpm info for path '/srv/pmacct/netflow.json': [x3]
Sep 17 18:07:06 ntop00 setroubleshoot[294879]: SELinux is preventing /usr/local/sbin/nfacctd from open access on the file /srv/pmacct/netflow.json. For complete SELinux messages run: sealert -l c28a02e8-a028-434b-8b14-c5770a528750 [x2]
Sep 17 18:07:08 ntop00 setroubleshoot[294879]: SELinux is preventing /usr/local/sbin/nfacctd from write access on the file netflow.json. For complete SELinux messages run: sealert -l 6ee8ccb3-78cd-4317-9099-2cda6c9e7195 [x2]
Sep 17 18:07:10 ntop00 setroubleshoot[294879]: SELinux is preventing /usr/local/sbin/nfacctd from lock access on the file /srv/pmacct/netflow.json. For complete SELinux messages run: sealert -l 978c927f-8b4c-4fa4-8245-d7dd7f676027 [x2]
Sep 17 18:11:01 ntop00 sfacctd[199410]: INFO ( default_print/print ): *** Purging cache - START (PID: 98) ***
Sep 17 18:11:01 ntop00 sfacctd[199410]: INFO ( default_print/print ): *** Purging cache - END (PID: 98, QN: 4747/4747, ET: 0) ***
Sep 17 18:12:01 ntop00 pmacct-mariadb[296457]: 2026-09-17 22:12:01+00:00 [Warn] [Entrypoint]: /sys/fs/cgroup///memory.pressure not writable, functionality unavailable to MariaDB
Sep 17 18:12:01 ntop00 nfacctd[199535]: INFO ( default_print/print ): *** Purging cache - START (PID: 98) ***
Sep 17 18:12:01 ntop00 nfacctd[199535]: INFO ( default_print/print ): *** Purging cache - END (PID: 98, QN: 41/41, ET: 0) ***
Sep 17 18:12:01 ntop00 pmacct-mariadb[296457]: 2026-09-17 22:12:01 0 [Warning] mariadbd: io_uring_queue_init() failed with ENOSYS: check seccomp filters, and the kernel version (newer than 5.1 required)
Sep 17 18:12:01 ntop00 pmacct-mariadb[296457]: create_uring failed: falling back to libaio [x3]
Sep 17 18:12:03 ntop00 sfacctd[199410]: INFO ( default_print/print ): *** Purging cache - START (PID: 2) ***
Sep 17 18:12:03 ntop00 sfacctd[199410]: INFO ( default_print/print ): *** Purging cache - END (PID: 2, QN: 931/931, ET: 0) ***
Sep 17 18:12:03 ntop00 sfacctd[199410]: INFO ( default/core ): OK, Exiting ... [x5]
Sep 17 18:12:03 ntop00 sfacctd[296620]: INFO ( default/core ): sFlow Accounting Daemon, sfacctd 1.7.9-git (20240801-0 (32fd57eb)) [x5]
Sep 17 18:12:03 ntop00 sfacctd[296620]: INFO ( default/core ): '--enable-mysql' '--enable-pgsql' '--enable-sqlite3' '--enable-kafka' '--enable-geoipv2' '--enable-jansson' '--enable-rabbitmq' '--enable-nflog' '--enable-ndpi' '--enable-zmq' '--enable-avro' '--enable-serdes' '--enable-redis' '--enable-gnutls' 'AVRO_CFLAGS=-I/usr/local/avro/include' 'AVRO_LIBS=-L/usr/local/avro/lib -lavro' '--enable-l2' '--enable-traffic-bins' '--enable-bgp-bins' '--enable-bmp-bins' '--enable-st-bins' [x5]
Sep 17 18:12:03 ntop00 sfacctd[296620]: INFO ( default/core ): Reading configuration file '/etc/pmacct/sfacctd.conf'. [x5]
Sep 17 18:12:03 ntop00 sfacctd[296620]: INFO ( p1/print ): cache entries=16411 base cache memory=72208400 bytes [x5]
Sep 17 18:12:03 ntop00 sfacctd[296620]: INFO ( default/core ): waiting for sFlow data on interface=all ip=:: port=6343/udp [x5]
Sep 17 18:12:03 ntop00 sfacctd[296620]: INFO ( m1/mysql ): sql_table_type set to 'bgp' (aggregate includes one or more BGP primitives). [x5]
Sep 17 18:12:03 ntop00 sfacctd[296620]: INFO ( m1/mysql ): cache entries=32771 base cache memory=14899240 bytes [x5]
... 694 more distinct messages not shown
== outbound00.cs.umd.edu (1 distinct, 6 total) ==
Sep 17 18:09:09 outbound00.cs.umd.edu python3[1097518]: ldapdb [x6]
== outbound01.cs.umd.edu (1 distinct, 6 total) ==
Sep 17 18:13:06 outbound01.cs.umd.edu python3[3357221]: ldapdb [x6]
== sentry-docker00.cs.umd.edu (36 distinct, 36 total) ==
Sep 17 18:09:58 sentry-docker00.cs.umd.edu systemd-udevd[2437955]: Could not generate persistent MAC address for veth7f3d0f0: No such file or directory
Sep 17 18:09:58 sentry-docker00.cs.umd.edu systemd-udevd[2437956]: Could not generate persistent MAC address for vethae34349: No such file or directory
Sep 17 18:09:58 sentry-docker00.cs.umd.edu systemd-udevd[2437974]: Could not generate persistent MAC address for veth2026b71: No such file or directory
Sep 17 18:09:58 sentry-docker00.cs.umd.edu systemd-udevd[2437959]: Could not generate persistent MAC address for veth4c8d276: No such file or directory
Sep 17 18:09:58 sentry-docker00.cs.umd.edu systemd-udevd[2437963]: Could not generate persistent MAC address for vethd220bc8: No such file or directory
Sep 17 18:09:58 sentry-docker00.cs.umd.edu systemd-udevd[2437955]: Could not generate persistent MAC address for veth0d7310a: No such file or directory
Sep 17 18:09:58 sentry-docker00.cs.umd.edu systemd-udevd[2437986]: Could not generate persistent MAC address for vethcbc1fe4: No such file or directory
Sep 17 18:09:58 sentry-docker00.cs.umd.edu systemd-udevd[2437985]: Could not generate persistent MAC address for veth905eac6: No such file or directory
Sep 17 18:09:58 sentry-docker00.cs.umd.edu systemd-udevd[2438031]: Could not generate persistent MAC address for veth508a8c6: No such file or directory
Sep 17 18:09:58 sentry-docker00.cs.umd.edu systemd-udevd[2438017]: Could not generate persistent MAC address for veth2b46785: No such file or directory
Sep 17 18:30:07 sentry-docker00.cs.umd.edu systemd-udevd[2447373]: link_config: could not get ethtool features for veth7f3d0f0
Sep 17 18:30:07 sentry-docker00.cs.umd.edu systemd-udevd[2447373]: Could not set offload features of veth7f3d0f0: No such device
Sep 17 18:30:07 sentry-docker00.cs.umd.edu systemd-udevd[2447406]: Could not generate persistent MAC address for vethe8eae7c: No such file or directory
Sep 17 18:30:07 sentry-docker00.cs.umd.edu systemd-udevd[2447407]: Could not generate persistent MAC address for veth4c6ac0e: No such file or directory
Sep 17 18:30:07 sentry-docker00.cs.umd.edu systemd-udevd[2447410]: Could not generate persistent MAC address for vethe47044d: No such file or directory
Sep 17 18:30:07 sentry-docker00.cs.umd.edu systemd-udevd[2447411]: Could not generate persistent MAC address for veth649ec55: No such file or directory
Sep 17 18:30:07 sentry-docker00.cs.umd.edu systemd-udevd[2447434]: Could not generate persistent MAC address for vethdc26f62: No such file or directory
Sep 17 18:30:07 sentry-docker00.cs.umd.edu systemd-udevd[2447435]: Could not generate persistent MAC address for veth70089c3: No such file or directory
Sep 17 18:30:07 sentry-docker00.cs.umd.edu systemd-udevd[2447453]: Could not generate persistent MAC address for vethe79d5b2: No such file or directory
Sep 17 18:30:07 sentry-docker00.cs.umd.edu systemd-udevd[2447456]: Could not generate persistent MAC address for veth6bfaef9: No such file or directory
Sep 17 18:30:07 sentry-docker00.cs.umd.edu systemd-udevd[2447445]: Could not generate persistent MAC address for veth2133a92: No such file or directory
Sep 17 18:30:07 sentry-docker00.cs.umd.edu systemd-udevd[2447448]: Could not generate persistent MAC address for vethffa498c: No such file or directory
Sep 17 18:50:15 sentry-docker00.cs.umd.edu systemd-udevd[2456752]: link_config: could not get ethtool features for vethe8eae7c
Sep 17 18:50:15 sentry-docker00.cs.umd.edu systemd-udevd[2456752]: Could not set offload features of vethe8eae7c: No such device
Sep 17 18:50:15 sentry-docker00.cs.umd.edu systemd-udevd[2456755]: link_config: could not get ethtool features for vethffa498c
Sep 17 18:50:15 sentry-docker00.cs.umd.edu systemd-udevd[2456755]: Could not set offload features of vethffa498c: No such device
Sep 17 18:50:15 sentry-docker00.cs.umd.edu systemd-udevd[2456786]: Could not generate persistent MAC address for veth606dfd3: No such file or directory
Sep 17 18:50:15 sentry-docker00.cs.umd.edu systemd-udevd[2456787]: Could not generate persistent MAC address for veth2c41074: No such file or directory
Sep 17 18:50:15 sentry-docker00.cs.umd.edu systemd-udevd[2456790]: Could not generate persistent MAC address for veth8049790: No such file or directory
Sep 17 18:50:15 sentry-docker00.cs.umd.edu systemd-udevd[2456791]: Could not generate persistent MAC address for veth0e63cb5: No such file or directory
... 6 more distinct messages not shown
== strawberry (7 distinct, 38 total) ==
Sep 17 18:07:04 strawberry kernel: I/O error, dev sda, sector 206848 op 0x0:(READ) flags 0x80700 phys_seg 1 prio class 2 [x6]
Sep 17 18:07:04 strawberry kernel: I/O error, dev sda, sector 206848 op 0x0:(READ) flags 0x0 phys_seg 1 prio class 2 [x6]
Sep 17 18:07:04 strawberry kernel: Buffer I/O error on dev sda2, logical block 0, async page read [x6]
Sep 17 18:07:04 strawberry kernel: I/O error, dev sda, sector 2048 op 0x0:(READ) flags 0x80700 phys_seg 1 prio class 2 [x6]
Sep 17 18:07:04 strawberry kernel: I/O error, dev sda, sector 2048 op 0x0:(READ) flags 0x0 phys_seg 1 prio class 2 [x6]
Sep 17 18:07:04 strawberry kernel: Buffer I/O error on dev sda1, logical block 0, async page read [x6]
Sep 17 18:34:42 strawberry smartd[5314]: Device: /dev/sda [SAT], failed to read SMART Attribute Data [x2]
== submit26-b9-f1 (9 distinct, 9 total) ==
Sep 17 18:25:53 submit26-b9-f1 setroubleshoot[2210533]: SELinux is preventing /usr/bin/python3.9 from create access on the directory /(null). For complete SELinux messages run: sealert -l 3ef7d677-731f-46bf-9c34-c2c55fea665c
Sep 17 18:25:53 submit26-b9-f1 setroubleshoot[2210533]: SELinux is preventing /usr/bin/python3.9 from add_name access on the directory /(null). For complete SELinux messages run: sealert -l aa60e26f-72e1-45f1-bc12-aa8b3b669e36
Sep 17 18:25:53 submit26-b9-f1 setroubleshoot[2210533]: SELinux is preventing /usr/bin/python3.9 from create access on the file /(null). For complete SELinux messages run: sealert -l d088fb43-23ee-4ae8-ae6a-5d1c041ee2d6
Sep 17 18:25:53 submit26-b9-f1 setroubleshoot[2210533]: SELinux is preventing /usr/bin/python3.9 from open access on the file /tmp/libdnf.psey3Y/repodata/repomd.xml. For complete SELinux messages run: sealert -l 3b0d8c9a-6637-4d6e-a864-f1dd7c00377d
Sep 17 18:25:53 submit26-b9-f1 setroubleshoot[2210533]: SELinux is preventing /usr/bin/python3.9 from setattr access on the file repomd.xml. For complete SELinux messages run: sealert -l 0fd3339f-3ef2-45f3-9e58-65a58b42f3ee
Sep 17 18:25:53 submit26-b9-f1 setroubleshoot[2210533]: SELinux is preventing /usr/bin/python3.9 from read access on the directory libdnf.psey3Y. For complete SELinux messages run: sealert -l 0d661d88-dc9e-469d-986b-52e29b353aa8
Sep 17 18:25:53 submit26-b9-f1 setroubleshoot[2210533]: SELinux is preventing /usr/bin/python3.9 from remove_name access on the directory repomd.xml. For complete SELinux messages run: sealert -l 405a8556-cf9f-4ef4-8525-0dca18d4259d
Sep 17 18:25:53 submit26-b9-f1 setroubleshoot[2210533]: SELinux is preventing /usr/bin/python3.9 from unlink access on the file repomd.xml. For complete SELinux messages run: sealert -l 3c38e23e-3631-4cb5-81c7-992675c836d9
Sep 17 18:25:53 submit26-b9-f1 setroubleshoot[2210533]: SELinux is preventing /usr/bin/python3.9 from rmdir access on the directory repodata. For complete SELinux messages run: sealert -l a070e9b5-2867-47d6-b2e3-3b7d99725848
== submit26-b9-f2 (9 distinct, 12 total) ==
Sep 17 18:06:48 submit26-b9-f2 setroubleshoot[1345422]: SELinux is preventing /usr/bin/python3.9 from create access on the directory /(null). For complete SELinux messages run: sealert -l 0659d546-3107-4f75-b00f-008c85f41dc6
Sep 17 18:06:48 submit26-b9-f2 setroubleshoot[1345422]: SELinux is preventing /usr/bin/python3.9 from add_name access on the directory /(null). For complete SELinux messages run: sealert -l 156d9270-3466-4356-b86f-1a128825961a
Sep 17 18:06:48 submit26-b9-f2 setroubleshoot[1345422]: SELinux is preventing /usr/bin/python3.9 from create access on the file /(null). For complete SELinux messages run: sealert -l c8a40bf5-2fc4-46b3-b813-8592b3523339 [x2]
Sep 17 18:06:48 submit26-b9-f2 setroubleshoot[1345422]: SELinux is preventing /usr/bin/python3.9 from open access on the file /tmp/libdnf.HWxjhN/repodata/repomd.xml. For complete SELinux messages run: sealert -l 7f4c3a8e-0f99-47c4-9baf-e1336fe24876 [x2]
Sep 17 18:06:48 submit26-b9-f2 setroubleshoot[1345422]: SELinux is preventing /usr/bin/python3.9 from setattr access on the file repomd.xml. For complete SELinux messages run: sealert -l 988123da-b724-4e6a-900c-33a2723fdaf1 [x2]
Sep 17 18:06:48 submit26-b9-f2 setroubleshoot[1345422]: SELinux is preventing /usr/bin/python3.9 from read access on the directory libdnf.HWxjhN. For complete SELinux messages run: sealert -l ca585e2b-d50f-4264-8127-6b3fa04070c8
Sep 17 18:06:48 submit26-b9-f2 setroubleshoot[1345422]: SELinux is preventing /usr/bin/python3.9 from remove_name access on the directory repomd.xml. For complete SELinux messages run: sealert -l 3a749560-1cec-40ca-a4dc-596841be3885
Sep 17 18:06:48 submit26-b9-f2 setroubleshoot[1345422]: SELinux is preventing /usr/bin/python3.9 from unlink access on the file repomd.xml. For complete SELinux messages run: sealert -l 0aa52f08-94f8-474e-96d8-e818846941af
Sep 17 18:06:48 submit26-b9-f2 setroubleshoot[1345422]: SELinux is preventing /usr/bin/python3.9 from rmdir access on the directory repodata. For complete SELinux messages run: sealert -l de019dc4-408f-439c-902a-676d18dfe8e7
== submit26-b9-f3 (1 distinct, 2 total) ==
Sep 17 18:08:50 submit26-b9-f3 systemd[1]: user(a)1001.service: Main process exited, code=killed, status=9/KILL [x2]
== submit26-b9-fclone (17 distinct, 17 total) ==
Sep 17 18:36:26 submit26-b9-fclone kernel: Warning: Deprecated Hardware is detected: x86_64-v2:GenuineIntel:Intel(R) Xeon(R) CPU E5-2650 v2 @ 2.60GHz will not be maintained in a future major release and may be disabled
Sep 17 18:36:26 submit26-b9-fclone kernel: acpi PNP0A03:00: fail to add MMCONFIG information, can't access extended configuration space under this bridge
Sep 17 18:36:27 submit26-b9-fclone kernel: device-mapper: core: CONFIG_IMA_DISABLE_HTABLE is disabled. Duplicate IMA measurements will not be recorded in the IMA log.
Sep 17 18:36:28 submit26-b9-fclone kernel: sd 0:0:0:0: Power-on or device reset occurred
Sep 17 18:36:34 submit26-b9-fclone lvm[684]: PV /dev/sda2 online, VG rhel_submit9build is complete.
Sep 17 18:36:39 submit26-b9-fclone systemd[1]: resmon.service: Supervising process 922 which is not our child. We'll most likely not notice when it exits.
Sep 17 18:36:44 submit26-b9-fclone rsyslogd[997]: imjournal: filecreatemode is not set, using default 0644 [v8.2506.0-2.el9 try https://www.rsyslog.com/e/2186 ]
Sep 17 18:36:45 submit26-b9-fclone irqbalance[767]: Cannot change IRQ 28 affinity: Operation not permitted
Sep 17 18:36:45 submit26-b9-fclone irqbalance[767]: IRQ 28 affinity is now unmanaged
Sep 17 18:36:45 submit26-b9-fclone irqbalance[767]: Cannot change IRQ 29 affinity: Operation not permitted
Sep 17 18:36:45 submit26-b9-fclone irqbalance[767]: IRQ 29 affinity is now unmanaged
Sep 17 18:36:45 submit26-b9-fclone irqbalance[767]: Cannot change IRQ 27 affinity: Operation not permitted
Sep 17 18:36:45 submit26-b9-fclone irqbalance[767]: IRQ 27 affinity is now unmanaged
Sep 17 18:36:47 submit26-b9-fclone kernel: block dm-0: the capability attribute has been deprecated.
Sep 17 18:37:16 submit26-b9-fclone irqbalance[767]: Cannot change IRQ 30 affinity: Operation not permitted
Sep 17 18:37:16 submit26-b9-fclone irqbalance[767]: IRQ 30 affinity is now unmanaged
Sep 17 18:44:30 submit26-b9-fclone systemd[1]: user(a)1001.service: Main process exited, code=killed, status=9/KILL
== syslog01 (10 distinct, 14 total) ==
Sep 17 18:34:03 syslog01 puppet-agent[554153]: Connection to https://puppet:8140/puppet/v3 failed, trying next route: Request to https://puppet:8140/puppet/v3 failed after 0.006 seconds: Failed to open TCP connection to puppet:8140 (Device or resource busy - getaddrinfo)
Sep 17 18:34:03 syslog01 puppet-agent[554153]: Wrapped exception: [x3]
Sep 17 18:34:03 syslog01 puppet-agent[554153]: Failed to open TCP connection to puppet:8140 (Device or resource busy - getaddrinfo) [x3]
Sep 17 18:34:03 syslog01 puppet-agent[554153]: No more routes to fileserver
Sep 17 18:34:07 syslog01 puppet-agent[554153]: Connection to https://puppet:8140/puppet/v3 failed, trying next route: Request to https://puppet:8140/puppet/v3 failed after 0.002 seconds: Failed to open TCP connection to puppet:8140 (Device or resource busy - getaddrinfo)
Sep 17 18:34:07 syslog01 puppet-agent[554153]: Could not retrieve catalog from remote server: No more routes to puppet
Sep 17 18:34:07 syslog01 puppet-agent[554153]: Not using cache on failed catalog
Sep 17 18:34:07 syslog01 puppet-agent[554153]: Could not retrieve catalog; skipping run
Sep 17 18:34:07 syslog01 puppet-agent[554153]: Connection to https://puppet:8140/puppet/v3 failed, trying next route: Request to https://puppet:8140/puppet/v3 failed after 0.001 seconds: Failed to open TCP connection to puppet:8140 (Device or resource busy - getaddrinfo)
Sep 17 18:34:07 syslog01 puppet-agent[554153]: Could not send report: No more routes to report
1
0
Command: /usr/local/sbin/syslog-digest.py
Time : 0.0528s
Status : exited 0
Output :
Syslog digest — 2026-09-17 18:05 EDT
Processed 2,924 lines, filtered 2,503 (85%). 421 unknown (135 distinct) from 18 host(s).
== b0b02.cs.umd.edu (1 distinct, 1 total) ==
Sep 17 17:48:19 b0b02.cs.umd.edu rustdesk[2232289]: cannot open display:
== biggulp.cs.umd.edu (1 distinct, 1 total) ==
Sep 17 17:37:05 biggulp.cs.umd.edu sshd-session[2098631]: pam_access(sshd:auth): access denied for user `conniehg' from `73.133.150.131'
== csfw00a (1 distinct, 118 total) ==
Sep 17 17:03:44 csfw00a kernel: bnxt_en 0000:09:00.0 eth3: NIC Link is Down [x118]
== frozone (1 distinct, 1 total) ==
Sep 17 17:35:36 frozone systemd-tmpfiles[1908926]: Failed to remove "/var/tmp/test.log", ignoring: Operation not permitted
== idm00 (1 distinct, 1 total) ==
Sep 17 17:53:57 idm00 named[4166701]: client @0x7f11a0045838 10.73.240.42#59727: update '73.10.in-addr.arpa/IN' denied
== idmp0 (1 distinct, 1 total) ==
Sep 17 17:37:57 idmp0 named[1598691]: client @0x7f2d2402e528 10.73.240.43#54771: update '73.10.in-addr.arpa/IN' denied
== itmon02 (1 distinct, 4 total) ==
Sep 17 17:07:58 itmon02 sshd[1750555]: error: beginning MaxStartups throttling [x4]
== munin (2 distinct, 4 total) ==
Sep 17 17:23:04 munin sudo[3524440]: pam_systemd(sudo:session): Failed to stat() runtime directory '/run/user/0': No such file or directory [x2]
Sep 17 17:23:04 munin sudo[3524440]: pam_systemd(sudo:session): Not setting $XDG_RUNTIME_DIR, as the directory is not in order. [x2]
== networkvm02 (1 distinct, 2 total) ==
Sep 17 17:46:25 networkvm02 systemd[1]: iscsi.service: Unit cannot be reloaded because it is inactive. [x2]
== newhonors2 (1 distinct, 24 total) ==
Sep 17 17:13:02 newhonors2 dhcpcd[2777576]: dhcpcd is not running [x24]
== ntop00 (57 distinct, 156 total) ==
Sep 17 17:06:01 ntop00 sfacctd[199410]: INFO ( default_print/print ): *** Purging cache - START (PID: 85) ***
Sep 17 17:06:01 ntop00 sfacctd[199410]: INFO ( default_print/print ): *** Purging cache - END (PID: 85, QN: 4866/4866, ET: 0) ***
Sep 17 17:06:02 ntop00 setroubleshoot[284450]: SELinux is preventing /usr/local/sbin/sfacctd from append access on the file sflow.json. For complete SELinux messages run: sealert -l 539d53cf-5c9e-4ce3-8be1-3107489dd267 [x12]
Sep 17 17:06:02 ntop00 setroubleshoot[284450]: SELinux is preventing /usr/local/sbin/sfacctd from write access on the file sflow.json. For complete SELinux messages run: sealert -l 4a31fdf6-45fc-4da3-a3a4-03f8ff60af3d [x12]
Sep 17 17:06:02 ntop00 setroubleshoot[284450]: failed to retrieve rpm info for path '/srv/pmacct/sflow.json': [x12]
Sep 17 17:06:02 ntop00 setroubleshoot[284450]: SELinux is preventing /usr/local/sbin/sfacctd from lock access on the file /srv/pmacct/sflow.json. For complete SELinux messages run: sealert -l a19c0db5-f585-4fb9-a34e-811b7321a145 [x12]
Sep 17 17:07:01 ntop00 nfacctd[199535]: INFO ( default_print/print ): *** Purging cache - START (PID: 85) ***
Sep 17 17:07:01 ntop00 nfacctd[199535]: INFO ( default_print/print ): *** Purging cache - END (PID: 85, QN: 65/65, ET: 0) ***
Sep 17 17:07:04 ntop00 setroubleshoot[284498]: SELinux is preventing /usr/local/sbin/nfacctd from append access on the file netflow.json. For complete SELinux messages run: sealert -l 41a326dc-aacd-478a-8da5-fdde097995a3 [x12]
Sep 17 17:07:04 ntop00 setroubleshoot[284498]: failed to retrieve rpm info for path '/srv/pmacct/netflow.json': [x12]
Sep 17 17:07:06 ntop00 setroubleshoot[284498]: SELinux is preventing /usr/local/sbin/nfacctd from open access on the file /srv/pmacct/netflow.json. For complete SELinux messages run: sealert -l c28a02e8-a028-434b-8b14-c5770a528750 [x12]
Sep 17 17:07:08 ntop00 setroubleshoot[284498]: SELinux is preventing /usr/local/sbin/nfacctd from write access on the file netflow.json. For complete SELinux messages run: sealert -l 6ee8ccb3-78cd-4317-9099-2cda6c9e7195 [x12]
Sep 17 17:07:10 ntop00 setroubleshoot[284498]: SELinux is preventing /usr/local/sbin/nfacctd from lock access on the file /srv/pmacct/netflow.json. For complete SELinux messages run: sealert -l 978c927f-8b4c-4fa4-8245-d7dd7f676027 [x12]
Sep 17 17:11:01 ntop00 sfacctd[199410]: INFO ( default_print/print ): *** Purging cache - START (PID: 86) ***
Sep 17 17:11:01 ntop00 sfacctd[199410]: INFO ( default_print/print ): *** Purging cache - END (PID: 86, QN: 4759/4759, ET: 0) ***
Sep 17 17:12:01 ntop00 nfacctd[199535]: INFO ( default_print/print ): *** Purging cache - START (PID: 86) ***
Sep 17 17:12:01 ntop00 nfacctd[199535]: INFO ( default_print/print ): *** Purging cache - END (PID: 86, QN: 44/44, ET: 0) ***
Sep 17 17:16:01 ntop00 sfacctd[199410]: INFO ( default_print/print ): *** Purging cache - START (PID: 87) ***
Sep 17 17:16:01 ntop00 sfacctd[199410]: INFO ( default_print/print ): *** Purging cache - END (PID: 87, QN: 5049/5049, ET: 0) ***
Sep 17 17:17:01 ntop00 nfacctd[199535]: INFO ( default_print/print ): *** Purging cache - START (PID: 87) ***
Sep 17 17:17:01 ntop00 nfacctd[199535]: INFO ( default_print/print ): *** Purging cache - END (PID: 87, QN: 66/66, ET: 0) ***
Sep 17 17:21:01 ntop00 sfacctd[199410]: INFO ( default_print/print ): *** Purging cache - START (PID: 88) ***
Sep 17 17:21:01 ntop00 sfacctd[199410]: INFO ( default_print/print ): *** Purging cache - END (PID: 88, QN: 4675/4675, ET: 0) ***
Sep 17 17:22:01 ntop00 nfacctd[199535]: INFO ( default_print/print ): *** Purging cache - START (PID: 88) ***
Sep 17 17:22:01 ntop00 nfacctd[199535]: INFO ( default_print/print ): *** Purging cache - END (PID: 88, QN: 51/51, ET: 0) ***
Sep 17 17:26:01 ntop00 sfacctd[199410]: INFO ( default_print/print ): *** Purging cache - START (PID: 89) ***
Sep 17 17:26:01 ntop00 sfacctd[199410]: INFO ( default_print/print ): *** Purging cache - END (PID: 89, QN: 4874/4874, ET: 0) ***
Sep 17 17:27:01 ntop00 nfacctd[199535]: INFO ( default_print/print ): *** Purging cache - START (PID: 89) ***
Sep 17 17:27:01 ntop00 nfacctd[199535]: INFO ( default_print/print ): *** Purging cache - END (PID: 89, QN: 54/54, ET: 0) ***
Sep 17 17:31:01 ntop00 sfacctd[199410]: INFO ( default_print/print ): *** Purging cache - START (PID: 90) ***
... 27 more distinct messages not shown
== outbound00.cs.umd.edu (1 distinct, 6 total) ==
Sep 17 17:09:08 outbound00.cs.umd.edu python3[1083528]: ldapdb [x6]
== outbound01.cs.umd.edu (1 distinct, 6 total) ==
Sep 17 17:13:07 outbound01.cs.umd.edu python3[3343085]: ldapdb [x6]
== sentry-docker00.cs.umd.edu (38 distinct, 38 total) ==
Sep 17 17:09:33 sentry-docker00.cs.umd.edu systemd-udevd[2409365]: link_config: could not get ethtool features for veth9a695d4
Sep 17 17:09:33 sentry-docker00.cs.umd.edu systemd-udevd[2409365]: Could not set offload features of veth9a695d4: No such device
Sep 17 17:09:33 sentry-docker00.cs.umd.edu systemd-udevd[2409367]: link_config: could not get ethtool features for veth7e75bff
Sep 17 17:09:33 sentry-docker00.cs.umd.edu systemd-udevd[2409367]: Could not set offload features of veth7e75bff: No such device
Sep 17 17:09:33 sentry-docker00.cs.umd.edu systemd-udevd[2409403]: Could not generate persistent MAC address for veth93d7df8: No such file or directory
Sep 17 17:09:33 sentry-docker00.cs.umd.edu systemd-udevd[2409404]: Could not generate persistent MAC address for veth94bd482: No such file or directory
Sep 17 17:09:34 sentry-docker00.cs.umd.edu systemd-udevd[2409422]: Could not generate persistent MAC address for vetha1a6306: No such file or directory
Sep 17 17:09:34 sentry-docker00.cs.umd.edu systemd-udevd[2409407]: Could not generate persistent MAC address for vethbbeaae4: No such file or directory
Sep 17 17:09:34 sentry-docker00.cs.umd.edu systemd-udevd[2409410]: Could not generate persistent MAC address for vethd1b2c99: No such file or directory
Sep 17 17:09:34 sentry-docker00.cs.umd.edu systemd-udevd[2409421]: Could not generate persistent MAC address for veth3047637: No such file or directory
Sep 17 17:09:34 sentry-docker00.cs.umd.edu systemd-udevd[2409414]: Could not generate persistent MAC address for veth285242b: No such file or directory
Sep 17 17:09:34 sentry-docker00.cs.umd.edu systemd-udevd[2409418]: Could not generate persistent MAC address for veth02ab4d1: No such file or directory
Sep 17 17:09:34 sentry-docker00.cs.umd.edu systemd-udevd[2409476]: Could not generate persistent MAC address for veth0f55bd9: No such file or directory
Sep 17 17:09:34 sentry-docker00.cs.umd.edu systemd-udevd[2409478]: Could not generate persistent MAC address for veth24ecfac: No such file or directory
Sep 17 17:29:41 sentry-docker00.cs.umd.edu systemd-udevd[2419032]: link_config: could not get ethtool features for veth285242b
Sep 17 17:29:41 sentry-docker00.cs.umd.edu systemd-udevd[2419032]: Could not set offload features of veth285242b: No such device
Sep 17 17:29:42 sentry-docker00.cs.umd.edu systemd-udevd[2419063]: Could not generate persistent MAC address for vethcea99bf: No such file or directory
Sep 17 17:29:42 sentry-docker00.cs.umd.edu systemd-udevd[2419064]: Could not generate persistent MAC address for veth35273f7: No such file or directory
Sep 17 17:29:42 sentry-docker00.cs.umd.edu systemd-udevd[2419067]: Could not generate persistent MAC address for vethf3c9f7d: No such file or directory
Sep 17 17:29:42 sentry-docker00.cs.umd.edu systemd-udevd[2419075]: Could not generate persistent MAC address for veth39986a6: No such file or directory
Sep 17 17:29:42 sentry-docker00.cs.umd.edu systemd-udevd[2419082]: Could not generate persistent MAC address for vethcc0db56: No such file or directory
Sep 17 17:29:42 sentry-docker00.cs.umd.edu systemd-udevd[2419068]: Could not generate persistent MAC address for veth5ae1fcb: No such file or directory
Sep 17 17:29:42 sentry-docker00.cs.umd.edu systemd-udevd[2419093]: Could not generate persistent MAC address for veth6116b8d: No such file or directory
Sep 17 17:29:42 sentry-docker00.cs.umd.edu systemd-udevd[2419094]: Could not generate persistent MAC address for vethe84b6ba: No such file or directory
Sep 17 17:29:42 sentry-docker00.cs.umd.edu systemd-udevd[2419119]: Could not generate persistent MAC address for vethb6d5ea1: No such file or directory
Sep 17 17:29:42 sentry-docker00.cs.umd.edu systemd-udevd[2419120]: Could not generate persistent MAC address for veth1096be6: No such file or directory
Sep 17 17:49:50 sentry-docker00.cs.umd.edu systemd-udevd[2428453]: link_config: could not get ethtool features for vethcc0db56
Sep 17 17:49:50 sentry-docker00.cs.umd.edu systemd-udevd[2428453]: Could not set offload features of vethcc0db56: No such device
Sep 17 17:49:50 sentry-docker00.cs.umd.edu systemd-udevd[2428488]: Could not generate persistent MAC address for veth83fd905: No such file or directory
Sep 17 17:49:50 sentry-docker00.cs.umd.edu systemd-udevd[2428489]: Could not generate persistent MAC address for vetha61a79e: No such file or directory
... 8 more distinct messages not shown
== strawberry (7 distinct, 38 total) ==
Sep 17 17:07:03 strawberry kernel: I/O error, dev sda, sector 206848 op 0x0:(READ) flags 0x80700 phys_seg 1 prio class 2 [x6]
Sep 17 17:07:03 strawberry kernel: I/O error, dev sda, sector 206848 op 0x0:(READ) flags 0x0 phys_seg 1 prio class 2 [x6]
Sep 17 17:07:03 strawberry kernel: Buffer I/O error on dev sda2, logical block 0, async page read [x6]
Sep 17 17:07:03 strawberry kernel: I/O error, dev sda, sector 2048 op 0x0:(READ) flags 0x80700 phys_seg 1 prio class 2 [x6]
Sep 17 17:07:03 strawberry kernel: I/O error, dev sda, sector 2048 op 0x0:(READ) flags 0x0 phys_seg 1 prio class 2 [x6]
Sep 17 17:07:03 strawberry kernel: Buffer I/O error on dev sda1, logical block 0, async page read [x6]
Sep 17 17:34:42 strawberry smartd[5314]: Device: /dev/sda [SAT], failed to read SMART Attribute Data [x2]
== submit26-b9-f1 (1 distinct, 1 total) ==
Sep 17 17:27:05 submit26-b9-f1 systemd[1]: user(a)1001.service: Main process exited, code=killed, status=9/KILL
== submit26-b9-f3 (9 distinct, 9 total) ==
Sep 17 17:06:42 submit26-b9-f3 setroubleshoot[1634055]: SELinux is preventing /usr/bin/python3.9 from create access on the directory /(null). For complete SELinux messages run: sealert -l a653b772-cbcd-438b-bae5-23c3dc69b31b
Sep 17 17:06:42 submit26-b9-f3 setroubleshoot[1634055]: SELinux is preventing /usr/bin/python3.9 from add_name access on the directory /(null). For complete SELinux messages run: sealert -l 3e904634-6caa-4202-8c92-f139db798859
Sep 17 17:06:42 submit26-b9-f3 setroubleshoot[1634055]: SELinux is preventing /usr/bin/python3.9 from create access on the file /(null). For complete SELinux messages run: sealert -l 580b20e4-ec2c-433d-905c-5bd417fba033
Sep 17 17:06:42 submit26-b9-f3 setroubleshoot[1634055]: SELinux is preventing /usr/bin/python3.9 from open access on the file /tmp/libdnf.0GZCqw/repodata/repomd.xml. For complete SELinux messages run: sealert -l 27f29d48-5e7c-4db7-b051-8ac055737d6f
Sep 17 17:06:42 submit26-b9-f3 setroubleshoot[1634055]: SELinux is preventing /usr/bin/python3.9 from setattr access on the file repomd.xml. For complete SELinux messages run: sealert -l bff72452-d40a-430b-9060-dd0a48f5b6ba
Sep 17 17:06:42 submit26-b9-f3 setroubleshoot[1634055]: SELinux is preventing /usr/bin/python3.9 from read access on the directory libdnf.0GZCqw. For complete SELinux messages run: sealert -l 9638d396-8ce5-4e6a-ae47-45cd3985e1cd
Sep 17 17:06:42 submit26-b9-f3 setroubleshoot[1634055]: SELinux is preventing /usr/bin/python3.9 from remove_name access on the directory repomd.xml. For complete SELinux messages run: sealert -l 6da64b94-7024-45a9-b8c2-3b9812517407
Sep 17 17:06:42 submit26-b9-f3 setroubleshoot[1634055]: SELinux is preventing /usr/bin/python3.9 from unlink access on the file repomd.xml. For complete SELinux messages run: sealert -l 64cbe179-abf1-4d5a-bade-bb164897ee65
Sep 17 17:06:42 submit26-b9-f3 setroubleshoot[1634055]: SELinux is preventing /usr/bin/python3.9 from rmdir access on the directory repodata. For complete SELinux messages run: sealert -l d2e35b1a-e27c-4f91-9217-2bb1204e1e68
== submit26-b9-f4 (10 distinct, 10 total) ==
Sep 17 17:24:46 submit26-b9-f4 setroubleshoot[1204130]: SELinux is preventing /usr/bin/python3.9 from create access on the directory /(null). For complete SELinux messages run: sealert -l ee160f23-b161-4f4a-9985-c4edfd3a5beb
Sep 17 17:24:46 submit26-b9-f4 setroubleshoot[1204130]: SELinux is preventing /usr/bin/python3.9 from add_name access on the directory /(null). For complete SELinux messages run: sealert -l 89a83821-4b24-4081-9973-0a79ca6ed5b4
Sep 17 17:24:46 submit26-b9-f4 setroubleshoot[1204130]: SELinux is preventing /usr/bin/python3.9 from create access on the file /(null). For complete SELinux messages run: sealert -l f73955d6-1416-45f9-bab6-ff1f3ea07e9d
Sep 17 17:24:46 submit26-b9-f4 setroubleshoot[1204130]: SELinux is preventing /usr/bin/python3.9 from open access on the file /tmp/libdnf.qEeg5Z/repodata/repomd.xml. For complete SELinux messages run: sealert -l 9f8f24a0-8fb6-454d-a103-31a8f7a6efa0
Sep 17 17:24:46 submit26-b9-f4 setroubleshoot[1204130]: SELinux is preventing /usr/bin/python3.9 from setattr access on the file repomd.xml. For complete SELinux messages run: sealert -l 20293136-86a3-40ba-a651-cff48d36059e
Sep 17 17:24:46 submit26-b9-f4 setroubleshoot[1204130]: SELinux is preventing /usr/bin/python3.9 from read access on the directory libdnf.qEeg5Z. For complete SELinux messages run: sealert -l 25f86b49-4ee7-4f60-ad1c-73a70032560c
Sep 17 17:24:46 submit26-b9-f4 setroubleshoot[1204130]: SELinux is preventing /usr/bin/python3.9 from remove_name access on the directory repomd.xml. For complete SELinux messages run: sealert -l eec250fb-073f-456d-93bc-f98776fd476d
Sep 17 17:24:46 submit26-b9-f4 setroubleshoot[1204130]: SELinux is preventing /usr/bin/python3.9 from unlink access on the file repomd.xml. For complete SELinux messages run: sealert -l c9209e04-a349-43d5-8cb2-3e303e48df74
Sep 17 17:24:46 submit26-b9-f4 setroubleshoot[1204130]: SELinux is preventing /usr/bin/python3.9 from rmdir access on the directory repodata. For complete SELinux messages run: sealert -l 3178d5f5-80e9-404b-92b7-9bef397a8915
Sep 17 17:48:10 submit26-b9-f4 systemd[1]: user(a)1001.service: Main process exited, code=killed, status=9/KILL
1
0
Command: /usr/local/sbin/syslog-digest.py
Time : 0.0618s
Status : exited 0
Output :
Syslog digest — 2026-09-17 17:05 EDT
Processed 3,249 lines, filtered 2,833 (87%). 416 unknown (129 distinct) from 18 host(s).
== atif01.cs.umd.edu (1 distinct, 1 total) ==
Sep 17 16:06:21 atif01.cs.umd.edu kernel: net_ratelimit: 12 callbacks suppressed
== b0b02.cs.umd.edu (1 distinct, 1 total) ==
Sep 17 16:48:16 b0b02.cs.umd.edu rustdesk[2217125]: cannot open display:
== csfw00a (1 distinct, 121 total) ==
Sep 17 16:03:58 csfw00a kernel: bnxt_en 0000:09:00.0 eth3: NIC Link is Down [x121]
== idm00 (1 distinct, 1 total) ==
Sep 17 16:53:56 idm00 named[4166701]: client @0x7f11a93e0168 10.73.240.42#59759: update '73.10.in-addr.arpa/IN' denied
== idmp0 (1 distinct, 1 total) ==
Sep 17 16:37:57 idmp0 named[1598691]: client @0x7f2d0889dd48 10.73.240.43#58579: update '73.10.in-addr.arpa/IN' denied
== itmon02 (1 distinct, 2 total) ==
Sep 17 16:52:58 itmon02 sshd[1750555]: error: beginning MaxStartups throttling [x2]
== jaws.cs.umd.edu (3 distinct, 3 total) ==
Sep 17 17:01:28 jaws.cs.umd.edu systemd-coredump[1791397]: Process 1791382 (podman) of user 0 dumped core.#012#012Stack trace of thread 1791382:#012#0 0x000056553a52946e internal/runtime/syscall/linux.Syscall6 (podman + 0x48c46e)#012#1 0x000056553a609326 syscall.Syscall (podman + 0x56c326)#012#2 0x000056553a609ed0 syscall.Syscall.abi0 (podman + 0x56ced0)#012#3 0x000056553a77436e github.com/containers/podman/vendor/golang.org/x/sys/unix.OpenTree (podman + 0x6d736e)#012#4 0x000056553add144b github.com/containers/podman/vendor/github.com/cyphar/filepath-securejoin/p… (podman + 0xd3444b)#012#5 0x000056553add1354 github.com/containers/podman/vendor/github.com/cyphar/filepath-securejoin/p… (podman + 0xd34354)#012#6 0x000056553a5bcf8c sync.(*Once).doSlow (podman + 0x51ff8c)#012#7 0x000056553a5bceb9 sync.(*Once).Do (podman + 0x51feb9)#012#8 0x000056553add12c5
github.com/containers/podman/vendor/github.com/cyphar/filepath-securejoin/p… (podman + 0xd342c5)#012#9 0x000056553add28e2 github.com/containers/podman/vendor/github.com/cyphar/filepath-securejoin/p… (podman + 0xd358e2)#012#10 0x000056553add2cf3 github.com/containers/podman/vendor/github.com/cyphar/filepath-securejoin/p… (podman + 0xd35cf3)#012#11 0x000056553add1e1c github.com/containers/podman/vendor/github.com/cyphar/filepath-securejoin/p… (podman + 0xd34e1c)#012#12 0x000056553add1858 github.com/containers/podman/vendor/github.com/cyphar/filepath-securejoin/p… (podman + 0xd34858)#012#13 0x000056553a5bcf8c sync.(*Once).doSlow (podman + 0x51ff8c)#012#14 0x000056553a5bceb9 sync.(*Once).Do
(podman + 0x51feb9)#012#15 0x000056553add17c5 github.com/containers/podman/vendor/github.com/cyphar/filepath-securejoin/p… (podman + 0xd347c5)#012#16 0x000056553add2c9a github.com/containers/podman/vendor/github.com/cyphar/filepath-securejoin/p… (podman + 0xd35c9a)#012#17 0x000056553add984e github.com/containers/podman/vendor/github.com/opencontainers/selinux/go-se… (podman + 0xd3c84e)#012#18 0x000056553add9d38 github.com/containers/podman/vendor/github.com/opencontainers/selinux/go-se… (podman + 0xd3cd38)#012#19 0x000056553add8adf github.com/containers/podman/vendor/github.com/opencontainers/selinux/go-se… (podman + 0xd3badf)#012#20 0x000056553add8d73 github.com/containers/podman/vendor/github.com/opencontainers/selinux/go-se… (podman + 0xd3bd73)#012#21 0x00005
6553afd26cb github.com/containers/podman/vendor/go.podman.io/common/pkg/config.defaultC… (podman + 0xf356cb)#012#22 0x000056553afd60b2 github.com/containers/podman/vendor/go.podman.io/common/pkg/config.newLocked (podman + 0xf390b2)#012#23 0x000056553afd5da5 github.com/containers/podman/vendor/go.podman.io/common/pkg/config.New (podman + 0xf38da5)#012#24 0x000056553b7527d3 github.com/containers/podman/cmd/podman/registry.newPodmanConfig (podman + 0x16b57d3)#012#25 0x000056553a5bcf8c sync.(*Once).doSlow (podman + 0x51ff8c)#012#26 0x000056553b773550 github.com/containers/podman/cmd/podman/common.init (podman + 0x16d6550)#012#27 0x000056553a582af7 runtime.doInit1 (podman + 0x4e5af7)#012#28 0x000056553a573030 runtime.main (podman + 0x4d6030)#012#29 0x000056553a5b3061 runtime.goexit.abi0 (podman + 0x516061)#012ELF object binary architecture: AMD x86-64
Sep 17 17:01:30 jaws.cs.umd.edu systemd-coredump[1791420]: Process 1791405 (podman) of user 0 dumped core.#012#012Stack trace of thread 1791405:#012#0 0x000055c6d81c246e internal/runtime/syscall/linux.Syscall6 (podman + 0x48c46e)#012#1 0x000055c6d82a2326 syscall.Syscall (podman + 0x56c326)#012#2 0x000055c6d82a2ed0 syscall.Syscall.abi0 (podman + 0x56ced0)#012#3 0x000055c6d840d36e github.com/containers/podman/vendor/golang.org/x/sys/unix.OpenTree (podman + 0x6d736e)#012#4 0x000055c6d8a6a44b github.com/containers/podman/vendor/github.com/cyphar/filepath-securejoin/p… (podman + 0xd3444b)#012#5 0x000055c6d8a6a354 github.com/containers/podman/vendor/github.com/cyphar/filepath-securejoin/p… (podman + 0xd34354)#012#6 0x000055c6d8255f8c sync.(*Once).doSlow (podman + 0x51ff8c)#012#7 0x000055c6d8255eb9 sync.(*Once).Do (podman + 0x51feb9)#012#8 0x000055c6d8a6a2c5
github.com/containers/podman/vendor/github.com/cyphar/filepath-securejoin/p… (podman + 0xd342c5)#012#9 0x000055c6d8a6b8e2 github.com/containers/podman/vendor/github.com/cyphar/filepath-securejoin/p… (podman + 0xd358e2)#012#10 0x000055c6d8a6bcf3 github.com/containers/podman/vendor/github.com/cyphar/filepath-securejoin/p… (podman + 0xd35cf3)#012#11 0x000055c6d8a6ae1c github.com/containers/podman/vendor/github.com/cyphar/filepath-securejoin/p… (podman + 0xd34e1c)#012#12 0x000055c6d8a6a858 github.com/containers/podman/vendor/github.com/cyphar/filepath-securejoin/p… (podman + 0xd34858)#012#13 0x000055c6d8255f8c sync.(*Once).doSlow (podman + 0x51ff8c)#012#14 0x000055c6d8255eb9 sync.(*Once).Do
(podman + 0x51feb9)#012#15 0x000055c6d8a6a7c5 github.com/containers/podman/vendor/github.com/cyphar/filepath-securejoin/p… (podman + 0xd347c5)#012#16 0x000055c6d8a6bc9a github.com/containers/podman/vendor/github.com/cyphar/filepath-securejoin/p… (podman + 0xd35c9a)#012#17 0x000055c6d8a7284e github.com/containers/podman/vendor/github.com/opencontainers/selinux/go-se… (podman + 0xd3c84e)#012#18 0x000055c6d8a72d38 github.com/containers/podman/vendor/github.com/opencontainers/selinux/go-se… (podman + 0xd3cd38)#012#19 0x000055c6d8a71adf github.com/containers/podman/vendor/github.com/opencontainers/selinux/go-se… (podman + 0xd3badf)#012#20 0x000055c6d8a71d73 github.com/containers/podman/vendor/github.com/opencontainers/selinux/go-se… (podman + 0xd3bd73)#012#21 0x00005
5c6d8c6b6cb github.com/containers/podman/vendor/go.podman.io/common/pkg/config.defaultC… (podman + 0xf356cb)#012#22 0x000055c6d8c6f0b2 github.com/containers/podman/vendor/go.podman.io/common/pkg/config.newLocked (podman + 0xf390b2)#012#23 0x000055c6d8c6eda5 github.com/containers/podman/vendor/go.podman.io/common/pkg/config.New (podman + 0xf38da5)#012#24 0x000055c6d93eb7d3 github.com/containers/podman/cmd/podman/registry.newPodmanConfig (podman + 0x16b57d3)#012#25 0x000055c6d8255f8c sync.(*Once).doSlow (podman + 0x51ff8c)#012#26 0x000055c6d940c550 github.com/containers/podman/cmd/podman/common.init (podman + 0x16d6550)#012#27 0x000055c6d821baf7 runtime.doInit1 (podman + 0x4e5af7)#012#28 0x000055c6d820c030 runtime.main (podman + 0x4d6030)#012#29 0x000055c6d824c061 runtime.goexit.abi0 (podman + 0x516061)#012ELF object binary architecture: AMD x86-64
Sep 17 17:01:31 jaws.cs.umd.edu systemd-coredump[1791444]: Process 1791426 (podman) of user 0 dumped core.#012#012Stack trace of thread 1791426:#012#0 0x0000564fa67a146e internal/runtime/syscall/linux.Syscall6 (podman + 0x48c46e)#012#1 0x0000564fa6881326 syscall.Syscall (podman + 0x56c326)#012#2 0x0000564fa6881ed0 syscall.Syscall.abi0 (podman + 0x56ced0)#012#3 0x0000564fa69ec36e github.com/containers/podman/vendor/golang.org/x/sys/unix.OpenTree (podman + 0x6d736e)#012#4 0x0000564fa704944b github.com/containers/podman/vendor/github.com/cyphar/filepath-securejoin/p… (podman + 0xd3444b)#012#5 0x0000564fa7049354 github.com/containers/podman/vendor/github.com/cyphar/filepath-securejoin/p… (podman + 0xd34354)#012#6 0x0000564fa6834f8c sync.(*Once).doSlow (podman + 0x51ff8c)#012#7 0x0000564fa6834eb9 sync.(*Once).Do (podman + 0x51feb9)#012#8 0x0000564fa70492c5
github.com/containers/podman/vendor/github.com/cyphar/filepath-securejoin/p… (podman + 0xd342c5)#012#9 0x0000564fa704a8e2 github.com/containers/podman/vendor/github.com/cyphar/filepath-securejoin/p… (podman + 0xd358e2)#012#10 0x0000564fa704acf3 github.com/containers/podman/vendor/github.com/cyphar/filepath-securejoin/p… (podman + 0xd35cf3)#012#11 0x0000564fa7049e1c github.com/containers/podman/vendor/github.com/cyphar/filepath-securejoin/p… (podman + 0xd34e1c)#012#12 0x0000564fa7049858 github.com/containers/podman/vendor/github.com/cyphar/filepath-securejoin/p… (podman + 0xd34858)#012#13 0x0000564fa6834f8c sync.(*Once).doSlow (podman + 0x51ff8c)#012#14 0x0000564fa6834eb9 sync.(*Once).Do
(podman + 0x51feb9)#012#15 0x0000564fa70497c5 github.com/containers/podman/vendor/github.com/cyphar/filepath-securejoin/p… (podman + 0xd347c5)#012#16 0x0000564fa704ac9a github.com/containers/podman/vendor/github.com/cyphar/filepath-securejoin/p… (podman + 0xd35c9a)#012#17 0x0000564fa705184e github.com/containers/podman/vendor/github.com/opencontainers/selinux/go-se… (podman + 0xd3c84e)#012#18 0x0000564fa7051d38 github.com/containers/podman/vendor/github.com/opencontainers/selinux/go-se… (podman + 0xd3cd38)#012#19 0x0000564fa7050adf github.com/containers/podman/vendor/github.com/opencontainers/selinux/go-se… (podman + 0xd3badf)#012#20 0x0000564fa7050d73 github.com/containers/podman/vendor/github.com/opencontainers/selinux/go-se… (podman + 0xd3bd73)#012#21 0x00005
64fa724a6cb github.com/containers/podman/vendor/go.podman.io/common/pkg/config.defaultC… (podman + 0xf356cb)#012#22 0x0000564fa724e0b2 github.com/containers/podman/vendor/go.podman.io/common/pkg/config.newLocked (podman + 0xf390b2)#012#23 0x0000564fa724dda5 github.com/containers/podman/vendor/go.podman.io/common/pkg/config.New (podman + 0xf38da5)#012#24 0x0000564fa79ca7d3 github.com/containers/podman/cmd/podman/registry.newPodmanConfig (podman + 0x16b57d3)#012#25 0x0000564fa6834f8c sync.(*Once).doSlow (podman + 0x51ff8c)#012#26 0x0000564fa79eb550 github.com/containers/podman/cmd/podman/common.init (podman + 0x16d6550)#012#27 0x0000564fa67faaf7 runtime.doInit1 (podman + 0x4e5af7)#012#28 0x0000564fa67eb030 runtime.main (podman + 0x4d6030)#012#29 0x0000564fa682b061 runtime.goexit.abi0 (podman + 0x516061)#012ELF object binary architecture: AMD x86-64
== munin (2 distinct, 4 total) ==
Sep 17 16:44:05 munin sudo[3510329]: pam_systemd(sudo:session): Failed to stat() runtime directory '/run/user/0': No such file or directory [x2]
Sep 17 16:44:05 munin sudo[3510329]: pam_systemd(sudo:session): Not setting $XDG_RUNTIME_DIR, as the directory is not in order. [x2]
== newhonors2 (1 distinct, 24 total) ==
Sep 17 16:13:03 newhonors2 dhcpcd[2775702]: dhcpcd is not running [x24]
== nightingale (8 distinct, 8 total) ==
Sep 17 16:59:55 nightingale gsd-subman[6922]: g_atomic_ref_count_dec: assertion 'g_atomic_int_get (arc) > 0' failed
Sep 17 16:59:55 nightingale xdg-desktop-por[7170]: Caught PipeWire error: connection error
Sep 17 17:00:11 nightingale systemd-coredump[81940]: Process 6897 (PanGPUI) of user 120942471 dumped core.#012#012Stack trace of thread 6897:#012#0 0x00007f4907a8d38c __pthread_kill_implementation (libc.so.6 + 0x8d38c)#012#1 0x00007f4907a3fa86 raise (libc.so.6 + 0x3fa86)#012#2 0x00007f4907a29873 abort (libc.so.6 + 0x29873)#012#3 0x00007f4907a2a1b2 __libc_message.cold (libc.so.6 + 0x2a1b2)#012#4 0x00007f4907b1d52b __fortify_fail (libc.so.6 + 0x11d52b)#012#5 0x00007f4907b1e7a6 __stack_chk_fail (libc.so.6 + 0x11e7a6)#012#6 0x00007f490c2d15ff _ZN14QObjectPrivate14deleteChildrenEv (libQt5Core.so.5 + 0x2d15ff)#012#7 0x00007f490b1edeb6 _ZN7QWidgetD1Ev (libQt5Widgets.so.5 + 0x1edeb6)#012#8 0x000055cf91c37968 n/a (PanGPUI + 0x74968)#012#9 0x00007f4907a2a610 __libc_start_call_main (libc.so.6 + 0x2a610)#012#10 0x00007f4907a2a6c0 __libc_start_main@@GLIBC_2.34 (libc.so.6 + 0x2a6c0)#012#11 0x000055cf91c412fe n/a (PanGPUI + 0x7e2fe)#012#012Stack trace of thread 7463:#012#0 0x00007f4907a8
854a __futex_abstimed_wait_common (libc.so.6 + 0x8854a)#012#1 0x00007f4907a8ab32 pthread_cond_wait@@GLIBC_2.3.2 (libc.so.6 + 0x8ab32)#012#2 0x00007f4907ed56c0 _ZNSt18condition_variable4waitERSt11unique_lockISt5mutexE (libstdc++.so.6 + 0xd56c0)#012#3 0x00007f49090662ca _ZN3WTF10ParkingLot17parkConditionallyEPKvSt8functionIFbvEES3_IFvvEENSt6chrono10time_pointINS8_3_V212steady_clockENS8_8durationIlSt5ratioILl1ELl1000000000EEEEEE (libQt5WebKit.so.5 + 0xe662ca)#012#4 0x00007f4909064a5b _ZN3WTF18ParallelHelperPool21waitForClientWithTaskERKNS_6LockerINS_8LockBaseEEE (libQt5WebKit.so.5 + 0xe64a5b)#012#5 0x00007f4909064b35 _ZN3WTF18ParallelHelperPool16helperThreadBodyEv (libQt5WebKit.so.5 + 0xe64b35)#012#6 0x00007f4909068a35 _ZN3WTFL16threadEntryPointEPv (libQt5WebKit.so.5 + 0xe68a35)#012#7 0x00007f49090887ff _ZN3WTFL19wtfThreadEntryPointEPv (libQt5WebKit.so.5 + 0xe887ff)#012#8 0x00007f4907a8b569 start_thread (libc.so.6 + 0x8b569)#012#9 0x00007f4907b10760 __clone3 (libc.so.6 + 0x110
760)#012#012Stack trace of thread 7459:#012#0 0x00007f4907b0345f __poll (libc.so.6 + 0x10345f)#012#1 0x00007f49081703bc g_main_context_iterate.constprop.0 (libglib-2.0.so.0 + 0xaa3bc)#012#2 0x00007f4908118783 g_main_context_iteration (libglib-2.0.so.0 + 0x52783)#012#3 0x00007f490c2f9878 _ZN20QEventDispatcherGlib13processEventsE6QFlagsIN10QEventLoop17ProcessEventsFlagEE (libQt5Core.so.5 + 0x2f9878)#012#4 0x00007f490c2a6402 _ZN10QEventLoop4execE6QFlagsINS_17ProcessEventsFlagEE (libQt5Core.so.5 + 0x2a6402)#012#5 0x00007f490c0e8a1a _ZN7QThread4execEv (libQt5Core.so.5 + 0xe8a1a)#012#6 0x00007f490c0e9cfd _ZN14QThreadPrivate5startEPv (libQt5Core.so.5 + 0xe9cfd)#012#7 0x00007f4907a8b569 start_thread (libc.so.6 + 0x8b569)#012#8 0x00007f4907b10760 __clone3 (libc.so.6 + 0x110760)#012#012Stack trace of thread 7302:#012#0 0x00007f4907b0345f __poll (libc.so.6 + 0x10345f)#012#1 0x00007f49081703bc g_main_context_iterate.constprop.0 (libglib-2.0.so.0 + 0xaa3bc)#012#2 0x00007f4908118783 g
_main_context_iteration (libglib-2.0.so.0 + 0x52783)#012#3 0x00007f490c2f9878 _ZN20QEventDispatcherGlib13processEventsE6QFlagsIN10QEventLoop17ProcessEventsFlagEE (libQt5Core.so.5 + 0x2f9878)#012#4 0x00007f490c2a6402 _ZN10QEventLoop4execE6QFlagsINS_17ProcessEventsFlagEE (libQt5Core.so.5 + 0x2a6402)#012#5 0x00007f490c0e8a1a _ZN7QThread4execEv (libQt5Core.so.5 + 0xe8a1a)#012#6 0x00007f48f5d36b8b _ZN22QDBusConnectionManager3runEv (libQt5DBus.so.5 + 0x1bb8b)#012#7 0x00007f490c0e9cfd _ZN14QThreadPrivate5startEPv (libQt5Core.so.5 + 0xe9cfd)#012#8 0x00007f4907a8b569 start_thread (libc.so.6 + 0x8b569)#012#9 0x00007f4907b10760 __clone3 (libc.so.6 + 0x110760)#012#012Stack trace of thread 7464:#012#0 0x00007f4907a8854a __futex_abstimed_wait_common (libc.so.6 + 0x8854a)#012#1 0x00007f4907a8ab32 pthread_cond_wait@@GLIBC_2.3.2 (libc.so.6 + 0x8ab32)#012#2 0x00007f4907ed56c0 _ZNSt18condition_variable4waitERSt11unique_lockISt5mutexE (libstdc++.so.6 + 0xd56c0)#012#3 0x00007f49090662ca _ZN3W
TF10ParkingLot17parkConditionallyEPKvSt8functionIFbvEES3_IFvvEENSt6chrono10time_pointINS8_3_V212steady_clockENS8_8durationIlSt5ratioILl1ELl1000000000EEEEEE (libQt5WebKit.so.5 + 0xe662ca)#012#4 0x00007f4909064a5b _ZN3WTF18ParallelHelperPool21waitForClientWithTaskERKNS_6LockerINS_8LockBaseEEE (libQt5WebKit.so.5 + 0xe64a5b)#012#5 0x00007f4909064b35 _ZN3WTF18ParallelHelperPool16helperThreadBodyEv (libQt5WebKit.so.5 + 0xe64b35)#012#6 0x00007f4909068a35 _ZN3WTFL16threadEntryPointEPv (libQt5WebKit.so.5 + 0xe68a35)#012#7 0x00007f49090887ff _ZN3WTFL19wtfThreadEntryPointEPv (libQt5WebKit.so.5 + 0xe887ff)#012#8 0x00007f4907a8b569 start_thread (libc.so.6 + 0x8b569)#012#9 0x00007f4907b10760 __clone3 (libc.so.6 + 0x110760)#012#012Stack trace of thread 7483:#012#0 0x00007f4907a8854a __futex_abstimed_wait_common (libc.so.6 + 0x8854a)#012#1 0x00007f4907a8ab32 pthread_cond_wait@@GLIBC_2.3.2 (libc.so.6 + 0x8ab32)#012#2 0x00007f4907ed56c0 _ZNSt18condition_variable4waitERSt11unique_lockISt5mute
xE (libstdc++.so.6 + 0xd56c0)#012#3 0x00007f49090662ca _ZN3WTF10ParkingLot17parkConditionallyEPKvSt8functionIFbvEES3_IFvvEENSt6chrono10time_pointINS8_3_V212steady_clockENS8_8durationIlSt5ratioILl1ELl1000000000EEEEEE (libQt5WebKit.so.5 + 0xe662ca)#012#4 0x00007f4908a08930 _ZN3JSC3DFG8Worklist9runThreadEPNS0_10ThreadDataE (libQt5WebKit.so.5 + 0x808930)#012#5 0x00007f4909068a35 _ZN3WTFL16threadEntryPointEPv (libQt5WebKit.so.5 + 0xe68a35)#012#6 0x00007f49090887ff _ZN3WTFL19wtfThreadEntryPointEPv (libQt5WebKit.so.5 + 0xe887ff)#012#7 0x00007f4907a8b569 start_thread (libc.so.6 + 0x8b569)#012#8 0x00007f4907b10760 __clone3 (libc.so.6 + 0x110760)#012#012Stack trace of thread 7465:#012#0 0x00007f4907a8854a __futex_abstimed_wait_common (libc.so.6 + 0x8854a)#012#1 0x00007f4907a8ab32 pthread_cond_wait@@GLIBC_2.3.2 (libc.so.6 + 0x8ab32)#012#2 0x00007f4907ed56c0 _ZNSt18condition_variable4waitERSt11unique_lockISt5mutexE (libstdc++.so.6 + 0xd56c0)#012#3 0x00007f49090662ca _ZN3WTF10ParkingLo
t17parkConditionallyEPKvSt8functionIFbvEES3_IFvvEENSt6chrono10time_pointINS8_3_V212steady_clockENS8_8durationIlSt5ratioILl1ELl1000000000EEEEEE (libQt5WebKit.so.5 + 0xe662ca)#012#4 0x00007f4909064a5b _ZN3WTF18ParallelHelperPool21waitForClientWithTaskERKNS_6LockerINS_8LockBaseEEE (libQt5WebKit.so.5 + 0xe64a5b)#012#5 0x00007f4909064b35 _ZN3WTF18ParallelHelperPool16helperThreadBodyEv (libQt5WebKit.so.5 + 0xe64b35)#012#6 0x00007f4909068a35 _ZN3WTFL16threadEntryPointEPv (libQt5WebKit.so.5 + 0xe68a35)#012#7 0x00007f49090887ff _ZN3WTFL19wtfThreadEntryPointEPv (libQt5WebKit.so.5 + 0xe887ff)#012#8 0x00007f4907a8b569 start_thread (libc.so.6 + 0x8b569)#012#9 0x00007f4907b10760 __clone3 (libc.so.6 + 0x110760)#012#012Stack trace of thread 7461:#012#0 0x00007f4907a8854a __futex_abstimed_wait_common (libc.so.6 + 0x8854a)#012#1 0x00007f4907a8ab32 pthread_cond_wait@@GLIBC_2.3.2 (libc.so.6 + 0x8ab32)#012#2 0x00007f4891d14a5d cnd_wait (libgallium-25.2.7.so + 0x514a5d)#012#3 0x00007f4891ce431b
util_queue_thread_func (libgallium-25.2.7.so + 0x4e431b)#012#4 0x00007f4891d1498b impl_thrd_routine (libgallium-25.2.7.so + 0x51498b)#012#5 0x00007f4907a8b569 start_thread (libc.so.6 + 0x8b569)#012#6 0x00007f4907b10760 __clone3 (libc.so.6 + 0x110760)#012#012Stack trace of thread 7384:#012#0 0x00007f4907b0345f __poll (libc.so.6 + 0x10345f)#012#1 0x00007f49081703bc g_main_context_iterate.constprop.0 (libglib-2.0.so.0 + 0xaa3bc)#012#2 0x00007f4908118783 g_main_context_iteration (libglib-2.0.so.0 + 0x52783)#012#3 0x00007f49081187d1 glib_worker_main (libglib-2.0.so.0 + 0x527d1)#012#4 0x00007f4908149902 g_thread_proxy (libglib-2.0.so.0 + 0x83902)#012#5 0x00007f4907a8b569 start_thread (libc.so.6 + 0x8b569)#012#6 0x00007f4907b10760 __clone3 (libc.so.6 + 0x110760)#012#012Stack trace of thread 7468:#012#0 0x00007f4907a8854a __futex_abstimed_wait_common (libc.so.6 + 0x8854a)#012#1 0x00007f4907a8ab32 pthread_cond_wait@@GLIBC_2.3.2 (libc.so.6 + 0x8ab32)#012#2 0x00007f4907ed56c0 _ZN
St18condition_variable4waitERSt11unique_lockISt5mutexE (libstdc++.so.6 + 0xd56c0)#012#3 0x00007f4
Sep 17 17:00:16 nightingale org.gnome.Shell.desktop[82747]: The XKEYBOARD keymap compiler (xkbcomp) reports:
Sep 17 17:00:16 nightingale org.gnome.Shell.desktop[82747]: > Warning: Unsupported maximum keycode 708, clipping.
Sep 17 17:00:16 nightingale org.gnome.Shell.desktop[82747]: > X11 cannot support keycodes above 255.
Sep 17 17:00:16 nightingale org.gnome.Shell.desktop[82747]: Errors from xkbcomp are not fatal to the X server
Sep 17 17:00:19 nightingale systemd-coredump[81896]: Process 24139 (firefox) of user 120942471 dumped core.#012#012Stack trace of thread 24161:#012#0 0x00007feced08d38c __pthread_kill_implementation (libc.so.6 + 0x8d38c)#012#1 0x00007feced03fa86 raise (libc.so.6 + 0x3fa86)#012#2 0x00007fece1b76155 _ZN13nsProfileLock18FatalSignalHandlerEiP9siginfo_tPv (libxul.so + 0x5976155)#012#3 0x00007feced03fb30 __restore_rt (libc.so.6 + 0x3fb30)#012#4 0x00007fece1017446 _ZN7mozilla6widget24WlCompositorCrashHandlerEv (libxul.so + 0x4e17446)#012#5 0x00007fece10191fc _ZN17ProxiedConnection14ProcessFailureEv (libxul.so + 0x4e191fc)#012#6 0x00007fece101b309 _ZN12WaylandProxy18ProcessConnectionsEv (libxul.so + 0x4e1b309)#012#7 0x00007fece101b404 _ZN12WaylandProxy3RunEv (libxul.so + 0x4e1b404)#012#8 0x00007fece101b484 _ZN12WaylandProxy14RunProxyThreadEPS_ (libxul.so + 0x4e1b484)#012#9 0x00007feced08b569 start_thread (libc.so.6 + 0x8b569)#012#10 0x00007feced110760 __clone3 (libc.so.6 + 0x110760
)#012#012Stack trace of thread 24158:#012#0 0x00007feced0ff44c read (libc.so.6 + 0xff44c)#012#1 0x00007fece17d5cd3 _ZN24AsyncSignalControlThread5WatchEv (libxul.so + 0x55d5cd3)#012#2 0x00007fece17d5e8c _ZL29AsyncSignalControlThreadEntryPv (libxul.so + 0x55d5e8c)#012#3 0x00007feced08b569 start_thread (libc.so.6 + 0x8b569)#012#4 0x00007feced110760 __clone3 (libc.so.6 + 0x110760)#012#012Stack trace of thread 24159:#012#0 0x00007feced10345f __poll (libc.so.6 + 0x10345f)#012#1 0x00007feceaf703bc g_main_context_iterate.constprop.0 (libglib-2.0.so.0 + 0xaa3bc)#012#2 0x00007feceaf18783 g_main_context_iteration (libglib-2.0.so.0 + 0x52783)#012#3 0x00007feceaf187d1 glib_worker_main (libglib-2.0.so.0 + 0x527d1)#012#4 0x00007feceaf49902 g_thread_proxy (libglib-2.0.so.0 + 0x83902)#012#5 0x00007feced08b569 start_thread (libc.so.6 + 0x8b569)#012#6 0x00007feced110760 __clone3 (libc.so.6 + 0x110760)#012#012Stack trace of thread 24163:#012#0 0x00007feced10345f __poll (libc.so.6 + 0x10345
f)#012#1 0x00007feceaf703bc g_main_context_iterate.constprop.0 (libglib-2.0.so.0 + 0xaa3bc)#012#2 0x00007feceaf1a613 g_main_loop_run (libglib-2.0.so.0 + 0x54613)#012#3 0x00007feceae00ffa gdbus_shared_thread_func.lto_priv.0 (libgio-2.0.so.0 + 0x111ffa)#012#4 0x00007feceaf49902 g_thread_proxy (libglib-2.0.so.0 + 0x83902)#012#5 0x00007feced08b569 start_thread (libc.so.6 + 0x8b569)#012#6 0x00007feced110760 __clone3 (libc.so.6 + 0x110760)#012#012Stack trace of thread 24208:#012#0 0x00007feced10345f __poll (libc.so.6 + 0x10345f)#012#1 0x00007fecec22013c wl_display_dispatch_queue (libwayland-client.so.0 + 0xa13c)#012#2 0x00007fecec22124f wl_display_roundtrip_queue (libwayland-client.so.0 + 0xb24f)#012#3 0x00007fecc024dc59 dri2_wl_create_window_surface (libEGL_mesa.so.0 + 0x2dc59)#012#4 0x00007fecc0242528 dri2_create_window_surface (libEGL_mesa.so.0 + 0x22528)#012#5 0x00007fecc0233aeb _eglCreateWindowSurfaceCommon (libEGL_mesa.so.0 + 0x13aeb)#012#6 0x00007fecddf411bb _ZN7mozill
a2gl12GLContextEGL29CreateWaylandOffscreenSurfaceERNS0_10EglDisplayEPvRNS_3gfx12IntSizeTypedINS5_12UnknownUnitsEEE (libxul.so + 0x1d411bb)#012#7 0x00007fecddf4dabd _ZN7mozilla2gl12GLContextEGL35CreateEGLSurfaceForCompositorWidgetEPNS_6widget16CompositorWidgetEPv (libxul.so + 0x1d4dabd)#012#8 0x00007fecde393ce8 _ZN7mozilla2wr19RenderCompositorEGL16CreateEGLSurfaceEv (libxul.so + 0x2193ce8)#012#9 0x00007fecde393d6a _ZN7mozilla2wr19RenderCompositorEGL6ResumeEv (libxul.so + 0x2193d6a)#012#10 0x00007fecde39a27a _ZN7mozilla2wr12RenderThread6ResumeENS0_10WrWindowIdE (libxul.so + 0x219a27a)#012#11 0x00007fecde39d64c _ZZN7mozilla2wr12WebRenderAPI6ResumeEvEN11ResumeEvent3RunERNS0_12RenderThreadENS0_10WrWindowIdE (libxul.so + 0x219d64c)#012#12 0x00007fecde3990d2 _ZN7mozilla2wr12RenderThread8RunEventENS0_10WrWindowIdENS_9UniquePtrINS0_13RendererEventENS_13DefaultDeleteIS4_EEEEb (libxul.so + 0x21990d2)#012#13 0x00007fecde37f884 _ZN7mozilla6detail18RunnableMethodImplIPNS_2wr12RenderThreadEMS3_
FvNS2_10WrWindowIdENS_9UniquePtrINS2_13RendererEventENS_13DefaultDeleteIS7_EEEEbELb1ELNS_12RunnableKindE0EJS5_OSA_bEE3RunEv (libxul.so + 0x217f884)#012#14 0x00007fecdd2d9169 _ZN8nsThread16ProcessNextEventEbPb (libxul.so + 0x10d9169)#012#15 0x00007fecdd2cb8df _Z19NS_ProcessNextEventP9nsIThreadb (libxul.so + 0x10cb8df)#012#16 0x00007fecddaae6ba _ZN7mozilla3ipc28MessagePumpForNonMainThreads3RunEPN4base11MessagePump8DelegateE (libxul.so + 0x18ae6ba)#012#17 0x00007fecdda56adb _ZN11MessageLoop3RunEv (libxul.so + 0x1856adb)#012#18 0x00007fecdd2debca _ZN8nsThread10ThreadFuncEPv (libxul.so + 0x10debca)#012#19 0x00007feced6c1bd4 _pt_root (libnspr4.so + 0x2cbd4)#012#20 0x00007feced08b569 start_thread (libc.so.6 + 0x8b569)#012#21 0x00007feced110760 __clone3 (libc.so.6 + 0x110760)#012#012Stack trace of thread 24182:#012#0 0x00007feced108b8d syscall (libc.so.6 + 0x108b8d)#012#1 0x00007fece36f0945 _ZN3std3sys4sync7condvar5futex7Condvar4wait17h735d281b4faa24d8E (libxul.so + 0x74f0945)#012#2 0x00
007fecdce37f65 _ZN10rayon_core5sleep5Sleep5sleep17heaf9f5d87959ccffE (libxul.so + 0xc37f65)#012#3 0x00007fecdce37add _ZN10rayon_core8registry12WorkerThread15wait_until_cold17h4d145ee6d6f115c9E (libxul.so + 0xc37add)#012#4 0x00007fece3567395 _ZN10rayon_core8registry13ThreadBuilder3run17h27b36447b766466eE (libxul.so + 0x7367395)#012#5 0x00007fece3950d66 _ZN3std3sys9backtrace28__rust_begin_short_backtrace17h2971d3b87a8cc9d3E (libxul.so + 0x7750d66)#012#6 0x00007fece39f7128 _ZN4core3ops8function6FnOnce40call_once$u7b$$u7b$vtable.shim$u7d$$u7d$17h508e3b49f3eedfd5E (libxul.so + 0x77f7128)#012#7 0x00007fece36f1331 _ZN3std3sys6thread4unix6Thread3new12thread_start17h82f636742a8325cbE (libxul.so + 0x74f1331)#012#8 0x00007feced08b569 start_thread (libc.so.6 + 0x8b569)#012#9 0x00007feced110760 __clone3 (libc.so.6 + 0x110760)#012#012Stack trace of thread 24139:#012#0 0x00007feced08854a __futex_abstimed_wait_common (libc.so.6 + 0x8854a)#012#1 0x00007feced08ab32 pthread_cond_wait@@GLIBC_2
.3.2 (libc.so.6 + 0x8ab32)#012#2 0x000055e4653ddddb _ZN7mozilla6detail21ConditionVariableImpl4waitERNS0_9MutexImplE (firefox + 0x5fddb)#012#3 0x000055e4653ddfd8 _ZN7mozilla6detail21ConditionVariableImpl8wait_forERNS0_9MutexImplERKNS_16BaseTimeDurationINS_27TimeDurationValueCalculatorEEE (firefox + 0x5ffd8)#012#4 0x00007fecddab43ec _ZN7mozilla3ipc14MessageChannel17WaitForSyncNotifyEv (libxul.so + 0x18b43ec)#012#5 0x00007fecddac99f7 _ZN7mozilla3ipc14MessageChannel4SendENS_9UniquePtrIN3IPC7MessageENS_13DefaultDeleteIS4_EEEEPS7_ (libxul.so + 0x18c99f7)#012#6 0x00007fecddac9e19 _ZN7mozilla3ipc9IProtocol11ChannelSendENS_9UniquePtrIN3IPC7MessageENS_13DefaultDeleteIS4_EEEEPS7_ (libxul.so + 0x18c9e19)#012#7 0x00007fecddfd4fa2 _ZN7mozilla6layers22PCompositorBridgeChild10SendResumeEv (libxul.so + 0x1dd4fa2)#012#8 0x00007fece0fa0a48 _Z19moz_container_unmapP10_GtkWidget (libxul.so + 0x4da0a48)#012#9 0x00007fece0fa0b23 _Z27moz_container_wayland_unmapP10_GtkWidget (libxul.so + 0x4da0b23)#0
12#10 0x00007feced2b9bbc g_closure_invoke (libgobject-2.0.so.0 + 0x13bbc)#012#11 0x00007feced2d5bf5 signal_emit_unlocked_R (libgobject-2.0.so.0 + 0x2fbf5)#012#12 0x00007feced2d785a g_signal_emit_valist (libgobject-2.0.so.0 + 0x3185a)#012#13 0x00007feced2d7a73 g_signal_emit (libgobject-2.0.so.0 + 0x31a73)#012#14 0x00007feceb366f54 gtk_widget_unmap (libgtk-3.so.0 + 0x366f54)#012#15 0x00007feced2b9c7f g_closure_invoke (libgobject-2.0.so.0 + 0x13c7f)#012#16 0x00007feced2d5bf5 signal_emit_unlocked_R (libgobject-2.0.so.0 + 0x2fbf5)#012#17 0x00007feced2d785a g_signal_emit_valist (libgobject-2.0.so.0 + 0x3185a)#012#18 0x00007feced2d7a73 g_signal_emit (libgobject-2.0.so.0 + 0x31a73)#012#19 0x00007feceb366f54 gtk_widget_unmap (libgtk-3.so.0 + 0x366f54)#012#20 0x00007feceb387a3b gtk_window_hide.lto_priv.0 (libgtk-3.so.0 + 0x387a3b)#012#21 0x00007feced2b9c7f g_closure_invoke (libgobject-2.0.so.0 + 0x13c7f)#012#22 0x00007feced2d5bf5 signal_emit_unlocked_R (libgobject-2.0.so.0 + 0x2fbf5)#012#23 0
x00007feced2d785a g_signal_emit_valist (libgobject-2.0.so.0 + 0x3185a)#012#24 0x00007feced2d7a73 g
== ntop00 (57 distinct, 156 total) ==
Sep 17 16:06:01 ntop00 sfacctd[199410]: INFO ( default_print/print ): *** Purging cache - START (PID: 73) ***
Sep 17 16:06:01 ntop00 sfacctd[199410]: INFO ( default_print/print ): *** Purging cache - END (PID: 73, QN: 5755/5755, ET: 0) ***
Sep 17 16:06:02 ntop00 setroubleshoot[275928]: SELinux is preventing /usr/local/sbin/sfacctd from append access on the file sflow.json. For complete SELinux messages run: sealert -l 539d53cf-5c9e-4ce3-8be1-3107489dd267 [x12]
Sep 17 16:06:02 ntop00 setroubleshoot[275928]: SELinux is preventing /usr/local/sbin/sfacctd from write access on the file sflow.json. For complete SELinux messages run: sealert -l 4a31fdf6-45fc-4da3-a3a4-03f8ff60af3d [x12]
Sep 17 16:06:02 ntop00 setroubleshoot[275928]: failed to retrieve rpm info for path '/srv/pmacct/sflow.json': [x12]
Sep 17 16:06:02 ntop00 setroubleshoot[275928]: SELinux is preventing /usr/local/sbin/sfacctd from lock access on the file /srv/pmacct/sflow.json. For complete SELinux messages run: sealert -l a19c0db5-f585-4fb9-a34e-811b7321a145 [x12]
Sep 17 16:07:01 ntop00 nfacctd[199535]: INFO ( default_print/print ): *** Purging cache - START (PID: 73) ***
Sep 17 16:07:01 ntop00 nfacctd[199535]: INFO ( default_print/print ): *** Purging cache - END (PID: 73, QN: 69/69, ET: 0) ***
Sep 17 16:07:04 ntop00 setroubleshoot[275976]: SELinux is preventing /usr/local/sbin/nfacctd from append access on the file netflow.json. For complete SELinux messages run: sealert -l 41a326dc-aacd-478a-8da5-fdde097995a3 [x12]
Sep 17 16:07:04 ntop00 setroubleshoot[275976]: failed to retrieve rpm info for path '/srv/pmacct/netflow.json': [x12]
Sep 17 16:07:06 ntop00 setroubleshoot[275976]: SELinux is preventing /usr/local/sbin/nfacctd from open access on the file /srv/pmacct/netflow.json. For complete SELinux messages run: sealert -l c28a02e8-a028-434b-8b14-c5770a528750 [x12]
Sep 17 16:07:08 ntop00 setroubleshoot[275976]: SELinux is preventing /usr/local/sbin/nfacctd from write access on the file netflow.json. For complete SELinux messages run: sealert -l 6ee8ccb3-78cd-4317-9099-2cda6c9e7195 [x12]
Sep 17 16:07:10 ntop00 setroubleshoot[275976]: SELinux is preventing /usr/local/sbin/nfacctd from lock access on the file /srv/pmacct/netflow.json. For complete SELinux messages run: sealert -l 978c927f-8b4c-4fa4-8245-d7dd7f676027 [x12]
Sep 17 16:11:01 ntop00 sfacctd[199410]: INFO ( default_print/print ): *** Purging cache - START (PID: 74) ***
Sep 17 16:11:01 ntop00 sfacctd[199410]: INFO ( default_print/print ): *** Purging cache - END (PID: 74, QN: 5460/5460, ET: 0) ***
Sep 17 16:12:01 ntop00 nfacctd[199535]: INFO ( default_print/print ): *** Purging cache - START (PID: 74) ***
Sep 17 16:12:01 ntop00 nfacctd[199535]: INFO ( default_print/print ): *** Purging cache - END (PID: 74, QN: 52/52, ET: 0) ***
Sep 17 16:16:01 ntop00 sfacctd[199410]: INFO ( default_print/print ): *** Purging cache - START (PID: 75) ***
Sep 17 16:16:01 ntop00 sfacctd[199410]: INFO ( default_print/print ): *** Purging cache - END (PID: 75, QN: 5662/5662, ET: 0) ***
Sep 17 16:17:01 ntop00 nfacctd[199535]: INFO ( default_print/print ): *** Purging cache - START (PID: 75) ***
Sep 17 16:17:01 ntop00 nfacctd[199535]: INFO ( default_print/print ): *** Purging cache - END (PID: 75, QN: 68/68, ET: 0) ***
Sep 17 16:21:01 ntop00 sfacctd[199410]: INFO ( default_print/print ): *** Purging cache - START (PID: 76) ***
Sep 17 16:21:01 ntop00 sfacctd[199410]: INFO ( default_print/print ): *** Purging cache - END (PID: 76, QN: 5541/5541, ET: 0) ***
Sep 17 16:22:01 ntop00 nfacctd[199535]: INFO ( default_print/print ): *** Purging cache - START (PID: 76) ***
Sep 17 16:22:01 ntop00 nfacctd[199535]: INFO ( default_print/print ): *** Purging cache - END (PID: 76, QN: 90/90, ET: 0) ***
Sep 17 16:26:01 ntop00 sfacctd[199410]: INFO ( default_print/print ): *** Purging cache - START (PID: 77) ***
Sep 17 16:26:01 ntop00 sfacctd[199410]: INFO ( default_print/print ): *** Purging cache - END (PID: 77, QN: 4840/4840, ET: 0) ***
Sep 17 16:27:01 ntop00 nfacctd[199535]: INFO ( default_print/print ): *** Purging cache - START (PID: 77) ***
Sep 17 16:27:01 ntop00 nfacctd[199535]: INFO ( default_print/print ): *** Purging cache - END (PID: 77, QN: 50/50, ET: 0) ***
Sep 17 16:31:01 ntop00 sfacctd[199410]: INFO ( default_print/print ): *** Purging cache - START (PID: 78) ***
... 27 more distinct messages not shown
== outbound00.cs.umd.edu (3 distinct, 8 total) ==
Sep 17 16:09:09 outbound00.cs.umd.edu python3[1069187]: ldapdb [x6]
Sep 17 16:53:59 outbound00.cs.umd.edu krb5_child[1079257]: Client 'admin(a)UMD.EDU' not found in Kerberos database
Sep 17 16:57:48 outbound00.cs.umd.edu krb5_child[1080901]: Client 'test1(a)UMD.EDU' not found in Kerberos database
== outbound01.cs.umd.edu (1 distinct, 6 total) ==
Sep 17 16:13:06 outbound01.cs.umd.edu python3[3328922]: ldapdb [x6]
== sentry-docker00.cs.umd.edu (38 distinct, 38 total) ==
Sep 17 16:09:08 sentry-docker00.cs.umd.edu systemd-udevd[2381001]: link_config: could not set ethtool features for veth1d51f99
Sep 17 16:09:08 sentry-docker00.cs.umd.edu systemd-udevd[2381001]: Could not set offload features of veth1d51f99: Operation not permitted
Sep 17 16:09:08 sentry-docker00.cs.umd.edu systemd-udevd[2381025]: Could not generate persistent MAC address for veth4d74ced: No such file or directory
Sep 17 16:09:08 sentry-docker00.cs.umd.edu systemd-udevd[2381026]: Could not generate persistent MAC address for veth84789d7: No such file or directory
Sep 17 16:09:08 sentry-docker00.cs.umd.edu systemd-udevd[2381044]: Could not generate persistent MAC address for vethdcb29d5: No such file or directory
Sep 17 16:09:08 sentry-docker00.cs.umd.edu systemd-udevd[2381049]: Could not generate persistent MAC address for vethf7ceae8: No such file or directory
Sep 17 16:09:08 sentry-docker00.cs.umd.edu systemd-udevd[2381045]: Could not generate persistent MAC address for vethd113202: No such file or directory
Sep 17 16:09:08 sentry-docker00.cs.umd.edu systemd-udevd[2381034]: Could not generate persistent MAC address for veth731fca7: No such file or directory
Sep 17 16:09:08 sentry-docker00.cs.umd.edu systemd-udevd[2381045]: Could not generate persistent MAC address for vethbd2bef7: No such file or directory
Sep 17 16:09:08 sentry-docker00.cs.umd.edu systemd-udevd[2381049]: Could not generate persistent MAC address for veth1b238a6: No such file or directory
Sep 17 16:09:08 sentry-docker00.cs.umd.edu systemd-udevd[2381034]: Could not generate persistent MAC address for vethc3cdca3: No such file or directory
Sep 17 16:09:08 sentry-docker00.cs.umd.edu systemd-udevd[2381045]: Could not generate persistent MAC address for vethe913cf3: No such file or directory
Sep 17 16:29:17 sentry-docker00.cs.umd.edu systemd-udevd[2390416]: link_config: could not get ethtool features for vethd113202
Sep 17 16:29:17 sentry-docker00.cs.umd.edu systemd-udevd[2390416]: Could not set offload features of vethd113202: No such device
Sep 17 16:29:17 sentry-docker00.cs.umd.edu systemd-udevd[2390449]: Could not generate persistent MAC address for veth497561e: No such file or directory
Sep 17 16:29:17 sentry-docker00.cs.umd.edu systemd-udevd[2390450]: Could not generate persistent MAC address for vethb4bc274: No such file or directory
Sep 17 16:29:17 sentry-docker00.cs.umd.edu systemd-udevd[2390453]: Could not generate persistent MAC address for vethbf1744f: No such file or directory
Sep 17 16:29:17 sentry-docker00.cs.umd.edu systemd-udevd[2390454]: Could not generate persistent MAC address for vethf3ba5a4: No such file or directory
Sep 17 16:29:17 sentry-docker00.cs.umd.edu systemd-udevd[2390477]: Could not generate persistent MAC address for veth810d05c: No such file or directory
Sep 17 16:29:17 sentry-docker00.cs.umd.edu systemd-udevd[2390478]: Could not generate persistent MAC address for veth403712e: No such file or directory
Sep 17 16:29:17 sentry-docker00.cs.umd.edu systemd-udevd[2390496]: Could not generate persistent MAC address for veth77d4a80: No such file or directory
Sep 17 16:29:17 sentry-docker00.cs.umd.edu systemd-udevd[2390489]: Could not generate persistent MAC address for vethc6f9b82: No such file or directory
Sep 17 16:29:17 sentry-docker00.cs.umd.edu systemd-udevd[2390509]: Could not generate persistent MAC address for vethc88601a: No such file or directory
Sep 17 16:29:17 sentry-docker00.cs.umd.edu systemd-udevd[2390512]: Could not generate persistent MAC address for veth4b6faf5: No such file or directory
Sep 17 16:49:25 sentry-docker00.cs.umd.edu systemd-udevd[2399877]: link_config: could not get ethtool features for veth497561e
Sep 17 16:49:25 sentry-docker00.cs.umd.edu systemd-udevd[2399877]: Could not set offload features of veth497561e: No such device
Sep 17 16:49:25 sentry-docker00.cs.umd.edu systemd-udevd[2399881]: link_config: could not get ethtool features for veth77d4a80
Sep 17 16:49:25 sentry-docker00.cs.umd.edu systemd-udevd[2399881]: Could not set offload features of veth77d4a80: No such device
Sep 17 16:49:25 sentry-docker00.cs.umd.edu systemd-udevd[2399912]: Could not generate persistent MAC address for veth977cc8d: No such file or directory
Sep 17 16:49:25 sentry-docker00.cs.umd.edu systemd-udevd[2399913]: Could not generate persistent MAC address for veth8cb98d2: No such file or directory
... 8 more distinct messages not shown
== strawberry (7 distinct, 38 total) ==
Sep 17 16:07:03 strawberry kernel: I/O error, dev sda, sector 206848 op 0x0:(READ) flags 0x80700 phys_seg 1 prio class 2 [x6]
Sep 17 16:07:03 strawberry kernel: I/O error, dev sda, sector 206848 op 0x0:(READ) flags 0x0 phys_seg 1 prio class 2 [x6]
Sep 17 16:07:03 strawberry kernel: Buffer I/O error on dev sda2, logical block 0, async page read [x6]
Sep 17 16:07:03 strawberry kernel: I/O error, dev sda, sector 2048 op 0x0:(READ) flags 0x80700 phys_seg 1 prio class 2 [x6]
Sep 17 16:07:03 strawberry kernel: I/O error, dev sda, sector 2048 op 0x0:(READ) flags 0x0 phys_seg 1 prio class 2 [x6]
Sep 17 16:07:03 strawberry kernel: Buffer I/O error on dev sda1, logical block 0, async page read [x6]
Sep 17 16:34:42 strawberry smartd[5314]: Device: /dev/sda [SAT], failed to read SMART Attribute Data [x2]
== submit26-b9-f1 (1 distinct, 1 total) ==
Sep 17 16:18:06 submit26-b9-f1 systemd[1]: user(a)1001.service: Main process exited, code=killed, status=9/KILL
== submit26-b9-f3 (1 distinct, 1 total) ==
Sep 17 16:23:14 submit26-b9-f3 systemd[1]: user(a)1001.service: Main process exited, code=killed, status=9/KILL
== submit26-b9-f4 (1 distinct, 2 total) ==
Sep 17 16:18:09 submit26-b9-f4 systemd[1]: user(a)1001.service: Main process exited, code=killed, status=9/KILL [x2]
1
0
Command: /usr/local/sbin/syslog-digest.py
Time : 0.0523s
Status : exited 0
Output :
Syslog digest — 2026-09-17 16:05 EDT
Processed 2,825 lines, filtered 2,392 (84%). 433 unknown (138 distinct) from 16 host(s).
== b0b02.cs.umd.edu (1 distinct, 1 total) ==
Sep 17 15:48:12 b0b02.cs.umd.edu rustdesk[2201741]: cannot open display:
== bachata (11 distinct, 12 total) ==
Sep 17 15:37:37 bachata setroubleshoot[723326]: SELinux is preventing /usr/sbin/smbd from name_bind access on the udp_socket port 891. For complete SELinux messages run: sealert -l 1a6d79c4-bfe5-4ba9-bad0-67cfbbae6a8c [x2]
Sep 17 15:51:26 bachata smbd[705756]: [2026/09/17 15:51:26.583400, 0] ../../source3/smbd/smb2_service.c:117(chdir_current_service)
Sep 17 15:51:26 bachata smbd[705756]: chdir_current_service: vfs_ChDir(/fs/junkfood/mount) failed: Permission denied. Current token: uid=11255, gid=11255, 12 groups: 11255 319000009 25038 15294 15229 755 25030 25025 30880 25029 770 15026
Sep 17 15:51:26 bachata smbd[705756]: [2026/09/17 15:51:26.583773, 0] ../../source3/smbd/smbXsrv_tcon.c:914(smbXsrv_tcon_disconnect)
Sep 17 15:51:26 bachata smbd[705756]: smbXsrv_tcon_disconnect: disconnect(0x65d937ff, 'mount'): chdir_current_service() failed: NT_STATUS_INTERNAL_ERROR
Sep 17 15:51:26 bachata smbd[705756]: [2026/09/17 15:51:26.583999, 0] ../../source3/smbd/smbXsrv_tcon.c:1028(smbXsrv_tcon_disconnect_all)
Sep 17 15:51:26 bachata smbd[705756]: smbXsrv_tcon_disconnect_all: count[2] errors[1] first[NT_STATUS_INTERNAL_ERROR]
Sep 17 15:51:26 bachata smbd[705756]: [2026/09/17 15:51:26.584080, 0] ../../source3/smbd/smbXsrv_session.c:1900(smbXsrv_session_logoff)
Sep 17 15:51:26 bachata smbd[705756]: smbXsrv_session_logoff: smbXsrv_session_logoff(0xe06703fa): smb2srv_tcon_disconnect_all() failed: NT_STATUS_INTERNAL_ERROR
Sep 17 15:51:26 bachata smbd[705756]: [2026/09/17 15:51:26.584157, 0] ../../source3/smbd/smbXsrv_session.c:1728(smbXsrv_session_remove_channel_done)
Sep 17 15:51:26 bachata smbd[705756]: smbXsrv_session_remove_channel_done: smbXsrv_session_logoff(3764847610) failed: NT_STATUS_INTERNAL_ERROR
== csfw00a (2 distinct, 128 total) ==
Sep 17 15:03:45 csfw00a kernel: bnxt_en 0000:09:00.0 eth3: NIC Link is Down [x124]
Sep 17 15:15:23 csfw00a ospf6d[1477]: [EC 100663307] Could not send entire message [x4]
== gle-dind00.cs.umd.edu (16 distinct, 16 total) ==
Sep 17 15:09:40 gle-dind00.cs.umd.edu systemd-udevd[881095]: Could not generate persistent MAC address for veth2a59f75: No such file or directory
Sep 17 15:09:40 gle-dind00.cs.umd.edu systemd-udevd[881096]: Could not generate persistent MAC address for veth87e8e19: No such file or directory
Sep 17 15:09:40 gle-dind00.cs.umd.edu systemd-udevd[881199]: Could not generate persistent MAC address for vethe4b5cbe: No such file or directory
Sep 17 15:09:40 gle-dind00.cs.umd.edu systemd-udevd[881198]: Could not generate persistent MAC address for veth49ad130: No such file or directory
Sep 17 15:09:41 gle-dind00.cs.umd.edu systemd-udevd[881299]: Could not generate persistent MAC address for vethcfa39b2: No such file or directory
Sep 17 15:09:41 gle-dind00.cs.umd.edu systemd-udevd[881300]: Could not generate persistent MAC address for vethf1ae6db: No such file or directory
Sep 17 15:09:42 gle-dind00.cs.umd.edu systemd-udevd[881401]: Could not generate persistent MAC address for vethee41cac: No such file or directory
Sep 17 15:09:42 gle-dind00.cs.umd.edu systemd-udevd[881402]: Could not generate persistent MAC address for veth5548aa9: No such file or directory
Sep 17 15:09:43 gle-dind00.cs.umd.edu systemd-udevd[881500]: Could not generate persistent MAC address for vethe8d6653: No such file or directory
Sep 17 15:09:43 gle-dind00.cs.umd.edu systemd-udevd[881501]: Could not generate persistent MAC address for veth25e04b5: No such file or directory
Sep 17 15:09:47 gle-dind00.cs.umd.edu systemd-udevd[881694]: Could not generate persistent MAC address for veth89ef1ef: No such file or directory
Sep 17 15:09:47 gle-dind00.cs.umd.edu systemd-udevd[881695]: Could not generate persistent MAC address for veth035b87f: No such file or directory
Sep 17 15:09:48 gle-dind00.cs.umd.edu systemd-udevd[881802]: Could not generate persistent MAC address for veth1f35c28: No such file or directory
Sep 17 15:09:48 gle-dind00.cs.umd.edu systemd-udevd[881803]: Could not generate persistent MAC address for vethe7231cb: No such file or directory
Sep 17 15:10:00 gle-dind00.cs.umd.edu systemd-udevd[882120]: Could not generate persistent MAC address for veth0384718: No such file or directory
Sep 17 15:10:00 gle-dind00.cs.umd.edu systemd-udevd[882119]: Could not generate persistent MAC address for veth7aaf2ae: No such file or directory
== idm00 (1 distinct, 1 total) ==
Sep 17 15:54:21 idm00 named[4166701]: client @0x7f11a006f7c8 10.73.240.42#58607: update '73.10.in-addr.arpa/IN' denied
== idmp0 (2 distinct, 2 total) ==
Sep 17 15:37:57 idmp0 named[1598691]: client @0x7f2d34049808 10.73.240.43#53398: update '73.10.in-addr.arpa/IN' denied
Sep 17 15:52:47 idmp0 named[1598691]: client @0x7f2d14036638 10.73.245.12#62577: update '73.10.in-addr.arpa/IN' denied
== itmon02 (1 distinct, 3 total) ==
Sep 17 15:08:07 itmon02 sshd[1750555]: error: beginning MaxStartups throttling [x3]
== newhonors2 (1 distinct, 24 total) ==
Sep 17 15:13:03 newhonors2 dhcpcd[2773861]: dhcpcd is not running [x24]
== ntop00 (57 distinct, 156 total) ==
Sep 17 15:06:01 ntop00 sfacctd[199410]: INFO ( default_print/print ): *** Purging cache - START (PID: 61) ***
Sep 17 15:06:01 ntop00 sfacctd[199410]: INFO ( default_print/print ): *** Purging cache - END (PID: 61, QN: 8863/8863, ET: 0) ***
Sep 17 15:06:02 ntop00 setroubleshoot[268055]: SELinux is preventing /usr/local/sbin/sfacctd from append access on the file sflow.json. For complete SELinux messages run: sealert -l 539d53cf-5c9e-4ce3-8be1-3107489dd267 [x12]
Sep 17 15:06:02 ntop00 setroubleshoot[268055]: SELinux is preventing /usr/local/sbin/sfacctd from write access on the file sflow.json. For complete SELinux messages run: sealert -l 4a31fdf6-45fc-4da3-a3a4-03f8ff60af3d [x12]
Sep 17 15:06:02 ntop00 setroubleshoot[268055]: failed to retrieve rpm info for path '/srv/pmacct/sflow.json': [x12]
Sep 17 15:06:02 ntop00 setroubleshoot[268055]: SELinux is preventing /usr/local/sbin/sfacctd from lock access on the file /srv/pmacct/sflow.json. For complete SELinux messages run: sealert -l a19c0db5-f585-4fb9-a34e-811b7321a145 [x12]
Sep 17 15:07:01 ntop00 nfacctd[199535]: INFO ( default_print/print ): *** Purging cache - START (PID: 61) ***
Sep 17 15:07:01 ntop00 nfacctd[199535]: INFO ( default_print/print ): *** Purging cache - END (PID: 61, QN: 71/71, ET: 0) ***
Sep 17 15:07:04 ntop00 setroubleshoot[268103]: SELinux is preventing /usr/local/sbin/nfacctd from append access on the file netflow.json. For complete SELinux messages run: sealert -l 41a326dc-aacd-478a-8da5-fdde097995a3 [x12]
Sep 17 15:07:04 ntop00 setroubleshoot[268103]: failed to retrieve rpm info for path '/srv/pmacct/netflow.json': [x12]
Sep 17 15:07:06 ntop00 setroubleshoot[268103]: SELinux is preventing /usr/local/sbin/nfacctd from open access on the file /srv/pmacct/netflow.json. For complete SELinux messages run: sealert -l c28a02e8-a028-434b-8b14-c5770a528750 [x12]
Sep 17 15:07:08 ntop00 setroubleshoot[268103]: SELinux is preventing /usr/local/sbin/nfacctd from write access on the file netflow.json. For complete SELinux messages run: sealert -l 6ee8ccb3-78cd-4317-9099-2cda6c9e7195 [x12]
Sep 17 15:07:10 ntop00 setroubleshoot[268103]: SELinux is preventing /usr/local/sbin/nfacctd from lock access on the file /srv/pmacct/netflow.json. For complete SELinux messages run: sealert -l 978c927f-8b4c-4fa4-8245-d7dd7f676027 [x12]
Sep 17 15:11:01 ntop00 sfacctd[199410]: INFO ( default_print/print ): *** Purging cache - START (PID: 62) ***
Sep 17 15:11:01 ntop00 sfacctd[199410]: INFO ( default_print/print ): *** Purging cache - END (PID: 62, QN: 8925/8925, ET: 0) ***
Sep 17 15:12:01 ntop00 nfacctd[199535]: INFO ( default_print/print ): *** Purging cache - START (PID: 62) ***
Sep 17 15:12:01 ntop00 nfacctd[199535]: INFO ( default_print/print ): *** Purging cache - END (PID: 62, QN: 88/88, ET: 0) ***
Sep 17 15:16:01 ntop00 sfacctd[199410]: INFO ( default_print/print ): *** Purging cache - START (PID: 63) ***
Sep 17 15:16:01 ntop00 sfacctd[199410]: INFO ( default_print/print ): *** Purging cache - END (PID: 63, QN: 8841/8841, ET: 0) ***
Sep 17 15:17:01 ntop00 nfacctd[199535]: INFO ( default_print/print ): *** Purging cache - START (PID: 63) ***
Sep 17 15:17:01 ntop00 nfacctd[199535]: INFO ( default_print/print ): *** Purging cache - END (PID: 63, QN: 60/60, ET: 0) ***
Sep 17 15:21:01 ntop00 sfacctd[199410]: INFO ( default_print/print ): *** Purging cache - START (PID: 64) ***
Sep 17 15:21:01 ntop00 sfacctd[199410]: INFO ( default_print/print ): *** Purging cache - END (PID: 64, QN: 8840/8840, ET: 0) ***
Sep 17 15:22:01 ntop00 nfacctd[199535]: INFO ( default_print/print ): *** Purging cache - START (PID: 64) ***
Sep 17 15:22:01 ntop00 nfacctd[199535]: INFO ( default_print/print ): *** Purging cache - END (PID: 64, QN: 77/77, ET: 0) ***
Sep 17 15:26:01 ntop00 sfacctd[199410]: INFO ( default_print/print ): *** Purging cache - START (PID: 65) ***
Sep 17 15:26:01 ntop00 sfacctd[199410]: INFO ( default_print/print ): *** Purging cache - END (PID: 65, QN: 9014/9014, ET: 0) ***
Sep 17 15:27:01 ntop00 nfacctd[199535]: INFO ( default_print/print ): *** Purging cache - START (PID: 65) ***
Sep 17 15:27:01 ntop00 nfacctd[199535]: INFO ( default_print/print ): *** Purging cache - END (PID: 65, QN: 57/57, ET: 0) ***
Sep 17 15:31:01 ntop00 sfacctd[199410]: INFO ( default_print/print ): *** Purging cache - START (PID: 66) ***
... 27 more distinct messages not shown
== outbound00.cs.umd.edu (1 distinct, 6 total) ==
Sep 17 15:09:09 outbound00.cs.umd.edu python3[1055197]: ldapdb [x6]
== outbound01.cs.umd.edu (1 distinct, 6 total) ==
Sep 17 15:13:06 outbound01.cs.umd.edu python3[3314925]: ldapdb [x6]
== sentry-docker00.cs.umd.edu (34 distinct, 34 total) ==
Sep 17 15:08:43 sentry-docker00.cs.umd.edu systemd-udevd[2352615]: link_config: could not get ethtool features for vethf6d2ffc
Sep 17 15:08:43 sentry-docker00.cs.umd.edu systemd-udevd[2352615]: Could not set offload features of vethf6d2ffc: No such device
Sep 17 15:08:43 sentry-docker00.cs.umd.edu systemd-udevd[2352650]: Could not generate persistent MAC address for veth0797c19: No such file or directory
Sep 17 15:08:43 sentry-docker00.cs.umd.edu systemd-udevd[2352651]: Could not generate persistent MAC address for vethab62342: No such file or directory
Sep 17 15:08:43 sentry-docker00.cs.umd.edu systemd-udevd[2352669]: Could not generate persistent MAC address for veth29f896c: No such file or directory
Sep 17 15:08:44 sentry-docker00.cs.umd.edu systemd-udevd[2352662]: Could not generate persistent MAC address for veth99b7d2b: No such file or directory
Sep 17 15:08:44 sentry-docker00.cs.umd.edu systemd-udevd[2352663]: Could not generate persistent MAC address for veth72e49c9: No such file or directory
Sep 17 15:08:44 sentry-docker00.cs.umd.edu systemd-udevd[2352669]: Could not generate persistent MAC address for veth5f03baf: No such file or directory
Sep 17 15:08:44 sentry-docker00.cs.umd.edu systemd-udevd[2352670]: Could not generate persistent MAC address for veth605da9a: No such file or directory
Sep 17 15:08:44 sentry-docker00.cs.umd.edu systemd-udevd[2352661]: Could not generate persistent MAC address for veth358f99c: No such file or directory
Sep 17 15:08:44 sentry-docker00.cs.umd.edu systemd-udevd[2352656]: Could not generate persistent MAC address for vethb7e3b31: No such file or directory
Sep 17 15:08:44 sentry-docker00.cs.umd.edu systemd-udevd[2352660]: Could not generate persistent MAC address for veth13574f6: No such file or directory
Sep 17 15:28:52 sentry-docker00.cs.umd.edu systemd-udevd[2362032]: link_config: could not get ethtool features for veth605da9a
Sep 17 15:28:52 sentry-docker00.cs.umd.edu systemd-udevd[2362032]: Could not set offload features of veth605da9a: No such device
Sep 17 15:28:52 sentry-docker00.cs.umd.edu systemd-udevd[2362057]: Could not generate persistent MAC address for veth488622c: No such file or directory
Sep 17 15:28:52 sentry-docker00.cs.umd.edu systemd-udevd[2362058]: Could not generate persistent MAC address for veth03bbb26: No such file or directory
Sep 17 15:28:52 sentry-docker00.cs.umd.edu systemd-udevd[2362076]: Could not generate persistent MAC address for veth1bf3297: No such file or directory
Sep 17 15:28:52 sentry-docker00.cs.umd.edu systemd-udevd[2362058]: Could not generate persistent MAC address for vethb88f8fd: No such file or directory
Sep 17 15:28:52 sentry-docker00.cs.umd.edu systemd-udevd[2362075]: Could not generate persistent MAC address for veth2df092b: No such file or directory
Sep 17 15:28:52 sentry-docker00.cs.umd.edu systemd-udevd[2362072]: Could not generate persistent MAC address for veth2439d5e: No such file or directory
Sep 17 15:28:52 sentry-docker00.cs.umd.edu systemd-udevd[2362152]: Could not generate persistent MAC address for vetha512b11: No such file or directory
Sep 17 15:28:52 sentry-docker00.cs.umd.edu systemd-udevd[2362146]: Could not generate persistent MAC address for veth6184b8e: No such file or directory
Sep 17 15:28:52 sentry-docker00.cs.umd.edu systemd-udevd[2362202]: Could not generate persistent MAC address for veth867d98b: No such file or directory
Sep 17 15:28:52 sentry-docker00.cs.umd.edu systemd-udevd[2362203]: Could not generate persistent MAC address for vethdd29780: No such file or directory
Sep 17 15:49:00 sentry-docker00.cs.umd.edu systemd-udevd[2371489]: Could not generate persistent MAC address for veth431c383: No such file or directory
Sep 17 15:49:00 sentry-docker00.cs.umd.edu systemd-udevd[2371490]: Could not generate persistent MAC address for veth42da4de: No such file or directory
Sep 17 15:49:00 sentry-docker00.cs.umd.edu systemd-udevd[2371493]: Could not generate persistent MAC address for veth910b35f: No such file or directory
Sep 17 15:49:00 sentry-docker00.cs.umd.edu systemd-udevd[2371494]: Could not generate persistent MAC address for veth8b6a319: No such file or directory
Sep 17 15:49:00 sentry-docker00.cs.umd.edu systemd-udevd[2371493]: Could not generate persistent MAC address for veth75e9357: No such file or directory
Sep 17 15:49:00 sentry-docker00.cs.umd.edu systemd-udevd[2371500]: Could not generate persistent MAC address for vethacacb25: No such file or directory
... 4 more distinct messages not shown
== strawberry (7 distinct, 38 total) ==
Sep 17 15:07:03 strawberry kernel: I/O error, dev sda, sector 206848 op 0x0:(READ) flags 0x80700 phys_seg 1 prio class 2 [x6]
Sep 17 15:07:03 strawberry kernel: I/O error, dev sda, sector 206848 op 0x0:(READ) flags 0x0 phys_seg 1 prio class 2 [x6]
Sep 17 15:07:03 strawberry kernel: Buffer I/O error on dev sda2, logical block 0, async page read [x6]
Sep 17 15:07:03 strawberry kernel: I/O error, dev sda, sector 2048 op 0x0:(READ) flags 0x80700 phys_seg 1 prio class 2 [x6]
Sep 17 15:07:03 strawberry kernel: I/O error, dev sda, sector 2048 op 0x0:(READ) flags 0x0 phys_seg 1 prio class 2 [x6]
Sep 17 15:07:03 strawberry kernel: Buffer I/O error on dev sda1, logical block 0, async page read [x6]
Sep 17 15:34:42 strawberry smartd[5314]: Device: /dev/sda [SAT], failed to read SMART Attribute Data [x2]
== submit26-b9-f1 (1 distinct, 2 total) ==
Sep 17 15:20:50 submit26-b9-f1 systemd[1]: user(a)1001.service: Main process exited, code=killed, status=9/KILL [x2]
== submit26-b9-f2 (1 distinct, 3 total) ==
Sep 17 15:35:07 submit26-b9-f2 systemd[1]: user(a)1001.service: Main process exited, code=killed, status=9/KILL [x3]
== submit26-b9-f4 (1 distinct, 1 total) ==
Sep 17 15:55:40 submit26-b9-f4 systemd[1]: user(a)1001.service: Main process exited, code=killed, status=9/KILL
1
0
Command: /usr/local/sbin/syslog-digest.py
Time : 0.0525s
Status : exited 0
Output :
Syslog digest — 2026-09-17 15:05 EDT
Processed 2,453 lines, filtered 1,979 (80%). 474 unknown (146 distinct) from 20 host(s).
== abadi-computer (3 distinct, 3 total) ==
Sep 17 14:40:29 abadi-computer falcon-sensor-bpf[529]: CrowdStrike(4): Could not retrieve DisableProxy value: c0000225
Sep 17 14:40:29 abadi-computer falcon-sensor-bpf[529]: CrowdStrike(4): ConnectWithProxy: Unable to get application proxy host from CsConfig: c0000225
Sep 17 14:40:36 abadi-computer kernel: process 'contrib/polyml-5.4.0/x86_64-linux/poly' started with executable stack
== b0b02.cs.umd.edu (1 distinct, 1 total) ==
Sep 17 14:48:08 b0b02.cs.umd.edu rustdesk[2186587]: cannot open display:
== cmsc436-0101-redis (5 distinct, 5 total) ==
Sep 17 14:45:51 cmsc436-0101-redis sshd-session[3180913]: error: maximum authentication attempts exceeded for root from 83.148.237.96 port 54946 ssh2 [preauth]
Sep 17 14:45:54 cmsc436-0101-redis sshd-session[3180915]: error: maximum authentication attempts exceeded for root from 83.148.237.96 port 54958 ssh2 [preauth]
Sep 17 14:45:58 cmsc436-0101-redis sshd-session[3180917]: error: maximum authentication attempts exceeded for root from 83.148.237.96 port 54972 ssh2 [preauth]
Sep 17 14:46:03 cmsc436-0101-redis sshd-session[3180921]: error: maximum authentication attempts exceeded for admin from 83.148.237.96 port 53266 ssh2 [preauth]
Sep 17 14:46:07 cmsc436-0101-redis sshd-session[3180923]: error: maximum authentication attempts exceeded for admin from 83.148.237.96 port 53272 ssh2 [preauth]
== csfw00a (1 distinct, 130 total) ==
Sep 17 14:03:54 csfw00a kernel: bnxt_en 0000:09:00.0 eth3: NIC Link is Down [x130]
== idm00 (3 distinct, 3 total) ==
Sep 17 14:37:18 idm00 named[4166701]: zone cs.umd.edu/IN: zone_journal_compact: could not get zone size: not found
Sep 17 14:38:38 idm00 named[4166701]: zone 73.10.in-addr.arpa/IN: zone_journal_compact: could not get zone size: not found
Sep 17 14:54:21 idm00 named[4166701]: client @0x7f11980497e8 10.73.240.42#52775: update '73.10.in-addr.arpa/IN' denied
== idmh1 (2 distinct, 2 total) ==
Sep 17 14:36:19 idmh1 named[3565631]: zone 73.10.in-addr.arpa/IN: zone_journal_compact: could not get zone size: not found
Sep 17 14:36:36 idmh1 named[3565631]: zone cs.umd.edu/IN: zone_journal_compact: could not get zone size: not found
== idmp0 (4 distinct, 4 total) ==
Sep 17 14:24:50 idmp0 named[1598691]: checkhints: unable to get root NS rrset from cache: not found
Sep 17 14:37:34 idmp0 named[1598691]: zone 73.10.in-addr.arpa/IN: zone_journal_compact: could not get zone size: not found
Sep 17 14:37:50 idmp0 named[1598691]: zone cs.umd.edu/IN: zone_journal_compact: could not get zone size: not found
Sep 17 14:37:57 idmp0 named[1598691]: client @0x7f2d3802f8f8 10.73.240.43#52373: update '73.10.in-addr.arpa/IN' denied
== idmv0 (2 distinct, 2 total) ==
Sep 17 14:36:50 idmv0 named[3973338]: zone 73.10.in-addr.arpa/IN: zone_journal_compact: could not get zone size: not found
Sep 17 14:38:59 idmv0 named[3973338]: zone cs.umd.edu/IN: zone_journal_compact: could not get zone size: not found
== itmon02 (1 distinct, 2 total) ==
Sep 17 14:08:16 itmon02 sshd[1750555]: error: beginning MaxStartups throttling [x2]
== munin (2 distinct, 32 total) ==
Sep 17 14:34:03 munin sudo[3462319]: pam_systemd(sudo:session): Failed to stat() runtime directory '/run/user/0': No such file or directory [x16]
Sep 17 14:34:03 munin sudo[3462319]: pam_systemd(sudo:session): Not setting $XDG_RUNTIME_DIR, as the directory is not in order. [x16]
== newhonors2 (1 distinct, 24 total) ==
Sep 17 14:13:02 newhonors2 dhcpcd[2772007]: dhcpcd is not running [x24]
== ntop00 (57 distinct, 156 total) ==
Sep 17 14:06:01 ntop00 sfacctd[199410]: INFO ( default_print/print ): *** Purging cache - START (PID: 49) ***
Sep 17 14:06:01 ntop00 sfacctd[199410]: INFO ( default_print/print ): *** Purging cache - END (PID: 49, QN: 8290/8290, ET: 0) ***
Sep 17 14:06:02 ntop00 setroubleshoot[260196]: SELinux is preventing /usr/local/sbin/sfacctd from append access on the file sflow.json. For complete SELinux messages run: sealert -l 539d53cf-5c9e-4ce3-8be1-3107489dd267 [x12]
Sep 17 14:06:02 ntop00 setroubleshoot[260196]: SELinux is preventing /usr/local/sbin/sfacctd from write access on the file sflow.json. For complete SELinux messages run: sealert -l 4a31fdf6-45fc-4da3-a3a4-03f8ff60af3d [x12]
Sep 17 14:06:02 ntop00 setroubleshoot[260196]: failed to retrieve rpm info for path '/srv/pmacct/sflow.json': [x12]
Sep 17 14:06:02 ntop00 setroubleshoot[260196]: SELinux is preventing /usr/local/sbin/sfacctd from lock access on the file /srv/pmacct/sflow.json. For complete SELinux messages run: sealert -l a19c0db5-f585-4fb9-a34e-811b7321a145 [x12]
Sep 17 14:07:01 ntop00 nfacctd[199535]: INFO ( default_print/print ): *** Purging cache - START (PID: 49) ***
Sep 17 14:07:01 ntop00 nfacctd[199535]: INFO ( default_print/print ): *** Purging cache - END (PID: 49, QN: 75/75, ET: 0) ***
Sep 17 14:07:04 ntop00 setroubleshoot[260243]: SELinux is preventing /usr/local/sbin/nfacctd from append access on the file netflow.json. For complete SELinux messages run: sealert -l 41a326dc-aacd-478a-8da5-fdde097995a3 [x12]
Sep 17 14:07:04 ntop00 setroubleshoot[260243]: failed to retrieve rpm info for path '/srv/pmacct/netflow.json': [x12]
Sep 17 14:07:06 ntop00 setroubleshoot[260243]: SELinux is preventing /usr/local/sbin/nfacctd from open access on the file /srv/pmacct/netflow.json. For complete SELinux messages run: sealert -l c28a02e8-a028-434b-8b14-c5770a528750 [x12]
Sep 17 14:07:08 ntop00 setroubleshoot[260243]: SELinux is preventing /usr/local/sbin/nfacctd from write access on the file netflow.json. For complete SELinux messages run: sealert -l 6ee8ccb3-78cd-4317-9099-2cda6c9e7195 [x12]
Sep 17 14:07:10 ntop00 setroubleshoot[260243]: SELinux is preventing /usr/local/sbin/nfacctd from lock access on the file /srv/pmacct/netflow.json. For complete SELinux messages run: sealert -l 978c927f-8b4c-4fa4-8245-d7dd7f676027 [x12]
Sep 17 14:11:01 ntop00 sfacctd[199410]: INFO ( default_print/print ): *** Purging cache - START (PID: 50) ***
Sep 17 14:11:01 ntop00 sfacctd[199410]: INFO ( default_print/print ): *** Purging cache - END (PID: 50, QN: 8226/8226, ET: 0) ***
Sep 17 14:12:01 ntop00 nfacctd[199535]: INFO ( default_print/print ): *** Purging cache - START (PID: 50) ***
Sep 17 14:12:01 ntop00 nfacctd[199535]: INFO ( default_print/print ): *** Purging cache - END (PID: 50, QN: 63/63, ET: 0) ***
Sep 17 14:16:01 ntop00 sfacctd[199410]: INFO ( default_print/print ): *** Purging cache - START (PID: 51) ***
Sep 17 14:16:01 ntop00 sfacctd[199410]: INFO ( default_print/print ): *** Purging cache - END (PID: 51, QN: 8337/8337, ET: 0) ***
Sep 17 14:17:01 ntop00 nfacctd[199535]: INFO ( default_print/print ): *** Purging cache - START (PID: 51) ***
Sep 17 14:17:01 ntop00 nfacctd[199535]: INFO ( default_print/print ): *** Purging cache - END (PID: 51, QN: 61/61, ET: 0) ***
Sep 17 14:21:01 ntop00 sfacctd[199410]: INFO ( default_print/print ): *** Purging cache - START (PID: 52) ***
Sep 17 14:21:01 ntop00 sfacctd[199410]: INFO ( default_print/print ): *** Purging cache - END (PID: 52, QN: 8207/8207, ET: 0) ***
Sep 17 14:22:01 ntop00 nfacctd[199535]: INFO ( default_print/print ): *** Purging cache - START (PID: 52) ***
Sep 17 14:22:01 ntop00 nfacctd[199535]: INFO ( default_print/print ): *** Purging cache - END (PID: 52, QN: 63/63, ET: 0) ***
Sep 17 14:26:01 ntop00 sfacctd[199410]: INFO ( default_print/print ): *** Purging cache - START (PID: 53) ***
Sep 17 14:26:01 ntop00 sfacctd[199410]: INFO ( default_print/print ): *** Purging cache - END (PID: 53, QN: 8323/8323, ET: 0) ***
Sep 17 14:27:01 ntop00 nfacctd[199535]: INFO ( default_print/print ): *** Purging cache - START (PID: 53) ***
Sep 17 14:27:01 ntop00 nfacctd[199535]: INFO ( default_print/print ): *** Purging cache - END (PID: 53, QN: 67/67, ET: 0) ***
Sep 17 14:31:01 ntop00 sfacctd[199410]: INFO ( default_print/print ): *** Purging cache - START (PID: 54) ***
... 27 more distinct messages not shown
== outbound00.cs.umd.edu (1 distinct, 6 total) ==
Sep 17 14:09:09 outbound00.cs.umd.edu python3[1041103]: ldapdb [x6]
== outbound01.cs.umd.edu (1 distinct, 6 total) ==
Sep 17 14:13:06 outbound01.cs.umd.edu python3[3300948]: ldapdb [x6]
== portal (1 distinct, 2 total) ==
Sep 17 14:34:44 portal setroubleshoot[1382353]: SELinux is preventing /usr/bin/podman from using the nnp_transition access on a process. For complete SELinux messages run: sealert -l 7fd47d7d-0597-41f1-9a89-8a4911d8024d [x2]
== sentry-docker00.cs.umd.edu (34 distinct, 34 total) ==
Sep 17 14:08:18 sentry-docker00.cs.umd.edu systemd-udevd[2324228]: link_config: could not set ethtool features for vethae8cb6a
Sep 17 14:08:18 sentry-docker00.cs.umd.edu systemd-udevd[2324228]: Could not set offload features of vethae8cb6a: Operation not permitted
Sep 17 14:08:19 sentry-docker00.cs.umd.edu systemd-udevd[2324263]: Could not generate persistent MAC address for veth797ed5b: No such file or directory
Sep 17 14:08:19 sentry-docker00.cs.umd.edu systemd-udevd[2324264]: Could not generate persistent MAC address for veth38b1326: No such file or directory
Sep 17 14:08:19 sentry-docker00.cs.umd.edu systemd-udevd[2324267]: Could not generate persistent MAC address for vethe20397c: No such file or directory
Sep 17 14:08:19 sentry-docker00.cs.umd.edu systemd-udevd[2324268]: Could not generate persistent MAC address for veth44082cd: No such file or directory
Sep 17 14:08:19 sentry-docker00.cs.umd.edu systemd-udevd[2324263]: Could not generate persistent MAC address for vethb1539f1: No such file or directory
Sep 17 14:08:19 sentry-docker00.cs.umd.edu systemd-udevd[2324287]: Could not generate persistent MAC address for veth1102771: No such file or directory
Sep 17 14:08:19 sentry-docker00.cs.umd.edu systemd-udevd[2324287]: Could not generate persistent MAC address for veth984280c: No such file or directory
Sep 17 14:08:19 sentry-docker00.cs.umd.edu systemd-udevd[2324289]: Could not generate persistent MAC address for vethfb812a8: No such file or directory
Sep 17 14:08:19 sentry-docker00.cs.umd.edu systemd-udevd[2324310]: Could not generate persistent MAC address for vethbc4ce7b: No such file or directory
Sep 17 14:08:19 sentry-docker00.cs.umd.edu systemd-udevd[2324314]: Could not generate persistent MAC address for veth0be5fed: No such file or directory
Sep 17 14:28:27 sentry-docker00.cs.umd.edu systemd-udevd[2333593]: link_config: could not get ethtool features for vethbc4ce7b
Sep 17 14:28:27 sentry-docker00.cs.umd.edu systemd-udevd[2333593]: Could not set offload features of vethbc4ce7b: No such device
Sep 17 14:28:27 sentry-docker00.cs.umd.edu systemd-udevd[2333711]: Could not generate persistent MAC address for vethd512fce: No such file or directory
Sep 17 14:28:27 sentry-docker00.cs.umd.edu systemd-udevd[2333712]: Could not generate persistent MAC address for veth40e31c2: No such file or directory
Sep 17 14:28:27 sentry-docker00.cs.umd.edu systemd-udevd[2333768]: Could not generate persistent MAC address for vethfb7338f: No such file or directory
Sep 17 14:28:27 sentry-docker00.cs.umd.edu systemd-udevd[2333769]: Could not generate persistent MAC address for veth2ecd160: No such file or directory
Sep 17 14:28:27 sentry-docker00.cs.umd.edu systemd-udevd[2333779]: Could not generate persistent MAC address for veth37ab30f: No such file or directory
Sep 17 14:28:27 sentry-docker00.cs.umd.edu systemd-udevd[2333782]: Could not generate persistent MAC address for vethfb99b66: No such file or directory
Sep 17 14:28:27 sentry-docker00.cs.umd.edu systemd-udevd[2333810]: Could not generate persistent MAC address for vethc0fe60f: No such file or directory
Sep 17 14:28:27 sentry-docker00.cs.umd.edu systemd-udevd[2333811]: Could not generate persistent MAC address for veth675e69b: No such file or directory
Sep 17 14:28:27 sentry-docker00.cs.umd.edu systemd-udevd[2333859]: Could not generate persistent MAC address for veth20d3aad: No such file or directory
Sep 17 14:28:27 sentry-docker00.cs.umd.edu systemd-udevd[2333863]: Could not generate persistent MAC address for vethe799cbb: No such file or directory
Sep 17 14:48:35 sentry-docker00.cs.umd.edu systemd-udevd[2343216]: Could not generate persistent MAC address for vethfebfb8d: No such file or directory
Sep 17 14:48:35 sentry-docker00.cs.umd.edu systemd-udevd[2343217]: Could not generate persistent MAC address for veth38a5181: No such file or directory
Sep 17 14:48:35 sentry-docker00.cs.umd.edu systemd-udevd[2343235]: Could not generate persistent MAC address for veth1452227: No such file or directory
Sep 17 14:48:35 sentry-docker00.cs.umd.edu systemd-udevd[2343223]: Could not generate persistent MAC address for vethe2e16a9: No such file or directory
Sep 17 14:48:35 sentry-docker00.cs.umd.edu systemd-udevd[2343228]: Could not generate persistent MAC address for vethbde5f60: No such file or directory
Sep 17 14:48:35 sentry-docker00.cs.umd.edu systemd-udevd[2343221]: Could not generate persistent MAC address for vethfdb12f4: No such file or directory
... 4 more distinct messages not shown
== strawberry (7 distinct, 38 total) ==
Sep 17 14:07:03 strawberry kernel: I/O error, dev sda, sector 206848 op 0x0:(READ) flags 0x80700 phys_seg 1 prio class 2 [x6]
Sep 17 14:07:03 strawberry kernel: I/O error, dev sda, sector 206848 op 0x0:(READ) flags 0x0 phys_seg 1 prio class 2 [x6]
Sep 17 14:07:03 strawberry kernel: Buffer I/O error on dev sda2, logical block 0, async page read [x6]
Sep 17 14:07:03 strawberry kernel: I/O error, dev sda, sector 2048 op 0x0:(READ) flags 0x80700 phys_seg 1 prio class 2 [x6]
Sep 17 14:07:03 strawberry kernel: I/O error, dev sda, sector 2048 op 0x0:(READ) flags 0x0 phys_seg 1 prio class 2 [x6]
Sep 17 14:07:03 strawberry kernel: Buffer I/O error on dev sda1, logical block 0, async page read [x6]
Sep 17 14:34:42 strawberry smartd[5314]: Device: /dev/sda [SAT], failed to read SMART Attribute Data [x2]
== submit26-b9-f1 (9 distinct, 9 total) ==
Sep 17 14:25:52 submit26-b9-f1 setroubleshoot[2171379]: SELinux is preventing /usr/bin/python3.9 from create access on the directory /(null). For complete SELinux messages run: sealert -l 3ef7d677-731f-46bf-9c34-c2c55fea665c
Sep 17 14:25:52 submit26-b9-f1 setroubleshoot[2171379]: SELinux is preventing /usr/bin/python3.9 from add_name access on the directory /(null). For complete SELinux messages run: sealert -l aa60e26f-72e1-45f1-bc12-aa8b3b669e36
Sep 17 14:25:52 submit26-b9-f1 setroubleshoot[2171379]: SELinux is preventing /usr/bin/python3.9 from create access on the file /(null). For complete SELinux messages run: sealert -l d088fb43-23ee-4ae8-ae6a-5d1c041ee2d6
Sep 17 14:25:52 submit26-b9-f1 setroubleshoot[2171379]: SELinux is preventing /usr/bin/python3.9 from open access on the file /tmp/libdnf.ylgMGu/repodata/repomd.xml. For complete SELinux messages run: sealert -l 3b0d8c9a-6637-4d6e-a864-f1dd7c00377d
Sep 17 14:25:52 submit26-b9-f1 setroubleshoot[2171379]: SELinux is preventing /usr/bin/python3.9 from setattr access on the file repomd.xml. For complete SELinux messages run: sealert -l 0fd3339f-3ef2-45f3-9e58-65a58b42f3ee
Sep 17 14:25:53 submit26-b9-f1 setroubleshoot[2171379]: SELinux is preventing /usr/bin/python3.9 from read access on the directory libdnf.ylgMGu. For complete SELinux messages run: sealert -l 0d661d88-dc9e-469d-986b-52e29b353aa8
Sep 17 14:25:53 submit26-b9-f1 setroubleshoot[2171379]: SELinux is preventing /usr/bin/python3.9 from remove_name access on the directory repomd.xml. For complete SELinux messages run: sealert -l 405a8556-cf9f-4ef4-8525-0dca18d4259d
Sep 17 14:25:53 submit26-b9-f1 setroubleshoot[2171379]: SELinux is preventing /usr/bin/python3.9 from unlink access on the file repomd.xml. For complete SELinux messages run: sealert -l 3c38e23e-3631-4cb5-81c7-992675c836d9
Sep 17 14:25:53 submit26-b9-f1 setroubleshoot[2171379]: SELinux is preventing /usr/bin/python3.9 from rmdir access on the directory repodata. For complete SELinux messages run: sealert -l a070e9b5-2867-47d6-b2e3-3b7d99725848
== submit26-b9-f2 (10 distinct, 14 total) ==
Sep 17 14:06:48 submit26-b9-f2 setroubleshoot[1305798]: SELinux is preventing /usr/bin/python3.9 from create access on the directory /(null). For complete SELinux messages run: sealert -l 0659d546-3107-4f75-b00f-008c85f41dc6 [x2]
Sep 17 14:06:48 submit26-b9-f2 setroubleshoot[1305798]: SELinux is preventing /usr/bin/python3.9 from add_name access on the directory /(null). For complete SELinux messages run: sealert -l 156d9270-3466-4356-b86f-1a128825961a [x2]
Sep 17 14:06:48 submit26-b9-f2 setroubleshoot[1305798]: SELinux is preventing /usr/bin/python3.9 from create access on the file /(null). For complete SELinux messages run: sealert -l c8a40bf5-2fc4-46b3-b813-8592b3523339
Sep 17 14:06:48 submit26-b9-f2 setroubleshoot[1305798]: SELinux is preventing /usr/bin/python3.9 from open access on the file /tmp/libdnf.YbWTUw/repodata/repomd.xml. For complete SELinux messages run: sealert -l 7f4c3a8e-0f99-47c4-9baf-e1336fe24876
Sep 17 14:06:48 submit26-b9-f2 setroubleshoot[1305798]: SELinux is preventing /usr/bin/python3.9 from setattr access on the file repomd.xml. For complete SELinux messages run: sealert -l 988123da-b724-4e6a-900c-33a2723fdaf1
Sep 17 14:06:48 submit26-b9-f2 setroubleshoot[1305798]: SELinux is preventing /usr/bin/python3.9 from read access on the directory libdnf.YbWTUw. For complete SELinux messages run: sealert -l ca585e2b-d50f-4264-8127-6b3fa04070c8
Sep 17 14:06:48 submit26-b9-f2 setroubleshoot[1305798]: SELinux is preventing /usr/bin/python3.9 from remove_name access on the directory repomd.xml. For complete SELinux messages run: sealert -l 3a749560-1cec-40ca-a4dc-596841be3885 [x2]
Sep 17 14:06:48 submit26-b9-f2 setroubleshoot[1305798]: SELinux is preventing /usr/bin/python3.9 from unlink access on the file repomd.xml. For complete SELinux messages run: sealert -l 0aa52f08-94f8-474e-96d8-e818846941af
Sep 17 14:06:48 submit26-b9-f2 setroubleshoot[1305798]: SELinux is preventing /usr/bin/python3.9 from rmdir access on the directory repodata. For complete SELinux messages run: sealert -l de019dc4-408f-439c-902a-676d18dfe8e7 [x2]
Sep 17 14:06:48 submit26-b9-f2 setroubleshoot[1305798]: SELinux is preventing /usr/bin/python3.9 from read access on the directory libdnf.MfPieW. For complete SELinux messages run: sealert -l ca585e2b-d50f-4264-8127-6b3fa04070c8
== wraith (1 distinct, 1 total) ==
Sep 17 14:13:23 wraith kernel: workqueue: i915_hpd_poll_init_work [i915] hogged CPU for >10000us 32771 times, consider switching to WQ_UNBOUND
1
0