Command: /usr/local/sbin/syslog-digest.py
Time : 0.0614s
Status : exited 0
Output :
Syslog digest — 2026-09-18 10:05 EDT
Processed 3,033 lines, filtered 2,242 (73%). 791 unknown (428 distinct) from 27 host(s).
== amoeba (7 distinct, 12 total) ==
Sep 18 09:56:48 amoeba upowerd[1032]: treating change event as add on /sys/devices/pci0000:00/0000:00:14.0/usb1/1-10
Sep 18 09:56:48 amoeba upowerd[1032]: treating change event as add on /sys/devices/pci0000:00/0000:00:14.0/usb2/2-5
Sep 18 09:56:49 amoeba firefox[1459102]: Couldn't map window 0x7f3d508530a0 as subsurface because its parent is not mapped. [x2]
Sep 18 09:56:49 amoeba firefox[1459102]: Couldn't map window 0x7f3d50856160 as subsurface because its parent is not mapped. [x2]
Sep 18 09:56:49 amoeba firefox[1459102]: Couldn't map window 0x7f3d50853240 as subsurface because its parent is not mapped. [x2]
Sep 18 09:56:49 amoeba firefox[1459102]: Couldn't map window 0x7f3d508533e0 as subsurface because its parent is not mapped. [x2]
Sep 18 09:56:49 amoeba firefox[1459102]: Couldn't map window 0x7f3d5deabae0 as subsurface because its parent is not mapped. [x2]
== b0b02.cs.umd.edu (1 distinct, 1 total) ==
Sep 18 09:49:23 b0b02.cs.umd.edu rustdesk[2478361]: cannot open display:
== bale (5 distinct, 87 total) ==
Sep 18 09:05:49 bale setroubleshoot[511656]: failed to retrieve rpm info for /dev/nvme0 [x37]
Sep 18 09:05:50 bale setroubleshoot[511656]: SELinux is preventing /usr/libexec/platform-python3.6 from getattr access on the chr_file /dev/nvme0. For complete SELinux messages run: sealert -l e098d0bd-ac29-4737-9018-de9a71e328ee [x12]
Sep 18 09:05:52 bale setroubleshoot[511656]: SELinux is preventing smartctl from read access on the chr_file nvme0. For complete SELinux messages run: sealert -l fc305ce6-663c-4aa2-8640-0ee0f8dce1a9 [x13]
Sep 18 09:05:55 bale setroubleshoot[511656]: SELinux is preventing smartctl from open access on the chr_file /dev/nvme0. For complete SELinux messages run: sealert -l 2c1d6b29-3343-488c-84c7-92d46f8010b6 [x11]
Sep 18 09:06:07 bale setroubleshoot[512271]: SELinux is preventing /usr/sbin/smartctl from ioctl access on the chr_file /dev/nvme0. For complete SELinux messages run: sealert -l 8ea740c2-97d8-42fb-b550-a236b114507d [x14]
== cheezit.cs.umd.edu (3 distinct, 4 total) ==
Sep 18 09:22:13 cheezit.cs.umd.edu sshd-session[518272]: pam_access(sshd:auth): access denied for user `larry' from `71.191.93.172' [x2]
Sep 18 09:22:14 cheezit.cs.umd.edu sshd-session[518272]: Error in Duo login for 'larry' from 71.191.93.172
Sep 18 09:22:14 cheezit.cs.umd.edu sshd-session[518270]: error: PAM: Authentication failure for larry from 71.191.93.172
== csfw00a (2 distinct, 136 total) ==
Sep 18 09:04:04 csfw00a kernel: bnxt_en 0000:09:00.0 eth3: NIC Link is Down [x132]
Sep 18 09:27:18 csfw00a ospf6d[1477]: [EC 100663307] Could not send entire message [x4]
== hackerman (220 distinct, 244 total) ==
Sep 18 09:57:57 hackerman goa-identity-se[3859063]: GoaKerberosIdentityManager: Using polling for change notification for credential cache type 'KCM'
Sep 18 09:57:59 hackerman vmware-user.desktop[3859209]: vmware-user: could not open /proc/fs/vmblock/dev
Sep 18 09:57:59 hackerman gsd-usb-protect[3859136]: Failed to fetch USBGuard parameters: GDBus.Error:org.freedesktop.DBus.Error.ServiceUnknown: The name is not activatable
Sep 18 09:58:27 hackerman gnome-software[3859145]: Kind change on net.launchpad.Gnuclad from console-application to desktop-application is not OK
Sep 18 09:58:30 hackerman gnome-software[3859145]: Kind change on io.github.sil_car.SqueezeVid from console-application to desktop-application is not OK
Sep 18 09:58:31 hackerman gnome-software[3859145]: Kind change on net.mkiol.SpeechNote.Addon.amd from addon to runtime is not OK
Sep 18 09:58:31 hackerman gnome-software[3859145]: Kind change on net.mkiol.SpeechNote.Addon.nvidia from addon to runtime is not OK
Sep 18 09:58:31 hackerman gnome-software[3859145]: Kind change on org.videolan.VLC.Plugin.pause_click from addon to runtime is not OK
Sep 18 09:58:34 hackerman gnome-software[3859145]: Kind change on com.github.ilai_deutel.kibi from console-application to desktop-application is not OK
Sep 18 09:58:35 hackerman gnome-software[3859145]: Kind change on dev.paullee.scraterpreter.Scrape from console-application to desktop-application is not OK
Sep 18 09:58:35 hackerman gnome-software[3859145]: Kind change on dev.paullee.scraterpreter.Scrapec from console-application to desktop-application is not OK
Sep 18 09:58:35 hackerman gnome-software[3859145]: Kind change on fr.inria.corese.CoreseCommand from console-application to desktop-application is not OK
Sep 18 09:58:36 hackerman gnome-software[3859145]: Kind change on io.github.erkin.ponysay from console-application to desktop-application is not OK
Sep 18 09:58:38 hackerman gnome-software[3859145]: Kind change on net.imaginaryinfinity.Squiid from console-application to desktop-application is not OK
Sep 18 09:58:39 hackerman gnome-software[3859145]: Kind change on org.eu.wabarc.wayback from console-application to desktop-application is not OK
Sep 18 09:58:41 hackerman gnome-software[3859145]: Kind change on com.jeffser.Alpaca.Plugins.AMD from addon to runtime is not OK
Sep 18 09:58:41 hackerman gnome-software[3859145]: Kind change on com.jeffser.Alpaca.Plugins.Ollama from addon to runtime is not OK
Sep 18 09:58:41 hackerman gnome-software[3859145]: Kind change on com.sublimetext.three.DevUtils from addon to runtime is not OK [x4]
Sep 18 09:58:41 hackerman gnome-software[3859145]: Kind change on com.valvesoftware.Steam.Utility.slonfig from addon to runtime is not OK
Sep 18 09:58:46 hackerman packagekitd[3859076]: failed to parse public key for /etc/pki/rpm-gpg/RPM-GPG-KEY-PQC-redhat-release [x7]
Sep 18 09:58:47 hackerman gnome-software[3859145]: Kind change on com.valvesoftware.Steam.Utility.InhibitScreensaver from addon to runtime is not OK
Sep 18 09:58:47 hackerman gnome-software[3859145]: Kind change on com.valvesoftware.Steam.Utility.steamtinkerlaunch from addon to runtime is not OK
Sep 18 09:58:47 hackerman gnome-software[3859145]: Kind change on io.github.theforceengine.tfe.Debug from addon to generic is not OK
Sep 18 09:58:47 hackerman gnome-software[3859145]: Kind change on io.github.theforceengine.tfe.Mod.AdjustableHud from addon to runtime is not OK
Sep 18 09:58:47 hackerman gnome-software[3859145]: Kind change on chat.iamb.iamb from console-application to desktop-application is not OK
Sep 18 09:58:49 hackerman gnome-software[3859145]: Kind change on net.sourceforge.fspclient from console-application to desktop-application is not OK
Sep 18 09:58:50 hackerman gnome-software[3859145]: Kind change on de.gonicus.gonnect.plugin.Matrix from addon to runtime is not OK
Sep 18 09:58:50 hackerman gnome-software[3859145]: Kind change on au.edu.uq.esys.escript from console-application to desktop-application is not OK
Sep 18 09:58:51 hackerman gnome-software[3859145]: Kind change on ca.uwaterloo.Raven from console-application to desktop-application is not OK
Sep 18 09:58:51 hackerman gnome-software[3859145]: Kind change on cern.root.ROOT from console-application to desktop-application is not OK
... 190 more distinct messages not shown
== idm00 (1 distinct, 1 total) ==
Sep 18 09:54:08 idm00 named[4166701]: client @0x7f11a9468268 10.73.240.42#60053: update '73.10.in-addr.arpa/IN' denied
== idmp0 (1 distinct, 1 total) ==
Sep 18 09:37:58 idmp0 named[1598691]: client @0x7f2d280332b8 10.73.240.43#58653: update '73.10.in-addr.arpa/IN' denied
== inbound00.cs.umd.edu (1 distinct, 1 total) ==
Sep 18 09:20:08 inbound00.cs.umd.edu krb5_child[1438909]: Client 'admin(a)UMD.EDU' not found in Kerberos database
== inbound01.cs.umd.edu (1 distinct, 1 total) ==
Sep 18 09:51:20 inbound01.cs.umd.edu krb5_child[3667327]: Preauthentication failed
== irb2156 (1 distinct, 1 total) ==
Sep 18 09:44:47 irb2156 systemd[1]: insights-client.service: Start request repeated too quickly.
== itmon02 (3 distinct, 9 total) ==
Sep 18 09:08:33 itmon02 sshd[1750555]: error: beginning MaxStartups throttling [x7]
Sep 18 09:33:00 itmon02 SetroubleshootPrivileged.py[4011 failed to retrieve rpm info for path '/var/lib/selinux/targeted/active/modules/200/grafana':
Sep 18 09:33:00 itmon02 setroubleshoot[4011240]: SELinux is preventing /usr/sbin/grafana from name_connect access on the tcp_socket port 3306. For complete SELinux messages run: sealert -l deb40268-1414-43e0-8915-0a3785a3ecd5
== matrix (3 distinct, 3 total) ==
Sep 18 10:03:32 matrix puppet-agent[1440403]: Could not retrieve catalog from remote server: Error 500 on SERVER: Server Error: Evaluation Error: Error while evaluating a Resource Statement, Duplicate declaration: File[/etc/letsencrypt/accounts/acme-us.certinext.io/v1/directory/] is already declared at (file: /etc/puppetlabs/code/environments/certbot_multisan_matrix/site/profile/manifests/certbot/umd.pp, line: 112); cannot redeclare (file: /etc/puppetlabs/code/environments/certbot_multisan_matrix/site/profile/manifests/certbot/umd.pp, line: 112) (file: /etc/puppetlabs/code/environments/certbot_multisan_matrix/site/profile/manifests/certbot/umd.pp, line: 112, column: 5) on node matrix.cs.umd.edu
Sep 18 10:03:32 matrix puppet-agent[1440403]: Not using cache on failed catalog
Sep 18 10:03:32 matrix puppet-agent[1440403]: Could not retrieve catalog; skipping run
== mcstic (1 distinct, 2 total) ==
Sep 18 09:26:50 mcstic krb5_child[760950]: Client 'admin(a)UMD.EDU' not found in Kerberos database [x2]
== munin (2 distinct, 4 total) ==
Sep 18 09:08:35 munin sudo[3867901]: pam_systemd(sudo:session): Failed to stat() runtime directory '/run/user/0': No such file or directory [x2]
Sep 18 09:08:35 munin sudo[3867901]: pam_systemd(sudo:session): Not setting $XDG_RUNTIME_DIR, as the directory is not in order. [x2]
== networkvm02 (1 distinct, 1 total) ==
Sep 18 09:54:18 networkvm02 virtqemud[2452]: Domain id=33 name='guestfs-080hyoqvthqj3y0i' uuid=fe8fe543-be7c-4c3b-972e-6a5e33c5a622 is tainted: custom-argv
== newhonors2 (1 distinct, 24 total) ==
Sep 18 09:13:03 newhonors2 dhcpcd[2808219]: dhcpcd is not running [x24]
== nightingale (5 distinct, 5 total) ==
Sep 18 09:05:03 nightingale gnome-software[189927]: failed to install runtime/org.freedesktop.Platform.codecs-extra/x86_64/26.08-extra (non fatal): Flatpak system operation Deploy not allowed for user
Sep 18 09:05:48 nightingale gnome-software[189927]: failed to install runtime/org.freedesktop.Platform.openh264/x86_64/2.2.0 (non fatal): Flatpak system operation Deploy not allowed for user
Sep 18 09:05:48 nightingale gnome-software[189927]: State change on system/flatpak/flathub/org.freedesktop.Platform/22.08 (Freedesktop Platform) from installing to removing is not OK
Sep 18 09:05:48 nightingale gnome-software[189927]: State change on system/flatpak/flathub/im.riot.Riot/stable (Element) from updatable-live to installed is not OK
Sep 18 09:05:48 nightingale gnome-software[189927]: State change on system/flatpak/flathub/org.freedesktop.Platform/22.08 (Freedesktop Platform) from updatable-live to installed is not OK
== ntop00 (101 distinct, 145 total) ==
Sep 18 09:05:01 ntop00 nfacctd[409883]: INFO ( m1/mysql ): *** Purging cache - START (PID: 34) ***
Sep 18 09:05:11 ntop00 sfacctd[409803]: INFO ( m1/mysql ): *** Purging cache - END (PID: 34, QN: 4837/4837, ET: 10) ***
Sep 18 09:05:11 ntop00 nfacctd[409883]: INFO ( m1/mysql ): *** Purging cache - END (PID: 34, QN: 62/62, ET: 10) ***
Sep 18 09:08:01 ntop00 sfacctd[409803]: INFO ( p1/print ): *** Purging cache - START (PID: 35) ***
Sep 18 09:08:01 ntop00 sfacctd[409803]: INFO ( p1/print ): *** Purging cache - END (PID: 35, QN: 4527/4527, ET: 0) ***
Sep 18 09:08:01 ntop00 nfacctd[409883]: INFO ( p1/print ): *** Purging cache - START (PID: 35) ***
Sep 18 09:08:01 ntop00 nfacctd[409883]: INFO ( p1/print ): *** Purging cache - END (PID: 35, QN: 63/63, ET: 0) ***
Sep 18 09:08:02 ntop00 setroubleshoot[420237]: SELinux is preventing /usr/local/sbin/sfacctd from append access on the file sflow.json. For complete SELinux messages run: sealert -l ba17169a-f61e-45e0-9bfd-16245ab8d860 [x12]
Sep 18 09:08:02 ntop00 setroubleshoot[420237]: SELinux is preventing /usr/local/sbin/sfacctd from write access on the file sflow.json. For complete SELinux messages run: sealert -l 85ad2812-105d-4895-83cc-04883c3725e4 [x12]
Sep 18 09:08:02 ntop00 setroubleshoot[420237]: failed to retrieve rpm info for path '/srv/pmacct/sflow.json': [x12]
Sep 18 09:08:02 ntop00 setroubleshoot[420237]: SELinux is preventing /usr/local/sbin/sfacctd from lock access on the file /srv/pmacct/sflow.json. For complete SELinux messages run: sealert -l d37d529f-f576-4d65-b493-960c1591cf89 [x12]
Sep 18 09:10:01 ntop00 nfacctd[409883]: INFO ( m1/mysql ): *** Purging cache - START (PID: 36) ***
Sep 18 09:10:01 ntop00 sfacctd[409803]: INFO ( m1/mysql ): *** Purging cache - START (PID: 36) ***
Sep 18 09:10:01 ntop00 nfacctd[409883]: INFO ( m1/mysql ): *** Purging cache - END (PID: 36, QN: 62/62, ET: 0) ***
Sep 18 09:10:11 ntop00 sfacctd[409803]: INFO ( m1/mysql ): *** Purging cache - END (PID: 36, QN: 4453/4453, ET: 10) ***
Sep 18 09:13:01 ntop00 sfacctd[409803]: INFO ( p1/print ): *** Purging cache - START (PID: 37) ***
Sep 18 09:13:01 ntop00 sfacctd[409803]: INFO ( p1/print ): *** Purging cache - END (PID: 37, QN: 4829/4829, ET: 0) ***
Sep 18 09:13:01 ntop00 nfacctd[409883]: INFO ( p1/print ): *** Purging cache - START (PID: 37) ***
Sep 18 09:13:01 ntop00 nfacctd[409883]: INFO ( p1/print ): *** Purging cache - END (PID: 37, QN: 54/54, ET: 0) ***
Sep 18 09:15:01 ntop00 sfacctd[409803]: INFO ( m1/mysql ): *** Purging cache - START (PID: 38) ***
Sep 18 09:15:01 ntop00 nfacctd[409883]: INFO ( m1/mysql ): *** Purging cache - START (PID: 38) ***
Sep 18 09:15:12 ntop00 sfacctd[409803]: INFO ( m1/mysql ): *** Purging cache - END (PID: 38, QN: 4726/4726, ET: 11) ***
Sep 18 09:15:12 ntop00 nfacctd[409883]: INFO ( m1/mysql ): *** Purging cache - END (PID: 38, QN: 57/57, ET: 11) ***
Sep 18 09:18:01 ntop00 sfacctd[409803]: INFO ( p1/print ): *** Purging cache - START (PID: 39) ***
Sep 18 09:18:01 ntop00 sfacctd[409803]: INFO ( p1/print ): *** Purging cache - END (PID: 39, QN: 4528/4528, ET: 0) ***
Sep 18 09:18:01 ntop00 nfacctd[409883]: INFO ( p1/print ): *** Purging cache - START (PID: 39) ***
Sep 18 09:18:01 ntop00 nfacctd[409883]: INFO ( p1/print ): *** Purging cache - END (PID: 39, QN: 52/52, ET: 0) ***
Sep 18 09:20:01 ntop00 sfacctd[409803]: INFO ( m1/mysql ): *** Purging cache - START (PID: 40) ***
Sep 18 09:20:01 ntop00 nfacctd[409883]: INFO ( m1/mysql ): *** Purging cache - START (PID: 40) ***
Sep 18 09:20:13 ntop00 sfacctd[409803]: INFO ( m1/mysql ): *** Purging cache - END (PID: 40, QN: 4787/4787, ET: 12) ***
... 71 more distinct messages not shown
== outbound00.cs.umd.edu (2 distinct, 7 total) ==
Sep 18 09:09:08 outbound00.cs.umd.edu python3[1311947]: ldapdb [x6]
Sep 18 09:46:13 outbound00.cs.umd.edu krb5_child[1320417]: Client 'admin(a)UMD.EDU' not found in Kerberos database
== outbound01.cs.umd.edu (1 distinct, 6 total) ==
Sep 18 09:13:07 outbound01.cs.umd.edu python3[3570124]: ldapdb [x6]
== sebatinsky.cs.umd.edu (1 distinct, 1 total) ==
Sep 18 09:55:56 sebatinsky.cs.umd.edu kernel: hpet1: lost 1 rtc interrupts
== sentry-docker00.cs.umd.edu (38 distinct, 38 total) ==
Sep 18 09:16:13 sentry-docker00.cs.umd.edu systemd-udevd[2865638]: link_config: could not get ethtool features for veth3d4fde2
Sep 18 09:16:13 sentry-docker00.cs.umd.edu systemd-udevd[2865638]: Could not set offload features of veth3d4fde2: No such device
Sep 18 09:16:13 sentry-docker00.cs.umd.edu systemd-udevd[2865683]: Could not generate persistent MAC address for veth8d57278: No such file or directory
Sep 18 09:16:13 sentry-docker00.cs.umd.edu systemd-udevd[2865684]: Could not generate persistent MAC address for veth53b8df1: No such file or directory
Sep 18 09:16:13 sentry-docker00.cs.umd.edu systemd-udevd[2865687]: Could not generate persistent MAC address for veth2ef55b2: No such file or directory
Sep 18 09:16:13 sentry-docker00.cs.umd.edu systemd-udevd[2865688]: Could not generate persistent MAC address for veth768722b: No such file or directory
Sep 18 09:16:13 sentry-docker00.cs.umd.edu systemd-udevd[2865702]: Could not generate persistent MAC address for veth293c974: No such file or directory
Sep 18 09:16:13 sentry-docker00.cs.umd.edu systemd-udevd[2865695]: Could not generate persistent MAC address for vethd38bba5: No such file or directory
Sep 18 09:16:13 sentry-docker00.cs.umd.edu systemd-udevd[2865715]: Could not generate persistent MAC address for vethaa2007b: No such file or directory
Sep 18 09:16:13 sentry-docker00.cs.umd.edu systemd-udevd[2865716]: Could not generate persistent MAC address for veth6dc4caa: No such file or directory
Sep 18 09:16:13 sentry-docker00.cs.umd.edu systemd-udevd[2865785]: Could not generate persistent MAC address for veth7debd41: No such file or directory
Sep 18 09:16:13 sentry-docker00.cs.umd.edu systemd-udevd[2865789]: Could not generate persistent MAC address for vethdeb4e95: No such file or directory
Sep 18 09:36:21 sentry-docker00.cs.umd.edu systemd-udevd[2875273]: link_config: could not get ethtool features for veth8d57278
Sep 18 09:36:21 sentry-docker00.cs.umd.edu systemd-udevd[2875273]: Could not set offload features of veth8d57278: No such device
Sep 18 09:36:21 sentry-docker00.cs.umd.edu systemd-udevd[2875308]: Could not generate persistent MAC address for vethf84e762: No such file or directory
Sep 18 09:36:21 sentry-docker00.cs.umd.edu systemd-udevd[2875309]: Could not generate persistent MAC address for vethd75e985: No such file or directory
Sep 18 09:36:21 sentry-docker00.cs.umd.edu systemd-udevd[2875312]: Could not generate persistent MAC address for veth0d5d497: No such file or directory
Sep 18 09:36:21 sentry-docker00.cs.umd.edu systemd-udevd[2875313]: Could not generate persistent MAC address for veth32b4f47: No such file or directory
Sep 18 09:36:21 sentry-docker00.cs.umd.edu systemd-udevd[2875319]: Could not generate persistent MAC address for veth9e452b8: No such file or directory
Sep 18 09:36:21 sentry-docker00.cs.umd.edu systemd-udevd[2875332]: Could not generate persistent MAC address for vethc42b96b: No such file or directory
Sep 18 09:36:21 sentry-docker00.cs.umd.edu systemd-udevd[2875338]: Could not generate persistent MAC address for veth3997fdd: No such file or directory
Sep 18 09:36:21 sentry-docker00.cs.umd.edu systemd-udevd[2875339]: Could not generate persistent MAC address for veth60ddccd: No such file or directory
Sep 18 09:36:21 sentry-docker00.cs.umd.edu systemd-udevd[2875357]: Could not generate persistent MAC address for vethb299861: No such file or directory
Sep 18 09:36:21 sentry-docker00.cs.umd.edu systemd-udevd[2875339]: Could not generate persistent MAC address for vethf9c7aa1: No such file or directory
Sep 18 09:56:29 sentry-docker00.cs.umd.edu systemd-udevd[2884680]: link_config: could not get ethtool features for vethf84e762
Sep 18 09:56:29 sentry-docker00.cs.umd.edu systemd-udevd[2884680]: Could not set offload features of vethf84e762: No such device
Sep 18 09:56:29 sentry-docker00.cs.umd.edu systemd-udevd[2884692]: link_config: could not set ethtool features for veth9e452b8
Sep 18 09:56:29 sentry-docker00.cs.umd.edu systemd-udevd[2884692]: Could not set offload features of veth9e452b8: Operation not permitted
Sep 18 09:56:30 sentry-docker00.cs.umd.edu systemd-udevd[2884738]: Could not generate persistent MAC address for vethd6ad87c: No such file or directory
Sep 18 09:56:30 sentry-docker00.cs.umd.edu systemd-udevd[2884739]: Could not generate persistent MAC address for veth10cbcf0: No such file or directory
... 8 more distinct messages not shown
== strawberry (7 distinct, 38 total) ==
Sep 18 09:07:03 strawberry kernel: I/O error, dev sda, sector 206848 op 0x0:(READ) flags 0x80700 phys_seg 1 prio class 2 [x6]
Sep 18 09:07:03 strawberry kernel: I/O error, dev sda, sector 206848 op 0x0:(READ) flags 0x0 phys_seg 1 prio class 2 [x6]
Sep 18 09:07:03 strawberry kernel: Buffer I/O error on dev sda2, logical block 0, async page read [x6]
Sep 18 09:07:03 strawberry kernel: I/O error, dev sda, sector 2048 op 0x0:(READ) flags 0x80700 phys_seg 1 prio class 2 [x6]
Sep 18 09:07:03 strawberry kernel: I/O error, dev sda, sector 2048 op 0x0:(READ) flags 0x0 phys_seg 1 prio class 2 [x6]
Sep 18 09:07:03 strawberry kernel: Buffer I/O error on dev sda1, logical block 0, async page read [x6]
Sep 18 09:34:42 strawberry smartd[5314]: Device: /dev/sda [SAT], failed to read SMART Attribute Data [x2]
== submit26-b9-f3 (9 distinct, 9 total) ==
Sep 18 09:06:42 submit26-b9-f3 setroubleshoot[1762649]: SELinux is preventing /usr/bin/python3.9 from create access on the directory /(null). For complete SELinux messages run: sealert -l a653b772-cbcd-438b-bae5-23c3dc69b31b
Sep 18 09:06:42 submit26-b9-f3 setroubleshoot[1762649]: SELinux is preventing /usr/bin/python3.9 from add_name access on the directory /(null). For complete SELinux messages run: sealert -l 3e904634-6caa-4202-8c92-f139db798859
Sep 18 09:06:42 submit26-b9-f3 setroubleshoot[1762649]: SELinux is preventing /usr/bin/python3.9 from create access on the file /(null). For complete SELinux messages run: sealert -l 580b20e4-ec2c-433d-905c-5bd417fba033
Sep 18 09:06:42 submit26-b9-f3 setroubleshoot[1762649]: SELinux is preventing /usr/bin/python3.9 from open access on the file /tmp/libdnf.o3H1dp/repodata/repomd.xml. For complete SELinux messages run: sealert -l 27f29d48-5e7c-4db7-b051-8ac055737d6f
Sep 18 09:06:42 submit26-b9-f3 setroubleshoot[1762649]: SELinux is preventing /usr/bin/python3.9 from setattr access on the file repomd.xml. For complete SELinux messages run: sealert -l bff72452-d40a-430b-9060-dd0a48f5b6ba
Sep 18 09:06:42 submit26-b9-f3 setroubleshoot[1762649]: SELinux is preventing /usr/bin/python3.9 from read access on the directory libdnf.o3H1dp. For complete SELinux messages run: sealert -l 9638d396-8ce5-4e6a-ae47-45cd3985e1cd
Sep 18 09:06:42 submit26-b9-f3 setroubleshoot[1762649]: SELinux is preventing /usr/bin/python3.9 from remove_name access on the directory repomd.xml. For complete SELinux messages run: sealert -l 6da64b94-7024-45a9-b8c2-3b9812517407
Sep 18 09:06:42 submit26-b9-f3 setroubleshoot[1762649]: SELinux is preventing /usr/bin/python3.9 from unlink access on the file repomd.xml. For complete SELinux messages run: sealert -l 64cbe179-abf1-4d5a-bade-bb164897ee65
Sep 18 09:06:42 submit26-b9-f3 setroubleshoot[1762649]: SELinux is preventing /usr/bin/python3.9 from rmdir access on the directory repodata. For complete SELinux messages run: sealert -l d2e35b1a-e27c-4f91-9217-2bb1204e1e68
== submit26-b9-f4 (9 distinct, 9 total) ==
Sep 18 09:24:47 submit26-b9-f4 setroubleshoot[1290705]: SELinux is preventing /usr/bin/python3.9 from create access on the directory /(null). For complete SELinux messages run: sealert -l ee160f23-b161-4f4a-9985-c4edfd3a5beb
Sep 18 09:24:47 submit26-b9-f4 setroubleshoot[1290705]: SELinux is preventing /usr/bin/python3.9 from add_name access on the directory /(null). For complete SELinux messages run: sealert -l 89a83821-4b24-4081-9973-0a79ca6ed5b4
Sep 18 09:24:47 submit26-b9-f4 setroubleshoot[1290705]: SELinux is preventing /usr/bin/python3.9 from create access on the file /(null). For complete SELinux messages run: sealert -l f73955d6-1416-45f9-bab6-ff1f3ea07e9d
Sep 18 09:24:47 submit26-b9-f4 setroubleshoot[1290705]: SELinux is preventing /usr/bin/python3.9 from open access on the file /tmp/libdnf.MhjWEO/repodata/repomd.xml. For complete SELinux messages run: sealert -l 9f8f24a0-8fb6-454d-a103-31a8f7a6efa0
Sep 18 09:24:47 submit26-b9-f4 setroubleshoot[1290705]: SELinux is preventing /usr/bin/python3.9 from setattr access on the file repomd.xml. For complete SELinux messages run: sealert -l 20293136-86a3-40ba-a651-cff48d36059e
Sep 18 09:24:47 submit26-b9-f4 setroubleshoot[1290705]: SELinux is preventing /usr/bin/python3.9 from read access on the directory libdnf.MhjWEO. For complete SELinux messages run: sealert -l 25f86b49-4ee7-4f60-ad1c-73a70032560c
Sep 18 09:24:47 submit26-b9-f4 setroubleshoot[1290705]: SELinux is preventing /usr/bin/python3.9 from remove_name access on the directory repomd.xml. For complete SELinux messages run: sealert -l eec250fb-073f-456d-93bc-f98776fd476d
Sep 18 09:24:47 submit26-b9-f4 setroubleshoot[1290705]: SELinux is preventing /usr/bin/python3.9 from unlink access on the file repomd.xml. For complete SELinux messages run: sealert -l c9209e04-a349-43d5-8cb2-3e303e48df74
Sep 18 09:24:47 submit26-b9-f4 setroubleshoot[1290705]: SELinux is preventing /usr/bin/python3.9 from rmdir access on the directory repodata. For complete SELinux messages run: sealert -l 3178d5f5-80e9-404b-92b7-9bef397a8915
== teaching-awards (1 distinct, 1 total) ==
Sep 18 09:46:31 teaching-awards krb5_child[1017149]: Client 'admin(a)UMD.EDU' not found in Kerberos database
1
0
Command: /usr/local/sbin/syslog-digest.py
Time : 0.0571s
Status : exited 0
Output :
Syslog digest — 2026-09-18 09:05 EDT
Processed 3,091 lines, filtered 2,495 (80%). 596 unknown (262 distinct) from 22 host(s).
== b0b02.cs.umd.edu (1 distinct, 1 total) ==
Sep 18 08:49:19 b0b02.cs.umd.edu rustdesk[2463192]: cannot open display:
== bale (5 distinct, 86 total) ==
Sep 18 08:05:18 bale setroubleshoot[498920]: failed to retrieve rpm info for /dev/nvme0 [x36]
Sep 18 08:05:19 bale setroubleshoot[498920]: SELinux is preventing /usr/libexec/platform-python3.6 from getattr access on the chr_file /dev/nvme0. For complete SELinux messages run: sealert -l e098d0bd-ac29-4737-9018-de9a71e328ee [x13]
Sep 18 08:05:21 bale setroubleshoot[498920]: SELinux is preventing smartctl from read access on the chr_file nvme0. For complete SELinux messages run: sealert -l fc305ce6-663c-4aa2-8640-0ee0f8dce1a9 [x14]
Sep 18 08:05:24 bale setroubleshoot[498920]: SELinux is preventing smartctl from open access on the chr_file /dev/nvme0. For complete SELinux messages run: sealert -l 2c1d6b29-3343-488c-84c7-92d46f8010b6 [x10]
Sep 18 08:05:36 bale setroubleshoot[499547]: SELinux is preventing /usr/sbin/smartctl from ioctl access on the chr_file /dev/nvme0. For complete SELinux messages run: sealert -l 8ea740c2-97d8-42fb-b550-a236b114507d [x13]
== cheezit.cs.umd.edu (4 distinct, 9 total) ==
Sep 18 08:21:59 cheezit.cs.umd.edu sshd-session[503059]: pam_access(sshd:auth): access denied for user `larry' from `71.191.93.172' [x4]
Sep 18 08:21:59 cheezit.cs.umd.edu sshd-session[503059]: Error in Duo login for 'larry' from 71.191.93.172 [x2]
Sep 18 08:21:59 cheezit.cs.umd.edu sshd-session[503057]: error: PAM: Authentication failure for larry from 71.191.93.172 [x2]
Sep 18 08:53:57 cheezit.cs.umd.edu systemd[1]: insights-client.service: Start request repeated too quickly.
== csfw00a (1 distinct, 124 total) ==
Sep 18 08:04:32 csfw00a kernel: bnxt_en 0000:09:00.0 eth3: NIC Link is Down [x124]
== emaar (2 distinct, 2 total) ==
Sep 18 08:43:13 emaar puppet-agent[2959421]: (Facter) invalid or malformed lldp data: MalformedDataError: no lldp interface data found
Sep 18 08:45:27 emaar systemd[1]: insights-client.service: Start request repeated too quickly.
== idm00 (1 distinct, 1 total) ==
Sep 18 08:54:08 idm00 named[4166701]: client @0x7f11a93e0168 10.73.240.42#53154: update '73.10.in-addr.arpa/IN' denied
== idmp0 (1 distinct, 1 total) ==
Sep 18 08:37:58 idmp0 named[1598691]: client @0x7f2d3c076558 10.73.240.43#64855: update '73.10.in-addr.arpa/IN' denied
== inbound00.cs.umd.edu (1 distinct, 1 total) ==
Sep 18 08:21:34 inbound00.cs.umd.edu krb5_child[1425423]: Client 'admin(a)UMD.EDU' not found in Kerberos database
== itmon02 (1 distinct, 3 total) ==
Sep 18 08:23:14 itmon02 sshd[1750555]: error: beginning MaxStartups throttling [x3]
== mirrors.cs.umd.edu (1 distinct, 1 total) ==
Sep 18 08:37:00 mirrors.cs.umd.edu puppet-agent[28034]: (Facter) Error while resolving custom fact fact='ipa', resolution='<anonymous>': Failed while executing '/usr/bin/kinit -k 2>&1': Timeout encounter after 10s, killing process with pid: 28239
== munin (2 distinct, 8 total) ==
Sep 18 08:19:05 munin sudo[3849048]: pam_systemd(sudo:session): Failed to stat() runtime directory '/run/user/0': No such file or directory [x4]
Sep 18 08:19:05 munin sudo[3849048]: pam_systemd(sudo:session): Not setting $XDG_RUNTIME_DIR, as the directory is not in order. [x4]
== newhonors2 (1 distinct, 24 total) ==
Sep 18 08:13:03 newhonors2 dhcpcd[2806332]: dhcpcd is not running [x24]
== nightingale (80 distinct, 93 total) ==
Sep 18 09:02:31 nightingale goa-identity-se[189863]: GoaKerberosIdentityManager: Using polling for change notification for credential cache type 'KCM'
Sep 18 09:02:31 nightingale vmware-user.desktop[190001]: vmware-user: could not open /proc/fs/vmblock/dev
Sep 18 09:02:31 nightingale gsd-usb-protect[189940]: Failed to fetch USBGuard parameters: GDBus.Error:org.freedesktop.DBus.Error.ServiceUnknown: The name is not activatable
Sep 18 09:02:33 nightingale gsd-color[189906]: failed to connect to device: Failed to connect to missing device /org/freedesktop/ColorManager/devices/xrandr_Acer_Technologies_B246WL_T1ZAA0012420_gdm_42
Sep 18 09:02:34 nightingale PanGPUI[189951]: QObject::connect: No such slot PanGPUIWebDialog::onReload()
Sep 18 09:02:34 nightingale PanGPUI[189951]: Setting a QCompleter on non-editable QComboBox is not allowed.
Sep 18 09:02:34 nightingale PanGPUI[189951]: QLayout: Attempting to add QLayout "" to ConnectionsTab "", which already has a layout [x5]
Sep 18 09:02:34 nightingale PanGPUI[189951]: QLayout: Attempting to add QLayout "" to TroubleShootingTab "", which already has a layout
Sep 18 09:02:34 nightingale PanGPUI[189951]: QLayout: Attempting to add QLayout "" to PanGPUIFedMandateDialog "", which already has a layout
Sep 18 09:02:34 nightingale PanGPUI[189951]: QLayout: Attempting to add QLayout "" to PanGPUIPreferredGwDialog "", which already has a layout
Sep 18 09:02:34 nightingale PanGPUI[189951]: QLayout: Attempting to add QLayout "" to PanGPUICertSelectDialog "", which already has a layout
Sep 18 09:02:45 nightingale gnome-software[189927]: Kind change on net.launchpad.Gnuclad from console-application to desktop-application is not OK
Sep 18 09:02:48 nightingale gnome-software[189927]: Kind change on io.github.sil_car.SqueezeVid from console-application to desktop-application is not OK
Sep 18 09:02:51 nightingale gnome-software[189927]: Kind change on net.mkiol.SpeechNote.Addon.amd from addon to runtime is not OK
Sep 18 09:02:51 nightingale gnome-software[189927]: Kind change on net.mkiol.SpeechNote.Addon.nvidia from addon to runtime is not OK
Sep 18 09:02:51 nightingale gnome-software[189927]: Kind change on org.videolan.VLC.Plugin.pause_click from addon to runtime is not OK
Sep 18 09:02:55 nightingale gnome-software[189927]: Kind change on com.github.ilai_deutel.kibi from console-application to desktop-application is not OK
Sep 18 09:02:56 nightingale gnome-software[189927]: Kind change on dev.paullee.scraterpreter.Scrape from console-application to desktop-application is not OK
Sep 18 09:02:56 nightingale gnome-software[189927]: Kind change on dev.paullee.scraterpreter.Scrapec from console-application to desktop-application is not OK
Sep 18 09:02:56 nightingale gnome-software[189927]: Kind change on fr.inria.corese.CoreseCommand from console-application to desktop-application is not OK
Sep 18 09:02:57 nightingale gnome-software[189927]: Kind change on io.github.erkin.ponysay from console-application to desktop-application is not OK
Sep 18 09:02:59 nightingale gnome-software[189927]: Kind change on net.imaginaryinfinity.Squiid from console-application to desktop-application is not OK
Sep 18 09:03:00 nightingale gnome-software[189927]: Kind change on org.eu.wabarc.wayback from console-application to desktop-application is not OK
Sep 18 09:03:02 nightingale gnome-software[189927]: Kind change on com.jeffser.Alpaca.Plugins.AMD from addon to runtime is not OK
Sep 18 09:03:02 nightingale gnome-software[189927]: Kind change on com.jeffser.Alpaca.Plugins.Ollama from addon to runtime is not OK
Sep 18 09:03:02 nightingale gnome-software[189927]: Kind change on com.sublimetext.three.DevUtils from addon to runtime is not OK [x4]
Sep 18 09:03:02 nightingale gnome-software[189927]: Kind change on com.valvesoftware.Steam.Utility.slonfig from addon to runtime is not OK
Sep 18 09:03:08 nightingale gnome-software[189927]: Kind change on com.valvesoftware.Steam.Utility.InhibitScreensaver from addon to runtime is not OK
Sep 18 09:03:08 nightingale gnome-software[189927]: Kind change on com.valvesoftware.Steam.Utility.steamtinkerlaunch from addon to runtime is not OK
Sep 18 09:03:08 nightingale gnome-software[189927]: Kind change on io.github.theforceengine.tfe.Debug from addon to generic is not OK
... 50 more distinct messages not shown
== ntop00 (101 distinct, 141 total) ==
Sep 18 08:05:01 ntop00 sfacctd[409803]: INFO ( m1/mysql ): *** Purging cache - START (PID: 10) ***
Sep 18 08:05:01 ntop00 nfacctd[409883]: INFO ( m1/mysql ): *** Purging cache - START (PID: 10) ***
Sep 18 08:05:11 ntop00 sfacctd[409803]: INFO ( m1/mysql ): *** Purging cache - END (PID: 10, QN: 4673/4673, ET: 10) ***
Sep 18 08:05:11 ntop00 nfacctd[409883]: INFO ( m1/mysql ): *** Purging cache - END (PID: 10, QN: 58/58, ET: 10) ***
Sep 18 08:08:01 ntop00 sfacctd[409803]: INFO ( p1/print ): *** Purging cache - START (PID: 11) ***
Sep 18 08:08:01 ntop00 sfacctd[409803]: INFO ( p1/print ): *** Purging cache - END (PID: 11, QN: 4550/4550, ET: 0) ***
Sep 18 08:08:01 ntop00 nfacctd[409883]: INFO ( p1/print ): *** Purging cache - START (PID: 11) ***
Sep 18 08:08:01 ntop00 nfacctd[409883]: INFO ( p1/print ): *** Purging cache - END (PID: 11, QN: 69/69, ET: 0) ***
Sep 18 08:08:02 ntop00 setroubleshoot[412520]: SELinux is preventing /usr/local/sbin/sfacctd from append access on the file sflow.json. For complete SELinux messages run: sealert -l ba17169a-f61e-45e0-9bfd-16245ab8d860 [x11]
Sep 18 08:08:02 ntop00 setroubleshoot[412520]: SELinux is preventing /usr/local/sbin/sfacctd from write access on the file sflow.json. For complete SELinux messages run: sealert -l 85ad2812-105d-4895-83cc-04883c3725e4 [x11]
Sep 18 08:08:03 ntop00 setroubleshoot[412520]: failed to retrieve rpm info for path '/srv/pmacct/sflow.json': [x11]
Sep 18 08:08:03 ntop00 setroubleshoot[412520]: SELinux is preventing /usr/local/sbin/sfacctd from lock access on the file /srv/pmacct/sflow.json. For complete SELinux messages run: sealert -l d37d529f-f576-4d65-b493-960c1591cf89 [x11]
Sep 18 08:10:01 ntop00 sfacctd[409803]: INFO ( m1/mysql ): *** Purging cache - START (PID: 12) ***
Sep 18 08:10:01 ntop00 nfacctd[409883]: INFO ( m1/mysql ): *** Purging cache - START (PID: 12) ***
Sep 18 08:10:11 ntop00 sfacctd[409803]: INFO ( m1/mysql ): *** Purging cache - END (PID: 12, QN: 4492/4492, ET: 10) ***
Sep 18 08:10:11 ntop00 nfacctd[409883]: INFO ( m1/mysql ): *** Purging cache - END (PID: 12, QN: 57/57, ET: 10) ***
Sep 18 08:13:01 ntop00 sfacctd[409803]: INFO ( p1/print ): *** Purging cache - START (PID: 13) ***
Sep 18 08:13:01 ntop00 sfacctd[409803]: INFO ( p1/print ): *** Purging cache - END (PID: 13, QN: 4829/4829, ET: 0) ***
Sep 18 08:13:01 ntop00 nfacctd[409883]: INFO ( p1/print ): *** Purging cache - START (PID: 13) ***
Sep 18 08:13:01 ntop00 nfacctd[409883]: INFO ( p1/print ): *** Purging cache - END (PID: 13, QN: 39/39, ET: 0) ***
Sep 18 08:15:01 ntop00 sfacctd[409803]: INFO ( m1/mysql ): *** Purging cache - START (PID: 14) ***
Sep 18 08:15:01 ntop00 nfacctd[409883]: INFO ( m1/mysql ): *** Purging cache - START (PID: 14) ***
Sep 18 08:15:12 ntop00 sfacctd[409803]: INFO ( m1/mysql ): *** Purging cache - END (PID: 14, QN: 4803/4803, ET: 11) ***
Sep 18 08:15:12 ntop00 nfacctd[409883]: INFO ( m1/mysql ): *** Purging cache - END (PID: 14, QN: 52/52, ET: 11) ***
Sep 18 08:18:01 ntop00 sfacctd[409803]: INFO ( p1/print ): *** Purging cache - START (PID: 15) ***
Sep 18 08:18:01 ntop00 sfacctd[409803]: INFO ( p1/print ): *** Purging cache - END (PID: 15, QN: 4507/4507, ET: 0) ***
Sep 18 08:18:01 ntop00 nfacctd[409883]: INFO ( p1/print ): *** Purging cache - START (PID: 15) ***
Sep 18 08:18:01 ntop00 nfacctd[409883]: INFO ( p1/print ): *** Purging cache - END (PID: 15, QN: 57/57, ET: 0) ***
Sep 18 08:20:01 ntop00 sfacctd[409803]: INFO ( m1/mysql ): *** Purging cache - START (PID: 16) ***
Sep 18 08:20:01 ntop00 nfacctd[409883]: INFO ( m1/mysql ): *** Purging cache - START (PID: 16) ***
... 71 more distinct messages not shown
== outbound00.cs.umd.edu (1 distinct, 6 total) ==
Sep 18 08:09:08 outbound00.cs.umd.edu python3[1297979]: ldapdb [x6]
== outbound01.cs.umd.edu (2 distinct, 7 total) ==
Sep 18 08:08:21 outbound01.cs.umd.edu krb5_child[3555131]: Preauthentication failed
Sep 18 08:13:06 outbound01.cs.umd.edu python3[3556120]: ldapdb [x6]
== sebatinsky.cs.umd.edu (1 distinct, 1 total) ==
Sep 18 09:03:56 sebatinsky.cs.umd.edu kernel: hpet1: lost 1 rtc interrupts
== sentry-docker00.cs.umd.edu (38 distinct, 38 total) ==
Sep 18 08:15:48 sentry-docker00.cs.umd.edu systemd-udevd[2835709]: link_config: could not get ethtool features for veth71bf7e1
Sep 18 08:15:48 sentry-docker00.cs.umd.edu systemd-udevd[2835709]: Could not set offload features of veth71bf7e1: No such device
Sep 18 08:15:48 sentry-docker00.cs.umd.edu systemd-udevd[2835743]: Could not generate persistent MAC address for veth85db8fc: No such file or directory
Sep 18 08:15:48 sentry-docker00.cs.umd.edu systemd-udevd[2835744]: Could not generate persistent MAC address for vetha8a0f11: No such file or directory
Sep 18 08:15:48 sentry-docker00.cs.umd.edu systemd-udevd[2835747]: Could not generate persistent MAC address for veth693c1a6: No such file or directory
Sep 18 08:15:48 sentry-docker00.cs.umd.edu systemd-udevd[2835748]: Could not generate persistent MAC address for vethe907b60: No such file or directory
Sep 18 08:15:48 sentry-docker00.cs.umd.edu systemd-udevd[2835752]: Could not generate persistent MAC address for veth2020d1b: No such file or directory
Sep 18 08:15:48 sentry-docker00.cs.umd.edu systemd-udevd[2835766]: Could not generate persistent MAC address for vethe8ff7f0: No such file or directory
Sep 18 08:15:48 sentry-docker00.cs.umd.edu systemd-udevd[2835773]: Could not generate persistent MAC address for veth1f59d2a: No such file or directory
Sep 18 08:15:48 sentry-docker00.cs.umd.edu systemd-udevd[2835774]: Could not generate persistent MAC address for vethb55f18b: No such file or directory
Sep 18 08:15:48 sentry-docker00.cs.umd.edu systemd-udevd[2835792]: Could not generate persistent MAC address for veth7fa1758: No such file or directory
Sep 18 08:15:48 sentry-docker00.cs.umd.edu systemd-udevd[2835786]: Could not generate persistent MAC address for veth8625a52: No such file or directory
Sep 18 08:35:56 sentry-docker00.cs.umd.edu systemd-udevd[2845387]: link_config: could not set ethtool features for veth693c1a6
Sep 18 08:35:56 sentry-docker00.cs.umd.edu systemd-udevd[2845387]: Could not set offload features of veth693c1a6: Operation not permitted
Sep 18 08:35:56 sentry-docker00.cs.umd.edu systemd-udevd[2845413]: Could not generate persistent MAC address for vethcb7b084: No such file or directory
Sep 18 08:35:56 sentry-docker00.cs.umd.edu systemd-udevd[2845414]: Could not generate persistent MAC address for veth8da8334: No such file or directory
Sep 18 08:35:56 sentry-docker00.cs.umd.edu systemd-udevd[2845422]: Could not generate persistent MAC address for veth5b3e4ac: No such file or directory
Sep 18 08:35:56 sentry-docker00.cs.umd.edu systemd-udevd[2845434]: Could not generate persistent MAC address for veth36ff01b: No such file or directory
Sep 18 08:35:56 sentry-docker00.cs.umd.edu systemd-udevd[2845430]: Could not generate persistent MAC address for veth64cda7c: No such file or directory
Sep 18 08:35:56 sentry-docker00.cs.umd.edu systemd-udevd[2845433]: Could not generate persistent MAC address for veth27057f3: No such file or directory
Sep 18 08:35:56 sentry-docker00.cs.umd.edu systemd-udevd[2845434]: Could not generate persistent MAC address for veth638e050: No such file or directory
Sep 18 08:35:56 sentry-docker00.cs.umd.edu systemd-udevd[2845433]: Could not generate persistent MAC address for veth37c44c1: No such file or directory
Sep 18 08:35:56 sentry-docker00.cs.umd.edu systemd-udevd[2845509]: Could not generate persistent MAC address for vethb693e39: No such file or directory
Sep 18 08:35:56 sentry-docker00.cs.umd.edu systemd-udevd[2845510]: Could not generate persistent MAC address for veth9a26c3a: No such file or directory
Sep 18 08:56:04 sentry-docker00.cs.umd.edu systemd-udevd[2856070]: link_config: could not get ethtool features for veth36ff01b
Sep 18 08:56:04 sentry-docker00.cs.umd.edu systemd-udevd[2856070]: Could not set offload features of veth36ff01b: No such device
Sep 18 08:56:04 sentry-docker00.cs.umd.edu systemd-udevd[2856098]: link_config: could not get ethtool features for vethb693e39
Sep 18 08:56:04 sentry-docker00.cs.umd.edu systemd-udevd[2856098]: Could not set offload features of vethb693e39: No such device
Sep 18 08:56:04 sentry-docker00.cs.umd.edu systemd-udevd[2856247]: Could not generate persistent MAC address for veth4a927d7: No such file or directory
Sep 18 08:56:04 sentry-docker00.cs.umd.edu systemd-udevd[2856248]: Could not generate persistent MAC address for veth1f58615: No such file or directory
... 8 more distinct messages not shown
== smokeping-slave (1 distinct, 1 total) ==
Sep 18 08:58:18 smokeping-slave nologin[1753956]: Attempted login by UNKNOWN (UID: 65534) on UNKNOWN
== soul (1 distinct, 1 total) ==
Sep 18 09:04:23 soul krb5_child[3266808]: Preauthentication failed
== strawberry (7 distinct, 38 total) ==
Sep 18 08:07:03 strawberry kernel: I/O error, dev sda, sector 206848 op 0x0:(READ) flags 0x80700 phys_seg 1 prio class 2 [x6]
Sep 18 08:07:03 strawberry kernel: I/O error, dev sda, sector 206848 op 0x0:(READ) flags 0x0 phys_seg 1 prio class 2 [x6]
Sep 18 08:07:03 strawberry kernel: Buffer I/O error on dev sda2, logical block 0, async page read [x6]
Sep 18 08:07:03 strawberry kernel: I/O error, dev sda, sector 2048 op 0x0:(READ) flags 0x80700 phys_seg 1 prio class 2 [x6]
Sep 18 08:07:03 strawberry kernel: I/O error, dev sda, sector 2048 op 0x0:(READ) flags 0x0 phys_seg 1 prio class 2 [x6]
Sep 18 08:07:03 strawberry kernel: Buffer I/O error on dev sda1, logical block 0, async page read [x6]
Sep 18 08:34:42 strawberry smartd[5314]: Device: /dev/sda [SAT], failed to read SMART Attribute Data [x2]
== submit26-b9-fclone (9 distinct, 9 total) ==
Sep 18 08:21:57 submit26-b9-fclone setroubleshoot[51757]: SELinux is preventing /usr/bin/python3.9 from create access on the directory /(null). For complete SELinux messages run: sealert -l 9355d9d9-a311-48d2-bd37-6c0f6947dfff
Sep 18 08:21:57 submit26-b9-fclone setroubleshoot[51757]: SELinux is preventing /usr/bin/python3.9 from add_name access on the directory /(null). For complete SELinux messages run: sealert -l cc4658d7-9db1-405d-9eee-de0ccee5857f
Sep 18 08:21:57 submit26-b9-fclone setroubleshoot[51757]: SELinux is preventing /usr/bin/python3.9 from create access on the file /(null). For complete SELinux messages run: sealert -l 568a2429-0b1b-49df-af41-49b5cd298ae8
Sep 18 08:21:57 submit26-b9-fclone setroubleshoot[51757]: SELinux is preventing /usr/bin/python3.9 from open access on the file /tmp/libdnf.uB0Yt0/repodata/repomd.xml. For complete SELinux messages run: sealert -l 03e2f521-0e7c-481f-8e92-0602c6adeedc
Sep 18 08:21:57 submit26-b9-fclone setroubleshoot[51757]: SELinux is preventing /usr/bin/python3.9 from setattr access on the file repomd.xml. For complete SELinux messages run: sealert -l 0d6b7b1f-ebe3-4beb-915a-b06b63bf2566
Sep 18 08:21:57 submit26-b9-fclone setroubleshoot[51757]: SELinux is preventing /usr/bin/python3.9 from read access on the directory libdnf.uB0Yt0. For complete SELinux messages run: sealert -l 887adbf9-2bb9-4009-b800-36ddf9ba0db5
Sep 18 08:21:57 submit26-b9-fclone setroubleshoot[51757]: SELinux is preventing /usr/bin/python3.9 from remove_name access on the directory repomd.xml. For complete SELinux messages run: sealert -l 092e0644-8373-4017-b77f-1afa6c6da4ac
Sep 18 08:21:57 submit26-b9-fclone setroubleshoot[51757]: SELinux is preventing /usr/bin/python3.9 from unlink access on the file repomd.xml. For complete SELinux messages run: sealert -l ce429a92-56de-4de1-b859-cbfb69ae123c
Sep 18 08:21:57 submit26-b9-fclone setroubleshoot[51757]: SELinux is preventing /usr/bin/python3.9 from rmdir access on the directory repodata. For complete SELinux messages run: sealert -l 99b886eb-497b-406d-8206-afe76a1086b4
1
0
Command: /usr/local/sbin/syslog-digest.py
Time : 0.0566s
Status : exited 0
Output :
Syslog digest — 2026-09-18 08:05 EDT
Processed 3,314 lines, filtered 2,726 (82%). 588 unknown (209 distinct) from 20 host(s).
== atif01.cs.umd.edu (3 distinct, 4 total) ==
Sep 18 07:08:50 atif01.cs.umd.edu kernel: net_ratelimit: 12 callbacks suppressed
Sep 18 07:09:59 atif01.cs.umd.edu kernel: net_ratelimit: 9 callbacks suppressed [x2]
Sep 18 07:39:07 atif01.cs.umd.edu kernel: nfsd: peername failed (err 107)!
== b0b02.cs.umd.edu (1 distinct, 1 total) ==
Sep 18 07:49:15 b0b02.cs.umd.edu rustdesk[2447853]: cannot open display:
== bale (5 distinct, 85 total) ==
Sep 18 07:05:50 bale setroubleshoot[486213]: failed to retrieve rpm info for /dev/nvme0 [x36]
Sep 18 07:05:51 bale setroubleshoot[486213]: SELinux is preventing /usr/libexec/platform-python3.6 from getattr access on the chr_file /dev/nvme0. For complete SELinux messages run: sealert -l e098d0bd-ac29-4737-9018-de9a71e328ee [x12]
Sep 18 07:05:53 bale setroubleshoot[486213]: SELinux is preventing smartctl from read access on the chr_file nvme0. For complete SELinux messages run: sealert -l fc305ce6-663c-4aa2-8640-0ee0f8dce1a9 [x13]
Sep 18 07:05:56 bale setroubleshoot[486213]: SELinux is preventing smartctl from open access on the chr_file /dev/nvme0. For complete SELinux messages run: sealert -l 2c1d6b29-3343-488c-84c7-92d46f8010b6 [x11]
Sep 18 07:06:08 bale setroubleshoot[486828]: SELinux is preventing /usr/sbin/smartctl from ioctl access on the chr_file /dev/nvme0. For complete SELinux messages run: sealert -l 8ea740c2-97d8-42fb-b550-a236b114507d [x13]
== csfw00a (1 distinct, 137 total) ==
Sep 18 07:04:13 csfw00a kernel: bnxt_en 0000:09:00.0 eth3: NIC Link is Down [x137]
== hazfs.cs.umd.edu (11 distinct, 66 total) ==
Sep 18 07:42:45 hazfs.cs.umd.edu snmpd[1431]: send response: Failure in sendto [x6]
Sep 18 07:42:45 hazfs.cs.umd.edu snmpd[1431]: -- NET-SNMP-EXTEND-MIB::nsExtendStatus."userweb" [x6]
Sep 18 07:42:45 hazfs.cs.umd.edu snmpd[1431]: -- NET-SNMP-EXTEND-MIB::nsExtendStatus."zfslist" [x6]
Sep 18 07:42:45 hazfs.cs.umd.edu snmpd[1431]: -- NET-SNMP-EXTEND-MIB::nsExtendStatus."userhome" [x6]
Sep 18 07:42:45 hazfs.cs.umd.edu snmpd[1431]: -- NET-SNMP-EXTEND-MIB::nsExtendOutput1Line."userweb" [x6]
Sep 18 07:42:45 hazfs.cs.umd.edu snmpd[1431]: -- NET-SNMP-EXTEND-MIB::nsExtendOutput1Line."zfslist" [x6]
Sep 18 07:42:45 hazfs.cs.umd.edu snmpd[1431]: -- NET-SNMP-EXTEND-MIB::nsExtendOutput1Line."userhome" [x6]
Sep 18 07:42:45 hazfs.cs.umd.edu snmpd[1431]: -- NET-SNMP-EXTEND-MIB::nsExtendOutputFull."userweb" [x6]
Sep 18 07:42:45 hazfs.cs.umd.edu snmpd[1431]: -- NET-SNMP-EXTEND-MIB::nsExtendOutputFull."zfslist" [x6]
Sep 18 07:42:45 hazfs.cs.umd.edu snmpd[1431]: -- NET-SNMP-EXTEND-MIB::nsExtendOutputFull."userhome" [x6]
Sep 18 07:42:45 hazfs.cs.umd.edu snmpd[1431]: -- NET-SNMP-EXTEND-MIB::nsExtendOutNumLines."userweb" [x6]
== idm00 (1 distinct, 1 total) ==
Sep 18 07:54:08 idm00 named[4166701]: client @0x7f11a93d09c8 10.73.240.42#63191: update '73.10.in-addr.arpa/IN' denied
== idmp0 (1 distinct, 1 total) ==
Sep 18 07:37:58 idmp0 named[1598691]: client @0x7f2d0889dd48 10.73.240.43#61063: update '73.10.in-addr.arpa/IN' denied
== inbound00.cs.umd.edu (2 distinct, 2 total) ==
Sep 18 07:18:05 inbound00.cs.umd.edu krb5_child[1409528]: Client 'admin(a)UMD.EDU' not found in Kerberos database
Sep 18 07:20:53 inbound00.cs.umd.edu krb5_child[1410185]: Preauthentication failed
== inbound01.cs.umd.edu (1 distinct, 1 total) ==
Sep 18 07:29:29 inbound01.cs.umd.edu krb5_child[3633945]: Client 'admin(a)UMD.EDU' not found in Kerberos database
== irb2156 (1 distinct, 1 total) ==
Sep 18 07:29:36 irb2156 systemd-resolved[3402]: Using degraded feature set TCP instead of UDP for DNS server 128.8.76.3.
== itmon02 (1 distinct, 3 total) ==
Sep 18 07:43:32 itmon02 sshd[1750555]: error: beginning MaxStartups throttling [x3]
== krispykreme.cs.umd.edu (2 distinct, 2 total) ==
Sep 18 07:27:19 krispykreme.cs.umd.edu krb5_child[3603665]: Preauthentication failed
Sep 18 07:27:19 krispykreme.cs.umd.edu sshd-session[3603636]: error: PAM: Authentication failure for psadeghi from 10.206.0.229
== newhonors2 (1 distinct, 24 total) ==
Sep 18 07:13:02 newhonors2 dhcpcd[2804492]: dhcpcd is not running [x24]
== ntop00 (131 distinct, 172 total) ==
Sep 18 07:05:11 ntop00 sfacctd[323304]: INFO ( m1/mysql ): *** Purging cache - END (PID: 250, QN: 4527/4527, ET: 10) ***
Sep 18 07:05:11 ntop00 nfacctd[323381]: INFO ( m1/mysql ): *** Purging cache - END (PID: 250, QN: 88/88, ET: 10) ***
Sep 18 07:06:01 ntop00 sfacctd[323304]: INFO ( p1/print ): *** Purging cache - START (PID: 251) ***
Sep 18 07:06:01 ntop00 sfacctd[323304]: INFO ( p1/print ): *** Purging cache - END (PID: 251, QN: 4347/4347, ET: 0) ***
Sep 18 07:06:01 ntop00 nfacctd[323381]: INFO ( p1/print ): *** Purging cache - START (PID: 251) ***
Sep 18 07:06:01 ntop00 nfacctd[323381]: INFO ( p1/print ): *** Purging cache - END (PID: 251, QN: 85/85, ET: 0) ***
Sep 18 07:06:02 ntop00 setroubleshoot[403810]: SELinux is preventing /usr/local/sbin/sfacctd from append access on the file sflow.json. For complete SELinux messages run: sealert -l 58e35a5d-c7c9-4337-868c-bb9d5ac2e29f [x9]
Sep 18 07:06:02 ntop00 setroubleshoot[403810]: SELinux is preventing /usr/local/sbin/sfacctd from write access on the file sflow.json. For complete SELinux messages run: sealert -l 369b1df3-2c9d-461b-8b1c-2fcd48dc737c [x9]
Sep 18 07:06:02 ntop00 setroubleshoot[403810]: failed to retrieve rpm info for path '/srv/pmacct/sflow.json': [x12]
Sep 18 07:06:02 ntop00 setroubleshoot[403810]: SELinux is preventing /usr/local/sbin/sfacctd from lock access on the file /srv/pmacct/sflow.json. For complete SELinux messages run: sealert -l 481e7e24-3846-4790-b17b-9e44a5f5b5d6 [x9]
Sep 18 07:10:01 ntop00 sfacctd[323304]: INFO ( m1/mysql ): *** Purging cache - START (PID: 252) ***
Sep 18 07:10:01 ntop00 nfacctd[323381]: INFO ( m1/mysql ): *** Purging cache - START (PID: 252) ***
Sep 18 07:10:10 ntop00 sfacctd[323304]: INFO ( m1/mysql ): *** Purging cache - END (PID: 252, QN: 4245/4245, ET: 9) ***
Sep 18 07:10:10 ntop00 nfacctd[323381]: INFO ( m1/mysql ): *** Purging cache - END (PID: 252, QN: 59/59, ET: 9) ***
Sep 18 07:11:01 ntop00 sfacctd[323304]: INFO ( p1/print ): *** Purging cache - START (PID: 253) ***
Sep 18 07:11:01 ntop00 sfacctd[323304]: INFO ( p1/print ): *** Purging cache - END (PID: 253, QN: 4460/4460, ET: 0) ***
Sep 18 07:11:01 ntop00 nfacctd[323381]: INFO ( p1/print ): *** Purging cache - START (PID: 253) ***
Sep 18 07:11:01 ntop00 nfacctd[323381]: INFO ( p1/print ): *** Purging cache - END (PID: 253, QN: 65/65, ET: 0) ***
Sep 18 07:15:01 ntop00 sfacctd[323304]: INFO ( m1/mysql ): *** Purging cache - START (PID: 254) ***
Sep 18 07:15:01 ntop00 nfacctd[323381]: INFO ( m1/mysql ): *** Purging cache - START (PID: 254) ***
Sep 18 07:15:10 ntop00 sfacctd[323304]: INFO ( m1/mysql ): *** Purging cache - END (PID: 254, QN: 4447/4447, ET: 9) ***
Sep 18 07:15:10 ntop00 nfacctd[323381]: INFO ( m1/mysql ): *** Purging cache - END (PID: 254, QN: 94/94, ET: 9) ***
Sep 18 07:16:01 ntop00 sfacctd[323304]: INFO ( p1/print ): *** Purging cache - START (PID: 255) ***
Sep 18 07:16:01 ntop00 sfacctd[323304]: INFO ( p1/print ): *** Purging cache - END (PID: 255, QN: 4311/4311, ET: 0) ***
Sep 18 07:16:01 ntop00 nfacctd[323381]: INFO ( p1/print ): *** Purging cache - START (PID: 255) ***
Sep 18 07:16:01 ntop00 nfacctd[323381]: INFO ( p1/print ): *** Purging cache - END (PID: 255, QN: 90/90, ET: 0) ***
Sep 18 07:20:01 ntop00 sfacctd[323304]: INFO ( m1/mysql ): *** Purging cache - START (PID: 256) ***
Sep 18 07:20:01 ntop00 nfacctd[323381]: INFO ( m1/mysql ): *** Purging cache - START (PID: 256) ***
Sep 18 07:20:09 ntop00 sfacctd[323304]: INFO ( m1/mysql ): *** Purging cache - END (PID: 256, QN: 4115/4115, ET: 8) ***
Sep 18 07:20:09 ntop00 nfacctd[323381]: INFO ( m1/mysql ): *** Purging cache - END (PID: 256, QN: 74/74, ET: 8) ***
... 101 more distinct messages not shown
== outbound00.cs.umd.edu (1 distinct, 6 total) ==
Sep 18 07:09:09 outbound00.cs.umd.edu python3[1283334]: ldapdb [x6]
== outbound01.cs.umd.edu (3 distinct, 8 total) ==
Sep 18 07:13:06 outbound01.cs.umd.edu python3[3541516]: ldapdb [x6]
Sep 18 07:54:13 outbound01.cs.umd.edu krb5_child[3551377]: Client 'admin(a)UMD.EDU' not found in Kerberos database
Sep 18 08:00:03 outbound01.cs.umd.edu krb5_child[3553231]: Preauthentication failed
== sentry-docker00.cs.umd.edu (34 distinct, 34 total) ==
Sep 18 07:15:23 sentry-docker00.cs.umd.edu systemd-udevd[2807336]: link_config: could not get ethtool features for vetha683f51
Sep 18 07:15:23 sentry-docker00.cs.umd.edu systemd-udevd[2807336]: Could not set offload features of vetha683f51: No such device
Sep 18 07:15:23 sentry-docker00.cs.umd.edu systemd-udevd[2807372]: Could not generate persistent MAC address for veth797799f: No such file or directory
Sep 18 07:15:23 sentry-docker00.cs.umd.edu systemd-udevd[2807371]: Could not generate persistent MAC address for vethae9b71a: No such file or directory
Sep 18 07:15:23 sentry-docker00.cs.umd.edu systemd-udevd[2807373]: Could not generate persistent MAC address for veth2f331e7: No such file or directory
Sep 18 07:15:23 sentry-docker00.cs.umd.edu systemd-udevd[2807376]: Could not generate persistent MAC address for vethdd14eb4: No such file or directory
Sep 18 07:15:23 sentry-docker00.cs.umd.edu systemd-udevd[2807399]: Could not generate persistent MAC address for veth57ac4b7: No such file or directory
Sep 18 07:15:23 sentry-docker00.cs.umd.edu systemd-udevd[2807400]: Could not generate persistent MAC address for vethedc3014: No such file or directory
Sep 18 07:15:23 sentry-docker00.cs.umd.edu systemd-udevd[2807418]: Could not generate persistent MAC address for veth9a8a8bf: No such file or directory
Sep 18 07:15:23 sentry-docker00.cs.umd.edu systemd-udevd[2807420]: Could not generate persistent MAC address for veth2d19118: No such file or directory
Sep 18 07:15:23 sentry-docker00.cs.umd.edu systemd-udevd[2807471]: Could not generate persistent MAC address for veth6c25f85: No such file or directory
Sep 18 07:15:23 sentry-docker00.cs.umd.edu systemd-udevd[2807475]: Could not generate persistent MAC address for vetha10f89f: No such file or directory
Sep 18 07:35:31 sentry-docker00.cs.umd.edu systemd-udevd[2816827]: link_config: could not get ethtool features for veth57ac4b7
Sep 18 07:35:31 sentry-docker00.cs.umd.edu systemd-udevd[2816827]: Could not set offload features of veth57ac4b7: No such device
Sep 18 07:35:31 sentry-docker00.cs.umd.edu systemd-udevd[2816850]: Could not generate persistent MAC address for vethc659b65: No such file or directory
Sep 18 07:35:31 sentry-docker00.cs.umd.edu systemd-udevd[2816849]: Could not generate persistent MAC address for vethb08e4d2: No such file or directory
Sep 18 07:35:31 sentry-docker00.cs.umd.edu systemd-udevd[2816869]: Could not generate persistent MAC address for vethed88af7: No such file or directory
Sep 18 07:35:31 sentry-docker00.cs.umd.edu systemd-udevd[2816873]: Could not generate persistent MAC address for veth5963888: No such file or directory
Sep 18 07:35:31 sentry-docker00.cs.umd.edu systemd-udevd[2816878]: Could not generate persistent MAC address for veth5532afe: No such file or directory
Sep 18 07:35:31 sentry-docker00.cs.umd.edu systemd-udevd[2816879]: Could not generate persistent MAC address for veth9ae8670: No such file or directory
Sep 18 07:35:31 sentry-docker00.cs.umd.edu systemd-udevd[2816898]: Could not generate persistent MAC address for vethe1acbb8: No such file or directory
Sep 18 07:35:31 sentry-docker00.cs.umd.edu systemd-udevd[2816902]: Could not generate persistent MAC address for veth32f05be: No such file or directory
Sep 18 07:35:31 sentry-docker00.cs.umd.edu systemd-udevd[2816961]: Could not generate persistent MAC address for veth2727ca0: No such file or directory
Sep 18 07:35:31 sentry-docker00.cs.umd.edu systemd-udevd[2816959]: Could not generate persistent MAC address for veth72c8d1e: No such file or directory
Sep 18 07:55:39 sentry-docker00.cs.umd.edu systemd-udevd[2826616]: Could not generate persistent MAC address for veth71bf7e1: No such file or directory
Sep 18 07:55:39 sentry-docker00.cs.umd.edu systemd-udevd[2826617]: Could not generate persistent MAC address for vethd5ca9fc: No such file or directory
Sep 18 07:55:39 sentry-docker00.cs.umd.edu systemd-udevd[2826620]: Could not generate persistent MAC address for vethd7890b5: No such file or directory
Sep 18 07:55:39 sentry-docker00.cs.umd.edu systemd-udevd[2826621]: Could not generate persistent MAC address for vethb36c942: No such file or directory
Sep 18 07:55:39 sentry-docker00.cs.umd.edu systemd-udevd[2826616]: Could not generate persistent MAC address for veth930dd40: No such file or directory
Sep 18 07:55:39 sentry-docker00.cs.umd.edu systemd-udevd[2826640]: Could not generate persistent MAC address for veth32c9b44: No such file or directory
... 4 more distinct messages not shown
== stomach (1 distinct, 1 total) ==
Sep 18 07:34:22 stomach systemd[1]: resmon.service: Supervising process 4138343 which is not our child. We'll most likely not notice when it exits.
== strawberry (7 distinct, 38 total) ==
Sep 18 07:07:03 strawberry kernel: I/O error, dev sda, sector 206848 op 0x0:(READ) flags 0x80700 phys_seg 1 prio class 2 [x6]
Sep 18 07:07:03 strawberry kernel: I/O error, dev sda, sector 206848 op 0x0:(READ) flags 0x0 phys_seg 1 prio class 2 [x6]
Sep 18 07:07:03 strawberry kernel: Buffer I/O error on dev sda2, logical block 0, async page read [x6]
Sep 18 07:07:03 strawberry kernel: I/O error, dev sda, sector 2048 op 0x0:(READ) flags 0x80700 phys_seg 1 prio class 2 [x6]
Sep 18 07:07:03 strawberry kernel: I/O error, dev sda, sector 2048 op 0x0:(READ) flags 0x0 phys_seg 1 prio class 2 [x6]
Sep 18 07:07:03 strawberry kernel: Buffer I/O error on dev sda1, logical block 0, async page read [x6]
Sep 18 07:34:42 strawberry smartd[5314]: Device: /dev/sda [SAT], failed to read SMART Attribute Data [x2]
== submit10-cln25 (1 distinct, 1 total) ==
Sep 18 07:37:00 submit10-cln25 systemd: Failed at step EXEC spawning /usr/local/bin/cronjob: No such file or directory
1
0
Command: /usr/local/sbin/syslog-digest.py
Time : 0.0579s
Status : exited 0
Output :
Syslog digest — 2026-09-18 07:05 EDT
Processed 2,867 lines, filtered 2,235 (77%). 632 unknown (233 distinct) from 32 host(s).
== abadi-computer (2 distinct, 2 total) ==
Sep 18 06:15:00 abadi-computer nologin[1057522]: Attempted login by UNKNOWN (UID: 65534) on UNKNOWN
Sep 18 06:15:00 abadi-computer pipewire[1057520]: mod.jackdbus-detect: Failed to receive jackdbus reply: org.freedesktop.DBus.Error.ServiceUnknown: The name org.jackaudio.service was not provided by any .service files
== amoeba (1 distinct, 1 total) ==
Sep 18 06:39:14 amoeba gnome-software[1458418]: Only 0 apps for recent list, hiding
== b0b02.cs.umd.edu (2 distinct, 2 total) ==
Sep 18 06:49:10 b0b02.cs.umd.edu rustdesk[2431690]: cannot open display:
Sep 18 06:51:11 b0b02.cs.umd.edu systemd[1]: insights-client.service: Start request repeated too quickly.
== bale (5 distinct, 87 total) ==
Sep 18 06:05:57 bale setroubleshoot[473492]: failed to retrieve rpm info for /dev/nvme0 [x37]
Sep 18 06:05:58 bale setroubleshoot[473492]: SELinux is preventing /usr/libexec/platform-python3.6 from getattr access on the chr_file /dev/nvme0. For complete SELinux messages run: sealert -l e098d0bd-ac29-4737-9018-de9a71e328ee [x13]
Sep 18 06:06:00 bale setroubleshoot[473492]: SELinux is preventing smartctl from read access on the chr_file nvme0. For complete SELinux messages run: sealert -l fc305ce6-663c-4aa2-8640-0ee0f8dce1a9 [x13]
Sep 18 06:06:03 bale setroubleshoot[473492]: SELinux is preventing smartctl from open access on the chr_file /dev/nvme0. For complete SELinux messages run: sealert -l 2c1d6b29-3343-488c-84c7-92d46f8010b6 [x11]
Sep 18 06:06:15 bale setroubleshoot[474106]: SELinux is preventing /usr/sbin/smartctl from ioctl access on the chr_file /dev/nvme0. For complete SELinux messages run: sealert -l 8ea740c2-97d8-42fb-b550-a236b114507d [x13]
== borealis (1 distinct, 1 total) ==
Sep 18 06:05:23 borealis gnome-software[531361]: Only 0 apps for recent list, hiding
== csfw00a (2 distinct, 123 total) ==
Sep 18 06:04:05 csfw00a kernel: bnxt_en 0000:09:00.0 eth3: NIC Link is Down [x121]
Sep 18 06:04:37 csfw00a ospf6d[1477]: [EC 100663307] Could not send entire message [x2]
== galahad.cs.umd.edu (1 distinct, 1 total) ==
Sep 18 06:19:12 galahad.cs.umd.edu gnome-software[2904800]: Only 0 apps for recent list, hiding
== hackerman (1 distinct, 1 total) ==
Sep 18 06:22:14 hackerman systemd[1]: insights-client.service: Start request repeated too quickly.
== idm00 (1 distinct, 1 total) ==
Sep 18 06:54:08 idm00 named[4166701]: client @0x7f11a4046478 10.73.240.42#64047: update '73.10.in-addr.arpa/IN' denied
== idmp0 (1 distinct, 1 total) ==
Sep 18 06:37:58 idmp0 named[1598691]: client @0x7f2d3c070a68 10.73.240.43#62528: update '73.10.in-addr.arpa/IN' denied
== inbound00.cs.umd.edu (3 distinct, 7 total) ==
Sep 18 06:07:19 inbound00.cs.umd.edu systemd[1]: Configuration file /usr/lib/systemd/system/authentication_milter.service is marked executable. Please remove executable permission bits. Proceeding anyway.
Sep 18 06:28:06 inbound00.cs.umd.edu cockpit-ws[1397817]: /usr/share/cockpit/static/login.js/favicon.ico: Failed to open file “/usr/share/cockpit/static/login.js/favicon.ico”: open() failed: Not a directory [x3]
Sep 18 06:30:34 inbound00.cs.umd.edu krb5_child[1398633]: Client 'admin(a)UMD.EDU' not found in Kerberos database [x3]
== inbound01.cs.umd.edu (4 distinct, 7 total) ==
Sep 18 06:18:20 inbound01.cs.umd.edu systemd[1]: Configuration file /usr/lib/systemd/system/authentication_milter.service is marked executable. Please remove executable permission bits. Proceeding anyway.
Sep 18 06:28:05 inbound01.cs.umd.edu cockpit-ws[3619045]: /usr/share/cockpit/static/login.js/favicon.ico: Failed to open file “/usr/share/cockpit/static/login.js/favicon.ico”: open() failed: Not a directory [x2]
Sep 18 06:40:31 inbound01.cs.umd.edu krb5_child[3622055]: Preauthentication failed [x3]
Sep 18 06:41:54 inbound01.cs.umd.edu krb5_child[3622303]: Client 'admin(a)UMD.EDU' not found in Kerberos database
== irb2156 (3 distinct, 5 total) ==
Sep 18 06:55:04 irb2156 packagekitd[363013]: Failed to get cache filename for sudo-python-plugin
Sep 18 06:55:04 irb2156 packagekitd[363013]: Failed to get cache filename for sudo
Sep 18 06:55:04 irb2156 packagekitd[363013]: Failed to get cache filename for kernel [x3]
== itmon02 (1 distinct, 6 total) ==
Sep 18 06:08:28 itmon02 sshd[1750555]: error: beginning MaxStartups throttling [x6]
== librenms (1 distinct, 1 total) ==
Sep 18 06:48:25 librenms puppet-agent[2140996]: The directory '/opt/librenms/rrd' contains 16517 entries, which exceeds the default soft limit 1000 and may cause excessive resource consumption and degraded performance. To remove this warning set a value for `max_files` parameter or consider using an alternate method to manage large directory trees
== matrix (2 distinct, 2 total) ==
Sep 18 06:41:49 matrix (nin-node)[1323911]: munin-node.service: Referenced but unset environment variable evaluates to an empty string: DAEMON_ARGS
Sep 18 06:41:49 matrix systemd[1]: resmon.service: Supervising process 1323913 which is not our child. We'll most likely not notice when it exits.
== mcstic (1 distinct, 2 total) ==
Sep 18 06:46:38 mcstic krb5_child[755838]: Preauthentication failed [x2]
== munin (2 distinct, 44 total) ==
Sep 18 06:08:36 munin sudo[3802093]: pam_systemd(sudo:session): Failed to stat() runtime directory '/run/user/0': No such file or directory [x22]
Sep 18 06:08:36 munin sudo[3802093]: pam_systemd(sudo:session): Not setting $XDG_RUNTIME_DIR, as the directory is not in order. [x22]
== neodontcare.cs.umd.edu (12 distinct, 12 total) ==
Sep 18 06:14:49 neodontcare.cs.umd.edu gnome-software[10171]: Only 0 apps for recent list, hiding
Sep 18 06:14:58 neodontcare.cs.umd.edu packagekitd[270775]: Failed to get cache filename for firefox
Sep 18 06:14:58 neodontcare.cs.umd.edu packagekitd[270775]: Failed to get cache filename for gstreamer1-plugins-good
Sep 18 06:14:58 neodontcare.cs.umd.edu packagekitd[270775]: Failed to get cache filename for gstreamer1-plugins-bad-free
Sep 18 06:14:58 neodontcare.cs.umd.edu packagekitd[270775]: Failed to get cache filename for gnome-control-center
Sep 18 06:14:58 neodontcare.cs.umd.edu packagekitd[270775]: Failed to get cache filename for cockpit-storaged
Sep 18 06:14:58 neodontcare.cs.umd.edu packagekitd[270775]: Failed to get cache filename for cockpit
Sep 18 06:14:58 neodontcare.cs.umd.edu packagekitd[270775]: Failed to get cache filename for gnu-free-mono-fonts
Sep 18 06:14:58 neodontcare.cs.umd.edu packagekitd[270775]: Failed to get cache filename for gnu-free-serif-fonts
Sep 18 06:14:58 neodontcare.cs.umd.edu packagekitd[270775]: Failed to get cache filename for gstreamer1-plugins-ugly-free
Sep 18 06:14:58 neodontcare.cs.umd.edu packagekitd[270775]: Failed to get cache filename for google-chrome-stable
Sep 18 06:15:03 neodontcare.cs.umd.edu packagekitd[270775]: failed to parse public key for /etc/pki/rpm-gpg/RPM-GPG-KEY-PQC-redhat-release
== netman.cs.umd.edu (2 distinct, 12 total) ==
Sep 18 06:23:45 netman.cs.umd.edu krb5_child[1898486]: Preauthentication failed [x10]
Sep 18 06:33:48 netman.cs.umd.edu krb5_child[1901645]: Client 'admin(a)UMD.EDU' not found in Kerberos database [x2]
== newhonors2 (1 distinct, 24 total) ==
Sep 18 06:13:03 newhonors2 dhcpcd[2802519]: dhcpcd is not running [x24]
== ntop00 (102 distinct, 146 total) ==
Sep 18 06:05:01 ntop00 sfacctd[323304]: INFO ( m1/mysql ): *** Purging cache - START (PID: 226) ***
Sep 18 06:05:01 ntop00 nfacctd[323381]: INFO ( m1/mysql ): *** Purging cache - START (PID: 226) ***
Sep 18 06:05:09 ntop00 sfacctd[323304]: INFO ( m1/mysql ): *** Purging cache - END (PID: 226, QN: 3936/3936, ET: 8) ***
Sep 18 06:05:09 ntop00 nfacctd[323381]: INFO ( m1/mysql ): *** Purging cache - END (PID: 226, QN: 72/72, ET: 8) ***
Sep 18 06:06:01 ntop00 sfacctd[323304]: INFO ( p1/print ): *** Purging cache - START (PID: 227) ***
Sep 18 06:06:01 ntop00 sfacctd[323304]: INFO ( p1/print ): *** Purging cache - END (PID: 227, QN: 4103/4103, ET: 0) ***
Sep 18 06:06:01 ntop00 nfacctd[323381]: INFO ( p1/print ): *** Purging cache - START (PID: 227) ***
Sep 18 06:06:01 ntop00 nfacctd[323381]: INFO ( p1/print ): *** Purging cache - END (PID: 227, QN: 62/62, ET: 0) ***
Sep 18 06:06:02 ntop00 setroubleshoot[395783]: SELinux is preventing /usr/local/sbin/sfacctd from append access on the file sflow.json. For complete SELinux messages run: sealert -l 58e35a5d-c7c9-4337-868c-bb9d5ac2e29f [x12]
Sep 18 06:06:02 ntop00 setroubleshoot[395783]: SELinux is preventing /usr/local/sbin/sfacctd from write access on the file sflow.json. For complete SELinux messages run: sealert -l 369b1df3-2c9d-461b-8b1c-2fcd48dc737c [x12]
Sep 18 06:06:03 ntop00 setroubleshoot[395783]: failed to retrieve rpm info for path '/srv/pmacct/sflow.json': [x12]
Sep 18 06:06:03 ntop00 setroubleshoot[395783]: SELinux is preventing /usr/local/sbin/sfacctd from lock access on the file /srv/pmacct/sflow.json. For complete SELinux messages run: sealert -l 481e7e24-3846-4790-b17b-9e44a5f5b5d6 [x12]
Sep 18 06:10:01 ntop00 sfacctd[323304]: INFO ( m1/mysql ): *** Purging cache - START (PID: 228) ***
Sep 18 06:10:01 ntop00 nfacctd[323381]: INFO ( m1/mysql ): *** Purging cache - START (PID: 228) ***
Sep 18 06:10:10 ntop00 sfacctd[323304]: INFO ( m1/mysql ): *** Purging cache - END (PID: 228, QN: 4300/4300, ET: 9) ***
Sep 18 06:10:10 ntop00 nfacctd[323381]: INFO ( m1/mysql ): *** Purging cache - END (PID: 228, QN: 47/47, ET: 9) ***
Sep 18 06:11:01 ntop00 sfacctd[323304]: INFO ( p1/print ): *** Purging cache - START (PID: 229) ***
Sep 18 06:11:01 ntop00 sfacctd[323304]: INFO ( p1/print ): *** Purging cache - END (PID: 229, QN: 4229/4229, ET: 0) ***
Sep 18 06:11:01 ntop00 nfacctd[323381]: INFO ( p1/print ): *** Purging cache - START (PID: 229) ***
Sep 18 06:11:01 ntop00 nfacctd[323381]: INFO ( p1/print ): *** Purging cache - END (PID: 229, QN: 62/62, ET: 0) ***
Sep 18 06:15:01 ntop00 sfacctd[323304]: INFO ( m1/mysql ): *** Purging cache - START (PID: 230) ***
Sep 18 06:15:01 ntop00 nfacctd[323381]: INFO ( m1/mysql ): *** Purging cache - START (PID: 230) ***
Sep 18 06:15:09 ntop00 sfacctd[323304]: INFO ( m1/mysql ): *** Purging cache - END (PID: 230, QN: 4234/4234, ET: 8) ***
Sep 18 06:15:09 ntop00 nfacctd[323381]: INFO ( m1/mysql ): *** Purging cache - END (PID: 230, QN: 60/60, ET: 8) ***
Sep 18 06:16:01 ntop00 sfacctd[323304]: INFO ( p1/print ): *** Purging cache - START (PID: 231) ***
Sep 18 06:16:01 ntop00 sfacctd[323304]: INFO ( p1/print ): *** Purging cache - END (PID: 231, QN: 4288/4288, ET: 0) ***
Sep 18 06:16:01 ntop00 nfacctd[323381]: INFO ( p1/print ): *** Purging cache - START (PID: 231) ***
Sep 18 06:16:01 ntop00 nfacctd[323381]: INFO ( p1/print ): *** Purging cache - END (PID: 231, QN: 59/59, ET: 0) ***
Sep 18 06:20:01 ntop00 sfacctd[323304]: INFO ( m1/mysql ): *** Purging cache - START (PID: 232) ***
Sep 18 06:20:01 ntop00 nfacctd[323381]: INFO ( m1/mysql ): *** Purging cache - START (PID: 232) ***
... 72 more distinct messages not shown
== orchids (6 distinct, 7 total) ==
Sep 18 06:11:31 orchids gnome-software[1516991]: Only 0 apps for recent list, hiding
Sep 18 06:11:38 orchids packagekitd[3879525]: Failed to get cache filename for google-chrome-stable
Sep 18 06:11:38 orchids packagekitd[3879525]: Failed to get cache filename for libreoffice
Sep 18 06:11:38 orchids packagekitd[3879525]: Failed to get cache filename for cups-filesystem
Sep 18 06:11:38 orchids packagekitd[3879525]: Failed to get cache filename for kernel
Sep 18 06:11:42 orchids packagekitd[3879525]: failed to parse public key for /etc/pki/rpm-gpg/RPM-GPG-KEY-PQC-redhat-release [x2]
== outbound00.cs.umd.edu (4 distinct, 15 total) ==
Sep 18 06:05:14 outbound00.cs.umd.edu krb5_child[1267828]: Client 'admin(a)UMD.EDU' not found in Kerberos database [x4]
Sep 18 06:09:09 outbound00.cs.umd.edu python3[1268795]: ldapdb [x6]
Sep 18 06:10:21 outbound00.cs.umd.edu krb5_child[1269026]: Preauthentication failed [x3]
Sep 18 06:25:33 outbound00.cs.umd.edu cockpit-ws[1273163]: /usr/share/cockpit/static/login.js/favicon.ico: Failed to open file “/usr/share/cockpit/static/login.js/favicon.ico”: open() failed: Not a directory [x2]
== outbound01.cs.umd.edu (2 distinct, 9 total) ==
Sep 18 06:13:06 outbound01.cs.umd.edu python3[3527224]: ldapdb [x6]
Sep 18 07:01:33 outbound01.cs.umd.edu cockpit-ws[3538837]: /usr/share/cockpit/static/login.js/favicon.ico: Failed to open file “/usr/share/cockpit/static/login.js/favicon.ico”: open() failed: Not a directory [x3]
== sentry-docker00.cs.umd.edu (38 distinct, 38 total) ==
Sep 18 06:14:58 sentry-docker00.cs.umd.edu systemd-udevd[2779050]: link_config: could not get ethtool features for veth77bde7a
Sep 18 06:14:58 sentry-docker00.cs.umd.edu systemd-udevd[2779050]: Could not set offload features of veth77bde7a: No such device
Sep 18 06:14:58 sentry-docker00.cs.umd.edu systemd-udevd[2779088]: Could not generate persistent MAC address for vetha5f873c: No such file or directory
Sep 18 06:14:58 sentry-docker00.cs.umd.edu systemd-udevd[2779089]: Could not generate persistent MAC address for veth78ec90e: No such file or directory
Sep 18 06:14:58 sentry-docker00.cs.umd.edu systemd-udevd[2779092]: Could not generate persistent MAC address for veth23ff7f1: No such file or directory
Sep 18 06:14:58 sentry-docker00.cs.umd.edu systemd-udevd[2779093]: Could not generate persistent MAC address for veth6efae6c: No such file or directory
Sep 18 06:14:58 sentry-docker00.cs.umd.edu systemd-udevd[2779104]: Could not generate persistent MAC address for veth7634439: No such file or directory
Sep 18 06:14:58 sentry-docker00.cs.umd.edu systemd-udevd[2779097]: Could not generate persistent MAC address for vetha369eaa: No such file or directory
Sep 18 06:14:58 sentry-docker00.cs.umd.edu systemd-udevd[2779118]: Could not generate persistent MAC address for vethc770e3b: No such file or directory
Sep 18 06:14:58 sentry-docker00.cs.umd.edu systemd-udevd[2779119]: Could not generate persistent MAC address for veth250a340: No such file or directory
Sep 18 06:14:58 sentry-docker00.cs.umd.edu systemd-udevd[2779137]: Could not generate persistent MAC address for veth8928220: No such file or directory
Sep 18 06:14:58 sentry-docker00.cs.umd.edu systemd-udevd[2779119]: Could not generate persistent MAC address for veth681073b: No such file or directory
Sep 18 06:35:06 sentry-docker00.cs.umd.edu systemd-udevd[2788459]: link_config: could not get ethtool features for vetha5f873c
Sep 18 06:35:06 sentry-docker00.cs.umd.edu systemd-udevd[2788459]: Could not set offload features of vetha5f873c: No such device
Sep 18 06:35:06 sentry-docker00.cs.umd.edu systemd-udevd[2788514]: Could not generate persistent MAC address for vethdd0f91b: No such file or directory
Sep 18 06:35:06 sentry-docker00.cs.umd.edu systemd-udevd[2788515]: Could not generate persistent MAC address for veth743a823: No such file or directory
Sep 18 06:35:06 sentry-docker00.cs.umd.edu systemd-udevd[2788518]: Could not generate persistent MAC address for vethee525db: No such file or directory
Sep 18 06:35:06 sentry-docker00.cs.umd.edu systemd-udevd[2788519]: Could not generate persistent MAC address for veth1b53d7e: No such file or directory
Sep 18 06:35:06 sentry-docker00.cs.umd.edu systemd-udevd[2788542]: Could not generate persistent MAC address for vethe77f1bf: No such file or directory
Sep 18 06:35:06 sentry-docker00.cs.umd.edu systemd-udevd[2788543]: Could not generate persistent MAC address for vethb297346: No such file or directory
Sep 18 06:35:06 sentry-docker00.cs.umd.edu systemd-udevd[2788561]: Could not generate persistent MAC address for vethb390b1b: No such file or directory
Sep 18 06:35:06 sentry-docker00.cs.umd.edu systemd-udevd[2788554]: Could not generate persistent MAC address for vethfa8e83d: No such file or directory
Sep 18 06:35:06 sentry-docker00.cs.umd.edu systemd-udevd[2788570]: Could not generate persistent MAC address for veth980ec0c: No such file or directory
Sep 18 06:35:06 sentry-docker00.cs.umd.edu systemd-udevd[2788571]: Could not generate persistent MAC address for veth6207337: No such file or directory
Sep 18 06:55:14 sentry-docker00.cs.umd.edu systemd-udevd[2797844]: link_config: could not get ethtool features for vethb390b1b
Sep 18 06:55:14 sentry-docker00.cs.umd.edu systemd-udevd[2797844]: Could not set offload features of vethb390b1b: No such device
Sep 18 06:55:14 sentry-docker00.cs.umd.edu systemd-udevd[2797940]: link_config: could not get ethtool features for vethe77f1bf
Sep 18 06:55:14 sentry-docker00.cs.umd.edu systemd-udevd[2797940]: Could not set offload features of vethe77f1bf: No such device
Sep 18 06:55:14 sentry-docker00.cs.umd.edu systemd-udevd[2797966]: Could not generate persistent MAC address for veth615e196: No such file or directory
Sep 18 06:55:14 sentry-docker00.cs.umd.edu systemd-udevd[2797967]: Could not generate persistent MAC address for vethf92ccdb: No such file or directory
... 8 more distinct messages not shown
== soul (2 distinct, 3 total) ==
Sep 18 06:21:01 soul krb5_child[3239531]: Client 'admin(a)UMD.EDU' not found in Kerberos database [x2]
Sep 18 06:35:22 soul systemd[1]: resmon.service: Supervising process 3242971 which is not our child. We'll most likely not notice when it exits.
== strawberry (9 distinct, 46 total) ==
Sep 18 06:07:04 strawberry kernel: I/O error, dev sda, sector 206848 op 0x0:(READ) flags 0x80700 phys_seg 1 prio class 2 [x7]
Sep 18 06:07:04 strawberry kernel: I/O error, dev sda, sector 206848 op 0x0:(READ) flags 0x0 phys_seg 1 prio class 2 [x7]
Sep 18 06:07:04 strawberry kernel: Buffer I/O error on dev sda2, logical block 0, async page read [x7]
Sep 18 06:07:04 strawberry kernel: I/O error, dev sda, sector 2048 op 0x0:(READ) flags 0x80700 phys_seg 1 prio class 2 [x7]
Sep 18 06:07:04 strawberry kernel: I/O error, dev sda, sector 2048 op 0x0:(READ) flags 0x0 phys_seg 1 prio class 2 [x7]
Sep 18 06:07:04 strawberry kernel: Buffer I/O error on dev sda1, logical block 0, async page read [x7]
Sep 18 06:31:04 strawberry nologin[2985240]: Attempted login by UNKNOWN (UID: 65534) on UNKNOWN
Sep 18 06:31:04 strawberry pipewire[2985239]: mod.jackdbus-detect: Failed to receive jackdbus reply: org.freedesktop.DBus.Error.ServiceUnknown: The name org.jackaudio.service was not provided by any .service files
Sep 18 06:34:42 strawberry smartd[5314]: Device: /dev/sda [SAT], failed to read SMART Attribute Data [x2]
== submit26-b9-f1 (10 distinct, 15 total) ==
Sep 18 06:25:53 submit26-b9-f1 setroubleshoot[2291432]: SELinux is preventing /usr/bin/python3.9 from create access on the directory /(null). For complete SELinux messages run: sealert -l 3ef7d677-731f-46bf-9c34-c2c55fea665c [x2]
Sep 18 06:25:53 submit26-b9-f1 setroubleshoot[2291432]: SELinux is preventing /usr/bin/python3.9 from add_name access on the directory /(null). For complete SELinux messages run: sealert -l aa60e26f-72e1-45f1-bc12-aa8b3b669e36 [x2]
Sep 18 06:25:53 submit26-b9-f1 setroubleshoot[2291432]: SELinux is preventing /usr/bin/python3.9 from create access on the file /(null). For complete SELinux messages run: sealert -l d088fb43-23ee-4ae8-ae6a-5d1c041ee2d6 [x2]
Sep 18 06:25:53 submit26-b9-f1 setroubleshoot[2291432]: SELinux is preventing /usr/bin/python3.9 from open access on the file /tmp/libdnf.cGBkcO/repodata/repomd.xml. For complete SELinux messages run: sealert -l 3b0d8c9a-6637-4d6e-a864-f1dd7c00377d
Sep 18 06:25:53 submit26-b9-f1 setroubleshoot[2291432]: SELinux is preventing /usr/bin/python3.9 from setattr access on the file repomd.xml. For complete SELinux messages run: sealert -l 0fd3339f-3ef2-45f3-9e58-65a58b42f3ee [x2]
Sep 18 06:25:53 submit26-b9-f1 setroubleshoot[2291432]: SELinux is preventing /usr/bin/python3.9 from read access on the directory libdnf.cGBkcO. For complete SELinux messages run: sealert -l 0d661d88-dc9e-469d-986b-52e29b353aa8
Sep 18 06:25:53 submit26-b9-f1 setroubleshoot[2291432]: SELinux is preventing /usr/bin/python3.9 from remove_name access on the directory repomd.xml. For complete SELinux messages run: sealert -l 405a8556-cf9f-4ef4-8525-0dca18d4259d
Sep 18 06:25:53 submit26-b9-f1 setroubleshoot[2291432]: SELinux is preventing /usr/bin/python3.9 from unlink access on the file repomd.xml. For complete SELinux messages run: sealert -l 3c38e23e-3631-4cb5-81c7-992675c836d9 [x2]
Sep 18 06:25:53 submit26-b9-f1 setroubleshoot[2291432]: SELinux is preventing /usr/bin/python3.9 from rmdir access on the directory repodata. For complete SELinux messages run: sealert -l a070e9b5-2867-47d6-b2e3-3b7d99725848
Sep 18 06:26:54 submit26-b9-f1 setroubleshoot[2291468]: SELinux is preventing /usr/bin/python3.9 from open access on the file /tmp/libdnf.u54ONl/repodata/repomd.xml. For complete SELinux messages run: sealert -l 3b0d8c9a-6637-4d6e-a864-f1dd7c00377d
== submit26-b9-f2 (9 distinct, 9 total) ==
Sep 18 06:06:48 submit26-b9-f2 setroubleshoot[1430510]: SELinux is preventing /usr/bin/python3.9 from create access on the directory /(null). For complete SELinux messages run: sealert -l 0659d546-3107-4f75-b00f-008c85f41dc6
Sep 18 06:06:48 submit26-b9-f2 setroubleshoot[1430510]: SELinux is preventing /usr/bin/python3.9 from add_name access on the directory /(null). For complete SELinux messages run: sealert -l 156d9270-3466-4356-b86f-1a128825961a
Sep 18 06:06:48 submit26-b9-f2 setroubleshoot[1430510]: SELinux is preventing /usr/bin/python3.9 from create access on the file /(null). For complete SELinux messages run: sealert -l c8a40bf5-2fc4-46b3-b813-8592b3523339
Sep 18 06:06:48 submit26-b9-f2 setroubleshoot[1430510]: SELinux is preventing /usr/bin/python3.9 from open access on the file /tmp/libdnf.RhaZpj/repodata/repomd.xml. For complete SELinux messages run: sealert -l 7f4c3a8e-0f99-47c4-9baf-e1336fe24876
Sep 18 06:06:48 submit26-b9-f2 setroubleshoot[1430510]: SELinux is preventing /usr/bin/python3.9 from setattr access on the file repomd.xml. For complete SELinux messages run: sealert -l 988123da-b724-4e6a-900c-33a2723fdaf1
Sep 18 06:06:48 submit26-b9-f2 setroubleshoot[1430510]: SELinux is preventing /usr/bin/python3.9 from read access on the directory libdnf.RhaZpj. For complete SELinux messages run: sealert -l ca585e2b-d50f-4264-8127-6b3fa04070c8
Sep 18 06:06:48 submit26-b9-f2 setroubleshoot[1430510]: SELinux is preventing /usr/bin/python3.9 from remove_name access on the directory repomd.xml. For complete SELinux messages run: sealert -l 3a749560-1cec-40ca-a4dc-596841be3885
Sep 18 06:06:48 submit26-b9-f2 setroubleshoot[1430510]: SELinux is preventing /usr/bin/python3.9 from unlink access on the file repomd.xml. For complete SELinux messages run: sealert -l 0aa52f08-94f8-474e-96d8-e818846941af
Sep 18 06:06:48 submit26-b9-f2 setroubleshoot[1430510]: SELinux is preventing /usr/bin/python3.9 from rmdir access on the directory repodata. For complete SELinux messages run: sealert -l de019dc4-408f-439c-902a-676d18dfe8e7
== teaching-awards (1 distinct, 1 total) ==
Sep 18 06:12:48 teaching-awards krb5_child[1006358]: Preauthentication failed
== tlsrpt (1 distinct, 1 total) ==
Sep 18 06:38:03 tlsrpt (httpd)[2831266]: httpd.service: Referenced but unset environment variable evaluates to an empty string: OPTIONS
1
0
Command: /usr/local/sbin/syslog-digest.py
Time : 0.0582s
Status : exited 0
Output :
Syslog digest — 2026-09-18 06:05 EDT
Processed 3,306 lines, filtered 2,728 (82%). 578 unknown (190 distinct) from 19 host(s).
== atif01.cs.umd.edu (2 distinct, 2 total) ==
Sep 18 05:31:51 atif01.cs.umd.edu kernel: net_ratelimit: 32 callbacks suppressed
Sep 18 05:31:51 atif01.cs.umd.edu kernel: nfsd: peername failed (err 107)!
== b0b02.cs.umd.edu (1 distinct, 1 total) ==
Sep 18 05:49:06 b0b02.cs.umd.edu rustdesk[2416102]: cannot open display:
== bale (5 distinct, 90 total) ==
Sep 18 05:05:18 bale setroubleshoot[460574]: failed to retrieve rpm info for /dev/nvme0 [x39]
Sep 18 05:05:18 bale setroubleshoot[460574]: SELinux is preventing /usr/libexec/platform-python3.6 from getattr access on the chr_file /dev/nvme0. For complete SELinux messages run: sealert -l e098d0bd-ac29-4737-9018-de9a71e328ee [x12]
Sep 18 05:05:21 bale setroubleshoot[460574]: SELinux is preventing smartctl from read access on the chr_file nvme0. For complete SELinux messages run: sealert -l fc305ce6-663c-4aa2-8640-0ee0f8dce1a9 [x12]
Sep 18 05:05:24 bale setroubleshoot[460574]: SELinux is preventing smartctl from open access on the chr_file /dev/nvme0. For complete SELinux messages run: sealert -l 2c1d6b29-3343-488c-84c7-92d46f8010b6 [x12]
Sep 18 05:05:36 bale setroubleshoot[461201]: SELinux is preventing /usr/sbin/smartctl from ioctl access on the chr_file /dev/nvme0. For complete SELinux messages run: sealert -l 8ea740c2-97d8-42fb-b550-a236b114507d [x15]
== csfw00a (1 distinct, 126 total) ==
Sep 18 05:04:20 csfw00a kernel: bnxt_en 0000:09:00.0 eth3: NIC Link is Down [x126]
== grades01.cs.umd.edu (1 distinct, 1 total) ==
Sep 18 05:48:17 grades01.cs.umd.edu puppet-agent[9239]: The directory '/srv/grades' contains 2471 entries, which exceeds the default soft limit 1000 and may cause excessive resource consumption and degraded performance. To remove this warning set a value for `max_files` parameter or consider using an alternate method to manage large directory trees
== idm00 (1 distinct, 1 total) ==
Sep 18 05:54:08 idm00 named[4166701]: client @0x7f11a4042778 10.73.240.42#56226: update '73.10.in-addr.arpa/IN' denied
== idmp0 (1 distinct, 1 total) ==
Sep 18 05:37:58 idmp0 named[1598691]: client @0x7f2d50036288 10.73.240.43#55497: update '73.10.in-addr.arpa/IN' denied
== itmon02 (1 distinct, 4 total) ==
Sep 18 05:27:58 itmon02 sshd[1750555]: error: beginning MaxStartups throttling [x4]
== munin (2 distinct, 40 total) ==
Sep 18 05:23:35 munin sudo[3785629]: pam_systemd(sudo:session): Failed to stat() runtime directory '/run/user/0': No such file or directory [x20]
Sep 18 05:23:35 munin sudo[3785629]: pam_systemd(sudo:session): Not setting $XDG_RUNTIME_DIR, as the directory is not in order. [x20]
== newhonors2 (1 distinct, 24 total) ==
Sep 18 05:13:03 newhonors2 dhcpcd[2800574]: dhcpcd is not running [x24]
== ntop00 (99 distinct, 143 total) ==
Sep 18 05:05:01 ntop00 nfacctd[323381]: INFO ( m1/mysql ): *** Purging cache - START (PID: 202) ***
Sep 18 05:05:12 ntop00 sfacctd[323304]: INFO ( m1/mysql ): *** Purging cache - END (PID: 202, QN: 5351/5351, ET: 11) ***
Sep 18 05:05:12 ntop00 nfacctd[323381]: INFO ( m1/mysql ): *** Purging cache - END (PID: 202, QN: 86/86, ET: 11) ***
Sep 18 05:06:01 ntop00 sfacctd[323304]: INFO ( p1/print ): *** Purging cache - START (PID: 203) ***
Sep 18 05:06:01 ntop00 sfacctd[323304]: INFO ( p1/print ): *** Purging cache - END (PID: 203, QN: 5291/5291, ET: 0) ***
Sep 18 05:06:01 ntop00 nfacctd[323381]: INFO ( p1/print ): *** Purging cache - START (PID: 203) ***
Sep 18 05:06:01 ntop00 nfacctd[323381]: INFO ( p1/print ): *** Purging cache - END (PID: 203, QN: 83/83, ET: 0) ***
Sep 18 05:06:02 ntop00 setroubleshoot[388160]: SELinux is preventing /usr/local/sbin/sfacctd from append access on the file sflow.json. For complete SELinux messages run: sealert -l 58e35a5d-c7c9-4337-868c-bb9d5ac2e29f [x12]
Sep 18 05:06:02 ntop00 setroubleshoot[388160]: SELinux is preventing /usr/local/sbin/sfacctd from write access on the file sflow.json. For complete SELinux messages run: sealert -l 369b1df3-2c9d-461b-8b1c-2fcd48dc737c [x12]
Sep 18 05:06:02 ntop00 setroubleshoot[388160]: failed to retrieve rpm info for path '/srv/pmacct/sflow.json': [x12]
Sep 18 05:06:02 ntop00 setroubleshoot[388160]: SELinux is preventing /usr/local/sbin/sfacctd from lock access on the file /srv/pmacct/sflow.json. For complete SELinux messages run: sealert -l 481e7e24-3846-4790-b17b-9e44a5f5b5d6 [x12]
Sep 18 05:10:01 ntop00 sfacctd[323304]: INFO ( m1/mysql ): *** Purging cache - START (PID: 204) ***
Sep 18 05:10:01 ntop00 nfacctd[323381]: INFO ( m1/mysql ): *** Purging cache - START (PID: 204) ***
Sep 18 05:10:12 ntop00 sfacctd[323304]: INFO ( m1/mysql ): *** Purging cache - END (PID: 204, QN: 5467/5467, ET: 11) ***
Sep 18 05:10:12 ntop00 nfacctd[323381]: INFO ( m1/mysql ): *** Purging cache - END (PID: 204, QN: 50/50, ET: 11) ***
Sep 18 05:11:01 ntop00 sfacctd[323304]: INFO ( p1/print ): *** Purging cache - START (PID: 205) ***
Sep 18 05:11:01 ntop00 sfacctd[323304]: INFO ( p1/print ): *** Purging cache - END (PID: 205, QN: 5481/5481, ET: 0) ***
Sep 18 05:11:01 ntop00 nfacctd[323381]: INFO ( p1/print ): *** Purging cache - START (PID: 205) ***
Sep 18 05:11:01 ntop00 nfacctd[323381]: INFO ( p1/print ): *** Purging cache - END (PID: 205, QN: 55/55, ET: 0) ***
Sep 18 05:15:01 ntop00 sfacctd[323304]: INFO ( m1/mysql ): *** Purging cache - START (PID: 206) ***
Sep 18 05:15:01 ntop00 nfacctd[323381]: INFO ( m1/mysql ): *** Purging cache - START (PID: 206) ***
Sep 18 05:15:13 ntop00 sfacctd[323304]: INFO ( m1/mysql ): *** Purging cache - END (PID: 206, QN: 5276/5276, ET: 12) ***
Sep 18 05:15:13 ntop00 nfacctd[323381]: INFO ( m1/mysql ): *** Purging cache - END (PID: 206, QN: 88/88, ET: 12) ***
Sep 18 05:16:01 ntop00 sfacctd[323304]: INFO ( p1/print ): *** Purging cache - START (PID: 207) ***
Sep 18 05:16:01 ntop00 sfacctd[323304]: INFO ( p1/print ): *** Purging cache - END (PID: 207, QN: 5143/5143, ET: 0) ***
Sep 18 05:16:01 ntop00 nfacctd[323381]: INFO ( p1/print ): *** Purging cache - START (PID: 207) ***
Sep 18 05:16:01 ntop00 nfacctd[323381]: INFO ( p1/print ): *** Purging cache - END (PID: 207, QN: 72/72, ET: 0) ***
Sep 18 05:20:01 ntop00 sfacctd[323304]: INFO ( m1/mysql ): *** Purging cache - START (PID: 208) ***
Sep 18 05:20:01 ntop00 nfacctd[323381]: INFO ( m1/mysql ): *** Purging cache - START (PID: 208) ***
Sep 18 05:20:12 ntop00 sfacctd[323304]: INFO ( m1/mysql ): *** Purging cache - END (PID: 208, QN: 4687/4687, ET: 11) ***
... 69 more distinct messages not shown
== outbound00.cs.umd.edu (5 distinct, 32 total) ==
Sep 18 05:05:58 outbound00.cs.umd.edu krb5_child[1252503]: Preauthentication failed [x12]
Sep 18 05:09:09 outbound00.cs.umd.edu python3[1253403]: ldapdb [x6]
Sep 18 05:09:22 outbound00.cs.umd.edu krb5_child[1253497]: Client 'admin(a)UMD.EDU' not found in Kerberos database [x9]
Sep 18 05:10:39 outbound00.cs.umd.edu krb5_child[1253674]: Client 'test1(a)UMD.EDU' not found in Kerberos database [x3]
Sep 18 05:51:50 outbound00.cs.umd.edu krb5_child[1264205]: Client 'george(a)UMD.EDU' not found in Kerberos database [x2]
== outbound01.cs.umd.edu (2 distinct, 8 total) ==
Sep 18 05:08:18 outbound01.cs.umd.edu python3[3511149]: ldapdb [x7]
Sep 18 05:09:58 outbound01.cs.umd.edu systemd[1]: Configuration file /usr/lib/systemd/system/authentication_milter.service is marked executable. Please remove executable permission bits. Proceeding anyway.
== sentry-docker00.cs.umd.edu (38 distinct, 38 total) ==
Sep 18 05:14:33 sentry-docker00.cs.umd.edu systemd-udevd[2750457]: link_config: could not get ethtool features for vethaa51905
Sep 18 05:14:33 sentry-docker00.cs.umd.edu systemd-udevd[2750457]: Could not set offload features of vethaa51905: No such device
Sep 18 05:14:33 sentry-docker00.cs.umd.edu systemd-udevd[2750575]: Could not generate persistent MAC address for veth5885e1a: No such file or directory
Sep 18 05:14:33 sentry-docker00.cs.umd.edu systemd-udevd[2750576]: Could not generate persistent MAC address for veth0104abd: No such file or directory
Sep 18 05:14:33 sentry-docker00.cs.umd.edu systemd-udevd[2750579]: Could not generate persistent MAC address for veth64b2356: No such file or directory
Sep 18 05:14:33 sentry-docker00.cs.umd.edu systemd-udevd[2750596]: Could not generate persistent MAC address for veth7b0596e: No such file or directory
Sep 18 05:14:33 sentry-docker00.cs.umd.edu systemd-udevd[2750585]: Could not generate persistent MAC address for veth8b156d6: No such file or directory
Sep 18 05:14:33 sentry-docker00.cs.umd.edu systemd-udevd[2750582]: Could not generate persistent MAC address for veth5099ab1: No such file or directory
Sep 18 05:14:33 sentry-docker00.cs.umd.edu systemd-udevd[2750598]: Could not generate persistent MAC address for veth846984b: No such file or directory
Sep 18 05:14:33 sentry-docker00.cs.umd.edu systemd-udevd[2750582]: Could not generate persistent MAC address for vethea6e619: No such file or directory
Sep 18 05:14:33 sentry-docker00.cs.umd.edu systemd-udevd[2750576]: Could not generate persistent MAC address for vethca7f88c: No such file or directory
Sep 18 05:14:33 sentry-docker00.cs.umd.edu systemd-udevd[2750585]: Could not generate persistent MAC address for veth12bd568: No such file or directory
Sep 18 05:34:41 sentry-docker00.cs.umd.edu systemd-udevd[2760173]: link_config: could not get ethtool features for veth64b2356
Sep 18 05:34:41 sentry-docker00.cs.umd.edu systemd-udevd[2760173]: Could not set offload features of veth64b2356: No such device
Sep 18 05:34:41 sentry-docker00.cs.umd.edu systemd-udevd[2760206]: Could not generate persistent MAC address for veth75dfb65: No such file or directory
Sep 18 05:34:41 sentry-docker00.cs.umd.edu systemd-udevd[2760207]: Could not generate persistent MAC address for veth8b95a3d: No such file or directory
Sep 18 05:34:41 sentry-docker00.cs.umd.edu systemd-udevd[2760210]: Could not generate persistent MAC address for veth9579528: No such file or directory
Sep 18 05:34:41 sentry-docker00.cs.umd.edu systemd-udevd[2760211]: Could not generate persistent MAC address for veth63f18aa: No such file or directory
Sep 18 05:34:41 sentry-docker00.cs.umd.edu systemd-udevd[2760234]: Could not generate persistent MAC address for vethfc0b830: No such file or directory
Sep 18 05:34:41 sentry-docker00.cs.umd.edu systemd-udevd[2760235]: Could not generate persistent MAC address for veth8867fe3: No such file or directory
Sep 18 05:34:41 sentry-docker00.cs.umd.edu systemd-udevd[2760250]: Could not generate persistent MAC address for veth1b12782: No such file or directory
Sep 18 05:34:41 sentry-docker00.cs.umd.edu systemd-udevd[2760256]: Could not generate persistent MAC address for veth2b81e00: No such file or directory
Sep 18 05:34:41 sentry-docker00.cs.umd.edu systemd-udevd[2760267]: Could not generate persistent MAC address for vetha2c96b9: No such file or directory
Sep 18 05:34:41 sentry-docker00.cs.umd.edu systemd-udevd[2760266]: Could not generate persistent MAC address for veth0b38d99: No such file or directory
Sep 18 05:54:49 sentry-docker00.cs.umd.edu systemd-udevd[2769561]: link_config: could not get ethtool features for veth9579528
Sep 18 05:54:49 sentry-docker00.cs.umd.edu systemd-udevd[2769561]: Could not set offload features of veth9579528: No such device
Sep 18 05:54:49 sentry-docker00.cs.umd.edu systemd-udevd[2769637]: link_config: could not set ethtool features for veth75dfb65
Sep 18 05:54:49 sentry-docker00.cs.umd.edu systemd-udevd[2769637]: Could not set offload features of veth75dfb65: Operation not permitted
Sep 18 05:54:49 sentry-docker00.cs.umd.edu systemd-udevd[2769659]: Could not generate persistent MAC address for veth77bde7a: No such file or directory
Sep 18 05:54:49 sentry-docker00.cs.umd.edu systemd-udevd[2769660]: Could not generate persistent MAC address for veth093c218: No such file or directory
... 8 more distinct messages not shown
== soul (2 distinct, 4 total) ==
Sep 18 05:09:59 soul krb5_child[3230594]: Client 'admin(a)UMD.EDU' not found in Kerberos database [x2]
Sep 18 05:20:23 soul krb5_child[3231870]: Preauthentication failed [x2]
== strawberry (7 distinct, 38 total) ==
Sep 18 05:07:03 strawberry kernel: I/O error, dev sda, sector 206848 op 0x0:(READ) flags 0x80700 phys_seg 1 prio class 2 [x6]
Sep 18 05:07:03 strawberry kernel: I/O error, dev sda, sector 206848 op 0x0:(READ) flags 0x0 phys_seg 1 prio class 2 [x6]
Sep 18 05:07:03 strawberry kernel: Buffer I/O error on dev sda2, logical block 0, async page read [x6]
Sep 18 05:07:03 strawberry kernel: I/O error, dev sda, sector 2048 op 0x0:(READ) flags 0x80700 phys_seg 1 prio class 2 [x6]
Sep 18 05:07:03 strawberry kernel: I/O error, dev sda, sector 2048 op 0x0:(READ) flags 0x0 phys_seg 1 prio class 2 [x6]
Sep 18 05:07:03 strawberry kernel: Buffer I/O error on dev sda1, logical block 0, async page read [x6]
Sep 18 05:34:42 strawberry smartd[5314]: Device: /dev/sda [SAT], failed to read SMART Attribute Data [x2]
== submit26-b9-f3 (9 distinct, 9 total) ==
Sep 18 05:06:42 submit26-b9-f3 setroubleshoot[1751765]: SELinux is preventing /usr/bin/python3.9 from create access on the directory /(null). For complete SELinux messages run: sealert -l a653b772-cbcd-438b-bae5-23c3dc69b31b
Sep 18 05:06:42 submit26-b9-f3 setroubleshoot[1751765]: SELinux is preventing /usr/bin/python3.9 from add_name access on the directory /(null). For complete SELinux messages run: sealert -l 3e904634-6caa-4202-8c92-f139db798859
Sep 18 05:06:42 submit26-b9-f3 setroubleshoot[1751765]: SELinux is preventing /usr/bin/python3.9 from create access on the file /(null). For complete SELinux messages run: sealert -l 580b20e4-ec2c-433d-905c-5bd417fba033
Sep 18 05:06:42 submit26-b9-f3 setroubleshoot[1751765]: SELinux is preventing /usr/bin/python3.9 from open access on the file /tmp/libdnf.AM9Ydi/repodata/repomd.xml. For complete SELinux messages run: sealert -l 27f29d48-5e7c-4db7-b051-8ac055737d6f
Sep 18 05:06:42 submit26-b9-f3 setroubleshoot[1751765]: SELinux is preventing /usr/bin/python3.9 from setattr access on the file repomd.xml. For complete SELinux messages run: sealert -l bff72452-d40a-430b-9060-dd0a48f5b6ba
Sep 18 05:06:42 submit26-b9-f3 setroubleshoot[1751765]: SELinux is preventing /usr/bin/python3.9 from read access on the directory libdnf.AM9Ydi. For complete SELinux messages run: sealert -l 9638d396-8ce5-4e6a-ae47-45cd3985e1cd
Sep 18 05:06:42 submit26-b9-f3 setroubleshoot[1751765]: SELinux is preventing /usr/bin/python3.9 from remove_name access on the directory repomd.xml. For complete SELinux messages run: sealert -l 6da64b94-7024-45a9-b8c2-3b9812517407
Sep 18 05:06:42 submit26-b9-f3 setroubleshoot[1751765]: SELinux is preventing /usr/bin/python3.9 from unlink access on the file repomd.xml. For complete SELinux messages run: sealert -l 64cbe179-abf1-4d5a-bade-bb164897ee65
Sep 18 05:06:42 submit26-b9-f3 setroubleshoot[1751765]: SELinux is preventing /usr/bin/python3.9 from rmdir access on the directory repodata. For complete SELinux messages run: sealert -l d2e35b1a-e27c-4f91-9217-2bb1204e1e68
== submit26-b9-f4 (10 distinct, 14 total) ==
Sep 18 05:24:45 submit26-b9-f4 setroubleshoot[1280964]: SELinux is preventing /usr/bin/python3.9 from create access on the directory /(null). For complete SELinux messages run: sealert -l ee160f23-b161-4f4a-9985-c4edfd3a5beb [x2]
Sep 18 05:24:45 submit26-b9-f4 setroubleshoot[1280964]: SELinux is preventing /usr/bin/python3.9 from add_name access on the directory /(null). For complete SELinux messages run: sealert -l 89a83821-4b24-4081-9973-0a79ca6ed5b4 [x2]
Sep 18 05:24:45 submit26-b9-f4 setroubleshoot[1280964]: SELinux is preventing /usr/bin/python3.9 from create access on the file /(null). For complete SELinux messages run: sealert -l f73955d6-1416-45f9-bab6-ff1f3ea07e9d
Sep 18 05:24:45 submit26-b9-f4 setroubleshoot[1280964]: SELinux is preventing /usr/bin/python3.9 from open access on the file /tmp/libdnf.sKcigQ/repodata/repomd.xml. For complete SELinux messages run: sealert -l 9f8f24a0-8fb6-454d-a103-31a8f7a6efa0
Sep 18 05:24:45 submit26-b9-f4 setroubleshoot[1280964]: SELinux is preventing /usr/bin/python3.9 from setattr access on the file repomd.xml. For complete SELinux messages run: sealert -l 20293136-86a3-40ba-a651-cff48d36059e
Sep 18 05:24:45 submit26-b9-f4 setroubleshoot[1280964]: SELinux is preventing /usr/bin/python3.9 from read access on the directory libdnf.sKcigQ. For complete SELinux messages run: sealert -l 25f86b49-4ee7-4f60-ad1c-73a70032560c
Sep 18 05:24:45 submit26-b9-f4 setroubleshoot[1280964]: SELinux is preventing /usr/bin/python3.9 from remove_name access on the directory repomd.xml. For complete SELinux messages run: sealert -l eec250fb-073f-456d-93bc-f98776fd476d [x2]
Sep 18 05:24:45 submit26-b9-f4 setroubleshoot[1280964]: SELinux is preventing /usr/bin/python3.9 from unlink access on the file repomd.xml. For complete SELinux messages run: sealert -l c9209e04-a349-43d5-8cb2-3e303e48df74
Sep 18 05:24:45 submit26-b9-f4 setroubleshoot[1280964]: SELinux is preventing /usr/bin/python3.9 from rmdir access on the directory repodata. For complete SELinux messages run: sealert -l 3178d5f5-80e9-404b-92b7-9bef397a8915 [x2]
Sep 18 05:25:19 submit26-b9-f4 setroubleshoot[1281018]: SELinux is preventing /usr/bin/python3.9 from read access on the directory libdnf.Fby2ky. For complete SELinux messages run: sealert -l 25f86b49-4ee7-4f60-ad1c-73a70032560c
== teaching-awards (2 distinct, 2 total) ==
Sep 18 05:28:17 teaching-awards krb5_child[1004056]: Preauthentication failed
Sep 18 05:43:00 teaching-awards krb5_child[1004909]: Client 'admin(a)UMD.EDU' not found in Kerberos database
1
0
Command: /usr/local/sbin/syslog-digest.py
Time : 0.0539s
Status : exited 0
Output :
Syslog digest — 2026-09-18 05:05 EDT
Processed 2,856 lines, filtered 2,331 (81%). 525 unknown (198 distinct) from 22 host(s).
== abadi-computer (2 distinct, 2 total) ==
Sep 18 04:15:00 abadi-computer nologin[1046775]: Attempted login by UNKNOWN (UID: 65534) on UNKNOWN
Sep 18 04:15:00 abadi-computer pipewire[1046773]: mod.jackdbus-detect: Failed to receive jackdbus reply: org.freedesktop.DBus.Error.ServiceUnknown: The name org.jackaudio.service was not provided by any .service files
== b0b02.cs.umd.edu (1 distinct, 1 total) ==
Sep 18 04:49:02 b0b02.cs.umd.edu rustdesk[2400819]: cannot open display:
== bale (7 distinct, 51 total) ==
Sep 18 04:30:29 bale systemd[1]: resmon.service: Supervising process 453675 which is not our child. We'll most likely not notice when it exits.
Sep 18 04:30:29 bale setroubleshoot[453266]: Deleting alert 8f58859c-1c63-4aee-afff-7c8e1dd95f45, it is allowed in current policy
Sep 18 04:30:29 bale setroubleshoot[453266]: failed to retrieve rpm info for /dev/nvme0 [x21]
Sep 18 04:30:30 bale setroubleshoot[453266]: SELinux is preventing /usr/libexec/platform-python3.6 from getattr access on the chr_file /dev/nvme0. For complete SELinux messages run: sealert -l e098d0bd-ac29-4737-9018-de9a71e328ee [x7]
Sep 18 04:30:32 bale setroubleshoot[453266]: SELinux is preventing smartctl from read access on the chr_file nvme0. For complete SELinux messages run: sealert -l fc305ce6-663c-4aa2-8640-0ee0f8dce1a9 [x7]
Sep 18 04:30:35 bale setroubleshoot[453266]: SELinux is preventing smartctl from open access on the chr_file /dev/nvme0. For complete SELinux messages run: sealert -l 2c1d6b29-3343-488c-84c7-92d46f8010b6 [x7]
Sep 18 04:30:37 bale setroubleshoot[453266]: SELinux is preventing /usr/sbin/smartctl from ioctl access on the chr_file /dev/nvme0. For complete SELinux messages run: sealert -l 8ea740c2-97d8-42fb-b550-a236b114507d [x7]
== csfw00a (1 distinct, 111 total) ==
Sep 18 04:03:43 csfw00a kernel: bnxt_en 0000:09:00.0 eth3: NIC Link is Down [x111]
== forge00 (1 distinct, 1 total) ==
Sep 18 04:09:03 forge00 (httpd)[84761]: httpd.service: Referenced but unset environment variable evaluates to an empty string: OPTIONS
== idm00 (1 distinct, 1 total) ==
Sep 18 04:54:08 idm00 named[4166701]: client @0x7f1198066c58 10.73.240.42#59928: update '73.10.in-addr.arpa/IN' denied
== idmp0 (1 distinct, 1 total) ==
Sep 18 04:37:58 idmp0 named[1598691]: client @0x7f2d2401e448 10.73.240.43#57901: update '73.10.in-addr.arpa/IN' denied
== inbound00.cs.umd.edu (1 distinct, 1 total) ==
Sep 18 04:20:01 inbound00.cs.umd.edu cockpit-ws[1365910]: /usr/share/cockpit/static/login.js/favicon.ico: Failed to open file “/usr/share/cockpit/static/login.js/favicon.ico”: open() failed: Not a directory
== inbound01.cs.umd.edu (1 distinct, 3 total) ==
Sep 18 04:19:50 inbound01.cs.umd.edu cockpit-ws[3586829]: /usr/share/cockpit/static/login.js/favicon.ico: Failed to open file “/usr/share/cockpit/static/login.js/favicon.ico”: open() failed: Not a directory [x3]
== itmon02 (1 distinct, 5 total) ==
Sep 18 04:08:54 itmon02 sshd[1750555]: error: beginning MaxStartups throttling [x5]
== matrix (12 distinct, 13 total) ==
Sep 18 04:23:15 matrix systemd[1]: networkd-dispatcher.service: Got notification message from PID 1243268, but reception only permitted for main PID 720
Sep 18 04:23:15 matrix systemd[1]: networkd-dispatcher.service: Got notification message from PID 1243272, but reception only permitted for main PID 720
Sep 18 04:23:22 matrix systemd[1]: networkd-dispatcher.service: Got notification message from PID 1243391, but reception only permitted for main PID 720
Sep 18 04:23:22 matrix systemd[1]: networkd-dispatcher.service: Got notification message from PID 1243397, but reception only permitted for main PID 720
Sep 18 04:23:22 matrix networkctl[1243407]: Interface "veth128026f" not found.
Sep 18 04:23:22 matrix systemd[1]: networkd-dispatcher.service: Got notification message from PID 1243407, but reception only permitted for main PID 720
Sep 18 04:23:23 matrix systemd[1]: networkd-dispatcher.service: Got notification message from PID 1243472, but reception only permitted for main PID 720
Sep 18 04:23:23 matrix systemd[1]: networkd-dispatcher.service: Got notification message from PID 1243485, but reception only permitted for main PID 720
Sep 18 04:26:49 matrix systemd[1]: networkd-dispatcher.service: Got notification message from PID 1245597, but reception only permitted for main PID 720
Sep 18 04:26:49 matrix systemd[1]: networkd-dispatcher.service: Got notification message from PID 1245603, but reception only permitted for main PID 720
Sep 18 04:26:49 matrix networkctl[1245616]: Interface "veth130d968" not found.
Sep 18 04:26:49 matrix systemd[1]: networkd-dispatcher.service: Got notification message from PID 1245616, but reception only permitted for main PID 720 [x2]
== munin (2 distinct, 54 total) ==
Sep 18 04:18:01 munin sudo[3761411]: pam_systemd(sudo:session): Failed to stat() runtime directory '/run/user/0': No such file or directory [x27]
Sep 18 04:18:01 munin sudo[3761411]: pam_systemd(sudo:session): Not setting $XDG_RUNTIME_DIR, as the directory is not in order. [x27]
== newhonors2 (1 distinct, 24 total) ==
Sep 18 04:13:02 newhonors2 dhcpcd[2798710]: dhcpcd is not running [x24]
== nightingale (2 distinct, 2 total) ==
Sep 18 04:58:13 nightingale rpc.idmapd[162425]: Setting log level to 0
Sep 18 04:58:49 nightingale systemd[1]: resmon.service: Supervising process 162805 which is not our child. We'll most likely not notice when it exits.
== ntop00 (100 distinct, 144 total) ==
Sep 18 04:05:01 ntop00 nfacctd[323381]: INFO ( m1/mysql ): *** Purging cache - START (PID: 178) ***
Sep 18 04:05:14 ntop00 sfacctd[323304]: INFO ( m1/mysql ): *** Purging cache - END (PID: 178, QN: 6138/6138, ET: 13) ***
Sep 18 04:05:14 ntop00 nfacctd[323381]: INFO ( m1/mysql ): *** Purging cache - END (PID: 178, QN: 60/60, ET: 13) ***
Sep 18 04:06:01 ntop00 sfacctd[323304]: INFO ( p1/print ): *** Purging cache - START (PID: 179) ***
Sep 18 04:06:01 ntop00 sfacctd[323304]: INFO ( p1/print ): *** Purging cache - END (PID: 179, QN: 5944/5944, ET: 0) ***
Sep 18 04:06:01 ntop00 nfacctd[323381]: INFO ( p1/print ): *** Purging cache - START (PID: 179) ***
Sep 18 04:06:01 ntop00 nfacctd[323381]: INFO ( p1/print ): *** Purging cache - END (PID: 179, QN: 49/49, ET: 0) ***
Sep 18 04:06:02 ntop00 setroubleshoot[380376]: SELinux is preventing /usr/local/sbin/sfacctd from append access on the file sflow.json. For complete SELinux messages run: sealert -l 58e35a5d-c7c9-4337-868c-bb9d5ac2e29f [x12]
Sep 18 04:06:02 ntop00 setroubleshoot[380376]: SELinux is preventing /usr/local/sbin/sfacctd from write access on the file sflow.json. For complete SELinux messages run: sealert -l 369b1df3-2c9d-461b-8b1c-2fcd48dc737c [x12]
Sep 18 04:06:02 ntop00 setroubleshoot[380376]: failed to retrieve rpm info for path '/srv/pmacct/sflow.json': [x12]
Sep 18 04:06:02 ntop00 setroubleshoot[380376]: SELinux is preventing /usr/local/sbin/sfacctd from lock access on the file /srv/pmacct/sflow.json. For complete SELinux messages run: sealert -l 481e7e24-3846-4790-b17b-9e44a5f5b5d6 [x12]
Sep 18 04:10:01 ntop00 sfacctd[323304]: INFO ( m1/mysql ): *** Purging cache - START (PID: 180) ***
Sep 18 04:10:01 ntop00 nfacctd[323381]: INFO ( m1/mysql ): *** Purging cache - START (PID: 180) ***
Sep 18 04:10:13 ntop00 sfacctd[323304]: INFO ( m1/mysql ): *** Purging cache - END (PID: 180, QN: 5832/5832, ET: 12) ***
Sep 18 04:10:13 ntop00 nfacctd[323381]: INFO ( m1/mysql ): *** Purging cache - END (PID: 180, QN: 61/61, ET: 12) ***
Sep 18 04:11:01 ntop00 sfacctd[323304]: INFO ( p1/print ): *** Purging cache - START (PID: 181) ***
Sep 18 04:11:01 ntop00 sfacctd[323304]: INFO ( p1/print ): *** Purging cache - END (PID: 181, QN: 5911/5911, ET: 0) ***
Sep 18 04:11:01 ntop00 nfacctd[323381]: INFO ( p1/print ): *** Purging cache - START (PID: 181) ***
Sep 18 04:11:01 ntop00 nfacctd[323381]: INFO ( p1/print ): *** Purging cache - END (PID: 181, QN: 61/61, ET: 0) ***
Sep 18 04:15:01 ntop00 sfacctd[323304]: INFO ( m1/mysql ): *** Purging cache - START (PID: 182) ***
Sep 18 04:15:01 ntop00 nfacctd[323381]: INFO ( m1/mysql ): *** Purging cache - START (PID: 182) ***
Sep 18 04:15:16 ntop00 sfacctd[323304]: INFO ( m1/mysql ): *** Purging cache - END (PID: 182, QN: 6262/6262, ET: 15) ***
Sep 18 04:15:16 ntop00 nfacctd[323381]: INFO ( m1/mysql ): *** Purging cache - END (PID: 182, QN: 60/60, ET: 15) ***
Sep 18 04:16:01 ntop00 sfacctd[323304]: INFO ( p1/print ): *** Purging cache - START (PID: 183) ***
Sep 18 04:16:01 ntop00 sfacctd[323304]: INFO ( p1/print ): *** Purging cache - END (PID: 183, QN: 6997/6997, ET: 0) ***
Sep 18 04:16:01 ntop00 nfacctd[323381]: INFO ( p1/print ): *** Purging cache - START (PID: 183) ***
Sep 18 04:16:01 ntop00 nfacctd[323381]: INFO ( p1/print ): *** Purging cache - END (PID: 183, QN: 69/69, ET: 0) ***
Sep 18 04:20:01 ntop00 nfacctd[323381]: INFO ( m1/mysql ): *** Purging cache - START (PID: 184) ***
Sep 18 04:20:01 ntop00 sfacctd[323304]: INFO ( m1/mysql ): *** Purging cache - START (PID: 184) ***
Sep 18 04:20:01 ntop00 nfacctd[323381]: INFO ( m1/mysql ): *** Purging cache - END (PID: 184, QN: 73/73, ET: 0) ***
... 70 more distinct messages not shown
== outbound00.cs.umd.edu (2 distinct, 8 total) ==
Sep 18 04:09:09 outbound00.cs.umd.edu python3[1239053]: ldapdb [x6]
Sep 18 04:18:30 outbound00.cs.umd.edu cockpit-ws[1240912]: /usr/share/cockpit/static/login.js/favicon.ico: Failed to open file “/usr/share/cockpit/static/login.js/favicon.ico”: open() failed: Not a directory [x2]
== outbound01.cs.umd.edu (2 distinct, 8 total) ==
Sep 18 04:13:06 outbound01.cs.umd.edu python3[3497707]: ldapdb [x6]
Sep 18 04:46:55 outbound01.cs.umd.edu cockpit-ws[3505611]: /usr/share/cockpit/static/login.js/favicon.ico: Failed to open file “/usr/share/cockpit/static/login.js/favicon.ico”: open() failed: Not a directory [x2]
== sentry-docker00.cs.umd.edu (38 distinct, 38 total) ==
Sep 18 04:14:08 sentry-docker00.cs.umd.edu systemd-udevd[2722060]: link_config: could not get ethtool features for veth515654c
Sep 18 04:14:08 sentry-docker00.cs.umd.edu systemd-udevd[2722060]: Could not set offload features of veth515654c: No such device
Sep 18 04:14:08 sentry-docker00.cs.umd.edu systemd-udevd[2722090]: Could not generate persistent MAC address for vethe1e2bc0: No such file or directory
Sep 18 04:14:08 sentry-docker00.cs.umd.edu systemd-udevd[2722091]: Could not generate persistent MAC address for vethc8f80f8: No such file or directory
Sep 18 04:14:08 sentry-docker00.cs.umd.edu systemd-udevd[2722094]: Could not generate persistent MAC address for veth7045c40: No such file or directory
Sep 18 04:14:08 sentry-docker00.cs.umd.edu systemd-udevd[2722097]: Could not generate persistent MAC address for veth77e8efc: No such file or directory
Sep 18 04:14:08 sentry-docker00.cs.umd.edu systemd-udevd[2722118]: Could not generate persistent MAC address for vethb2760d1: No such file or directory
Sep 18 04:14:08 sentry-docker00.cs.umd.edu systemd-udevd[2722119]: Could not generate persistent MAC address for vethf090796: No such file or directory
Sep 18 04:14:08 sentry-docker00.cs.umd.edu systemd-udevd[2722137]: Could not generate persistent MAC address for veth1219ec1: No such file or directory
Sep 18 04:14:08 sentry-docker00.cs.umd.edu systemd-udevd[2722139]: Could not generate persistent MAC address for vethe60f143: No such file or directory
Sep 18 04:14:08 sentry-docker00.cs.umd.edu systemd-udevd[2722162]: Could not generate persistent MAC address for veth484ce73: No such file or directory
Sep 18 04:14:08 sentry-docker00.cs.umd.edu systemd-udevd[2722163]: Could not generate persistent MAC address for veth0a61400: No such file or directory
Sep 18 04:34:16 sentry-docker00.cs.umd.edu systemd-udevd[2731587]: link_config: could not get ethtool features for vethe1e2bc0
Sep 18 04:34:16 sentry-docker00.cs.umd.edu systemd-udevd[2731587]: Could not set offload features of vethe1e2bc0: No such device
Sep 18 04:34:16 sentry-docker00.cs.umd.edu systemd-udevd[2731590]: link_config: could not get ethtool features for veth1219ec1
Sep 18 04:34:16 sentry-docker00.cs.umd.edu systemd-udevd[2731590]: Could not set offload features of veth1219ec1: No such device
Sep 18 04:34:17 sentry-docker00.cs.umd.edu systemd-udevd[2731623]: Could not generate persistent MAC address for veth66f94c1: No such file or directory
Sep 18 04:34:17 sentry-docker00.cs.umd.edu systemd-udevd[2731624]: Could not generate persistent MAC address for veth304eaff: No such file or directory
Sep 18 04:34:17 sentry-docker00.cs.umd.edu systemd-udevd[2731627]: Could not generate persistent MAC address for vethdeb0cd4: No such file or directory
Sep 18 04:34:17 sentry-docker00.cs.umd.edu systemd-udevd[2731628]: Could not generate persistent MAC address for veth948a5b5: No such file or directory
Sep 18 04:34:17 sentry-docker00.cs.umd.edu systemd-udevd[2731651]: Could not generate persistent MAC address for vethe478c95: No such file or directory
Sep 18 04:34:17 sentry-docker00.cs.umd.edu systemd-udevd[2731652]: Could not generate persistent MAC address for veth247dc2e: No such file or directory
Sep 18 04:34:17 sentry-docker00.cs.umd.edu systemd-udevd[2731670]: Could not generate persistent MAC address for veth0d4861b: No such file or directory
Sep 18 04:34:17 sentry-docker00.cs.umd.edu systemd-udevd[2731651]: Could not generate persistent MAC address for vethc7f4134: No such file or directory
Sep 18 04:34:17 sentry-docker00.cs.umd.edu systemd-udevd[2731680]: Could not generate persistent MAC address for veth125d25b: No such file or directory
Sep 18 04:34:17 sentry-docker00.cs.umd.edu systemd-udevd[2731684]: Could not generate persistent MAC address for vethf4ee9e2: No such file or directory
Sep 18 04:54:24 sentry-docker00.cs.umd.edu systemd-udevd[2741047]: link_config: could not get ethtool features for veth125d25b
Sep 18 04:54:24 sentry-docker00.cs.umd.edu systemd-udevd[2741047]: Could not set offload features of veth125d25b: No such device
Sep 18 04:54:25 sentry-docker00.cs.umd.edu systemd-udevd[2741089]: Could not generate persistent MAC address for veth701a18d: No such file or directory
Sep 18 04:54:25 sentry-docker00.cs.umd.edu systemd-udevd[2741090]: Could not generate persistent MAC address for vethac85f14: No such file or directory
... 8 more distinct messages not shown
== smokeping-slave (1 distinct, 1 total) ==
Sep 18 04:15:31 smokeping-slave nologin[1731153]: Attempted login by UNKNOWN (UID: 65534) on UNKNOWN
== soul (2 distinct, 3 total) ==
Sep 18 05:01:41 soul krb5_child[3229733]: Preauthentication failed
Sep 18 05:02:15 soul krb5_child[3230071]: Client 'admin(a)UMD.EDU' not found in Kerberos database [x2]
== strawberry (9 distinct, 40 total) ==
Sep 18 04:07:03 strawberry kernel: I/O error, dev sda, sector 206848 op 0x0:(READ) flags 0x80700 phys_seg 1 prio class 2 [x6]
Sep 18 04:07:03 strawberry kernel: I/O error, dev sda, sector 206848 op 0x0:(READ) flags 0x0 phys_seg 1 prio class 2 [x6]
Sep 18 04:07:03 strawberry kernel: Buffer I/O error on dev sda2, logical block 0, async page read [x6]
Sep 18 04:07:03 strawberry kernel: I/O error, dev sda, sector 2048 op 0x0:(READ) flags 0x80700 phys_seg 1 prio class 2 [x6]
Sep 18 04:07:03 strawberry kernel: I/O error, dev sda, sector 2048 op 0x0:(READ) flags 0x0 phys_seg 1 prio class 2 [x6]
Sep 18 04:07:03 strawberry kernel: Buffer I/O error on dev sda1, logical block 0, async page read [x6]
Sep 18 04:15:01 strawberry nologin[2977649]: Attempted login by UNKNOWN (UID: 65534) on UNKNOWN
Sep 18 04:15:01 strawberry pipewire[2977648]: mod.jackdbus-detect: Failed to receive jackdbus reply: org.freedesktop.DBus.Error.ServiceUnknown: The name org.jackaudio.service was not provided by any .service files
Sep 18 04:34:42 strawberry smartd[5314]: Device: /dev/sda [SAT], failed to read SMART Attribute Data [x2]
== submit26-b9-fclone (10 distinct, 13 total) ==
Sep 18 04:21:57 submit26-b9-fclone setroubleshoot[42051]: SELinux is preventing /usr/bin/python3.9 from create access on the directory /(null). For complete SELinux messages run: sealert -l 9355d9d9-a311-48d2-bd37-6c0f6947dfff
Sep 18 04:21:57 submit26-b9-fclone setroubleshoot[42051]: SELinux is preventing /usr/bin/python3.9 from add_name access on the directory /(null). For complete SELinux messages run: sealert -l cc4658d7-9db1-405d-9eee-de0ccee5857f
Sep 18 04:21:57 submit26-b9-fclone setroubleshoot[42051]: SELinux is preventing /usr/bin/python3.9 from create access on the file /(null). For complete SELinux messages run: sealert -l 568a2429-0b1b-49df-af41-49b5cd298ae8 [x2]
Sep 18 04:21:57 submit26-b9-fclone setroubleshoot[42051]: SELinux is preventing /usr/bin/python3.9 from open access on the file /tmp/libdnf.lnhpme/repodata/repomd.xml. For complete SELinux messages run: sealert -l 03e2f521-0e7c-481f-8e92-0602c6adeedc
Sep 18 04:21:57 submit26-b9-fclone setroubleshoot[42051]: SELinux is preventing /usr/bin/python3.9 from setattr access on the file repomd.xml. For complete SELinux messages run: sealert -l 0d6b7b1f-ebe3-4beb-915a-b06b63bf2566 [x2]
Sep 18 04:21:57 submit26-b9-fclone setroubleshoot[42051]: SELinux is preventing /usr/bin/python3.9 from read access on the directory libdnf.lnhpme. For complete SELinux messages run: sealert -l 887adbf9-2bb9-4009-b800-36ddf9ba0db5
Sep 18 04:21:57 submit26-b9-fclone setroubleshoot[42051]: SELinux is preventing /usr/bin/python3.9 from remove_name access on the directory repomd.xml. For complete SELinux messages run: sealert -l 092e0644-8373-4017-b77f-1afa6c6da4ac
Sep 18 04:21:57 submit26-b9-fclone setroubleshoot[42051]: SELinux is preventing /usr/bin/python3.9 from unlink access on the file repomd.xml. For complete SELinux messages run: sealert -l ce429a92-56de-4de1-b859-cbfb69ae123c [x2]
Sep 18 04:21:57 submit26-b9-fclone setroubleshoot[42051]: SELinux is preventing /usr/bin/python3.9 from rmdir access on the directory repodata. For complete SELinux messages run: sealert -l 99b886eb-497b-406d-8206-afe76a1086b4
Sep 18 04:21:57 submit26-b9-fclone setroubleshoot[42051]: SELinux is preventing /usr/bin/python3.9 from open access on the file /tmp/libdnf.3WV2cR/repodata/repomd.xml. For complete SELinux messages run: sealert -l 03e2f521-0e7c-481f-8e92-0602c6adeedc
1
0
Command: /usr/local/sbin/syslog-digest.py
Time : 0.0511s
Status : exited 0
Output :
Syslog digest — 2026-09-18 04:05 EDT
Processed 3,152 lines, filtered 2,775 (88%). 377 unknown (157 distinct) from 14 host(s).
== b0b02.cs.umd.edu (1 distinct, 1 total) ==
Sep 18 03:48:58 b0b02.cs.umd.edu rustdesk[2385332]: cannot open display:
== csfw00a (2 distinct, 112 total) ==
Sep 18 03:03:57 csfw00a kernel: bnxt_en 0000:09:00.0 eth3: NIC Link is Down [x106]
Sep 18 03:24:19 csfw00a ospf6d[1477]: [EC 100663307] Could not send entire message [x6]
== idm00 (1 distinct, 1 total) ==
Sep 18 03:53:57 idm00 named[4166701]: client @0x7f11a40356e8 10.73.240.42#65021: update '73.10.in-addr.arpa/IN' denied
== idmp0 (1 distinct, 1 total) ==
Sep 18 03:37:58 idmp0 named[1598691]: client @0x7f2d2401b378 10.73.240.43#59976: update '73.10.in-addr.arpa/IN' denied
== itmon02 (2 distinct, 3 total) ==
Sep 18 03:15:03 itmon02 (httpd)[3480335]: httpd.service: Referenced but unset environment variable evaluates to an empty string: OPTIONS
Sep 18 03:18:57 itmon02 sshd[1750555]: error: beginning MaxStartups throttling [x2]
== kadath.cs.umd.edu (1 distinct, 1 total) ==
Sep 18 03:47:30 kadath.cs.umd.edu puppet-agent[524547]: (Facter) invalid or malformed lldp data: MalformedDataError: no lldp interface data found
== librenms (1 distinct, 1 total) ==
Sep 18 03:47:03 librenms (httpd)[1984088]: httpd.service: Referenced but unset environment variable evaluates to an empty string: OPTIONS
== netbox (1 distinct, 1 total) ==
Sep 18 03:08:03 netbox (httpd)[3755288]: httpd.service: Referenced but unset environment variable evaluates to an empty string: OPTIONS
== newhonors2 (1 distinct, 24 total) ==
Sep 18 03:13:03 newhonors2 dhcpcd[2796271]: dhcpcd is not running [x24]
== ntop00 (100 distinct, 144 total) ==
Sep 18 03:05:01 ntop00 nfacctd[323381]: INFO ( m1/mysql ): *** Purging cache - START (PID: 154) ***
Sep 18 03:05:13 ntop00 sfacctd[323304]: INFO ( m1/mysql ): *** Purging cache - END (PID: 154, QN: 6195/6195, ET: 12) ***
Sep 18 03:05:13 ntop00 nfacctd[323381]: INFO ( m1/mysql ): *** Purging cache - END (PID: 154, QN: 63/63, ET: 12) ***
Sep 18 03:06:01 ntop00 sfacctd[323304]: INFO ( p1/print ): *** Purging cache - START (PID: 155) ***
Sep 18 03:06:01 ntop00 sfacctd[323304]: INFO ( p1/print ): *** Purging cache - END (PID: 155, QN: 6192/6192, ET: 0) ***
Sep 18 03:06:01 ntop00 nfacctd[323381]: INFO ( p1/print ): *** Purging cache - START (PID: 155) ***
Sep 18 03:06:01 ntop00 nfacctd[323381]: INFO ( p1/print ): *** Purging cache - END (PID: 155, QN: 62/62, ET: 0) ***
Sep 18 03:06:02 ntop00 setroubleshoot[372647]: SELinux is preventing /usr/local/sbin/sfacctd from append access on the file sflow.json. For complete SELinux messages run: sealert -l 58e35a5d-c7c9-4337-868c-bb9d5ac2e29f [x12]
Sep 18 03:06:02 ntop00 setroubleshoot[372647]: SELinux is preventing /usr/local/sbin/sfacctd from write access on the file sflow.json. For complete SELinux messages run: sealert -l 369b1df3-2c9d-461b-8b1c-2fcd48dc737c [x12]
Sep 18 03:06:02 ntop00 setroubleshoot[372647]: failed to retrieve rpm info for path '/srv/pmacct/sflow.json': [x12]
Sep 18 03:06:02 ntop00 setroubleshoot[372647]: SELinux is preventing /usr/local/sbin/sfacctd from lock access on the file /srv/pmacct/sflow.json. For complete SELinux messages run: sealert -l 481e7e24-3846-4790-b17b-9e44a5f5b5d6 [x12]
Sep 18 03:10:01 ntop00 sfacctd[323304]: INFO ( m1/mysql ): *** Purging cache - START (PID: 156) ***
Sep 18 03:10:01 ntop00 nfacctd[323381]: INFO ( m1/mysql ): *** Purging cache - START (PID: 156) ***
Sep 18 03:10:14 ntop00 sfacctd[323304]: INFO ( m1/mysql ): *** Purging cache - END (PID: 156, QN: 6822/6822, ET: 13) ***
Sep 18 03:10:14 ntop00 nfacctd[323381]: INFO ( m1/mysql ): *** Purging cache - END (PID: 156, QN: 70/70, ET: 13) ***
Sep 18 03:11:01 ntop00 sfacctd[323304]: INFO ( p1/print ): *** Purging cache - START (PID: 157) ***
Sep 18 03:11:01 ntop00 sfacctd[323304]: INFO ( p1/print ): *** Purging cache - END (PID: 157, QN: 6723/6723, ET: 0) ***
Sep 18 03:11:01 ntop00 nfacctd[323381]: INFO ( p1/print ): *** Purging cache - START (PID: 157) ***
Sep 18 03:11:01 ntop00 nfacctd[323381]: INFO ( p1/print ): *** Purging cache - END (PID: 157, QN: 80/80, ET: 0) ***
Sep 18 03:15:01 ntop00 sfacctd[323304]: INFO ( m1/mysql ): *** Purging cache - START (PID: 158) ***
Sep 18 03:15:01 ntop00 nfacctd[323381]: INFO ( m1/mysql ): *** Purging cache - START (PID: 158) ***
Sep 18 03:15:14 ntop00 sfacctd[323304]: INFO ( m1/mysql ): *** Purging cache - END (PID: 158, QN: 7277/7277, ET: 13) ***
Sep 18 03:15:14 ntop00 nfacctd[323381]: INFO ( m1/mysql ): *** Purging cache - END (PID: 158, QN: 86/86, ET: 13) ***
Sep 18 03:16:01 ntop00 sfacctd[323304]: INFO ( p1/print ): *** Purging cache - START (PID: 159) ***
Sep 18 03:16:01 ntop00 sfacctd[323304]: INFO ( p1/print ): *** Purging cache - END (PID: 159, QN: 7531/7531, ET: 0) ***
Sep 18 03:16:01 ntop00 nfacctd[323381]: INFO ( p1/print ): *** Purging cache - START (PID: 159) ***
Sep 18 03:16:01 ntop00 nfacctd[323381]: INFO ( p1/print ): *** Purging cache - END (PID: 159, QN: 81/81, ET: 0) ***
Sep 18 03:20:01 ntop00 sfacctd[323304]: INFO ( m1/mysql ): *** Purging cache - START (PID: 160) ***
Sep 18 03:20:01 ntop00 nfacctd[323381]: INFO ( m1/mysql ): *** Purging cache - START (PID: 160) ***
Sep 18 03:20:15 ntop00 sfacctd[323304]: INFO ( m1/mysql ): *** Purging cache - END (PID: 160, QN: 7152/7152, ET: 14) ***
... 70 more distinct messages not shown
== outbound00.cs.umd.edu (2 distinct, 8 total) ==
Sep 18 03:09:09 outbound00.cs.umd.edu python3[1224334]: ldapdb [x7]
Sep 18 03:25:01 outbound00.cs.umd.edu systemd[1]: Configuration file /usr/lib/systemd/system/authentication_milter.service is marked executable. Please remove executable permission bits. Proceeding anyway.
== outbound01.cs.umd.edu (1 distinct, 6 total) ==
Sep 18 03:13:06 outbound01.cs.umd.edu python3[3483755]: ldapdb [x6]
== sentry-docker00.cs.umd.edu (36 distinct, 36 total) ==
Sep 18 03:13:43 sentry-docker00.cs.umd.edu systemd-udevd[2693753]: link_config: could not get ethtool features for veth66410e5
Sep 18 03:13:43 sentry-docker00.cs.umd.edu systemd-udevd[2693753]: Could not set offload features of veth66410e5: No such device
Sep 18 03:13:43 sentry-docker00.cs.umd.edu systemd-udevd[2693796]: Could not generate persistent MAC address for vethd93a02d: No such file or directory
Sep 18 03:13:43 sentry-docker00.cs.umd.edu systemd-udevd[2693797]: Could not generate persistent MAC address for veth7da4150: No such file or directory
Sep 18 03:13:43 sentry-docker00.cs.umd.edu systemd-udevd[2693800]: Could not generate persistent MAC address for veth692354a: No such file or directory
Sep 18 03:13:43 sentry-docker00.cs.umd.edu systemd-udevd[2693801]: Could not generate persistent MAC address for vethc0265c4: No such file or directory
Sep 18 03:13:43 sentry-docker00.cs.umd.edu systemd-udevd[2693824]: Could not generate persistent MAC address for veth06a5309: No such file or directory
Sep 18 03:13:43 sentry-docker00.cs.umd.edu systemd-udevd[2693825]: Could not generate persistent MAC address for vethd57085b: No such file or directory
Sep 18 03:13:43 sentry-docker00.cs.umd.edu systemd-udevd[2693858]: Could not generate persistent MAC address for veth906b7e2: No such file or directory
Sep 18 03:13:43 sentry-docker00.cs.umd.edu systemd-udevd[2693863]: Could not generate persistent MAC address for vethd5e6275: No such file or directory
Sep 18 03:13:43 sentry-docker00.cs.umd.edu systemd-udevd[2693895]: Could not generate persistent MAC address for vethed79c73: No such file or directory
Sep 18 03:13:43 sentry-docker00.cs.umd.edu systemd-udevd[2693888]: Could not generate persistent MAC address for vetha0c4d2b: No such file or directory
Sep 18 03:33:51 sentry-docker00.cs.umd.edu systemd-udevd[2703203]: link_config: could not get ethtool features for vethd93a02d
Sep 18 03:33:51 sentry-docker00.cs.umd.edu systemd-udevd[2703203]: Could not set offload features of vethd93a02d: No such device
Sep 18 03:33:51 sentry-docker00.cs.umd.edu systemd-udevd[2703264]: Could not generate persistent MAC address for veth95b0669: No such file or directory
Sep 18 03:33:51 sentry-docker00.cs.umd.edu systemd-udevd[2703261]: Could not generate persistent MAC address for vethd14b16d: No such file or directory
Sep 18 03:33:51 sentry-docker00.cs.umd.edu systemd-udevd[2703289]: Could not generate persistent MAC address for vethd19e731: No such file or directory
Sep 18 03:33:51 sentry-docker00.cs.umd.edu systemd-udevd[2703290]: Could not generate persistent MAC address for veth59567ea: No such file or directory
Sep 18 03:33:51 sentry-docker00.cs.umd.edu systemd-udevd[2703280]: Could not generate persistent MAC address for vethf08ae12: No such file or directory
Sep 18 03:33:51 sentry-docker00.cs.umd.edu systemd-udevd[2703284]: Could not generate persistent MAC address for veth195cbfe: No such file or directory
Sep 18 03:33:51 sentry-docker00.cs.umd.edu systemd-udevd[2703308]: Could not generate persistent MAC address for veth0b6cc68: No such file or directory
Sep 18 03:33:51 sentry-docker00.cs.umd.edu systemd-udevd[2703309]: Could not generate persistent MAC address for veth84b304a: No such file or directory
Sep 18 03:33:51 sentry-docker00.cs.umd.edu systemd-udevd[2703348]: Could not generate persistent MAC address for vethb95751d: No such file or directory
Sep 18 03:33:51 sentry-docker00.cs.umd.edu systemd-udevd[2703363]: Could not generate persistent MAC address for vethec8881b: No such file or directory
Sep 18 03:53:59 sentry-docker00.cs.umd.edu systemd-udevd[2712642]: link_config: could not get ethtool features for vethd19e731
Sep 18 03:53:59 sentry-docker00.cs.umd.edu systemd-udevd[2712642]: Could not set offload features of vethd19e731: No such device
Sep 18 03:54:00 sentry-docker00.cs.umd.edu systemd-udevd[2712703]: Could not generate persistent MAC address for veth515654c: No such file or directory
Sep 18 03:54:00 sentry-docker00.cs.umd.edu systemd-udevd[2712704]: Could not generate persistent MAC address for veth8640fc4: No such file or directory
Sep 18 03:54:00 sentry-docker00.cs.umd.edu systemd-udevd[2712707]: Could not generate persistent MAC address for veth4f1a583: No such file or directory
Sep 18 03:54:00 sentry-docker00.cs.umd.edu systemd-udevd[2712724]: Could not generate persistent MAC address for vethe50289a: No such file or directory
... 6 more distinct messages not shown
== strawberry (7 distinct, 38 total) ==
Sep 18 03:07:03 strawberry kernel: I/O error, dev sda, sector 206848 op 0x0:(READ) flags 0x80700 phys_seg 1 prio class 2 [x6]
Sep 18 03:07:03 strawberry kernel: I/O error, dev sda, sector 206848 op 0x0:(READ) flags 0x0 phys_seg 1 prio class 2 [x6]
Sep 18 03:07:03 strawberry kernel: Buffer I/O error on dev sda2, logical block 0, async page read [x6]
Sep 18 03:07:03 strawberry kernel: I/O error, dev sda, sector 2048 op 0x0:(READ) flags 0x80700 phys_seg 1 prio class 2 [x6]
Sep 18 03:07:03 strawberry kernel: I/O error, dev sda, sector 2048 op 0x0:(READ) flags 0x0 phys_seg 1 prio class 2 [x6]
Sep 18 03:07:03 strawberry kernel: Buffer I/O error on dev sda1, logical block 0, async page read [x6]
Sep 18 03:34:42 strawberry smartd[5314]: Device: /dev/sda [SAT], failed to read SMART Attribute Data [x2]
1
0
Command: /usr/local/sbin/syslog-digest.py
Time : 0.0509s
Status : exited 0
Output :
Syslog digest — 2026-09-18 03:05 EDT
Processed 2,789 lines, filtered 2,341 (83%). 448 unknown (190 distinct) from 18 host(s).
== b0b02.cs.umd.edu (1 distinct, 1 total) ==
Sep 18 02:48:54 b0b02.cs.umd.edu rustdesk[2370096]: cannot open display:
== biggulp.cs.umd.edu (4 distinct, 4 total) ==
Sep 18 03:00:42 biggulp.cs.umd.edu sshd-session[2201802]: pam_access(sshd:auth): access denied for user `admin' from `34.77.193.5'
Sep 18 03:00:42 biggulp.cs.umd.edu krb5_child[2201804]: Client 'admin(a)UMD.EDU' not found in Kerberos database
Sep 18 03:00:42 biggulp.cs.umd.edu sshd-session[2201800]: error: PAM: System error for admin from 34.77.193.5
Sep 18 03:00:56 biggulp.cs.umd.edu sshd-session[2201838]: error: Protocol major versions differ: 2 vs. 1
== cheezit.cs.umd.edu (6 distinct, 6 total) ==
Sep 18 03:04:57 cheezit.cs.umd.edu sshd-session[426744]: error: kex_protocol_error: type 20 seq 2 [preauth]
Sep 18 03:04:57 cheezit.cs.umd.edu sshd-session[426744]: error: kex_protocol_error: type 30 seq 3 [preauth]
Sep 18 03:04:59 cheezit.cs.umd.edu sshd-session[426744]: error: kex_protocol_error: type 20 seq 4 [preauth]
Sep 18 03:04:59 cheezit.cs.umd.edu sshd-session[426744]: error: kex_protocol_error: type 30 seq 5 [preauth]
Sep 18 03:05:01 cheezit.cs.umd.edu sshd-session[426744]: error: kex_protocol_error: type 20 seq 6 [preauth]
Sep 18 03:05:01 cheezit.cs.umd.edu sshd-session[426744]: error: kex_protocol_error: type 30 seq 7 [preauth]
== csfw00a (1 distinct, 136 total) ==
Sep 18 02:04:04 csfw00a kernel: bnxt_en 0000:09:00.0 eth3: NIC Link is Down [x136]
== idm00 (1 distinct, 1 total) ==
Sep 18 02:53:57 idm00 named[4166701]: client @0x7f11a0068ca8 10.73.240.42#64221: update '73.10.in-addr.arpa/IN' denied
== idmp0 (1 distinct, 1 total) ==
Sep 18 02:37:57 idmp0 named[1598691]: client @0x7f2d38010098 10.73.240.43#64560: update '73.10.in-addr.arpa/IN' denied
== itmon02 (1 distinct, 2 total) ==
Sep 18 02:13:05 itmon02 sshd[1750555]: error: beginning MaxStartups throttling [x2]
== krispykreme.cs.umd.edu (6 distinct, 18 total) ==
Sep 18 03:03:04 krispykreme.cs.umd.edu sshd-session[3531333]: error: kex_protocol_error: type 20 seq 2 [preauth] [x3]
Sep 18 03:03:04 krispykreme.cs.umd.edu sshd-session[3531333]: error: kex_protocol_error: type 30 seq 3 [preauth] [x3]
Sep 18 03:03:05 krispykreme.cs.umd.edu sshd-session[3531333]: error: kex_protocol_error: type 20 seq 4 [preauth] [x3]
Sep 18 03:03:05 krispykreme.cs.umd.edu sshd-session[3531333]: error: kex_protocol_error: type 30 seq 5 [preauth] [x3]
Sep 18 03:03:11 krispykreme.cs.umd.edu sshd-session[3531333]: error: kex_protocol_error: type 20 seq 6 [preauth] [x3]
Sep 18 03:03:11 krispykreme.cs.umd.edu sshd-session[3531333]: error: kex_protocol_error: type 30 seq 7 [preauth] [x3]
== newhonors2 (1 distinct, 24 total) ==
Sep 18 02:13:03 newhonors2 dhcpcd[2794426]: dhcpcd is not running [x24]
== ntop00 (101 distinct, 145 total) ==
Sep 18 02:05:01 ntop00 sfacctd[323304]: INFO ( m1/mysql ): *** Purging cache - START (PID: 130) ***
Sep 18 02:05:01 ntop00 nfacctd[323381]: INFO ( m1/mysql ): *** Purging cache - START (PID: 130) ***
Sep 18 02:05:14 ntop00 sfacctd[323304]: INFO ( m1/mysql ): *** Purging cache - END (PID: 130, QN: 6737/6737, ET: 13) ***
Sep 18 02:05:15 ntop00 nfacctd[323381]: INFO ( m1/mysql ): *** Purging cache - END (PID: 130, QN: 69/69, ET: 14) ***
Sep 18 02:06:01 ntop00 sfacctd[323304]: INFO ( p1/print ): *** Purging cache - START (PID: 131) ***
Sep 18 02:06:01 ntop00 sfacctd[323304]: INFO ( p1/print ): *** Purging cache - END (PID: 131, QN: 6998/6998, ET: 0) ***
Sep 18 02:06:01 ntop00 nfacctd[323381]: INFO ( p1/print ): *** Purging cache - START (PID: 131) ***
Sep 18 02:06:01 ntop00 nfacctd[323381]: INFO ( p1/print ): *** Purging cache - END (PID: 131, QN: 68/68, ET: 0) ***
Sep 18 02:06:02 ntop00 setroubleshoot[364892]: SELinux is preventing /usr/local/sbin/sfacctd from append access on the file sflow.json. For complete SELinux messages run: sealert -l 58e35a5d-c7c9-4337-868c-bb9d5ac2e29f [x12]
Sep 18 02:06:02 ntop00 setroubleshoot[364892]: SELinux is preventing /usr/local/sbin/sfacctd from write access on the file sflow.json. For complete SELinux messages run: sealert -l 369b1df3-2c9d-461b-8b1c-2fcd48dc737c [x12]
Sep 18 02:06:02 ntop00 setroubleshoot[364892]: failed to retrieve rpm info for path '/srv/pmacct/sflow.json': [x12]
Sep 18 02:06:02 ntop00 setroubleshoot[364892]: SELinux is preventing /usr/local/sbin/sfacctd from lock access on the file /srv/pmacct/sflow.json. For complete SELinux messages run: sealert -l 481e7e24-3846-4790-b17b-9e44a5f5b5d6 [x12]
Sep 18 02:10:01 ntop00 nfacctd[323381]: INFO ( m1/mysql ): *** Purging cache - START (PID: 132) ***
Sep 18 02:10:01 ntop00 sfacctd[323304]: INFO ( m1/mysql ): *** Purging cache - START (PID: 132) ***
Sep 18 02:10:01 ntop00 nfacctd[323381]: INFO ( m1/mysql ): *** Purging cache - END (PID: 132, QN: 80/80, ET: 0) ***
Sep 18 02:10:15 ntop00 sfacctd[323304]: INFO ( m1/mysql ): *** Purging cache - END (PID: 132, QN: 7445/7445, ET: 14) ***
Sep 18 02:11:01 ntop00 sfacctd[323304]: INFO ( p1/print ): *** Purging cache - START (PID: 133) ***
Sep 18 02:11:01 ntop00 sfacctd[323304]: INFO ( p1/print ): *** Purging cache - END (PID: 133, QN: 7115/7115, ET: 0) ***
Sep 18 02:11:01 ntop00 nfacctd[323381]: INFO ( p1/print ): *** Purging cache - START (PID: 133) ***
Sep 18 02:11:01 ntop00 nfacctd[323381]: INFO ( p1/print ): *** Purging cache - END (PID: 133, QN: 70/70, ET: 0) ***
Sep 18 02:15:01 ntop00 sfacctd[323304]: INFO ( m1/mysql ): *** Purging cache - START (PID: 134) ***
Sep 18 02:15:01 ntop00 nfacctd[323381]: INFO ( m1/mysql ): *** Purging cache - START (PID: 134) ***
Sep 18 02:15:13 ntop00 sfacctd[323304]: INFO ( m1/mysql ): *** Purging cache - END (PID: 134, QN: 6456/6456, ET: 12) ***
Sep 18 02:15:13 ntop00 nfacctd[323381]: INFO ( m1/mysql ): *** Purging cache - END (PID: 134, QN: 53/53, ET: 12) ***
Sep 18 02:16:01 ntop00 sfacctd[323304]: INFO ( p1/print ): *** Purging cache - START (PID: 135) ***
Sep 18 02:16:01 ntop00 sfacctd[323304]: INFO ( p1/print ): *** Purging cache - END (PID: 135, QN: 6753/6753, ET: 0) ***
Sep 18 02:16:01 ntop00 nfacctd[323381]: INFO ( p1/print ): *** Purging cache - START (PID: 135) ***
Sep 18 02:16:01 ntop00 nfacctd[323381]: INFO ( p1/print ): *** Purging cache - END (PID: 135, QN: 54/54, ET: 0) ***
Sep 18 02:20:01 ntop00 sfacctd[323304]: INFO ( m1/mysql ): *** Purging cache - START (PID: 136) ***
Sep 18 02:20:02 ntop00 nfacctd[323381]: INFO ( m1/mysql ): *** Purging cache - START (PID: 136) ***
... 71 more distinct messages not shown
== outbound00.cs.umd.edu (1 distinct, 6 total) ==
Sep 18 02:09:09 outbound00.cs.umd.edu python3[1210253]: ldapdb [x6]
== outbound01.cs.umd.edu (1 distinct, 6 total) ==
Sep 18 02:13:06 outbound01.cs.umd.edu python3[3469825]: ldapdb [x6]
== sentry-docker00.cs.umd.edu (36 distinct, 36 total) ==
Sep 18 02:13:18 sentry-docker00.cs.umd.edu systemd-udevd[2664971]: link_config: could not get ethtool features for vethf3002d2
Sep 18 02:13:18 sentry-docker00.cs.umd.edu systemd-udevd[2664971]: Could not set offload features of vethf3002d2: No such device
Sep 18 02:13:18 sentry-docker00.cs.umd.edu systemd-udevd[2665050]: Could not generate persistent MAC address for vetha21c640: No such file or directory
Sep 18 02:13:18 sentry-docker00.cs.umd.edu systemd-udevd[2665051]: Could not generate persistent MAC address for veth93ae960: No such file or directory
Sep 18 02:13:18 sentry-docker00.cs.umd.edu systemd-udevd[2665054]: Could not generate persistent MAC address for veth8753a6d: No such file or directory
Sep 18 02:13:18 sentry-docker00.cs.umd.edu systemd-udevd[2665055]: Could not generate persistent MAC address for veth71d63f7: No such file or directory
Sep 18 02:13:18 sentry-docker00.cs.umd.edu systemd-udevd[2665058]: Could not generate persistent MAC address for vethb7a9a5e: No such file or directory
Sep 18 02:13:18 sentry-docker00.cs.umd.edu systemd-udevd[2665069]: Could not generate persistent MAC address for vetha3cacc5: No such file or directory
Sep 18 02:13:18 sentry-docker00.cs.umd.edu systemd-udevd[2665072]: Could not generate persistent MAC address for veth1c0ab70: No such file or directory
Sep 18 02:13:18 sentry-docker00.cs.umd.edu systemd-udevd[2665065]: Could not generate persistent MAC address for veth4122e5f: No such file or directory
Sep 18 02:13:18 sentry-docker00.cs.umd.edu systemd-udevd[2665069]: Could not generate persistent MAC address for veth04bdbd8: No such file or directory
Sep 18 02:13:18 sentry-docker00.cs.umd.edu systemd-udevd[2665058]: Could not generate persistent MAC address for veth7161564: No such file or directory
Sep 18 02:33:26 sentry-docker00.cs.umd.edu systemd-udevd[2674695]: link_config: could not get ethtool features for vetha21c640
Sep 18 02:33:26 sentry-docker00.cs.umd.edu systemd-udevd[2674695]: Could not set offload features of vetha21c640: No such device
Sep 18 02:33:26 sentry-docker00.cs.umd.edu systemd-udevd[2674729]: Could not generate persistent MAC address for vethd6ceadf: No such file or directory
Sep 18 02:33:26 sentry-docker00.cs.umd.edu systemd-udevd[2674730]: Could not generate persistent MAC address for veth3c8b944: No such file or directory
Sep 18 02:33:26 sentry-docker00.cs.umd.edu systemd-udevd[2674733]: Could not generate persistent MAC address for vethe8a4cff: No such file or directory
Sep 18 02:33:26 sentry-docker00.cs.umd.edu systemd-udevd[2674729]: Could not generate persistent MAC address for veth0a5f811: No such file or directory
Sep 18 02:33:26 sentry-docker00.cs.umd.edu systemd-udevd[2674753]: Could not generate persistent MAC address for vethf4b0a0c: No such file or directory
Sep 18 02:33:26 sentry-docker00.cs.umd.edu systemd-udevd[2674736]: Could not generate persistent MAC address for veth576ad7c: No such file or directory
Sep 18 02:33:27 sentry-docker00.cs.umd.edu systemd-udevd[2674759]: Could not generate persistent MAC address for vethb8edc52: No such file or directory
Sep 18 02:33:27 sentry-docker00.cs.umd.edu systemd-udevd[2674760]: Could not generate persistent MAC address for vethe13582f: No such file or directory
Sep 18 02:33:27 sentry-docker00.cs.umd.edu systemd-udevd[2674776]: Could not generate persistent MAC address for veth6bfa95e: No such file or directory
Sep 18 02:33:27 sentry-docker00.cs.umd.edu systemd-udevd[2674779]: Could not generate persistent MAC address for vethb2c1459: No such file or directory
Sep 18 02:53:34 sentry-docker00.cs.umd.edu systemd-udevd[2684309]: link_config: could not get ethtool features for vethb8edc52
Sep 18 02:53:34 sentry-docker00.cs.umd.edu systemd-udevd[2684309]: Could not set offload features of vethb8edc52: No such device
Sep 18 02:53:35 sentry-docker00.cs.umd.edu systemd-udevd[2684374]: Could not generate persistent MAC address for veth191e861: No such file or directory
Sep 18 02:53:35 sentry-docker00.cs.umd.edu systemd-udevd[2684373]: Could not generate persistent MAC address for vethafc0d88: No such file or directory
Sep 18 02:53:35 sentry-docker00.cs.umd.edu systemd-udevd[2684377]: Could not generate persistent MAC address for veth3567009: No such file or directory
Sep 18 02:53:35 sentry-docker00.cs.umd.edu systemd-udevd[2684378]: Could not generate persistent MAC address for vethc702bd7: No such file or directory
... 6 more distinct messages not shown
== strawberry (7 distinct, 38 total) ==
Sep 18 02:07:03 strawberry kernel: I/O error, dev sda, sector 206848 op 0x0:(READ) flags 0x80700 phys_seg 1 prio class 2 [x6]
Sep 18 02:07:03 strawberry kernel: I/O error, dev sda, sector 206848 op 0x0:(READ) flags 0x0 phys_seg 1 prio class 2 [x6]
Sep 18 02:07:03 strawberry kernel: Buffer I/O error on dev sda2, logical block 0, async page read [x6]
Sep 18 02:07:03 strawberry kernel: I/O error, dev sda, sector 2048 op 0x0:(READ) flags 0x80700 phys_seg 1 prio class 2 [x6]
Sep 18 02:07:03 strawberry kernel: I/O error, dev sda, sector 2048 op 0x0:(READ) flags 0x0 phys_seg 1 prio class 2 [x6]
Sep 18 02:07:03 strawberry kernel: Buffer I/O error on dev sda1, logical block 0, async page read [x6]
Sep 18 02:34:42 strawberry smartd[5314]: Device: /dev/sda [SAT], failed to read SMART Attribute Data [x2]
== submit26-b9-f1 (10 distinct, 12 total) ==
Sep 18 02:13:39 submit26-b9-f1 systemd[1]: user(a)1001.service: Main process exited, code=killed, status=9/KILL [x3]
Sep 18 02:25:53 submit26-b9-f1 setroubleshoot[2281010]: SELinux is preventing /usr/bin/python3.9 from create access on the directory /(null). For complete SELinux messages run: sealert -l 3ef7d677-731f-46bf-9c34-c2c55fea665c
Sep 18 02:25:53 submit26-b9-f1 setroubleshoot[2281010]: SELinux is preventing /usr/bin/python3.9 from add_name access on the directory /(null). For complete SELinux messages run: sealert -l aa60e26f-72e1-45f1-bc12-aa8b3b669e36
Sep 18 02:25:53 submit26-b9-f1 setroubleshoot[2281010]: SELinux is preventing /usr/bin/python3.9 from create access on the file /(null). For complete SELinux messages run: sealert -l d088fb43-23ee-4ae8-ae6a-5d1c041ee2d6
Sep 18 02:25:53 submit26-b9-f1 setroubleshoot[2281010]: SELinux is preventing /usr/bin/python3.9 from open access on the file /tmp/libdnf.Wvsbez/repodata/repomd.xml. For complete SELinux messages run: sealert -l 3b0d8c9a-6637-4d6e-a864-f1dd7c00377d
Sep 18 02:25:53 submit26-b9-f1 setroubleshoot[2281010]: SELinux is preventing /usr/bin/python3.9 from setattr access on the file repomd.xml. For complete SELinux messages run: sealert -l 0fd3339f-3ef2-45f3-9e58-65a58b42f3ee
Sep 18 02:25:53 submit26-b9-f1 setroubleshoot[2281010]: SELinux is preventing /usr/bin/python3.9 from read access on the directory libdnf.Wvsbez. For complete SELinux messages run: sealert -l 0d661d88-dc9e-469d-986b-52e29b353aa8
Sep 18 02:25:53 submit26-b9-f1 setroubleshoot[2281010]: SELinux is preventing /usr/bin/python3.9 from remove_name access on the directory repomd.xml. For complete SELinux messages run: sealert -l 405a8556-cf9f-4ef4-8525-0dca18d4259d
Sep 18 02:25:53 submit26-b9-f1 setroubleshoot[2281010]: SELinux is preventing /usr/bin/python3.9 from unlink access on the file repomd.xml. For complete SELinux messages run: sealert -l 3c38e23e-3631-4cb5-81c7-992675c836d9
Sep 18 02:25:53 submit26-b9-f1 setroubleshoot[2281010]: SELinux is preventing /usr/bin/python3.9 from rmdir access on the directory repodata. For complete SELinux messages run: sealert -l a070e9b5-2867-47d6-b2e3-3b7d99725848
== submit26-b9-f2 (10 distinct, 10 total) ==
Sep 18 02:06:48 submit26-b9-f2 setroubleshoot[1417858]: SELinux is preventing /usr/bin/python3.9 from create access on the directory /(null). For complete SELinux messages run: sealert -l 0659d546-3107-4f75-b00f-008c85f41dc6
Sep 18 02:06:48 submit26-b9-f2 setroubleshoot[1417858]: SELinux is preventing /usr/bin/python3.9 from add_name access on the directory /(null). For complete SELinux messages run: sealert -l 156d9270-3466-4356-b86f-1a128825961a
Sep 18 02:06:48 submit26-b9-f2 setroubleshoot[1417858]: SELinux is preventing /usr/bin/python3.9 from create access on the file /(null). For complete SELinux messages run: sealert -l c8a40bf5-2fc4-46b3-b813-8592b3523339
Sep 18 02:06:48 submit26-b9-f2 setroubleshoot[1417858]: SELinux is preventing /usr/bin/python3.9 from open access on the file /tmp/libdnf.RjWSeu/repodata/repomd.xml. For complete SELinux messages run: sealert -l 7f4c3a8e-0f99-47c4-9baf-e1336fe24876
Sep 18 02:06:48 submit26-b9-f2 setroubleshoot[1417858]: SELinux is preventing /usr/bin/python3.9 from setattr access on the file repomd.xml. For complete SELinux messages run: sealert -l 988123da-b724-4e6a-900c-33a2723fdaf1
Sep 18 02:06:48 submit26-b9-f2 setroubleshoot[1417858]: SELinux is preventing /usr/bin/python3.9 from read access on the directory libdnf.RjWSeu. For complete SELinux messages run: sealert -l ca585e2b-d50f-4264-8127-6b3fa04070c8
Sep 18 02:06:48 submit26-b9-f2 setroubleshoot[1417858]: SELinux is preventing /usr/bin/python3.9 from remove_name access on the directory repomd.xml. For complete SELinux messages run: sealert -l 3a749560-1cec-40ca-a4dc-596841be3885
Sep 18 02:06:48 submit26-b9-f2 setroubleshoot[1417858]: SELinux is preventing /usr/bin/python3.9 from unlink access on the file repomd.xml. For complete SELinux messages run: sealert -l 0aa52f08-94f8-474e-96d8-e818846941af
Sep 18 02:06:48 submit26-b9-f2 setroubleshoot[1417858]: SELinux is preventing /usr/bin/python3.9 from rmdir access on the directory repodata. For complete SELinux messages run: sealert -l de019dc4-408f-439c-902a-676d18dfe8e7
Sep 18 02:55:07 submit26-b9-f2 systemd[1]: user(a)1001.service: Main process exited, code=killed, status=9/KILL
== submit26-b9-f3 (1 distinct, 1 total) ==
Sep 18 02:05:06 submit26-b9-f3 systemd[1]: user(a)1001.service: Main process exited, code=killed, status=9/KILL
== zebatinsky.cs.umd.edu (1 distinct, 1 total) ==
Sep 18 02:17:54 zebatinsky.cs.umd.edu sshd[2513932]: error: Protocol major versions differ: 2 vs. 1
1
0
Command: /usr/local/sbin/syslog-digest.py
Time : 0.0500s
Status : exited 0
Output :
Syslog digest — 2026-09-18 02:05 EDT
Processed 2,764 lines, filtered 2,362 (85%). 402 unknown (185 distinct) from 18 host(s).
== b0b02.cs.umd.edu (1 distinct, 1 total) ==
Sep 18 01:48:50 b0b02.cs.umd.edu rustdesk[2354906]: cannot open display:
== bachata (10 distinct, 10 total) ==
Sep 18 01:05:13 bachata smbd[652135]: [2026/09/18 01:05:13.334612, 0] ../../source3/smbd/smb2_service.c:117(chdir_current_service)
Sep 18 01:05:13 bachata smbd[652135]: chdir_current_service: vfs_ChDir(/fs/junkfood/jworden) failed: Permission denied. Current token: uid=12641, gid=12641, 16 groups: 12641 105272 319000000 319050000 105239 25010 319000009 105240 33001 112010 15072 30040 30744 30877 319050001 319100017
Sep 18 01:05:13 bachata smbd[652135]: [2026/09/18 01:05:13.335124, 0] ../../source3/smbd/smbXsrv_tcon.c:914(smbXsrv_tcon_disconnect)
Sep 18 01:05:13 bachata smbd[652135]: smbXsrv_tcon_disconnect: disconnect(0x79459a4a, 'jworden'): chdir_current_service() failed: NT_STATUS_INTERNAL_ERROR
Sep 18 01:05:13 bachata smbd[652135]: [2026/09/18 01:05:13.335265, 0] ../../source3/smbd/smbXsrv_tcon.c:1028(smbXsrv_tcon_disconnect_all)
Sep 18 01:05:13 bachata smbd[652135]: smbXsrv_tcon_disconnect_all: count[1] errors[1] first[NT_STATUS_INTERNAL_ERROR]
Sep 18 01:05:13 bachata smbd[652135]: [2026/09/18 01:05:13.335301, 0] ../../source3/smbd/smbXsrv_session.c:1900(smbXsrv_session_logoff)
Sep 18 01:05:13 bachata smbd[652135]: smbXsrv_session_logoff: smbXsrv_session_logoff(0xca4ca7af): smb2srv_tcon_disconnect_all() failed: NT_STATUS_INTERNAL_ERROR
Sep 18 01:05:13 bachata smbd[652135]: [2026/09/18 01:05:13.335347, 0] ../../source3/smbd/smbXsrv_session.c:1728(smbXsrv_session_remove_channel_done)
Sep 18 01:05:13 bachata smbd[652135]: smbXsrv_session_remove_channel_done: smbXsrv_session_logoff(3394021295) failed: NT_STATUS_INTERNAL_ERROR
== csfw00a (1 distinct, 97 total) ==
Sep 18 01:03:51 csfw00a kernel: bnxt_en 0000:09:00.0 eth3: NIC Link is Down [x97]
== idm00 (1 distinct, 1 total) ==
Sep 18 01:53:57 idm00 named[4166701]: client @0x7f11a9464788 10.73.240.42#53250: update '73.10.in-addr.arpa/IN' denied
== idmp0 (1 distinct, 1 total) ==
Sep 18 01:37:57 idmp0 named[1598691]: client @0x7f2d1c04b088 10.73.240.43#52401: update '73.10.in-addr.arpa/IN' denied
== itmon02 (1 distinct, 3 total) ==
Sep 18 01:14:00 itmon02 sshd[1750555]: error: beginning MaxStartups throttling [x3]
== newhonors2 (1 distinct, 24 total) ==
Sep 18 01:13:03 newhonors2 dhcpcd[2792582]: dhcpcd is not running [x24]
== ntop00 (100 distinct, 144 total) ==
Sep 18 01:05:01 ntop00 nfacctd[323381]: INFO ( m1/mysql ): *** Purging cache - START (PID: 106) ***
Sep 18 01:05:01 ntop00 sfacctd[323304]: INFO ( m1/mysql ): *** Purging cache - START (PID: 106) ***
Sep 18 01:05:01 ntop00 nfacctd[323381]: INFO ( m1/mysql ): *** Purging cache - END (PID: 106, QN: 78/78, ET: 0) ***
Sep 18 01:05:12 ntop00 sfacctd[323304]: INFO ( m1/mysql ): *** Purging cache - END (PID: 106, QN: 6671/6671, ET: 11) ***
Sep 18 01:06:01 ntop00 sfacctd[323304]: INFO ( p1/print ): *** Purging cache - START (PID: 107) ***
Sep 18 01:06:01 ntop00 sfacctd[323304]: INFO ( p1/print ): *** Purging cache - END (PID: 107, QN: 6372/6372, ET: 0) ***
Sep 18 01:06:01 ntop00 nfacctd[323381]: INFO ( p1/print ): *** Purging cache - START (PID: 107) ***
Sep 18 01:06:01 ntop00 nfacctd[323381]: INFO ( p1/print ): *** Purging cache - END (PID: 107, QN: 75/75, ET: 0) ***
Sep 18 01:06:02 ntop00 setroubleshoot[357005]: SELinux is preventing /usr/local/sbin/sfacctd from append access on the file sflow.json. For complete SELinux messages run: sealert -l 58e35a5d-c7c9-4337-868c-bb9d5ac2e29f [x12]
Sep 18 01:06:02 ntop00 setroubleshoot[357005]: SELinux is preventing /usr/local/sbin/sfacctd from write access on the file sflow.json. For complete SELinux messages run: sealert -l 369b1df3-2c9d-461b-8b1c-2fcd48dc737c [x12]
Sep 18 01:06:02 ntop00 setroubleshoot[357005]: failed to retrieve rpm info for path '/srv/pmacct/sflow.json': [x12]
Sep 18 01:06:02 ntop00 setroubleshoot[357005]: SELinux is preventing /usr/local/sbin/sfacctd from lock access on the file /srv/pmacct/sflow.json. For complete SELinux messages run: sealert -l 481e7e24-3846-4790-b17b-9e44a5f5b5d6 [x12]
Sep 18 01:10:01 ntop00 sfacctd[323304]: INFO ( m1/mysql ): *** Purging cache - START (PID: 108) ***
Sep 18 01:10:01 ntop00 nfacctd[323381]: INFO ( m1/mysql ): *** Purging cache - START (PID: 108) ***
Sep 18 01:10:11 ntop00 sfacctd[323304]: INFO ( m1/mysql ): *** Purging cache - END (PID: 108, QN: 6249/6249, ET: 10) ***
Sep 18 01:10:12 ntop00 nfacctd[323381]: INFO ( m1/mysql ): *** Purging cache - END (PID: 108, QN: 80/80, ET: 11) ***
Sep 18 01:11:01 ntop00 sfacctd[323304]: INFO ( p1/print ): *** Purging cache - START (PID: 109) ***
Sep 18 01:11:01 ntop00 sfacctd[323304]: INFO ( p1/print ): *** Purging cache - END (PID: 109, QN: 6421/6421, ET: 0) ***
Sep 18 01:11:01 ntop00 nfacctd[323381]: INFO ( p1/print ): *** Purging cache - START (PID: 109) ***
Sep 18 01:11:01 ntop00 nfacctd[323381]: INFO ( p1/print ): *** Purging cache - END (PID: 109, QN: 88/88, ET: 0) ***
Sep 18 01:15:01 ntop00 sfacctd[323304]: INFO ( m1/mysql ): *** Purging cache - START (PID: 110) ***
Sep 18 01:15:01 ntop00 nfacctd[323381]: INFO ( m1/mysql ): *** Purging cache - START (PID: 110) ***
Sep 18 01:15:13 ntop00 sfacctd[323304]: INFO ( m1/mysql ): *** Purging cache - END (PID: 110, QN: 6839/6839, ET: 12) ***
Sep 18 01:15:13 ntop00 nfacctd[323381]: INFO ( m1/mysql ): *** Purging cache - END (PID: 110, QN: 71/71, ET: 12) ***
Sep 18 01:16:01 ntop00 sfacctd[323304]: INFO ( p1/print ): *** Purging cache - START (PID: 111) ***
Sep 18 01:16:01 ntop00 sfacctd[323304]: INFO ( p1/print ): *** Purging cache - END (PID: 111, QN: 6980/6980, ET: 0) ***
Sep 18 01:16:01 ntop00 nfacctd[323381]: INFO ( p1/print ): *** Purging cache - START (PID: 111) ***
Sep 18 01:16:01 ntop00 nfacctd[323381]: INFO ( p1/print ): *** Purging cache - END (PID: 111, QN: 62/62, ET: 0) ***
Sep 18 01:20:01 ntop00 sfacctd[323304]: INFO ( m1/mysql ): *** Purging cache - START (PID: 112) ***
Sep 18 01:20:02 ntop00 nfacctd[323381]: INFO ( m1/mysql ): *** Purging cache - START (PID: 112) ***
... 70 more distinct messages not shown
== outbound00.cs.umd.edu (1 distinct, 6 total) ==
Sep 18 01:09:09 outbound00.cs.umd.edu python3[1196314]: ldapdb [x6]
== outbound01.cs.umd.edu (1 distinct, 6 total) ==
Sep 18 01:13:06 outbound01.cs.umd.edu python3[3455706]: ldapdb [x6]
== sentry-docker00.cs.umd.edu (36 distinct, 36 total) ==
Sep 18 01:12:53 sentry-docker00.cs.umd.edu systemd-udevd[2636546]: link_config: could not get ethtool features for veth5eb71dc
Sep 18 01:12:53 sentry-docker00.cs.umd.edu systemd-udevd[2636546]: Could not set offload features of veth5eb71dc: No such device
Sep 18 01:12:53 sentry-docker00.cs.umd.edu systemd-udevd[2636615]: Could not generate persistent MAC address for vethd3dd310: No such file or directory
Sep 18 01:12:53 sentry-docker00.cs.umd.edu systemd-udevd[2636616]: Could not generate persistent MAC address for vethb6476de: No such file or directory
Sep 18 01:12:53 sentry-docker00.cs.umd.edu systemd-udevd[2636619]: Could not generate persistent MAC address for vethf3b2035: No such file or directory
Sep 18 01:12:53 sentry-docker00.cs.umd.edu systemd-udevd[2636620]: Could not generate persistent MAC address for veth3402bf5: No such file or directory
Sep 18 01:12:53 sentry-docker00.cs.umd.edu systemd-udevd[2636643]: Could not generate persistent MAC address for veth4dc4b78: No such file or directory
Sep 18 01:12:53 sentry-docker00.cs.umd.edu systemd-udevd[2636644]: Could not generate persistent MAC address for veth53ef061: No such file or directory
Sep 18 01:12:53 sentry-docker00.cs.umd.edu systemd-udevd[2636662]: Could not generate persistent MAC address for veth659a1ff: No such file or directory
Sep 18 01:12:53 sentry-docker00.cs.umd.edu systemd-udevd[2636650]: Could not generate persistent MAC address for veth179ef4b: No such file or directory
Sep 18 01:12:53 sentry-docker00.cs.umd.edu systemd-udevd[2636654]: Could not generate persistent MAC address for vethba409b5: No such file or directory
Sep 18 01:12:53 sentry-docker00.cs.umd.edu systemd-udevd[2636653]: Could not generate persistent MAC address for vetha59eb86: No such file or directory
Sep 18 01:33:01 sentry-docker00.cs.umd.edu systemd-udevd[2646223]: link_config: could not get ethtool features for vethba409b5
Sep 18 01:33:01 sentry-docker00.cs.umd.edu systemd-udevd[2646223]: Could not set offload features of vethba409b5: No such device
Sep 18 01:33:01 sentry-docker00.cs.umd.edu systemd-udevd[2646257]: Could not generate persistent MAC address for veth271cd39: No such file or directory
Sep 18 01:33:01 sentry-docker00.cs.umd.edu systemd-udevd[2646258]: Could not generate persistent MAC address for veth289a3e7: No such file or directory
Sep 18 01:33:01 sentry-docker00.cs.umd.edu systemd-udevd[2646261]: Could not generate persistent MAC address for vethc6631ac: No such file or directory
Sep 18 01:33:01 sentry-docker00.cs.umd.edu systemd-udevd[2646262]: Could not generate persistent MAC address for veth282b654: No such file or directory
Sep 18 01:33:01 sentry-docker00.cs.umd.edu systemd-udevd[2646278]: Could not generate persistent MAC address for veth76f5e7c: No such file or directory
Sep 18 01:33:01 sentry-docker00.cs.umd.edu systemd-udevd[2646275]: Could not generate persistent MAC address for vethb14e054: No such file or directory
Sep 18 01:33:01 sentry-docker00.cs.umd.edu systemd-udevd[2646266]: Could not generate persistent MAC address for veth541b4c2: No such file or directory
Sep 18 01:33:01 sentry-docker00.cs.umd.edu systemd-udevd[2646279]: Could not generate persistent MAC address for veth0f0413e: No such file or directory
Sep 18 01:33:01 sentry-docker00.cs.umd.edu systemd-udevd[2646266]: Could not generate persistent MAC address for vethc86c321: No such file or directory
Sep 18 01:33:01 sentry-docker00.cs.umd.edu systemd-udevd[2646278]: Could not generate persistent MAC address for vethc62b72f: No such file or directory
Sep 18 01:53:10 sentry-docker00.cs.umd.edu systemd-udevd[2655617]: link_config: could not get ethtool features for vethc62b72f
Sep 18 01:53:10 sentry-docker00.cs.umd.edu systemd-udevd[2655617]: Could not set offload features of vethc62b72f: No such device
Sep 18 01:53:10 sentry-docker00.cs.umd.edu systemd-udevd[2655647]: Could not generate persistent MAC address for vethc159333: No such file or directory
Sep 18 01:53:10 sentry-docker00.cs.umd.edu systemd-udevd[2655648]: Could not generate persistent MAC address for veth75b6d42: No such file or directory
Sep 18 01:53:10 sentry-docker00.cs.umd.edu systemd-udevd[2655651]: Could not generate persistent MAC address for vethf9a5417: No such file or directory
Sep 18 01:53:10 sentry-docker00.cs.umd.edu systemd-udevd[2655652]: Could not generate persistent MAC address for vethd117ca1: No such file or directory
... 6 more distinct messages not shown
== soul (2 distinct, 2 total) ==
Sep 18 01:59:10 soul krb5_child[3206900]: Client 'admin(a)UMD.EDU' not found in Kerberos database
Sep 18 01:59:50 soul sshd-session[3206913]: error: Protocol major versions differ: 2 vs. 1
== strawberry (7 distinct, 38 total) ==
Sep 18 01:07:03 strawberry kernel: I/O error, dev sda, sector 206848 op 0x0:(READ) flags 0x80700 phys_seg 1 prio class 2 [x6]
Sep 18 01:07:03 strawberry kernel: I/O error, dev sda, sector 206848 op 0x0:(READ) flags 0x0 phys_seg 1 prio class 2 [x6]
Sep 18 01:07:03 strawberry kernel: Buffer I/O error on dev sda2, logical block 0, async page read [x6]
Sep 18 01:07:03 strawberry kernel: I/O error, dev sda, sector 2048 op 0x0:(READ) flags 0x80700 phys_seg 1 prio class 2 [x6]
Sep 18 01:07:03 strawberry kernel: I/O error, dev sda, sector 2048 op 0x0:(READ) flags 0x0 phys_seg 1 prio class 2 [x6]
Sep 18 01:07:03 strawberry kernel: Buffer I/O error on dev sda1, logical block 0, async page read [x6]
Sep 18 01:34:42 strawberry smartd[5314]: Device: /dev/sda [SAT], failed to read SMART Attribute Data [x2]
== submit26-b9-f1 (1 distinct, 3 total) ==
Sep 18 01:24:14 submit26-b9-f1 systemd[1]: user(a)1001.service: Main process exited, code=killed, status=9/KILL [x3]
== submit26-b9-f2 (1 distinct, 2 total) ==
Sep 18 01:35:00 submit26-b9-f2 systemd[1]: user(a)1001.service: Main process exited, code=killed, status=9/KILL [x2]
== submit26-b9-f3 (10 distinct, 18 total) ==
Sep 18 01:06:42 submit26-b9-f3 setroubleshoot[1732360]: SELinux is preventing /usr/bin/python3.9 from create access on the directory /(null). For complete SELinux messages run: sealert -l a653b772-cbcd-438b-bae5-23c3dc69b31b
Sep 18 01:06:42 submit26-b9-f3 setroubleshoot[1732360]: SELinux is preventing /usr/bin/python3.9 from add_name access on the directory /(null). For complete SELinux messages run: sealert -l 3e904634-6caa-4202-8c92-f139db798859
Sep 18 01:06:42 submit26-b9-f3 setroubleshoot[1732360]: SELinux is preventing /usr/bin/python3.9 from create access on the file /(null). For complete SELinux messages run: sealert -l 580b20e4-ec2c-433d-905c-5bd417fba033 [x2]
Sep 18 01:06:42 submit26-b9-f3 setroubleshoot[1732360]: SELinux is preventing /usr/bin/python3.9 from open access on the file /tmp/libdnf.juzrma/repodata/repomd.xml. For complete SELinux messages run: sealert -l 27f29d48-5e7c-4db7-b051-8ac055737d6f [x2]
Sep 18 01:06:42 submit26-b9-f3 setroubleshoot[1732360]: SELinux is preventing /usr/bin/python3.9 from setattr access on the file repomd.xml. For complete SELinux messages run: sealert -l bff72452-d40a-430b-9060-dd0a48f5b6ba [x2]
Sep 18 01:06:42 submit26-b9-f3 setroubleshoot[1732360]: SELinux is preventing /usr/bin/python3.9 from read access on the directory libdnf.juzrma. For complete SELinux messages run: sealert -l 9638d396-8ce5-4e6a-ae47-45cd3985e1cd
Sep 18 01:06:42 submit26-b9-f3 setroubleshoot[1732360]: SELinux is preventing /usr/bin/python3.9 from remove_name access on the directory repomd.xml. For complete SELinux messages run: sealert -l 6da64b94-7024-45a9-b8c2-3b9812517407
Sep 18 01:06:42 submit26-b9-f3 setroubleshoot[1732360]: SELinux is preventing /usr/bin/python3.9 from unlink access on the file repomd.xml. For complete SELinux messages run: sealert -l 64cbe179-abf1-4d5a-bade-bb164897ee65
Sep 18 01:06:42 submit26-b9-f3 setroubleshoot[1732360]: SELinux is preventing /usr/bin/python3.9 from rmdir access on the directory repodata. For complete SELinux messages run: sealert -l d2e35b1a-e27c-4f91-9217-2bb1204e1e68
Sep 18 01:19:02 submit26-b9-f3 systemd[1]: user(a)1001.service: Main process exited, code=killed, status=9/KILL [x6]
== submit26-b9-f4 (9 distinct, 9 total) ==
Sep 18 01:24:46 submit26-b9-f4 setroubleshoot[1268554]: SELinux is preventing /usr/bin/python3.9 from create access on the directory /(null). For complete SELinux messages run: sealert -l ee160f23-b161-4f4a-9985-c4edfd3a5beb
Sep 18 01:24:46 submit26-b9-f4 setroubleshoot[1268554]: SELinux is preventing /usr/bin/python3.9 from add_name access on the directory /(null). For complete SELinux messages run: sealert -l 89a83821-4b24-4081-9973-0a79ca6ed5b4
Sep 18 01:24:46 submit26-b9-f4 setroubleshoot[1268554]: SELinux is preventing /usr/bin/python3.9 from create access on the file /(null). For complete SELinux messages run: sealert -l f73955d6-1416-45f9-bab6-ff1f3ea07e9d
Sep 18 01:24:47 submit26-b9-f4 setroubleshoot[1268554]: SELinux is preventing /usr/bin/python3.9 from open access on the file /tmp/libdnf.6i5OfQ/repodata/repomd.xml. For complete SELinux messages run: sealert -l 9f8f24a0-8fb6-454d-a103-31a8f7a6efa0
Sep 18 01:24:47 submit26-b9-f4 setroubleshoot[1268554]: SELinux is preventing /usr/bin/python3.9 from setattr access on the file repomd.xml. For complete SELinux messages run: sealert -l 20293136-86a3-40ba-a651-cff48d36059e
Sep 18 01:24:47 submit26-b9-f4 setroubleshoot[1268554]: SELinux is preventing /usr/bin/python3.9 from read access on the directory libdnf.6i5OfQ. For complete SELinux messages run: sealert -l 25f86b49-4ee7-4f60-ad1c-73a70032560c
Sep 18 01:24:47 submit26-b9-f4 setroubleshoot[1268554]: SELinux is preventing /usr/bin/python3.9 from remove_name access on the directory repomd.xml. For complete SELinux messages run: sealert -l eec250fb-073f-456d-93bc-f98776fd476d
Sep 18 01:24:47 submit26-b9-f4 setroubleshoot[1268554]: SELinux is preventing /usr/bin/python3.9 from unlink access on the file repomd.xml. For complete SELinux messages run: sealert -l c9209e04-a349-43d5-8cb2-3e303e48df74
Sep 18 01:24:47 submit26-b9-f4 setroubleshoot[1268554]: SELinux is preventing /usr/bin/python3.9 from rmdir access on the directory repodata. For complete SELinux messages run: sealert -l 3178d5f5-80e9-404b-92b7-9bef397a8915
== tma-0 (1 distinct, 1 total) ==
Sep 18 01:52:35 tma-0 sshd[10885]: error: PAM: Authentication failure for admin from 88.81.233.35.bc.googleusercontent.com
1
0
Command: /usr/local/sbin/syslog-digest.py
Time : 0.0528s
Status : exited 0
Output :
Syslog digest — 2026-09-18 01:05 EDT
Processed 2,747 lines, filtered 2,201 (80%). 546 unknown (217 distinct) from 28 host(s).
== abuse (3 distinct, 4 total) ==
Sep 18 00:10:13 abuse systemd[1]: New main PID 22697 does not belong to service, and PID file is not owned by root. Refusing. [x2]
Sep 18 00:10:32 abuse systemd[1]: Daemon never wrote its PID file. Failing.
Sep 18 00:10:44 abuse systemd[1]: pmlogger.service: Supervising process 30110 which is not our child. We'll most likely not notice when it exits.
== b0b02.cs.umd.edu (1 distinct, 1 total) ==
Sep 18 00:48:46 b0b02.cs.umd.edu rustdesk[2339723]: cannot open display:
== cheezit.cs.umd.edu (4 distinct, 4 total) ==
Sep 18 00:32:26 cheezit.cs.umd.edu sshd-session[392316]: pam_access(sshd:auth): access denied for user `admin' from `35.189.200.192'
Sep 18 00:32:27 cheezit.cs.umd.edu krb5_child[392322]: Client 'admin(a)UMD.EDU' not found in Kerberos database
Sep 18 00:32:27 cheezit.cs.umd.edu sshd-session[392314]: error: PAM: System error for admin from 35.189.200.192
Sep 18 00:32:51 cheezit.cs.umd.edu sshd-session[392373]: error: Protocol major versions differ: 2 vs. 1
== csfw00a (1 distinct, 120 total) ==
Sep 18 00:03:50 csfw00a kernel: bnxt_en 0000:09:00.0 eth3: NIC Link is Down [x120]
== grades01.cs.umd.edu (3 distinct, 4 total) ==
Sep 18 00:10:13 grades01.cs.umd.edu systemd[1]: New main PID 1003 does not belong to service, and PID file is not owned by root. Refusing. [x2]
Sep 18 00:10:34 grades01.cs.umd.edu systemd[1]: Daemon never wrote its PID file. Failing.
Sep 18 00:10:50 grades01.cs.umd.edu systemd[1]: pmlogger.service: Supervising process 8367 which is not our child. We'll most likely not notice when it exits.
== hazfs.cs.umd.edu (11 distinct, 66 total) ==
Sep 18 00:59:59 hazfs.cs.umd.edu snmpd[1431]: send response: Failure in sendto [x6]
Sep 18 00:59:59 hazfs.cs.umd.edu snmpd[1431]: -- NET-SNMP-EXTEND-MIB::nsExtendStatus."userweb" [x6]
Sep 18 00:59:59 hazfs.cs.umd.edu snmpd[1431]: -- NET-SNMP-EXTEND-MIB::nsExtendStatus."zfslist" [x6]
Sep 18 00:59:59 hazfs.cs.umd.edu snmpd[1431]: -- NET-SNMP-EXTEND-MIB::nsExtendStatus."userhome" [x6]
Sep 18 00:59:59 hazfs.cs.umd.edu snmpd[1431]: -- NET-SNMP-EXTEND-MIB::nsExtendOutput1Line."userweb" [x6]
Sep 18 00:59:59 hazfs.cs.umd.edu snmpd[1431]: -- NET-SNMP-EXTEND-MIB::nsExtendOutput1Line."zfslist" [x6]
Sep 18 00:59:59 hazfs.cs.umd.edu snmpd[1431]: -- NET-SNMP-EXTEND-MIB::nsExtendOutput1Line."userhome" [x6]
Sep 18 00:59:59 hazfs.cs.umd.edu snmpd[1431]: -- NET-SNMP-EXTEND-MIB::nsExtendOutputFull."userweb" [x6]
Sep 18 00:59:59 hazfs.cs.umd.edu snmpd[1431]: -- NET-SNMP-EXTEND-MIB::nsExtendOutputFull."zfslist" [x6]
Sep 18 00:59:59 hazfs.cs.umd.edu snmpd[1431]: -- NET-SNMP-EXTEND-MIB::nsExtendOutputFull."userhome" [x6]
Sep 18 00:59:59 hazfs.cs.umd.edu snmpd[1431]: -- NET-SNMP-EXTEND-MIB::nsExtendOutNumLines."userweb" [x6]
== idm00 (1 distinct, 1 total) ==
Sep 18 00:53:57 idm00 named[4166701]: client @0x7f11a945ef38 10.73.240.42#52254: update '73.10.in-addr.arpa/IN' denied
== idmp0 (1 distinct, 1 total) ==
Sep 18 00:37:57 idmp0 named[1598691]: client @0x7f2d280332b8 10.73.240.43#60763: update '73.10.in-addr.arpa/IN' denied
== itmon02 (1 distinct, 3 total) ==
Sep 18 00:08:42 itmon02 sshd[1750555]: error: beginning MaxStartups throttling [x3]
== jubjub.cs.umd.edu (3 distinct, 4 total) ==
Sep 18 00:10:12 jubjub.cs.umd.edu systemd[1]: New main PID 3004158 does not belong to service, and PID file is not owned by root. Refusing. [x2]
Sep 18 00:10:32 jubjub.cs.umd.edu systemd[1]: Daemon never wrote its PID file. Failing.
Sep 18 00:10:40 jubjub.cs.umd.edu systemd[1]: pmlogger.service: Supervising process 3011244 which is not our child. We'll most likely not notice when it exits.
== krispykreme.cs.umd.edu (7 distinct, 8 total) ==
Sep 18 00:51:01 krispykreme.cs.umd.edu sshd-session[3495783]: pam_access(sshd:auth): access denied for user `admin' from `35.189.200.192'
Sep 18 00:51:01 krispykreme.cs.umd.edu krb5_child[3495785]: Client 'admin(a)UMD.EDU' not found in Kerberos database
Sep 18 00:51:01 krispykreme.cs.umd.edu sshd-session[3495781]: error: PAM: System error for admin from 35.189.200.192
Sep 18 00:51:20 krispykreme.cs.umd.edu sshd-session[3495850]: error: Protocol major versions differ: 2 vs. 1
Sep 18 00:54:30 krispykreme.cs.umd.edu sshd-session[3496123]: pam_access(sshd:auth): access denied for user `larry' from `71.191.93.172' [x2]
Sep 18 00:54:32 krispykreme.cs.umd.edu sshd-session[3496123]: Error in Duo login for 'larry' from 71.191.93.172
Sep 18 00:54:32 krispykreme.cs.umd.edu sshd-session[3496121]: error: PAM: Authentication failure for larry from 71.191.93.172
== mirrors.cs.umd.edu (4 distinct, 6 total) ==
Sep 18 00:10:58 mirrors.cs.umd.edu root[17184]: pmlogger_daily failed - see /var/log/pcp/pmlogger/pmlogger_daily-K.log
Sep 18 00:10:58 mirrors.cs.umd.edu systemd[1]: Daemon never wrote its PID file. Failing. [x2]
Sep 18 00:11:02 mirrors.cs.umd.edu systemd[1]: New main PID 16134 does not belong to service, and PID file is not owned by root. Refusing. [x2]
Sep 18 00:12:03 mirrors.cs.umd.edu systemd[1]: pmlogger.service: Supervising process 32762 which is not our child. We'll most likely not notice when it exits.
== misty.cs.umd.edu (3 distinct, 4 total) ==
Sep 18 00:10:14 misty.cs.umd.edu systemd[1]: New main PID 12751 does not belong to service, and PID file is not owned by root. Refusing. [x2]
Sep 18 00:10:34 misty.cs.umd.edu systemd[1]: Daemon never wrote its PID file. Failing.
Sep 18 00:10:50 misty.cs.umd.edu systemd[1]: pmlogger.service: Supervising process 19962 which is not our child. We'll most likely not notice when it exits.
== munin (2 distinct, 30 total) ==
Sep 18 00:08:44 munin sudo[3671283]: pam_systemd(sudo:session): Failed to stat() runtime directory '/run/user/0': No such file or directory [x15]
Sep 18 00:08:44 munin sudo[3671283]: pam_systemd(sudo:session): Not setting $XDG_RUNTIME_DIR, as the directory is not in order. [x15]
== netman.cs.umd.edu (2 distinct, 5 total) ==
Sep 18 00:54:27 netman.cs.umd.edu krb5_child[1807559]: Client 'admin(a)UMD.EDU' not found in Kerberos database [x4]
Sep 18 00:54:31 netman.cs.umd.edu sshd[1807555]: error: PAM: Authentication failure for admin from 34.76.100.45
== newhonors2 (1 distinct, 24 total) ==
Sep 18 00:13:02 newhonors2 dhcpcd[2790757]: dhcpcd is not running [x24]
== ntop00 (99 distinct, 143 total) ==
Sep 18 00:05:01 ntop00 nfacctd[323381]: INFO ( m1/mysql ): *** Purging cache - START (PID: 82) ***
Sep 18 00:05:09 ntop00 sfacctd[323304]: INFO ( m1/mysql ): *** Purging cache - END (PID: 82, QN: 4859/4859, ET: 8) ***
Sep 18 00:05:09 ntop00 nfacctd[323381]: INFO ( m1/mysql ): *** Purging cache - END (PID: 82, QN: 56/56, ET: 8) ***
Sep 18 00:06:01 ntop00 sfacctd[323304]: INFO ( p1/print ): *** Purging cache - START (PID: 83) ***
Sep 18 00:06:01 ntop00 sfacctd[323304]: INFO ( p1/print ): *** Purging cache - END (PID: 83, QN: 4749/4749, ET: 0) ***
Sep 18 00:06:01 ntop00 nfacctd[323381]: INFO ( p1/print ): *** Purging cache - START (PID: 83) ***
Sep 18 00:06:01 ntop00 nfacctd[323381]: INFO ( p1/print ): *** Purging cache - END (PID: 83, QN: 67/67, ET: 0) ***
Sep 18 00:06:02 ntop00 setroubleshoot[348973]: SELinux is preventing /usr/local/sbin/sfacctd from append access on the file sflow.json. For complete SELinux messages run: sealert -l 58e35a5d-c7c9-4337-868c-bb9d5ac2e29f [x12]
Sep 18 00:06:02 ntop00 setroubleshoot[348973]: SELinux is preventing /usr/local/sbin/sfacctd from write access on the file sflow.json. For complete SELinux messages run: sealert -l 369b1df3-2c9d-461b-8b1c-2fcd48dc737c [x12]
Sep 18 00:06:02 ntop00 setroubleshoot[348973]: failed to retrieve rpm info for path '/srv/pmacct/sflow.json': [x12]
Sep 18 00:06:02 ntop00 setroubleshoot[348973]: SELinux is preventing /usr/local/sbin/sfacctd from lock access on the file /srv/pmacct/sflow.json. For complete SELinux messages run: sealert -l 481e7e24-3846-4790-b17b-9e44a5f5b5d6 [x12]
Sep 18 00:10:01 ntop00 sfacctd[323304]: INFO ( m1/mysql ): *** Purging cache - START (PID: 84) ***
Sep 18 00:10:01 ntop00 nfacctd[323381]: INFO ( m1/mysql ): *** Purging cache - START (PID: 84) ***
Sep 18 00:10:09 ntop00 sfacctd[323304]: INFO ( m1/mysql ): *** Purging cache - END (PID: 84, QN: 4584/4584, ET: 8) ***
Sep 18 00:10:09 ntop00 nfacctd[323381]: INFO ( m1/mysql ): *** Purging cache - END (PID: 84, QN: 65/65, ET: 8) ***
Sep 18 00:11:01 ntop00 sfacctd[323304]: INFO ( p1/print ): *** Purging cache - START (PID: 85) ***
Sep 18 00:11:01 ntop00 sfacctd[323304]: INFO ( p1/print ): *** Purging cache - END (PID: 85, QN: 4461/4461, ET: 0) ***
Sep 18 00:11:01 ntop00 nfacctd[323381]: INFO ( p1/print ): *** Purging cache - START (PID: 85) ***
Sep 18 00:11:01 ntop00 nfacctd[323381]: INFO ( p1/print ): *** Purging cache - END (PID: 85, QN: 64/64, ET: 0) ***
Sep 18 00:15:01 ntop00 sfacctd[323304]: INFO ( m1/mysql ): *** Purging cache - START (PID: 86) ***
Sep 18 00:15:01 ntop00 nfacctd[323381]: INFO ( m1/mysql ): *** Purging cache - START (PID: 86) ***
Sep 18 00:15:09 ntop00 sfacctd[323304]: INFO ( m1/mysql ): *** Purging cache - END (PID: 86, QN: 4813/4813, ET: 8) ***
Sep 18 00:15:09 ntop00 nfacctd[323381]: INFO ( m1/mysql ): *** Purging cache - END (PID: 86, QN: 84/84, ET: 8) ***
Sep 18 00:16:01 ntop00 sfacctd[323304]: INFO ( p1/print ): *** Purging cache - START (PID: 87) ***
Sep 18 00:16:01 ntop00 sfacctd[323304]: INFO ( p1/print ): *** Purging cache - END (PID: 87, QN: 4892/4892, ET: 0) ***
Sep 18 00:16:01 ntop00 nfacctd[323381]: INFO ( p1/print ): *** Purging cache - START (PID: 87) ***
Sep 18 00:16:01 ntop00 nfacctd[323381]: INFO ( p1/print ): *** Purging cache - END (PID: 87, QN: 89/89, ET: 0) ***
Sep 18 00:20:01 ntop00 sfacctd[323304]: INFO ( m1/mysql ): *** Purging cache - START (PID: 88) ***
Sep 18 00:20:01 ntop00 nfacctd[323381]: INFO ( m1/mysql ): *** Purging cache - START (PID: 88) ***
Sep 18 00:20:08 ntop00 sfacctd[323304]: INFO ( m1/mysql ): *** Purging cache - END (PID: 88, QN: 4583/4583, ET: 7) ***
... 69 more distinct messages not shown
== openrepo (1 distinct, 1 total) ==
Sep 18 00:56:53 openrepo (nin-node)[2841904]: munin-node.service: Referenced but unset environment variable evaluates to an empty string: DAEMON_ARGS
== outbound00.cs.umd.edu (1 distinct, 6 total) ==
Sep 18 00:09:09 outbound00.cs.umd.edu python3[1181765]: ldapdb [x6]
== outbound01.cs.umd.edu (2 distinct, 7 total) ==
Sep 18 00:13:06 outbound01.cs.umd.edu python3[3441768]: ldapdb [x6]
Sep 18 00:21:06 outbound01.cs.umd.edu krb5_child[3443393]: Client 'admin(a)UMD.EDU' not found in Kerberos database
== sentry-docker00.cs.umd.edu (34 distinct, 34 total) ==
Sep 18 00:12:28 sentry-docker00.cs.umd.edu systemd-udevd[2608291]: Could not generate persistent MAC address for veth42c9508: No such file or directory
Sep 18 00:12:28 sentry-docker00.cs.umd.edu systemd-udevd[2608292]: Could not generate persistent MAC address for vethc1bef8c: No such file or directory
Sep 18 00:12:28 sentry-docker00.cs.umd.edu systemd-udevd[2608296]: Could not generate persistent MAC address for veth8cfb878: No such file or directory
Sep 18 00:12:28 sentry-docker00.cs.umd.edu systemd-udevd[2608316]: Could not generate persistent MAC address for veth84e6cd1: No such file or directory
Sep 18 00:12:28 sentry-docker00.cs.umd.edu systemd-udevd[2608309]: Could not generate persistent MAC address for veth374b3d1: No such file or directory
Sep 18 00:12:28 sentry-docker00.cs.umd.edu systemd-udevd[2608313]: Could not generate persistent MAC address for vethf1f8653: No such file or directory
Sep 18 00:12:28 sentry-docker00.cs.umd.edu systemd-udevd[2608327]: Could not generate persistent MAC address for vethabbcb40: No such file or directory
Sep 18 00:12:28 sentry-docker00.cs.umd.edu systemd-udevd[2608328]: Could not generate persistent MAC address for veth5a24647: No such file or directory
Sep 18 00:12:28 sentry-docker00.cs.umd.edu systemd-udevd[2608360]: Could not generate persistent MAC address for veth86c2011: No such file or directory
Sep 18 00:12:28 sentry-docker00.cs.umd.edu systemd-udevd[2608345]: Could not generate persistent MAC address for vetha38840e: No such file or directory
Sep 18 00:32:36 sentry-docker00.cs.umd.edu systemd-udevd[2617702]: link_config: could not get ethtool features for veth42c9508
Sep 18 00:32:36 sentry-docker00.cs.umd.edu systemd-udevd[2617702]: Could not set offload features of veth42c9508: No such device
Sep 18 00:32:36 sentry-docker00.cs.umd.edu systemd-udevd[2617733]: Could not generate persistent MAC address for vethf3a562d: No such file or directory
Sep 18 00:32:36 sentry-docker00.cs.umd.edu systemd-udevd[2617734]: Could not generate persistent MAC address for veth58ca601: No such file or directory
Sep 18 00:32:36 sentry-docker00.cs.umd.edu systemd-udevd[2617737]: Could not generate persistent MAC address for veth561ef17: No such file or directory
Sep 18 00:32:36 sentry-docker00.cs.umd.edu systemd-udevd[2617746]: Could not generate persistent MAC address for veth0851311: No such file or directory
Sep 18 00:32:36 sentry-docker00.cs.umd.edu systemd-udevd[2617738]: Could not generate persistent MAC address for veth1836636: No such file or directory
Sep 18 00:32:36 sentry-docker00.cs.umd.edu systemd-udevd[2617734]: Could not generate persistent MAC address for veth3e08210: No such file or directory
Sep 18 00:32:36 sentry-docker00.cs.umd.edu systemd-udevd[2617763]: Could not generate persistent MAC address for veth7804572: No such file or directory
Sep 18 00:32:36 sentry-docker00.cs.umd.edu systemd-udevd[2617764]: Could not generate persistent MAC address for vethc1c3d2c: No such file or directory
Sep 18 00:32:36 sentry-docker00.cs.umd.edu systemd-udevd[2617796]: Could not generate persistent MAC address for veth3715986: No such file or directory
Sep 18 00:32:36 sentry-docker00.cs.umd.edu systemd-udevd[2617798]: Could not generate persistent MAC address for veth3b5cba4: No such file or directory
Sep 18 00:52:45 sentry-docker00.cs.umd.edu systemd-udevd[2627182]: link_config: could not get ethtool features for veth7804572
Sep 18 00:52:45 sentry-docker00.cs.umd.edu systemd-udevd[2627182]: Could not set offload features of veth7804572: No such device
Sep 18 00:52:45 sentry-docker00.cs.umd.edu systemd-udevd[2627211]: Could not generate persistent MAC address for veth711d753: No such file or directory
Sep 18 00:52:45 sentry-docker00.cs.umd.edu systemd-udevd[2627212]: Could not generate persistent MAC address for veth8e1d309: No such file or directory
Sep 18 00:52:45 sentry-docker00.cs.umd.edu systemd-udevd[2627215]: Could not generate persistent MAC address for vethf218f75: No such file or directory
Sep 18 00:52:45 sentry-docker00.cs.umd.edu systemd-udevd[2627229]: Could not generate persistent MAC address for veth1660b01: No such file or directory
Sep 18 00:52:45 sentry-docker00.cs.umd.edu systemd-udevd[2627225]: Could not generate persistent MAC address for vethfb34b7f: No such file or directory
Sep 18 00:52:45 sentry-docker00.cs.umd.edu systemd-udevd[2627222]: Could not generate persistent MAC address for vethe201537: No such file or directory
... 4 more distinct messages not shown
== strawberry (8 distinct, 39 total) ==
Sep 18 00:07:04 strawberry kernel: I/O error, dev sda, sector 206848 op 0x0:(READ) flags 0x80700 phys_seg 1 prio class 2 [x6]
Sep 18 00:07:04 strawberry kernel: I/O error, dev sda, sector 206848 op 0x0:(READ) flags 0x0 phys_seg 1 prio class 2 [x6]
Sep 18 00:07:04 strawberry kernel: Buffer I/O error on dev sda2, logical block 0, async page read [x6]
Sep 18 00:07:04 strawberry kernel: I/O error, dev sda, sector 2048 op 0x0:(READ) flags 0x80700 phys_seg 1 prio class 2 [x6]
Sep 18 00:07:04 strawberry kernel: I/O error, dev sda, sector 2048 op 0x0:(READ) flags 0x0 phys_seg 1 prio class 2 [x6]
Sep 18 00:07:04 strawberry kernel: Buffer I/O error on dev sda1, logical block 0, async page read [x6]
Sep 18 00:34:42 strawberry smartd[5314]: Device: /dev/sda [SAT], failed to read SMART Attribute Data [x2]
Sep 18 01:04:42 strawberry smartd[5314]: Device: /dev/sda [SAT], not capable of Offline or Self-Testing.
== submit10-cln25 (3 distinct, 4 total) ==
Sep 18 00:10:11 submit10-cln25 systemd: New main PID 29786 does not belong to service, and PID file is not owned by root. Refusing. [x2]
Sep 18 00:10:30 submit10-cln25 systemd: Daemon never wrote its PID file. Failing.
Sep 18 00:10:36 submit10-cln25 systemd: pmlogger.service: Supervising process 4322 which is not our child. We'll most likely not notice when it exits.
== submit26-b9-fclone (9 distinct, 11 total) ==
Sep 18 00:21:57 submit26-b9-fclone setroubleshoot[32232]: SELinux is preventing /usr/bin/python3.9 from create access on the directory /(null). For complete SELinux messages run: sealert -l 9355d9d9-a311-48d2-bd37-6c0f6947dfff [x2]
Sep 18 00:21:57 submit26-b9-fclone setroubleshoot[32232]: SELinux is preventing /usr/bin/python3.9 from add_name access on the directory /(null). For complete SELinux messages run: sealert -l cc4658d7-9db1-405d-9eee-de0ccee5857f [x2]
Sep 18 00:21:57 submit26-b9-fclone setroubleshoot[32232]: SELinux is preventing /usr/bin/python3.9 from create access on the file /(null). For complete SELinux messages run: sealert -l 568a2429-0b1b-49df-af41-49b5cd298ae8
Sep 18 00:21:57 submit26-b9-fclone setroubleshoot[32232]: SELinux is preventing /usr/bin/python3.9 from open access on the file /tmp/libdnf.ogPYhB/repodata/repomd.xml. For complete SELinux messages run: sealert -l 03e2f521-0e7c-481f-8e92-0602c6adeedc
Sep 18 00:21:57 submit26-b9-fclone setroubleshoot[32232]: SELinux is preventing /usr/bin/python3.9 from setattr access on the file repomd.xml. For complete SELinux messages run: sealert -l 0d6b7b1f-ebe3-4beb-915a-b06b63bf2566
Sep 18 00:21:57 submit26-b9-fclone setroubleshoot[32232]: SELinux is preventing /usr/bin/python3.9 from read access on the directory libdnf.ogPYhB. For complete SELinux messages run: sealert -l 887adbf9-2bb9-4009-b800-36ddf9ba0db5
Sep 18 00:21:57 submit26-b9-fclone setroubleshoot[32232]: SELinux is preventing /usr/bin/python3.9 from remove_name access on the directory repomd.xml. For complete SELinux messages run: sealert -l 092e0644-8373-4017-b77f-1afa6c6da4ac
Sep 18 00:21:57 submit26-b9-fclone setroubleshoot[32232]: SELinux is preventing /usr/bin/python3.9 from unlink access on the file repomd.xml. For complete SELinux messages run: sealert -l ce429a92-56de-4de1-b859-cbfb69ae123c
Sep 18 00:21:57 submit26-b9-fclone setroubleshoot[32232]: SELinux is preventing /usr/bin/python3.9 from rmdir access on the directory repodata. For complete SELinux messages run: sealert -l 99b886eb-497b-406d-8206-afe76a1086b4
== tma-0 (3 distinct, 4 total) ==
Sep 18 00:10:13 tma-0 systemd[1]: New main PID 14600 does not belong to service, and PID file is not owned by root. Refusing. [x2]
Sep 18 00:10:31 tma-0 systemd[1]: Daemon never wrote its PID file. Failing.
Sep 18 00:10:39 tma-0 systemd[1]: pmlogger.service: Supervising process 21551 which is not our child. We'll most likely not notice when it exits.
== uffish.cs.umd.edu (3 distinct, 4 total) ==
Sep 18 00:10:12 uffish.cs.umd.edu systemd[1]: New main PID 1462912 does not belong to service, and PID file is not owned by root. Refusing. [x2]
Sep 18 00:10:32 uffish.cs.umd.edu systemd[1]: Daemon never wrote its PID file. Failing.
Sep 18 00:10:49 uffish.cs.umd.edu systemd[1]: pmlogger.service: Supervising process 1470057 which is not our child. We'll most likely not notice when it exits.
== vacuum.cs.umd.edu (3 distinct, 4 total) ==
Sep 18 00:10:14 vacuum.cs.umd.edu systemd[1]: New main PID 24682 does not belong to service, and PID file is not owned by root. Refusing. [x2]
Sep 18 00:10:34 vacuum.cs.umd.edu systemd[1]: Daemon never wrote its PID file. Failing.
Sep 18 00:10:45 vacuum.cs.umd.edu systemd[1]: pmlogger.service: Supervising process 31842 which is not our child. We'll most likely not notice when it exits.
== whiffle.cs.umd.edu (3 distinct, 4 total) ==
Sep 18 00:10:13 whiffle.cs.umd.edu systemd[1]: New main PID 1031225 does not belong to service, and PID file is not owned by root. Refusing. [x2]
Sep 18 00:10:33 whiffle.cs.umd.edu systemd[1]: Daemon never wrote its PID file. Failing.
Sep 18 00:10:46 whiffle.cs.umd.edu systemd[1]: pmlogger.service: Supervising process 1038341 which is not our child. We'll most likely not notice when it exits.
1
0