Command: /usr/local/sbin/syslog-digest.py
Time : 0.0441s
Status : exited 0
Output :
Syslog digest — 2026-09-17 00:05 EDT
Processed 2,034 lines, filtered 1,671 (82%). 363 unknown (133 distinct) from 28 host(s).
== abadi-computer (1 distinct, 1 total) ==
Sep 17 00:00:00 abadi-computer systemctl[783481]: Warning: The unit file, source configuration file or drop-ins of cups.service changed on disk. Run 'systemctl daemon-reload' to reload units.
== b0b02.cs.umd.edu (1 distinct, 1 total) ==
Sep 16 23:47:06 b0b02.cs.umd.edu rustdesk[1956234]: cannot open display:
== biggulp.cs.umd.edu (5 distinct, 5 total) ==
Sep 16 23:19:38 biggulp.cs.umd.edu sshd-session[1896834]: pam_access(sshd:auth): access denied for user `root' from `158.173.89.129'
Sep 16 23:19:40 biggulp.cs.umd.edu sshd-session[1896832]: error: PAM: Authentication failure for root from 158.173.89.129
Sep 16 23:45:11 biggulp.cs.umd.edu sshd-session[1901370]: pam_access(sshd:auth): access denied for user `admin' from `158.173.89.41'
Sep 16 23:45:12 biggulp.cs.umd.edu krb5_child[1901372]: Client 'admin(a)UMD.EDU' not found in Kerberos database
Sep 16 23:45:12 biggulp.cs.umd.edu sshd-session[1901368]: error: PAM: System error for admin from 158.173.89.41
== csfw00a (1 distinct, 127 total) ==
Sep 16 23:03:52 csfw00a kernel: bnxt_en 0000:09:00.0 eth3: NIC Link is Down [x127]
== gle-omnibus00.cs.umd.edu (2 distinct, 2 total) ==
Sep 17 00:04:41 gle-omnibus00.cs.umd.edu falcon-sensor-bpf[935]: CrowdStrike(4): Could not retrieve DisableProxy value: c0000225
Sep 17 00:04:41 gle-omnibus00.cs.umd.edu falcon-sensor-bpf[935]: CrowdStrike(4): ConnectWithProxy: Unable to get application proxy host from CsConfig: c0000225
== idm00 (1 distinct, 1 total) ==
Sep 16 23:53:56 idm00 named[4166701]: client @0x7f11a406bb48 10.73.240.42#58740: update '73.10.in-addr.arpa/IN' denied
== idmp0 (1 distinct, 1 total) ==
Sep 16 23:37:37 idmp0 named[1598691]: client @0x7f2d3400d5c8 10.73.240.43#61182: update '73.10.in-addr.arpa/IN' denied
== inbound01.cs.umd.edu (1 distinct, 1 total) ==
Sep 16 23:45:50 inbound01.cs.umd.edu krb5_child[3179293]: Client 'admin(a)UMD.EDU' not found in Kerberos database
== itmon02 (1 distinct, 10 total) ==
Sep 16 23:08:25 itmon02 sshd[1750555]: error: beginning MaxStartups throttling [x10]
== jaws.cs.umd.edu (2 distinct, 2 total) ==
Sep 17 00:04:05 jaws.cs.umd.edu falcon-sensor-bpf[1192]: CrowdStrike(4): Could not retrieve DisableProxy value: c0000225
Sep 17 00:04:05 jaws.cs.umd.edu falcon-sensor-bpf[1192]: CrowdStrike(4): ConnectWithProxy: Unable to get application proxy host from CsConfig: c0000225
== krispykreme.cs.umd.edu (3 distinct, 3 total) ==
Sep 16 23:42:20 krispykreme.cs.umd.edu sshd-session[3080895]: pam_access(sshd:auth): access denied for user `admin' from `34.156.211.39'
Sep 16 23:42:20 krispykreme.cs.umd.edu krb5_child[3080897]: Client 'admin(a)UMD.EDU' not found in Kerberos database
Sep 16 23:42:20 krispykreme.cs.umd.edu sshd-session[3080893]: error: PAM: System error for admin from 34.156.211.39
== matrix (1 distinct, 1 total) ==
Sep 17 00:00:19 matrix (nin-node)[259571]: munin-node.service: Referenced but unset environment variable evaluates to an empty string: DAEMON_ARGS
== munin (2 distinct, 28 total) ==
Sep 16 23:13:48 munin sudo[3128761]: pam_systemd(sudo:session): Failed to stat() runtime directory '/run/user/0': No such file or directory [x14]
Sep 16 23:13:48 munin sudo[3128763]: pam_systemd(sudo:session): Not setting $XDG_RUNTIME_DIR, as the directory is not in order. [x14]
== neo-gizmonic (1 distinct, 1 total) ==
Sep 17 00:00:01 neo-gizmonic (nin-node)[1432726]: munin-node.service: Referenced but unset environment variable evaluates to an empty string: DAEMON_ARGS
== neoavion (1 distinct, 1 total) ==
Sep 17 00:00:02 neoavion (nin-node)[3118121]: munin-node.service: Referenced but unset environment variable evaluates to an empty string: DAEMON_ARGS
== netman.cs.umd.edu (3 distinct, 6 total) ==
Sep 16 23:45:24 netman.cs.umd.edu krb5_child[1391421]: Client 'admin(a)UMD.EDU' not found in Kerberos database [x4]
Sep 16 23:45:31 netman.cs.umd.edu sshd[1391418]: error: PAM: Authentication failure for admin from 35.195.217.162
Sep 16 23:47:18 netman.cs.umd.edu sshd[1392633]: error: Protocol major versions differ: 2 vs. 1
== newhonors2 (2 distinct, 25 total) ==
Sep 16 23:13:02 newhonors2 dhcpcd[2742494]: dhcpcd is not running [x24]
Sep 17 00:00:16 newhonors2 (nin-node)[2744076]: munin-node.service: Referenced but unset environment variable evaluates to an empty string: DAEMON_ARGS
== ntop00 (48 distinct, 48 total) ==
Sep 16 23:07:01 ntop00 nfacctd[9667]: INFO ( default_print/print ): *** Purging cache - START (PID: 127) ***
Sep 16 23:07:01 ntop00 nfacctd[9667]: INFO ( default_print/print ): *** Purging cache - END (PID: 127, QN: 0/0, ET: X) ***
Sep 16 23:10:01 ntop00 sfacctd[48024]: INFO ( default_print/print ): *** Purging cache - START (PID: 103) ***
Sep 16 23:10:01 ntop00 sfacctd[48024]: INFO ( default_print/print ): *** Purging cache - END (PID: 103, QN: 1990/1990, ET: 0) ***
Sep 16 23:12:01 ntop00 nfacctd[9667]: INFO ( default_print/print ): *** Purging cache - START (PID: 128) ***
Sep 16 23:12:01 ntop00 nfacctd[9667]: INFO ( default_print/print ): *** Purging cache - END (PID: 128, QN: 0/0, ET: X) ***
Sep 16 23:15:01 ntop00 sfacctd[48024]: INFO ( default_print/print ): *** Purging cache - START (PID: 104) ***
Sep 16 23:15:01 ntop00 sfacctd[48024]: INFO ( default_print/print ): *** Purging cache - END (PID: 104, QN: 2018/2018, ET: 0) ***
Sep 16 23:17:01 ntop00 nfacctd[9667]: INFO ( default_print/print ): *** Purging cache - START (PID: 129) ***
Sep 16 23:17:01 ntop00 nfacctd[9667]: INFO ( default_print/print ): *** Purging cache - END (PID: 129, QN: 0/0, ET: X) ***
Sep 16 23:20:01 ntop00 sfacctd[48024]: INFO ( default_print/print ): *** Purging cache - START (PID: 105) ***
Sep 16 23:20:01 ntop00 sfacctd[48024]: INFO ( default_print/print ): *** Purging cache - END (PID: 105, QN: 1836/1836, ET: 0) ***
Sep 16 23:22:01 ntop00 nfacctd[9667]: INFO ( default_print/print ): *** Purging cache - START (PID: 130) ***
Sep 16 23:22:01 ntop00 nfacctd[9667]: INFO ( default_print/print ): *** Purging cache - END (PID: 130, QN: 0/0, ET: X) ***
Sep 16 23:25:01 ntop00 sfacctd[48024]: INFO ( default_print/print ): *** Purging cache - START (PID: 106) ***
Sep 16 23:25:01 ntop00 sfacctd[48024]: INFO ( default_print/print ): *** Purging cache - END (PID: 106, QN: 1858/1858, ET: 0) ***
Sep 16 23:27:01 ntop00 nfacctd[9667]: INFO ( default_print/print ): *** Purging cache - START (PID: 131) ***
Sep 16 23:27:01 ntop00 nfacctd[9667]: INFO ( default_print/print ): *** Purging cache - END (PID: 131, QN: 0/0, ET: X) ***
Sep 16 23:30:01 ntop00 sfacctd[48024]: INFO ( default_print/print ): *** Purging cache - START (PID: 107) ***
Sep 16 23:30:01 ntop00 sfacctd[48024]: INFO ( default_print/print ): *** Purging cache - END (PID: 107, QN: 1725/1725, ET: 0) ***
Sep 16 23:32:02 ntop00 nfacctd[9667]: INFO ( default_print/print ): *** Purging cache - START (PID: 132) ***
Sep 16 23:32:02 ntop00 nfacctd[9667]: INFO ( default_print/print ): *** Purging cache - END (PID: 132, QN: 0/0, ET: X) ***
Sep 16 23:35:01 ntop00 sfacctd[48024]: INFO ( default_print/print ): *** Purging cache - START (PID: 108) ***
Sep 16 23:35:01 ntop00 sfacctd[48024]: INFO ( default_print/print ): *** Purging cache - END (PID: 108, QN: 1687/1687, ET: 0) ***
Sep 16 23:37:01 ntop00 nfacctd[9667]: INFO ( default_print/print ): *** Purging cache - START (PID: 133) ***
Sep 16 23:37:01 ntop00 nfacctd[9667]: INFO ( default_print/print ): *** Purging cache - END (PID: 133, QN: 0/0, ET: X) ***
Sep 16 23:40:01 ntop00 sfacctd[48024]: INFO ( default_print/print ): *** Purging cache - START (PID: 109) ***
Sep 16 23:40:01 ntop00 sfacctd[48024]: INFO ( default_print/print ): *** Purging cache - END (PID: 109, QN: 1764/1764, ET: 0) ***
Sep 16 23:42:01 ntop00 nfacctd[9667]: INFO ( default_print/print ): *** Purging cache - START (PID: 134) ***
Sep 16 23:42:01 ntop00 nfacctd[9667]: INFO ( default_print/print ): *** Purging cache - END (PID: 134, QN: 0/0, ET: X) ***
... 18 more distinct messages not shown
== orchids (4 distinct, 4 total) ==
Sep 16 23:44:27 orchids clearpass-onguard-auto.desktop[1 Failed to parse xml data
Sep 16 23:44:27 orchids clearpass-onguard-auto.desktop[1 Error 44 fault: SOAP-ENV:Client[no subcode]
Sep 16 23:44:27 orchids clearpass-onguard-auto.desktop[1 "Validation constraint violation: occurrence violation in element 'PostureReevalResponse'"
Sep 16 23:44:27 orchids clearpass-onguard-auto.desktop[1 Detail: [no detail]
== outbound00.cs.umd.edu (1 distinct, 6 total) ==
Sep 16 23:09:08 outbound00.cs.umd.edu python3[827566]: ldapdb [x6]
== outbound01.cs.umd.edu (1 distinct, 6 total) ==
Sep 16 23:13:06 outbound01.cs.umd.edu python3[3087683]: ldapdb [x6]
== sentry-docker00.cs.umd.edu (36 distinct, 36 total) ==
Sep 16 23:22:12 sentry-docker00.cs.umd.edu systemd-udevd[1904912]: link_config: could not set ethtool features for vethd01327c
Sep 16 23:22:12 sentry-docker00.cs.umd.edu systemd-udevd[1904912]: Could not set offload features of vethd01327c: Operation not permitted
Sep 16 23:22:12 sentry-docker00.cs.umd.edu systemd-udevd[1904945]: Could not generate persistent MAC address for veth485cce2: No such file or directory
Sep 16 23:22:12 sentry-docker00.cs.umd.edu systemd-udevd[1904946]: Could not generate persistent MAC address for vethf7133cd: No such file or directory
Sep 16 23:22:12 sentry-docker00.cs.umd.edu systemd-udevd[1904949]: Could not generate persistent MAC address for veth49cff6e: No such file or directory
Sep 16 23:22:12 sentry-docker00.cs.umd.edu systemd-udevd[1904950]: Could not generate persistent MAC address for veth5b1a229: No such file or directory
Sep 16 23:22:13 sentry-docker00.cs.umd.edu systemd-udevd[1904973]: Could not generate persistent MAC address for veth1f9f171: No such file or directory
Sep 16 23:22:13 sentry-docker00.cs.umd.edu systemd-udevd[1904974]: Could not generate persistent MAC address for veth3624c5f: No such file or directory
Sep 16 23:22:13 sentry-docker00.cs.umd.edu systemd-udevd[1904986]: Could not generate persistent MAC address for veth84692c3: No such file or directory
Sep 16 23:22:13 sentry-docker00.cs.umd.edu systemd-udevd[1904987]: Could not generate persistent MAC address for vethffee196: No such file or directory
Sep 16 23:22:13 sentry-docker00.cs.umd.edu systemd-udevd[1904987]: Could not generate persistent MAC address for veth56e2ca9: No such file or directory
Sep 16 23:22:13 sentry-docker00.cs.umd.edu systemd-udevd[1904974]: Could not generate persistent MAC address for veth679c236: No such file or directory
Sep 16 23:42:20 sentry-docker00.cs.umd.edu systemd-udevd[1914226]: link_config: could not get ethtool features for veth1f9f171
Sep 16 23:42:20 sentry-docker00.cs.umd.edu systemd-udevd[1914226]: Could not set offload features of veth1f9f171: No such device
Sep 16 23:42:21 sentry-docker00.cs.umd.edu systemd-udevd[1914315]: Could not generate persistent MAC address for veth84796c4: No such file or directory
Sep 16 23:42:21 sentry-docker00.cs.umd.edu systemd-udevd[1914316]: Could not generate persistent MAC address for veth9c6caf6: No such file or directory
Sep 16 23:42:21 sentry-docker00.cs.umd.edu systemd-udevd[1914316]: Could not generate persistent MAC address for vethd4350cc: No such file or directory
Sep 16 23:42:21 sentry-docker00.cs.umd.edu systemd-udevd[1914332]: Could not generate persistent MAC address for veth0209d60: No such file or directory
Sep 16 23:42:21 sentry-docker00.cs.umd.edu systemd-udevd[1914343]: Could not generate persistent MAC address for vethca5fc03: No such file or directory
Sep 16 23:42:21 sentry-docker00.cs.umd.edu systemd-udevd[1914344]: Could not generate persistent MAC address for vethcbb2d28: No such file or directory
Sep 16 23:42:21 sentry-docker00.cs.umd.edu systemd-udevd[1914369]: Could not generate persistent MAC address for vetheb0cc17: No such file or directory
Sep 16 23:42:21 sentry-docker00.cs.umd.edu systemd-udevd[1914370]: Could not generate persistent MAC address for veth7e6f32d: No such file or directory
Sep 16 23:42:21 sentry-docker00.cs.umd.edu systemd-udevd[1914396]: Could not generate persistent MAC address for veth967da08: No such file or directory
Sep 16 23:42:21 sentry-docker00.cs.umd.edu systemd-udevd[1914399]: Could not generate persistent MAC address for veth33afd33: No such file or directory
Sep 17 00:02:29 sentry-docker00.cs.umd.edu systemd-udevd[1923834]: link_config: could not get ethtool features for veth967da08
Sep 17 00:02:29 sentry-docker00.cs.umd.edu systemd-udevd[1923834]: Could not set offload features of veth967da08: No such device
Sep 17 00:02:29 sentry-docker00.cs.umd.edu systemd-udevd[1923866]: Could not generate persistent MAC address for vethaf5179a: No such file or directory
Sep 17 00:02:29 sentry-docker00.cs.umd.edu systemd-udevd[1923867]: Could not generate persistent MAC address for veth98839f8: No such file or directory
Sep 17 00:02:29 sentry-docker00.cs.umd.edu systemd-udevd[1923870]: Could not generate persistent MAC address for vethb2fe5d3: No such file or directory
Sep 17 00:02:29 sentry-docker00.cs.umd.edu systemd-udevd[1923871]: Could not generate persistent MAC address for veth4e4a45c: No such file or directory
... 6 more distinct messages not shown
== strawberry (7 distinct, 38 total) ==
Sep 16 23:07:03 strawberry kernel: I/O error, dev sda, sector 206848 op 0x0:(READ) flags 0x80700 phys_seg 1 prio class 2 [x6]
Sep 16 23:07:03 strawberry kernel: I/O error, dev sda, sector 206848 op 0x0:(READ) flags 0x0 phys_seg 1 prio class 2 [x6]
Sep 16 23:07:03 strawberry kernel: Buffer I/O error on dev sda2, logical block 0, async page read [x6]
Sep 16 23:07:03 strawberry kernel: I/O error, dev sda, sector 2048 op 0x0:(READ) flags 0x80700 phys_seg 1 prio class 2 [x6]
Sep 16 23:07:03 strawberry kernel: I/O error, dev sda, sector 2048 op 0x0:(READ) flags 0x0 phys_seg 1 prio class 2 [x6]
Sep 16 23:07:03 strawberry kernel: Buffer I/O error on dev sda1, logical block 0, async page read [x6]
Sep 16 23:34:42 strawberry smartd[5314]: Device: /dev/sda [SAT], failed to read SMART Attribute Data [x2]
== submit26-b9-f1 (1 distinct, 2 total) ==
Sep 16 23:23:58 submit26-b9-f1 systemd[1]: user(a)1001.service: Main process exited, code=killed, status=9/KILL [x2]
== submit26-b9-f2 (1 distinct, 2 total) ==
Sep 16 23:23:06 submit26-b9-f2 systemd[1]: user(a)1001.service: Main process exited, code=killed, status=9/KILL [x2]
== tumtum.cs.umd.edu (2 distinct, 2 total) ==
Sep 17 00:04:49 tumtum.cs.umd.edu falcon-sensor-bpf[1360]: CrowdStrike(4): Could not retrieve DisableProxy value: c0000225
Sep 17 00:04:49 tumtum.cs.umd.edu falcon-sensor-bpf[1360]: CrowdStrike(4): ConnectWithProxy: Unable to get application proxy host from CsConfig: c0000225
== wraith (2 distinct, 2 total) ==
Sep 17 00:00:00 wraith kernel: kauditd_printk_skb: 29 callbacks suppressed
Sep 17 00:00:00 wraith (nin-node)[567463]: munin-node.service: Referenced but unset environment variable evaluates to an empty string: DAEMON_ARGS
== zwicker-computer (1 distinct, 1 total) ==
Sep 17 00:00:01 zwicker-computer kernel: kauditd_printk_skb: 4 callbacks suppressed
1
0
Command: /usr/local/sbin/syslog-digest.py
Time : 0.0445s
Status : exited 0
Output :
Syslog digest — 2026-09-16 23:05 EDT
Processed 1,966 lines, filtered 1,605 (81%). 361 unknown (161 distinct) from 27 host(s).
== abadi-computer (5 distinct, 5 total) ==
Sep 16 22:18:32 abadi-computer systemd-tmpfiles[740875]: Opening file "/tmp/code-1f46f990-58b5-46ac-b4a2-7ed5bdd65989" failed, ignoring: No such device or address
Sep 16 22:18:32 abadi-computer systemd-tmpfiles[740875]: Opening file "/tmp/code-301e4f99-70a0-4f59-91e9-7265fc9852c7" failed, ignoring: No such device or address
Sep 16 22:18:32 abadi-computer systemd-tmpfiles[740875]: Opening file "/tmp/code-c343a21f-c0af-4a87-a762-b3756a39ddfa" failed, ignoring: No such device or address
Sep 16 22:40:18 abadi-computer falcon-sensor-bpf[529]: CrowdStrike(4): Could not retrieve DisableProxy value: c0000225
Sep 16 22:40:18 abadi-computer falcon-sensor-bpf[529]: CrowdStrike(4): ConnectWithProxy: Unable to get application proxy host from CsConfig: c0000225
== b0b02.cs.umd.edu (1 distinct, 1 total) ==
Sep 16 22:47:05 b0b02.cs.umd.edu rustdesk[1941076]: cannot open display:
== biggulp.cs.umd.edu (4 distinct, 4 total) ==
Sep 16 22:29:03 biggulp.cs.umd.edu sshd-session[1889058]: pam_access(sshd:auth): access denied for user `root' from `158.173.89.129'
Sep 16 22:29:05 biggulp.cs.umd.edu sshd-session[1889056]: error: PAM: Authentication failure for root from 158.173.89.129
Sep 16 22:54:47 biggulp.cs.umd.edu sshd-session[1892478]: pam_access(sshd:auth): access denied for user `operator' from `158.173.89.129'
Sep 16 22:54:49 biggulp.cs.umd.edu sshd-session[1892476]: error: PAM: Authentication failure for operator from 158.173.89.129
== cheezit.cs.umd.edu (5 distinct, 5 total) ==
Sep 16 22:11:49 cheezit.cs.umd.edu sshd-session[11003]: error: kex_protocol_error: type 20 seq 2 [preauth]
Sep 16 22:11:49 cheezit.cs.umd.edu sshd-session[11003]: error: kex_protocol_error: type 30 seq 3 [preauth]
Sep 16 22:11:51 cheezit.cs.umd.edu sshd-session[11003]: error: kex_protocol_error: type 20 seq 4 [preauth]
Sep 16 22:11:51 cheezit.cs.umd.edu sshd-session[11003]: error: kex_protocol_error: type 30 seq 5 [preauth]
Sep 16 22:24:56 cheezit.cs.umd.edu sshd-session[13204]: pam_access(sshd:auth): access denied for user `bhatele' from `172.58.244.184'
== csfw00a (1 distinct, 127 total) ==
Sep 16 22:04:33 csfw00a kernel: bnxt_en 0000:09:00.0 eth3: NIC Link is Down [x127]
== galax (4 distinct, 4 total) ==
Sep 16 22:19:36 galax systemd-sysv-generator[139074]: SysV service '/etc/init.d/openipmi' lacks a native systemd unit file, automatically generating a unit file for compatibility.
Sep 16 22:19:36 galax systemd-sysv-generator[139074]: Please update package to include a native systemd unit file.
Sep 16 22:19:36 galax systemd-sysv-generator[139074]: ! This compatibility logic is deprecated, expect removal soon. !
Sep 16 22:19:36 galax kernel: set_capacity_and_notify: 5 callbacks suppressed
== idm00 (1 distinct, 1 total) ==
Sep 16 22:53:56 idm00 named[4166701]: client @0x7f11980abff8 10.73.240.42#57897: update '73.10.in-addr.arpa/IN' denied
== idmp0 (1 distinct, 1 total) ==
Sep 16 22:37:37 idmp0 named[1598691]: client @0x7f2d50022b88 10.73.240.43#64786: update '73.10.in-addr.arpa/IN' denied
== inbound00.cs.umd.edu (1 distinct, 1 total) ==
Sep 16 22:19:36 inbound00.cs.umd.edu krb5_child[938317]: Client 'admin(a)UMD.EDU' not found in Kerberos database
== itmon02 (1 distinct, 4 total) ==
Sep 16 22:08:25 itmon02 sshd[1750555]: error: beginning MaxStartups throttling [x4]
== matrix (3 distinct, 4 total) ==
Sep 16 22:54:01 matrix krb5_child[222087]: Client 'admin(a)UMD.EDU' not found in Kerberos database [x2]
Sep 16 22:54:03 matrix sshd[222080]: error: PAM: Authentication failure for admin from 35.189.206.68
Sep 16 22:54:25 matrix sshd[222240]: error: Protocol major versions differ: 2 vs. 1
== munin (2 distinct, 2 total) ==
Sep 16 22:08:32 munin sudo[3106068]: pam_systemd(sudo:session): Failed to stat() runtime directory '/run/user/0': No such file or directory
Sep 16 22:08:32 munin sudo[3106068]: pam_systemd(sudo:session): Not setting $XDG_RUNTIME_DIR, as the directory is not in order.
== newhonors.cs.umd.edu (1 distinct, 1 total) ==
Sep 16 22:56:41 newhonors.cs.umd.edu systemd-tmpfiles: [/usr/lib/tmpfiles.d/var.conf:14] Duplicate line for path "/var/log", ignoring.
== newhonors2 (1 distinct, 24 total) ==
Sep 16 22:13:03 newhonors2 dhcpcd[2740654]: dhcpcd is not running [x24]
== ntop00 (48 distinct, 48 total) ==
Sep 16 22:07:01 ntop00 nfacctd[9667]: INFO ( default_print/print ): *** Purging cache - START (PID: 115) ***
Sep 16 22:07:01 ntop00 nfacctd[9667]: INFO ( default_print/print ): *** Purging cache - END (PID: 115, QN: 0/0, ET: X) ***
Sep 16 22:10:01 ntop00 sfacctd[48024]: INFO ( default_print/print ): *** Purging cache - START (PID: 91) ***
Sep 16 22:10:01 ntop00 sfacctd[48024]: INFO ( default_print/print ): *** Purging cache - END (PID: 91, QN: 1584/1584, ET: 0) ***
Sep 16 22:12:01 ntop00 nfacctd[9667]: INFO ( default_print/print ): *** Purging cache - START (PID: 116) ***
Sep 16 22:12:01 ntop00 nfacctd[9667]: INFO ( default_print/print ): *** Purging cache - END (PID: 116, QN: 0/0, ET: X) ***
Sep 16 22:15:01 ntop00 sfacctd[48024]: INFO ( default_print/print ): *** Purging cache - START (PID: 92) ***
Sep 16 22:15:01 ntop00 sfacctd[48024]: INFO ( default_print/print ): *** Purging cache - END (PID: 92, QN: 1794/1794, ET: 0) ***
Sep 16 22:17:02 ntop00 nfacctd[9667]: INFO ( default_print/print ): *** Purging cache - START (PID: 117) ***
Sep 16 22:17:02 ntop00 nfacctd[9667]: INFO ( default_print/print ): *** Purging cache - END (PID: 117, QN: 0/0, ET: X) ***
Sep 16 22:20:01 ntop00 sfacctd[48024]: INFO ( default_print/print ): *** Purging cache - START (PID: 93) ***
Sep 16 22:20:01 ntop00 sfacctd[48024]: INFO ( default_print/print ): *** Purging cache - END (PID: 93, QN: 1681/1681, ET: 0) ***
Sep 16 22:22:01 ntop00 nfacctd[9667]: INFO ( default_print/print ): *** Purging cache - START (PID: 118) ***
Sep 16 22:22:01 ntop00 nfacctd[9667]: INFO ( default_print/print ): *** Purging cache - END (PID: 118, QN: 0/0, ET: X) ***
Sep 16 22:25:01 ntop00 sfacctd[48024]: INFO ( default_print/print ): *** Purging cache - START (PID: 94) ***
Sep 16 22:25:01 ntop00 sfacctd[48024]: INFO ( default_print/print ): *** Purging cache - END (PID: 94, QN: 1581/1581, ET: 0) ***
Sep 16 22:27:01 ntop00 nfacctd[9667]: INFO ( default_print/print ): *** Purging cache - START (PID: 119) ***
Sep 16 22:27:01 ntop00 nfacctd[9667]: INFO ( default_print/print ): *** Purging cache - END (PID: 119, QN: 0/0, ET: X) ***
Sep 16 22:30:01 ntop00 sfacctd[48024]: INFO ( default_print/print ): *** Purging cache - START (PID: 95) ***
Sep 16 22:30:01 ntop00 sfacctd[48024]: INFO ( default_print/print ): *** Purging cache - END (PID: 95, QN: 1581/1581, ET: 0) ***
Sep 16 22:32:01 ntop00 nfacctd[9667]: INFO ( default_print/print ): *** Purging cache - START (PID: 120) ***
Sep 16 22:32:01 ntop00 nfacctd[9667]: INFO ( default_print/print ): *** Purging cache - END (PID: 120, QN: 0/0, ET: X) ***
Sep 16 22:35:01 ntop00 sfacctd[48024]: INFO ( default_print/print ): *** Purging cache - START (PID: 96) ***
Sep 16 22:35:01 ntop00 sfacctd[48024]: INFO ( default_print/print ): *** Purging cache - END (PID: 96, QN: 1638/1638, ET: 0) ***
Sep 16 22:37:01 ntop00 nfacctd[9667]: INFO ( default_print/print ): *** Purging cache - START (PID: 121) ***
Sep 16 22:37:01 ntop00 nfacctd[9667]: INFO ( default_print/print ): *** Purging cache - END (PID: 121, QN: 0/0, ET: X) ***
Sep 16 22:40:01 ntop00 sfacctd[48024]: INFO ( default_print/print ): *** Purging cache - START (PID: 97) ***
Sep 16 22:40:01 ntop00 sfacctd[48024]: INFO ( default_print/print ): *** Purging cache - END (PID: 97, QN: 1673/1673, ET: 0) ***
Sep 16 22:42:01 ntop00 nfacctd[9667]: INFO ( default_print/print ): *** Purging cache - START (PID: 122) ***
Sep 16 22:42:01 ntop00 nfacctd[9667]: INFO ( default_print/print ): *** Purging cache - END (PID: 122, QN: 0/0, ET: X) ***
... 18 more distinct messages not shown
== outbound00.cs.umd.edu (1 distinct, 6 total) ==
Sep 16 22:09:10 outbound00.cs.umd.edu python3[813448]: ldapdb [x6]
== outbound01.cs.umd.edu (2 distinct, 7 total) ==
Sep 16 22:13:06 outbound01.cs.umd.edu python3[3073723]: ldapdb [x6]
Sep 16 22:46:21 outbound01.cs.umd.edu krb5_child[3081415]: Client 'admin(a)UMD.EDU' not found in Kerberos database
== sentry-docker00.cs.umd.edu (36 distinct, 36 total) ==
Sep 16 22:21:47 sentry-docker00.cs.umd.edu systemd-udevd[1876554]: link_config: could not get ethtool features for vethda255fb
Sep 16 22:21:47 sentry-docker00.cs.umd.edu systemd-udevd[1876554]: Could not set offload features of vethda255fb: No such device
Sep 16 22:21:47 sentry-docker00.cs.umd.edu systemd-udevd[1876585]: Could not generate persistent MAC address for veth6df3c96: No such file or directory
Sep 16 22:21:47 sentry-docker00.cs.umd.edu systemd-udevd[1876586]: Could not generate persistent MAC address for vethd86e4fb: No such file or directory
Sep 16 22:21:47 sentry-docker00.cs.umd.edu systemd-udevd[1876611]: Could not generate persistent MAC address for vethe9b3e07: No such file or directory
Sep 16 22:21:47 sentry-docker00.cs.umd.edu systemd-udevd[1876612]: Could not generate persistent MAC address for veth0f0a370: No such file or directory
Sep 16 22:21:47 sentry-docker00.cs.umd.edu systemd-udevd[1876630]: Could not generate persistent MAC address for veth4a23cb1: No such file or directory
Sep 16 22:21:47 sentry-docker00.cs.umd.edu systemd-udevd[1876632]: Could not generate persistent MAC address for veth9aafe7e: No such file or directory
Sep 16 22:21:47 sentry-docker00.cs.umd.edu systemd-udevd[1876639]: Could not generate persistent MAC address for vethecb055d: No such file or directory
Sep 16 22:21:47 sentry-docker00.cs.umd.edu systemd-udevd[1876640]: Could not generate persistent MAC address for vethe1b668d: No such file or directory
Sep 16 22:21:48 sentry-docker00.cs.umd.edu systemd-udevd[1876655]: Could not generate persistent MAC address for veth5c02194: No such file or directory
Sep 16 22:21:48 sentry-docker00.cs.umd.edu systemd-udevd[1876647]: Could not generate persistent MAC address for veth60e1cb5: No such file or directory
Sep 16 22:41:56 sentry-docker00.cs.umd.edu systemd-udevd[1886004]: link_config: could not set ethtool features for vethecb055d
Sep 16 22:41:56 sentry-docker00.cs.umd.edu systemd-udevd[1886004]: Could not set offload features of vethecb055d: Operation not permitted
Sep 16 22:41:56 sentry-docker00.cs.umd.edu systemd-udevd[1886036]: Could not generate persistent MAC address for vethcb798db: No such file or directory
Sep 16 22:41:56 sentry-docker00.cs.umd.edu systemd-udevd[1886037]: Could not generate persistent MAC address for veth225b7f3: No such file or directory
Sep 16 22:41:56 sentry-docker00.cs.umd.edu systemd-udevd[1886062]: Could not generate persistent MAC address for veth61c2f00: No such file or directory
Sep 16 22:41:56 sentry-docker00.cs.umd.edu systemd-udevd[1886063]: Could not generate persistent MAC address for veth182f97a: No such file or directory
Sep 16 22:41:56 sentry-docker00.cs.umd.edu systemd-udevd[1886081]: Could not generate persistent MAC address for veth433eb6b: No such file or directory
Sep 16 22:41:56 sentry-docker00.cs.umd.edu systemd-udevd[1886088]: Could not generate persistent MAC address for vethe4eb7ec: No such file or directory
Sep 16 22:41:56 sentry-docker00.cs.umd.edu systemd-udevd[1886062]: Could not generate persistent MAC address for veth5415c89: No such file or directory
Sep 16 22:41:56 sentry-docker00.cs.umd.edu systemd-udevd[1886070]: Could not generate persistent MAC address for veth8b2473d: No such file or directory
Sep 16 22:41:56 sentry-docker00.cs.umd.edu systemd-udevd[1886072]: Could not generate persistent MAC address for veth64ab19e: No such file or directory
Sep 16 22:41:56 sentry-docker00.cs.umd.edu systemd-udevd[1886079]: Could not generate persistent MAC address for vethbc0343c: No such file or directory
Sep 16 23:02:04 sentry-docker00.cs.umd.edu systemd-udevd[1895471]: link_config: could not get ethtool features for veth8b2473d
Sep 16 23:02:04 sentry-docker00.cs.umd.edu systemd-udevd[1895471]: Could not set offload features of veth8b2473d: No such device
Sep 16 23:02:04 sentry-docker00.cs.umd.edu systemd-udevd[1895501]: Could not generate persistent MAC address for veth012b3e1: No such file or directory
Sep 16 23:02:04 sentry-docker00.cs.umd.edu systemd-udevd[1895502]: Could not generate persistent MAC address for veth8805d45: No such file or directory
Sep 16 23:02:04 sentry-docker00.cs.umd.edu systemd-udevd[1895516]: Could not generate persistent MAC address for veth925f804: No such file or directory
Sep 16 23:02:04 sentry-docker00.cs.umd.edu systemd-udevd[1895515]: Could not generate persistent MAC address for vethc91770d: No such file or directory
... 6 more distinct messages not shown
== soul (6 distinct, 6 total) ==
Sep 16 22:12:56 soul sshd-session[2999574]: error: kex_protocol_error: type 20 seq 2 [preauth]
Sep 16 22:12:56 soul sshd-session[2999574]: error: kex_protocol_error: type 30 seq 3 [preauth]
Sep 16 22:13:20 soul sshd-session[2999574]: error: kex_protocol_error: type 20 seq 4 [preauth]
Sep 16 22:13:20 soul sshd-session[2999574]: error: kex_protocol_error: type 30 seq 5 [preauth]
Sep 16 22:13:22 soul sshd-session[2999574]: error: kex_protocol_error: type 20 seq 6 [preauth]
Sep 16 22:13:22 soul sshd-session[2999574]: error: kex_protocol_error: type 30 seq 7 [preauth]
== strawberry (7 distinct, 38 total) ==
Sep 16 22:07:03 strawberry kernel: I/O error, dev sda, sector 206848 op 0x0:(READ) flags 0x80700 phys_seg 1 prio class 2 [x6]
Sep 16 22:07:03 strawberry kernel: I/O error, dev sda, sector 206848 op 0x0:(READ) flags 0x0 phys_seg 1 prio class 2 [x6]
Sep 16 22:07:03 strawberry kernel: Buffer I/O error on dev sda2, logical block 0, async page read [x6]
Sep 16 22:07:03 strawberry kernel: I/O error, dev sda, sector 2048 op 0x0:(READ) flags 0x80700 phys_seg 1 prio class 2 [x6]
Sep 16 22:07:03 strawberry kernel: I/O error, dev sda, sector 2048 op 0x0:(READ) flags 0x0 phys_seg 1 prio class 2 [x6]
Sep 16 22:07:03 strawberry kernel: Buffer I/O error on dev sda1, logical block 0, async page read [x6]
Sep 16 22:34:42 strawberry smartd[5314]: Device: /dev/sda [SAT], failed to read SMART Attribute Data [x2]
== submit26-b9-f1 (11 distinct, 16 total) ==
Sep 16 22:25:52 submit26-b9-f1 setroubleshoot[2049685]: SELinux is preventing /usr/bin/python3.9 from create access on the directory /(null). For complete SELinux messages run: sealert -l 3ef7d677-731f-46bf-9c34-c2c55fea665c [x2]
Sep 16 22:25:52 submit26-b9-f1 setroubleshoot[2049685]: SELinux is preventing /usr/bin/python3.9 from add_name access on the directory /(null). For complete SELinux messages run: sealert -l aa60e26f-72e1-45f1-bc12-aa8b3b669e36 [x2]
Sep 16 22:25:52 submit26-b9-f1 setroubleshoot[2049685]: SELinux is preventing /usr/bin/python3.9 from create access on the file /(null). For complete SELinux messages run: sealert -l d088fb43-23ee-4ae8-ae6a-5d1c041ee2d6
Sep 16 22:25:52 submit26-b9-f1 setroubleshoot[2049685]: SELinux is preventing /usr/bin/python3.9 from open access on the file /tmp/libdnf.KxUNZf/repodata/repomd.xml. For complete SELinux messages run: sealert -l 3b0d8c9a-6637-4d6e-a864-f1dd7c00377d
Sep 16 22:25:52 submit26-b9-f1 setroubleshoot[2049685]: SELinux is preventing /usr/bin/python3.9 from setattr access on the file repomd.xml. For complete SELinux messages run: sealert -l 0fd3339f-3ef2-45f3-9e58-65a58b42f3ee
Sep 16 22:25:53 submit26-b9-f1 setroubleshoot[2049685]: SELinux is preventing /usr/bin/python3.9 from read access on the directory libdnf.KxUNZf. For complete SELinux messages run: sealert -l 0d661d88-dc9e-469d-986b-52e29b353aa8
Sep 16 22:25:53 submit26-b9-f1 setroubleshoot[2049685]: SELinux is preventing /usr/bin/python3.9 from remove_name access on the directory repomd.xml. For complete SELinux messages run: sealert -l 405a8556-cf9f-4ef4-8525-0dca18d4259d [x2]
Sep 16 22:25:53 submit26-b9-f1 setroubleshoot[2049685]: SELinux is preventing /usr/bin/python3.9 from unlink access on the file repomd.xml. For complete SELinux messages run: sealert -l 3c38e23e-3631-4cb5-81c7-992675c836d9
Sep 16 22:25:53 submit26-b9-f1 setroubleshoot[2049685]: SELinux is preventing /usr/bin/python3.9 from rmdir access on the directory repodata. For complete SELinux messages run: sealert -l a070e9b5-2867-47d6-b2e3-3b7d99725848 [x2]
Sep 16 22:25:53 submit26-b9-f1 setroubleshoot[2049685]: SELinux is preventing /usr/bin/python3.9 from read access on the directory libdnf.x3D6ac. For complete SELinux messages run: sealert -l 0d661d88-dc9e-469d-986b-52e29b353aa8
Sep 16 22:28:06 submit26-b9-f1 systemd[1]: user(a)1001.service: Main process exited, code=killed, status=9/KILL [x2]
== submit26-b9-f2 (9 distinct, 9 total) ==
Sep 16 22:06:48 submit26-b9-f2 setroubleshoot[1175622]: SELinux is preventing /usr/bin/python3.9 from create access on the directory /(null). For complete SELinux messages run: sealert -l 0659d546-3107-4f75-b00f-008c85f41dc6
Sep 16 22:06:48 submit26-b9-f2 setroubleshoot[1175622]: SELinux is preventing /usr/bin/python3.9 from add_name access on the directory /(null). For complete SELinux messages run: sealert -l 156d9270-3466-4356-b86f-1a128825961a
Sep 16 22:06:48 submit26-b9-f2 setroubleshoot[1175622]: SELinux is preventing /usr/bin/python3.9 from create access on the file /(null). For complete SELinux messages run: sealert -l c8a40bf5-2fc4-46b3-b813-8592b3523339
Sep 16 22:06:48 submit26-b9-f2 setroubleshoot[1175622]: SELinux is preventing /usr/bin/python3.9 from open access on the file /tmp/libdnf.BLyJ6i/repodata/repomd.xml. For complete SELinux messages run: sealert -l 7f4c3a8e-0f99-47c4-9baf-e1336fe24876
Sep 16 22:06:48 submit26-b9-f2 setroubleshoot[1175622]: SELinux is preventing /usr/bin/python3.9 from setattr access on the file repomd.xml. For complete SELinux messages run: sealert -l 988123da-b724-4e6a-900c-33a2723fdaf1
Sep 16 22:06:48 submit26-b9-f2 setroubleshoot[1175622]: SELinux is preventing /usr/bin/python3.9 from read access on the directory libdnf.BLyJ6i. For complete SELinux messages run: sealert -l ca585e2b-d50f-4264-8127-6b3fa04070c8
Sep 16 22:06:48 submit26-b9-f2 setroubleshoot[1175622]: SELinux is preventing /usr/bin/python3.9 from remove_name access on the directory repomd.xml. For complete SELinux messages run: sealert -l 3a749560-1cec-40ca-a4dc-596841be3885
Sep 16 22:06:48 submit26-b9-f2 setroubleshoot[1175622]: SELinux is preventing /usr/bin/python3.9 from unlink access on the file repomd.xml. For complete SELinux messages run: sealert -l 0aa52f08-94f8-474e-96d8-e818846941af
Sep 16 22:06:48 submit26-b9-f2 setroubleshoot[1175622]: SELinux is preventing /usr/bin/python3.9 from rmdir access on the directory repodata. For complete SELinux messages run: sealert -l de019dc4-408f-439c-902a-676d18dfe8e7
== submit26-b9-f3 (1 distinct, 2 total) ==
Sep 16 22:42:25 submit26-b9-f3 systemd[1]: user(a)1001.service: Main process exited, code=killed, status=9/KILL [x2]
== submit26-b9-f4 (1 distinct, 1 total) ==
Sep 16 22:07:25 submit26-b9-f4 systemd[1]: user(a)1001.service: Main process exited, code=killed, status=9/KILL
== teaching-awards (2 distinct, 2 total) ==
Sep 16 22:10:00 teaching-awards krb5_child[909862]: Client 'admin(a)UMD.EDU' not found in Kerberos database
Sep 16 22:11:08 teaching-awards sshd-session[909891]: error: Protocol major versions differ: 2 vs. 1
== tma-0 (2 distinct, 2 total) ==
Sep 16 22:05:15 tma-0 sshd[5884]: fatal: monitor_read: unpermitted request 6
Sep 16 23:00:38 tma-0 sshd[17896]: error: PAM: Authentication failure for admin from 252.83.211.130.bc.googleusercontent.com
== vacuum.cs.umd.edu (4 distinct, 4 total) ==
Sep 16 22:11:58 vacuum.cs.umd.edu abrt-hook-ccpp[5319]: Process 679 (driver) of user 33 killed by SIGSEGV - dumping core
Sep 16 22:11:59 vacuum.cs.umd.edu abrt-server[5321]: Package 'amanda-backup_server' isn't signed with proper key
Sep 16 22:11:59 vacuum.cs.umd.edu abrt-server[5321]: 'post-create' on '/var/spool/abrt/ccpp-2026-09-16-22:11:58-679' exited with 1
Sep 16 22:11:59 vacuum.cs.umd.edu abrt-server[5321]: Deleting problem directory '/var/spool/abrt/ccpp-2026-09-16-22:11:58-679'
1
0
Command: /usr/local/sbin/syslog-digest.py
Time : 0.0451s
Status : exited 0
Output :
Syslog digest — 2026-09-16 22:05 EDT
Processed 2,168 lines, filtered 1,810 (83%). 358 unknown (131 distinct) from 19 host(s).
== b0b02.cs.umd.edu (1 distinct, 1 total) ==
Sep 16 21:47:01 b0b02.cs.umd.edu rustdesk[1925942]: cannot open display:
== csfw00a (1 distinct, 147 total) ==
Sep 16 21:04:03 csfw00a kernel: bnxt_en 0000:09:00.0 eth3: NIC Link is Down [x147]
== idm00 (1 distinct, 1 total) ==
Sep 16 21:53:56 idm00 named[4166701]: client @0x7f11a405bcf8 10.73.240.42#63381: update '73.10.in-addr.arpa/IN' denied
== idmp0 (1 distinct, 1 total) ==
Sep 16 21:37:37 idmp0 named[1598691]: client @0x7f2d40025c28 10.73.240.43#51275: update '73.10.in-addr.arpa/IN' denied
== itmon02 (1 distinct, 4 total) ==
Sep 16 21:18:33 itmon02 sshd[1750555]: error: beginning MaxStartups throttling [x4]
== krispykreme.cs.umd.edu (3 distinct, 3 total) ==
Sep 16 21:26:54 krispykreme.cs.umd.edu sshd-session[3044747]: error: maximum authentication attempts exceeded for root from 186.242.202.93 port 30270 ssh2 [preauth]
Sep 16 21:26:55 krispykreme.cs.umd.edu sshd-session[3044753]: error: maximum authentication attempts exceeded for root from 186.242.202.93 port 30411 ssh2 [preauth]
Sep 16 21:26:57 krispykreme.cs.umd.edu sshd-session[3044759]: error: maximum authentication attempts exceeded for root from 186.242.202.93 port 30544 ssh2 [preauth]
== mcstic (6 distinct, 12 total) ==
Sep 16 22:04:06 mcstic sshd[689658]: error: kex_protocol_error: type 20 seq 2 [preauth] [x2]
Sep 16 22:04:06 mcstic sshd[689658]: error: kex_protocol_error: type 30 seq 3 [preauth] [x2]
Sep 16 22:04:10 mcstic sshd[689658]: error: kex_protocol_error: type 20 seq 4 [preauth] [x2]
Sep 16 22:04:10 mcstic sshd[689658]: error: kex_protocol_error: type 30 seq 5 [preauth] [x2]
Sep 16 22:04:12 mcstic sshd[689658]: error: kex_protocol_error: type 20 seq 6 [preauth] [x2]
Sep 16 22:04:12 mcstic sshd[689658]: error: kex_protocol_error: type 30 seq 7 [preauth] [x2]
== munin (2 distinct, 2 total) ==
Sep 16 22:03:05 munin sudo[3103361]: pam_systemd(sudo:session): Failed to stat() runtime directory '/run/user/0': No such file or directory
Sep 16 22:03:05 munin sudo[3103361]: pam_systemd(sudo:session): Not setting $XDG_RUNTIME_DIR, as the directory is not in order.
== newhonors2 (1 distinct, 24 total) ==
Sep 16 21:13:03 newhonors2 dhcpcd[2738810]: dhcpcd is not running [x24]
== ntop00 (48 distinct, 48 total) ==
Sep 16 21:07:01 ntop00 nfacctd[9667]: INFO ( default_print/print ): *** Purging cache - START (PID: 103) ***
Sep 16 21:07:01 ntop00 nfacctd[9667]: INFO ( default_print/print ): *** Purging cache - END (PID: 103, QN: 0/0, ET: X) ***
Sep 16 21:10:01 ntop00 sfacctd[48024]: INFO ( default_print/print ): *** Purging cache - START (PID: 79) ***
Sep 16 21:10:01 ntop00 sfacctd[48024]: INFO ( default_print/print ): *** Purging cache - END (PID: 79, QN: 5128/5128, ET: 0) ***
Sep 16 21:12:01 ntop00 nfacctd[9667]: INFO ( default_print/print ): *** Purging cache - START (PID: 104) ***
Sep 16 21:12:01 ntop00 nfacctd[9667]: INFO ( default_print/print ): *** Purging cache - END (PID: 104, QN: 0/0, ET: X) ***
Sep 16 21:15:01 ntop00 sfacctd[48024]: INFO ( default_print/print ): *** Purging cache - START (PID: 80) ***
Sep 16 21:15:01 ntop00 sfacctd[48024]: INFO ( default_print/print ): *** Purging cache - END (PID: 80, QN: 5063/5063, ET: 0) ***
Sep 16 21:17:01 ntop00 nfacctd[9667]: INFO ( default_print/print ): *** Purging cache - START (PID: 105) ***
Sep 16 21:17:01 ntop00 nfacctd[9667]: INFO ( default_print/print ): *** Purging cache - END (PID: 105, QN: 0/0, ET: X) ***
Sep 16 21:20:01 ntop00 sfacctd[48024]: INFO ( default_print/print ): *** Purging cache - START (PID: 81) ***
Sep 16 21:20:01 ntop00 sfacctd[48024]: INFO ( default_print/print ): *** Purging cache - END (PID: 81, QN: 1959/1959, ET: 0) ***
Sep 16 21:22:01 ntop00 nfacctd[9667]: INFO ( default_print/print ): *** Purging cache - START (PID: 106) ***
Sep 16 21:22:01 ntop00 nfacctd[9667]: INFO ( default_print/print ): *** Purging cache - END (PID: 106, QN: 0/0, ET: X) ***
Sep 16 21:25:01 ntop00 sfacctd[48024]: INFO ( default_print/print ): *** Purging cache - START (PID: 82) ***
Sep 16 21:25:01 ntop00 sfacctd[48024]: INFO ( default_print/print ): *** Purging cache - END (PID: 82, QN: 1846/1846, ET: 0) ***
Sep 16 21:27:01 ntop00 nfacctd[9667]: INFO ( default_print/print ): *** Purging cache - START (PID: 107) ***
Sep 16 21:27:01 ntop00 nfacctd[9667]: INFO ( default_print/print ): *** Purging cache - END (PID: 107, QN: 0/0, ET: X) ***
Sep 16 21:30:01 ntop00 sfacctd[48024]: INFO ( default_print/print ): *** Purging cache - START (PID: 83) ***
Sep 16 21:30:01 ntop00 sfacctd[48024]: INFO ( default_print/print ): *** Purging cache - END (PID: 83, QN: 1597/1597, ET: 0) ***
Sep 16 21:32:01 ntop00 nfacctd[9667]: INFO ( default_print/print ): *** Purging cache - START (PID: 108) ***
Sep 16 21:32:01 ntop00 nfacctd[9667]: INFO ( default_print/print ): *** Purging cache - END (PID: 108, QN: 0/0, ET: X) ***
Sep 16 21:35:01 ntop00 sfacctd[48024]: INFO ( default_print/print ): *** Purging cache - START (PID: 84) ***
Sep 16 21:35:01 ntop00 sfacctd[48024]: INFO ( default_print/print ): *** Purging cache - END (PID: 84, QN: 1739/1739, ET: 0) ***
Sep 16 21:37:01 ntop00 nfacctd[9667]: INFO ( default_print/print ): *** Purging cache - START (PID: 109) ***
Sep 16 21:37:01 ntop00 nfacctd[9667]: INFO ( default_print/print ): *** Purging cache - END (PID: 109, QN: 0/0, ET: X) ***
Sep 16 21:40:01 ntop00 sfacctd[48024]: INFO ( default_print/print ): *** Purging cache - START (PID: 85) ***
Sep 16 21:40:01 ntop00 sfacctd[48024]: INFO ( default_print/print ): *** Purging cache - END (PID: 85, QN: 1726/1726, ET: 0) ***
Sep 16 21:42:01 ntop00 nfacctd[9667]: INFO ( default_print/print ): *** Purging cache - START (PID: 110) ***
Sep 16 21:42:01 ntop00 nfacctd[9667]: INFO ( default_print/print ): *** Purging cache - END (PID: 110, QN: 0/0, ET: X) ***
... 18 more distinct messages not shown
== outbound00.cs.umd.edu (1 distinct, 6 total) ==
Sep 16 21:09:10 outbound00.cs.umd.edu python3[799490]: ldapdb [x6]
== outbound01.cs.umd.edu (2 distinct, 7 total) ==
Sep 16 21:13:06 outbound01.cs.umd.edu python3[3059583]: ldapdb [x6]
Sep 16 21:14:18 outbound01.cs.umd.edu krb5_child[3059806]: Client 'admin(a)UMD.EDU' not found in Kerberos database
== sentry-docker00.cs.umd.edu (34 distinct, 34 total) ==
Sep 16 21:21:22 sentry-docker00.cs.umd.edu systemd-udevd[1848119]: Could not generate persistent MAC address for vethea749de: No such file or directory
Sep 16 21:21:22 sentry-docker00.cs.umd.edu systemd-udevd[1848120]: Could not generate persistent MAC address for vethb088649: No such file or directory
Sep 16 21:21:22 sentry-docker00.cs.umd.edu systemd-udevd[1848123]: Could not generate persistent MAC address for vethf5826eb: No such file or directory
Sep 16 21:21:22 sentry-docker00.cs.umd.edu systemd-udevd[1848124]: Could not generate persistent MAC address for veth318e790: No such file or directory
Sep 16 21:21:22 sentry-docker00.cs.umd.edu systemd-udevd[1848120]: Could not generate persistent MAC address for veth8177144: No such file or directory
Sep 16 21:21:22 sentry-docker00.cs.umd.edu systemd-udevd[1848124]: Could not generate persistent MAC address for veth451cfa1: No such file or directory
Sep 16 21:21:22 sentry-docker00.cs.umd.edu systemd-udevd[1848149]: Could not generate persistent MAC address for veth1b19330: No such file or directory
Sep 16 21:21:22 sentry-docker00.cs.umd.edu systemd-udevd[1848150]: Could not generate persistent MAC address for vethfa156ed: No such file or directory
Sep 16 21:21:22 sentry-docker00.cs.umd.edu systemd-udevd[1848168]: Could not generate persistent MAC address for veth8ee9da6: No such file or directory
Sep 16 21:21:22 sentry-docker00.cs.umd.edu systemd-udevd[1848166]: Could not generate persistent MAC address for vethc57173c: No such file or directory
Sep 16 21:41:31 sentry-docker00.cs.umd.edu systemd-udevd[1857721]: link_config: could not get ethtool features for vethf5826eb
Sep 16 21:41:31 sentry-docker00.cs.umd.edu systemd-udevd[1857721]: Could not set offload features of vethf5826eb: No such device
Sep 16 21:41:31 sentry-docker00.cs.umd.edu systemd-udevd[1857808]: Could not generate persistent MAC address for veth445b05f: No such file or directory
Sep 16 21:41:31 sentry-docker00.cs.umd.edu systemd-udevd[1857809]: Could not generate persistent MAC address for veth9ed1d92: No such file or directory
Sep 16 21:41:31 sentry-docker00.cs.umd.edu systemd-udevd[1857827]: Could not generate persistent MAC address for vethb54b2ee: No such file or directory
Sep 16 21:41:31 sentry-docker00.cs.umd.edu systemd-udevd[1857814]: Could not generate persistent MAC address for veth1f44fff: No such file or directory
Sep 16 21:41:31 sentry-docker00.cs.umd.edu systemd-udevd[1857823]: Could not generate persistent MAC address for vethd7ae145: No such file or directory
Sep 16 21:41:31 sentry-docker00.cs.umd.edu systemd-udevd[1857808]: Could not generate persistent MAC address for veth9073def: No such file or directory
Sep 16 21:41:31 sentry-docker00.cs.umd.edu systemd-udevd[1857830]: Could not generate persistent MAC address for veth6f64f39: No such file or directory
Sep 16 21:41:31 sentry-docker00.cs.umd.edu systemd-udevd[1857831]: Could not generate persistent MAC address for vethcc4bb40: No such file or directory
Sep 16 21:41:31 sentry-docker00.cs.umd.edu systemd-udevd[1857927]: Could not generate persistent MAC address for veth41dac78: No such file or directory
Sep 16 21:41:31 sentry-docker00.cs.umd.edu systemd-udevd[1857928]: Could not generate persistent MAC address for vethcc45cc1: No such file or directory
Sep 16 22:01:39 sentry-docker00.cs.umd.edu systemd-udevd[1867144]: link_config: could not set ethtool features for veth6f64f39
Sep 16 22:01:39 sentry-docker00.cs.umd.edu systemd-udevd[1867144]: Could not set offload features of veth6f64f39: Operation not permitted
Sep 16 22:01:39 sentry-docker00.cs.umd.edu systemd-udevd[1867178]: Could not generate persistent MAC address for veth03941ae: No such file or directory
Sep 16 22:01:39 sentry-docker00.cs.umd.edu systemd-udevd[1867179]: Could not generate persistent MAC address for vethfe92c74: No such file or directory
Sep 16 22:01:39 sentry-docker00.cs.umd.edu systemd-udevd[1867182]: Could not generate persistent MAC address for veth2d67371: No such file or directory
Sep 16 22:01:39 sentry-docker00.cs.umd.edu systemd-udevd[1867183]: Could not generate persistent MAC address for vethc6d83f5: No such file or directory
Sep 16 22:01:39 sentry-docker00.cs.umd.edu systemd-udevd[1867202]: Could not generate persistent MAC address for vethda255fb: No such file or directory
Sep 16 22:01:39 sentry-docker00.cs.umd.edu systemd-udevd[1867190]: Could not generate persistent MAC address for veth31cc5d1: No such file or directory
... 4 more distinct messages not shown
== strawberry (7 distinct, 38 total) ==
Sep 16 21:07:03 strawberry kernel: I/O error, dev sda, sector 206848 op 0x0:(READ) flags 0x80700 phys_seg 1 prio class 2 [x6]
Sep 16 21:07:03 strawberry kernel: I/O error, dev sda, sector 206848 op 0x0:(READ) flags 0x0 phys_seg 1 prio class 2 [x6]
Sep 16 21:07:03 strawberry kernel: Buffer I/O error on dev sda2, logical block 0, async page read [x6]
Sep 16 21:07:03 strawberry kernel: I/O error, dev sda, sector 2048 op 0x0:(READ) flags 0x80700 phys_seg 1 prio class 2 [x6]
Sep 16 21:07:03 strawberry kernel: I/O error, dev sda, sector 2048 op 0x0:(READ) flags 0x0 phys_seg 1 prio class 2 [x6]
Sep 16 21:07:03 strawberry kernel: Buffer I/O error on dev sda1, logical block 0, async page read [x6]
Sep 16 21:34:42 strawberry smartd[5314]: Device: /dev/sda [SAT], failed to read SMART Attribute Data [x2]
== submit26-b9-f1 (1 distinct, 1 total) ==
Sep 16 21:07:41 submit26-b9-f1 systemd[1]: user(a)1001.service: Main process exited, code=killed, status=9/KILL
== submit26-b9-f3 (9 distinct, 12 total) ==
Sep 16 21:06:41 submit26-b9-f3 setroubleshoot[1425007]: SELinux is preventing /usr/bin/python3.9 from create access on the directory /(null). For complete SELinux messages run: sealert -l a653b772-cbcd-438b-bae5-23c3dc69b31b
Sep 16 21:06:41 submit26-b9-f3 setroubleshoot[1425007]: SELinux is preventing /usr/bin/python3.9 from add_name access on the directory /(null). For complete SELinux messages run: sealert -l 3e904634-6caa-4202-8c92-f139db798859
Sep 16 21:06:41 submit26-b9-f3 setroubleshoot[1425007]: SELinux is preventing /usr/bin/python3.9 from create access on the file /(null). For complete SELinux messages run: sealert -l 580b20e4-ec2c-433d-905c-5bd417fba033 [x2]
Sep 16 21:06:41 submit26-b9-f3 setroubleshoot[1425007]: SELinux is preventing /usr/bin/python3.9 from open access on the file /tmp/libdnf.RrLUKv/repodata/repomd.xml. For complete SELinux messages run: sealert -l 27f29d48-5e7c-4db7-b051-8ac055737d6f [x2]
Sep 16 21:06:41 submit26-b9-f3 setroubleshoot[1425007]: SELinux is preventing /usr/bin/python3.9 from setattr access on the file repomd.xml. For complete SELinux messages run: sealert -l bff72452-d40a-430b-9060-dd0a48f5b6ba [x2]
Sep 16 21:06:41 submit26-b9-f3 setroubleshoot[1425007]: SELinux is preventing /usr/bin/python3.9 from read access on the directory libdnf.RrLUKv. For complete SELinux messages run: sealert -l 9638d396-8ce5-4e6a-ae47-45cd3985e1cd
Sep 16 21:06:41 submit26-b9-f3 setroubleshoot[1425007]: SELinux is preventing /usr/bin/python3.9 from remove_name access on the directory repomd.xml. For complete SELinux messages run: sealert -l 6da64b94-7024-45a9-b8c2-3b9812517407
Sep 16 21:06:42 submit26-b9-f3 setroubleshoot[1425007]: SELinux is preventing /usr/bin/python3.9 from unlink access on the file repomd.xml. For complete SELinux messages run: sealert -l 64cbe179-abf1-4d5a-bade-bb164897ee65
Sep 16 21:06:42 submit26-b9-f3 setroubleshoot[1425007]: SELinux is preventing /usr/bin/python3.9 from rmdir access on the directory repodata. For complete SELinux messages run: sealert -l d2e35b1a-e27c-4f91-9217-2bb1204e1e68
== submit26-b9-f4 (10 distinct, 14 total) ==
Sep 16 21:24:45 submit26-b9-f4 setroubleshoot[1053275]: SELinux is preventing /usr/bin/python3.9 from create access on the directory /(null). For complete SELinux messages run: sealert -l ee160f23-b161-4f4a-9985-c4edfd3a5beb [x2]
Sep 16 21:24:45 submit26-b9-f4 setroubleshoot[1053275]: SELinux is preventing /usr/bin/python3.9 from add_name access on the directory /(null). For complete SELinux messages run: sealert -l 89a83821-4b24-4081-9973-0a79ca6ed5b4 [x2]
Sep 16 21:24:45 submit26-b9-f4 setroubleshoot[1053275]: SELinux is preventing /usr/bin/python3.9 from create access on the file /(null). For complete SELinux messages run: sealert -l f73955d6-1416-45f9-bab6-ff1f3ea07e9d
Sep 16 21:24:45 submit26-b9-f4 setroubleshoot[1053275]: SELinux is preventing /usr/bin/python3.9 from open access on the file /tmp/libdnf.PneB9W/repodata/repomd.xml. For complete SELinux messages run: sealert -l 9f8f24a0-8fb6-454d-a103-31a8f7a6efa0
Sep 16 21:24:45 submit26-b9-f4 setroubleshoot[1053275]: SELinux is preventing /usr/bin/python3.9 from setattr access on the file repomd.xml. For complete SELinux messages run: sealert -l 20293136-86a3-40ba-a651-cff48d36059e
Sep 16 21:24:45 submit26-b9-f4 setroubleshoot[1053275]: SELinux is preventing /usr/bin/python3.9 from read access on the directory libdnf.PneB9W. For complete SELinux messages run: sealert -l 25f86b49-4ee7-4f60-ad1c-73a70032560c
Sep 16 21:24:45 submit26-b9-f4 setroubleshoot[1053275]: SELinux is preventing /usr/bin/python3.9 from remove_name access on the directory repomd.xml. For complete SELinux messages run: sealert -l eec250fb-073f-456d-93bc-f98776fd476d [x2]
Sep 16 21:24:45 submit26-b9-f4 setroubleshoot[1053275]: SELinux is preventing /usr/bin/python3.9 from unlink access on the file repomd.xml. For complete SELinux messages run: sealert -l c9209e04-a349-43d5-8cb2-3e303e48df74
Sep 16 21:24:45 submit26-b9-f4 setroubleshoot[1053275]: SELinux is preventing /usr/bin/python3.9 from rmdir access on the directory repodata. For complete SELinux messages run: sealert -l 3178d5f5-80e9-404b-92b7-9bef397a8915 [x2]
Sep 16 21:24:45 submit26-b9-f4 setroubleshoot[1053275]: SELinux is preventing /usr/bin/python3.9 from read access on the directory libdnf.Rrq1kj. For complete SELinux messages run: sealert -l 25f86b49-4ee7-4f60-ad1c-73a70032560c
== tma-0 (1 distinct, 1 total) ==
Sep 16 22:04:14 tma-0 sshd[5860]: fatal: monitor_read: unpermitted request 6
== yogurt (1 distinct, 2 total) ==
Sep 16 21:09:06 yogurt kernel: [drm:radeon_gem_va_update_vm [radeon]] *ERROR* Couldn't update BO_VA (-4) [x2]
1
0
Command: /usr/local/sbin/syslog-digest.py
Time : 0.0457s
Status : exited 0
Output :
Syslog digest — 2026-09-16 21:05 EDT
Processed 2,387 lines, filtered 2,051 (85%). 336 unknown (112 distinct) from 20 host(s).
== b0b02.cs.umd.edu (1 distinct, 1 total) ==
Sep 16 20:46:57 b0b02.cs.umd.edu rustdesk[1910785]: cannot open display:
== biggulp.cs.umd.edu (2 distinct, 2 total) ==
Sep 16 20:25:39 biggulp.cs.umd.edu sshd-session[1868224]: pam_access(sshd:auth): access denied for user `root' from `158.173.89.41'
Sep 16 20:25:41 biggulp.cs.umd.edu sshd-session[1868219]: error: PAM: Authentication failure for root from 158.173.89.41
== cheezit.cs.umd.edu (2 distinct, 2 total) ==
Sep 16 20:07:10 cheezit.cs.umd.edu sshd-session[4172951]: pam_access(sshd:auth): access denied for user `egolub' from `108.28.255.142'
Sep 16 20:35:12 cheezit.cs.umd.edu sshd-session[4179068]: pam_access(sshd:auth): access denied for user `pugh' from `108.45.150.204'
== csfw00a (1 distinct, 118 total) ==
Sep 16 20:03:54 csfw00a kernel: bnxt_en 0000:09:00.0 eth3: NIC Link is Down [x118]
== haproxy03.cs.umd.edu (3 distinct, 5 total) ==
Sep 16 20:59:35 haproxy03.cs.umd.edu sshd-session[545861]: error: Certificate does not contain an authorized principal [x3]
Sep 16 20:59:52 haproxy03.cs.umd.edu sshd-session[545861]: error: maximum authentication attempts exceeded for seriv from 10.73.255.10 port 59670 ssh2 [preauth]
Sep 16 21:00:07 haproxy03.cs.umd.edu sshd-session[546461]: error: maximum authentication attempts exceeded for seriv from 10.73.255.10 port 46964 ssh2 [preauth]
== hazfs.cs.umd.edu (1 distinct, 1 total) ==
Sep 16 20:28:12 hazfs.cs.umd.edu rpc.mountd[1586325]: /raid/instruct exported to both 10.227.96.0/19 and 10.227.102.0/23, arbitrarily choosing options from first
== idm00 (1 distinct, 1 total) ==
Sep 16 20:53:56 idm00 named[4166701]: client @0x7f11a40029c8 10.73.240.42#52170: update '73.10.in-addr.arpa/IN' denied
== idmp0 (1 distinct, 1 total) ==
Sep 16 20:37:37 idmp0 named[1598691]: client @0x7f2d50000cc8 10.73.240.43#54115: update '73.10.in-addr.arpa/IN' denied
== itmon02 (1 distinct, 6 total) ==
Sep 16 20:13:11 itmon02 sshd[1750555]: error: beginning MaxStartups throttling [x6]
== munin (2 distinct, 16 total) ==
Sep 16 20:23:47 munin sudo[3067098]: pam_systemd(sudo:session): Failed to stat() runtime directory '/run/user/0': No such file or directory [x8]
Sep 16 20:23:47 munin sudo[3067098]: pam_systemd(sudo:session): Not setting $XDG_RUNTIME_DIR, as the directory is not in order. [x8]
== newhonors2 (1 distinct, 24 total) ==
Sep 16 20:13:02 newhonors2 dhcpcd[2736962]: dhcpcd is not running [x24]
== ntop00 (48 distinct, 48 total) ==
Sep 16 20:07:01 ntop00 nfacctd[9667]: INFO ( default_print/print ): *** Purging cache - START (PID: 91) ***
Sep 16 20:07:01 ntop00 nfacctd[9667]: INFO ( default_print/print ): *** Purging cache - END (PID: 91, QN: 0/0, ET: X) ***
Sep 16 20:10:01 ntop00 sfacctd[48024]: INFO ( default_print/print ): *** Purging cache - START (PID: 67) ***
Sep 16 20:10:01 ntop00 sfacctd[48024]: INFO ( default_print/print ): *** Purging cache - END (PID: 67, QN: 5063/5063, ET: 0) ***
Sep 16 20:12:01 ntop00 nfacctd[9667]: INFO ( default_print/print ): *** Purging cache - START (PID: 92) ***
Sep 16 20:12:01 ntop00 nfacctd[9667]: INFO ( default_print/print ): *** Purging cache - END (PID: 92, QN: 0/0, ET: X) ***
Sep 16 20:15:01 ntop00 sfacctd[48024]: INFO ( default_print/print ): *** Purging cache - START (PID: 68) ***
Sep 16 20:15:01 ntop00 sfacctd[48024]: INFO ( default_print/print ): *** Purging cache - END (PID: 68, QN: 5275/5275, ET: 0) ***
Sep 16 20:17:01 ntop00 nfacctd[9667]: INFO ( default_print/print ): *** Purging cache - START (PID: 93) ***
Sep 16 20:17:01 ntop00 nfacctd[9667]: INFO ( default_print/print ): *** Purging cache - END (PID: 93, QN: 0/0, ET: X) ***
Sep 16 20:20:01 ntop00 sfacctd[48024]: INFO ( default_print/print ): *** Purging cache - START (PID: 69) ***
Sep 16 20:20:01 ntop00 sfacctd[48024]: INFO ( default_print/print ): *** Purging cache - END (PID: 69, QN: 5049/5049, ET: 0) ***
Sep 16 20:22:01 ntop00 nfacctd[9667]: INFO ( default_print/print ): *** Purging cache - START (PID: 94) ***
Sep 16 20:22:01 ntop00 nfacctd[9667]: INFO ( default_print/print ): *** Purging cache - END (PID: 94, QN: 0/0, ET: X) ***
Sep 16 20:25:01 ntop00 sfacctd[48024]: INFO ( default_print/print ): *** Purging cache - START (PID: 70) ***
Sep 16 20:25:01 ntop00 sfacctd[48024]: INFO ( default_print/print ): *** Purging cache - END (PID: 70, QN: 5010/5010, ET: 0) ***
Sep 16 20:27:01 ntop00 nfacctd[9667]: INFO ( default_print/print ): *** Purging cache - START (PID: 95) ***
Sep 16 20:27:01 ntop00 nfacctd[9667]: INFO ( default_print/print ): *** Purging cache - END (PID: 95, QN: 0/0, ET: X) ***
Sep 16 20:30:01 ntop00 sfacctd[48024]: INFO ( default_print/print ): *** Purging cache - START (PID: 71) ***
Sep 16 20:30:01 ntop00 sfacctd[48024]: INFO ( default_print/print ): *** Purging cache - END (PID: 71, QN: 5143/5143, ET: 0) ***
Sep 16 20:32:01 ntop00 nfacctd[9667]: INFO ( default_print/print ): *** Purging cache - START (PID: 96) ***
Sep 16 20:32:01 ntop00 nfacctd[9667]: INFO ( default_print/print ): *** Purging cache - END (PID: 96, QN: 0/0, ET: X) ***
Sep 16 20:35:01 ntop00 sfacctd[48024]: INFO ( default_print/print ): *** Purging cache - START (PID: 72) ***
Sep 16 20:35:01 ntop00 sfacctd[48024]: INFO ( default_print/print ): *** Purging cache - END (PID: 72, QN: 5119/5119, ET: 0) ***
Sep 16 20:37:01 ntop00 nfacctd[9667]: INFO ( default_print/print ): *** Purging cache - START (PID: 97) ***
Sep 16 20:37:01 ntop00 nfacctd[9667]: INFO ( default_print/print ): *** Purging cache - END (PID: 97, QN: 0/0, ET: X) ***
Sep 16 20:40:01 ntop00 sfacctd[48024]: INFO ( default_print/print ): *** Purging cache - START (PID: 73) ***
Sep 16 20:40:01 ntop00 sfacctd[48024]: INFO ( default_print/print ): *** Purging cache - END (PID: 73, QN: 5279/5279, ET: 0) ***
Sep 16 20:42:01 ntop00 nfacctd[9667]: INFO ( default_print/print ): *** Purging cache - START (PID: 98) ***
Sep 16 20:42:01 ntop00 nfacctd[9667]: INFO ( default_print/print ): *** Purging cache - END (PID: 98, QN: 0/0, ET: X) ***
... 18 more distinct messages not shown
== outbound00.cs.umd.edu (1 distinct, 6 total) ==
Sep 16 20:09:09 outbound00.cs.umd.edu python3[785482]: ldapdb [x6]
== outbound01.cs.umd.edu (2 distinct, 7 total) ==
Sep 16 20:13:06 outbound01.cs.umd.edu python3[3045477]: ldapdb [x6]
Sep 16 20:55:50 outbound01.cs.umd.edu krb5_child[3055962]: Client 'admin(a)UMD.EDU' not found in Kerberos database
== sentry-docker00.cs.umd.edu (34 distinct, 34 total) ==
Sep 16 20:20:57 sentry-docker00.cs.umd.edu systemd-udevd[1819772]: link_config: could not get ethtool features for vethb9c7a71
Sep 16 20:20:57 sentry-docker00.cs.umd.edu systemd-udevd[1819772]: Could not set offload features of vethb9c7a71: No such device
Sep 16 20:20:58 sentry-docker00.cs.umd.edu systemd-udevd[1819843]: Could not generate persistent MAC address for veth3952511: No such file or directory
Sep 16 20:20:58 sentry-docker00.cs.umd.edu systemd-udevd[1819844]: Could not generate persistent MAC address for vethef8b603: No such file or directory
Sep 16 20:20:58 sentry-docker00.cs.umd.edu systemd-udevd[1819847]: Could not generate persistent MAC address for veth3502993: No such file or directory
Sep 16 20:20:58 sentry-docker00.cs.umd.edu systemd-udevd[1819861]: Could not generate persistent MAC address for veth673a8cd: No such file or directory
Sep 16 20:20:58 sentry-docker00.cs.umd.edu systemd-udevd[1819849]: Could not generate persistent MAC address for veth8e4c501: No such file or directory
Sep 16 20:20:58 sentry-docker00.cs.umd.edu systemd-udevd[1819850]: Could not generate persistent MAC address for veth4950e55: No such file or directory
Sep 16 20:20:58 sentry-docker00.cs.umd.edu systemd-udevd[1819873]: Could not generate persistent MAC address for vethe5730ae: No such file or directory
Sep 16 20:20:58 sentry-docker00.cs.umd.edu systemd-udevd[1819874]: Could not generate persistent MAC address for vetha19be40: No such file or directory
Sep 16 20:20:58 sentry-docker00.cs.umd.edu systemd-udevd[1819894]: Could not generate persistent MAC address for veth986f818: No such file or directory
Sep 16 20:20:58 sentry-docker00.cs.umd.edu systemd-udevd[1819883]: Could not generate persistent MAC address for veth1c2e7b0: No such file or directory
Sep 16 20:41:06 sentry-docker00.cs.umd.edu systemd-udevd[1829222]: link_config: could not get ethtool features for veth986f818
Sep 16 20:41:06 sentry-docker00.cs.umd.edu systemd-udevd[1829222]: Could not set offload features of veth986f818: No such device
Sep 16 20:41:06 sentry-docker00.cs.umd.edu systemd-udevd[1829254]: Could not generate persistent MAC address for veth01aacde: No such file or directory
Sep 16 20:41:06 sentry-docker00.cs.umd.edu systemd-udevd[1829255]: Could not generate persistent MAC address for veth23ab463: No such file or directory
Sep 16 20:41:06 sentry-docker00.cs.umd.edu systemd-udevd[1829258]: Could not generate persistent MAC address for vethb42b1de: No such file or directory
Sep 16 20:41:06 sentry-docker00.cs.umd.edu systemd-udevd[1829280]: Could not generate persistent MAC address for veth11871c7: No such file or directory
Sep 16 20:41:06 sentry-docker00.cs.umd.edu systemd-udevd[1829274]: Could not generate persistent MAC address for veth34b9466: No such file or directory
Sep 16 20:41:06 sentry-docker00.cs.umd.edu systemd-udevd[1829267]: Could not generate persistent MAC address for veth2797e7c: No such file or directory
Sep 16 20:41:06 sentry-docker00.cs.umd.edu systemd-udevd[1829255]: Could not generate persistent MAC address for veth4e76ff8: No such file or directory
Sep 16 20:41:06 sentry-docker00.cs.umd.edu systemd-udevd[1829271]: Could not generate persistent MAC address for vethd7c1c4b: No such file or directory
Sep 16 20:41:06 sentry-docker00.cs.umd.edu systemd-udevd[1829288]: Could not generate persistent MAC address for veth574479b: No such file or directory
Sep 16 20:41:06 sentry-docker00.cs.umd.edu systemd-udevd[1829293]: Could not generate persistent MAC address for veth48a5576: No such file or directory
Sep 16 21:01:14 sentry-docker00.cs.umd.edu systemd-udevd[1838689]: Could not generate persistent MAC address for veth65b7e42: No such file or directory
Sep 16 21:01:14 sentry-docker00.cs.umd.edu systemd-udevd[1838690]: Could not generate persistent MAC address for veth253cb15: No such file or directory
Sep 16 21:01:14 sentry-docker00.cs.umd.edu systemd-udevd[1838693]: Could not generate persistent MAC address for vethe26b29b: No such file or directory
Sep 16 21:01:14 sentry-docker00.cs.umd.edu systemd-udevd[1838694]: Could not generate persistent MAC address for veth03eca26: No such file or directory
Sep 16 21:01:14 sentry-docker00.cs.umd.edu systemd-udevd[1838706]: Could not generate persistent MAC address for veth22256e6: No such file or directory
Sep 16 21:01:14 sentry-docker00.cs.umd.edu systemd-udevd[1838699]: Could not generate persistent MAC address for vethaa00997: No such file or directory
... 4 more distinct messages not shown
== strawberry (7 distinct, 38 total) ==
Sep 16 20:07:03 strawberry kernel: I/O error, dev sda, sector 206848 op 0x0:(READ) flags 0x80700 phys_seg 1 prio class 2 [x6]
Sep 16 20:07:03 strawberry kernel: I/O error, dev sda, sector 206848 op 0x0:(READ) flags 0x0 phys_seg 1 prio class 2 [x6]
Sep 16 20:07:03 strawberry kernel: Buffer I/O error on dev sda2, logical block 0, async page read [x6]
Sep 16 20:07:03 strawberry kernel: I/O error, dev sda, sector 2048 op 0x0:(READ) flags 0x80700 phys_seg 1 prio class 2 [x6]
Sep 16 20:07:03 strawberry kernel: I/O error, dev sda, sector 2048 op 0x0:(READ) flags 0x0 phys_seg 1 prio class 2 [x6]
Sep 16 20:07:03 strawberry kernel: Buffer I/O error on dev sda1, logical block 0, async page read [x6]
Sep 16 20:34:42 strawberry smartd[5314]: Device: /dev/sda [SAT], failed to read SMART Attribute Data [x2]
== submit26-b9-f1 (1 distinct, 1 total) ==
Sep 16 20:26:56 submit26-b9-f1 systemd[1]: user(a)1001.service: Main process exited, code=killed, status=9/KILL
== submit26-b9-f2 (1 distinct, 1 total) ==
Sep 16 20:14:12 submit26-b9-f2 systemd[1]: user(a)1001.service: Main process exited, code=killed, status=9/KILL
== submit26-b9-f3 (1 distinct, 1 total) ==
Sep 16 20:47:05 submit26-b9-f3 systemd[1]: user(a)1001.service: Main process exited, code=killed, status=9/KILL
== yogurt (1 distinct, 23 total) ==
Sep 16 20:29:20 yogurt kernel: [drm:radeon_gem_va_update_vm [radeon]] *ERROR* Couldn't update BO_VA (-4) [x23]
1
0
Command: /usr/local/sbin/syslog-digest.py
Time : 0.0437s
Status : exited 0
Output :
Syslog digest — 2026-09-16 20:05 EDT
Processed 1,784 lines, filtered 1,368 (76%). 416 unknown (123 distinct) from 18 host(s).
== b0b02.cs.umd.edu (1 distinct, 1 total) ==
Sep 16 19:46:53 b0b02.cs.umd.edu rustdesk[1895420]: cannot open display:
== biggulp.cs.umd.edu (4 distinct, 6 total) ==
Sep 16 19:10:37 biggulp.cs.umd.edu sshd-session[1852640]: pam_access(sshd:auth): access denied for user `root' from `158.173.89.129' [x2]
Sep 16 19:10:39 biggulp.cs.umd.edu sshd-session[1852638]: error: PAM: Authentication failure for root from 158.173.89.129 [x2]
Sep 16 20:01:01 biggulp.cs.umd.edu sshd-session[1864456]: pam_access(sshd:auth): access denied for user `root' from `158.173.89.41'
Sep 16 20:01:04 biggulp.cs.umd.edu sshd-session[1864441]: error: PAM: Authentication failure for root from 158.173.89.41
== cheezit.cs.umd.edu (1 distinct, 1 total) ==
Sep 16 19:49:56 cheezit.cs.umd.edu sshd-session[4168205]: pam_access(sshd:auth): access denied for user `egolub' from `108.28.255.142'
== csfw00a (1 distinct, 145 total) ==
Sep 16 19:03:52 csfw00a kernel: bnxt_en 0000:09:00.0 eth3: NIC Link is Down [x145]
== hazfs.cs.umd.edu (11 distinct, 66 total) ==
Sep 16 19:58:29 hazfs.cs.umd.edu snmpd[1431]: send response: Failure in sendto [x6]
Sep 16 19:58:29 hazfs.cs.umd.edu snmpd[1431]: -- NET-SNMP-EXTEND-MIB::nsExtendStatus."userweb" [x6]
Sep 16 19:58:29 hazfs.cs.umd.edu snmpd[1431]: -- NET-SNMP-EXTEND-MIB::nsExtendStatus."zfslist" [x6]
Sep 16 19:58:29 hazfs.cs.umd.edu snmpd[1431]: -- NET-SNMP-EXTEND-MIB::nsExtendStatus."userhome" [x6]
Sep 16 19:58:29 hazfs.cs.umd.edu snmpd[1431]: -- NET-SNMP-EXTEND-MIB::nsExtendOutput1Line."userweb" [x6]
Sep 16 19:58:29 hazfs.cs.umd.edu snmpd[1431]: -- NET-SNMP-EXTEND-MIB::nsExtendOutput1Line."zfslist" [x6]
Sep 16 19:58:29 hazfs.cs.umd.edu snmpd[1431]: -- NET-SNMP-EXTEND-MIB::nsExtendOutput1Line."userhome" [x6]
Sep 16 19:58:29 hazfs.cs.umd.edu snmpd[1431]: -- NET-SNMP-EXTEND-MIB::nsExtendOutputFull."userweb" [x6]
Sep 16 19:58:29 hazfs.cs.umd.edu snmpd[1431]: -- NET-SNMP-EXTEND-MIB::nsExtendOutputFull."zfslist" [x6]
Sep 16 19:58:29 hazfs.cs.umd.edu snmpd[1431]: -- NET-SNMP-EXTEND-MIB::nsExtendOutputFull."userhome" [x6]
Sep 16 19:58:29 hazfs.cs.umd.edu snmpd[1431]: -- NET-SNMP-EXTEND-MIB::nsExtendOutNumLines."userweb" [x6]
== idm00 (1 distinct, 1 total) ==
Sep 16 19:53:56 idm00 named[4166701]: client @0x7f11a4042778 10.73.240.42#61150: update '73.10.in-addr.arpa/IN' denied
== idmp0 (1 distinct, 1 total) ==
Sep 16 19:37:37 idmp0 named[1598691]: client @0x7f2d20000cc8 10.73.240.43#57234: update '73.10.in-addr.arpa/IN' denied
== inbound01.cs.umd.edu (4 distinct, 22 total) ==
Sep 16 19:06:09 inbound01.cs.umd.edu krb5_child[3113444]: Preauthentication failed
Sep 16 19:06:22 inbound01.cs.umd.edu krb5_child[3113459]: Client 'admin(a)UMD.EDU' not found in Kerberos database [x19]
Sep 16 19:07:40 inbound01.cs.umd.edu krb5_child[3113745]: Client 'test1(a)UMD.EDU' not found in Kerberos database
Sep 16 19:27:17 inbound01.cs.umd.edu krb5_child[3118899]: Client 'wesley(a)UMD.EDU' not found in Kerberos database
== itmon02 (1 distinct, 6 total) ==
Sep 16 19:23:36 itmon02 sshd[1750555]: error: beginning MaxStartups throttling [x6]
== munin (2 distinct, 6 total) ==
Sep 16 19:08:50 munin sudo[3041396]: pam_systemd(sudo:session): Failed to stat() runtime directory '/run/user/0': No such file or directory [x3]
Sep 16 19:08:50 munin sudo[3041396]: pam_systemd(sudo:session): Not setting $XDG_RUNTIME_DIR, as the directory is not in order. [x3]
== newhonors2 (1 distinct, 24 total) ==
Sep 16 19:13:03 newhonors2 dhcpcd[2735122]: dhcpcd is not running [x24]
== ntop00 (48 distinct, 48 total) ==
Sep 16 19:07:01 ntop00 nfacctd[9667]: INFO ( default_print/print ): *** Purging cache - START (PID: 79) ***
Sep 16 19:07:01 ntop00 nfacctd[9667]: INFO ( default_print/print ): *** Purging cache - END (PID: 79, QN: 0/0, ET: X) ***
Sep 16 19:10:01 ntop00 sfacctd[48024]: INFO ( default_print/print ): *** Purging cache - START (PID: 55) ***
Sep 16 19:10:01 ntop00 sfacctd[48024]: INFO ( default_print/print ): *** Purging cache - END (PID: 55, QN: 1798/1798, ET: 0) ***
Sep 16 19:12:01 ntop00 nfacctd[9667]: INFO ( default_print/print ): *** Purging cache - START (PID: 80) ***
Sep 16 19:12:01 ntop00 nfacctd[9667]: INFO ( default_print/print ): *** Purging cache - END (PID: 80, QN: 0/0, ET: X) ***
Sep 16 19:15:01 ntop00 sfacctd[48024]: INFO ( default_print/print ): *** Purging cache - START (PID: 56) ***
Sep 16 19:15:01 ntop00 sfacctd[48024]: INFO ( default_print/print ): *** Purging cache - END (PID: 56, QN: 1709/1709, ET: 0) ***
Sep 16 19:17:01 ntop00 nfacctd[9667]: INFO ( default_print/print ): *** Purging cache - START (PID: 81) ***
Sep 16 19:17:01 ntop00 nfacctd[9667]: INFO ( default_print/print ): *** Purging cache - END (PID: 81, QN: 0/0, ET: X) ***
Sep 16 19:20:01 ntop00 sfacctd[48024]: INFO ( default_print/print ): *** Purging cache - START (PID: 57) ***
Sep 16 19:20:01 ntop00 sfacctd[48024]: INFO ( default_print/print ): *** Purging cache - END (PID: 57, QN: 1855/1855, ET: 0) ***
Sep 16 19:22:01 ntop00 nfacctd[9667]: INFO ( default_print/print ): *** Purging cache - START (PID: 82) ***
Sep 16 19:22:01 ntop00 nfacctd[9667]: INFO ( default_print/print ): *** Purging cache - END (PID: 82, QN: 0/0, ET: X) ***
Sep 16 19:25:01 ntop00 sfacctd[48024]: INFO ( default_print/print ): *** Purging cache - START (PID: 58) ***
Sep 16 19:25:01 ntop00 sfacctd[48024]: INFO ( default_print/print ): *** Purging cache - END (PID: 58, QN: 5127/5127, ET: 0) ***
Sep 16 19:27:01 ntop00 nfacctd[9667]: INFO ( default_print/print ): *** Purging cache - START (PID: 83) ***
Sep 16 19:27:01 ntop00 nfacctd[9667]: INFO ( default_print/print ): *** Purging cache - END (PID: 83, QN: 0/0, ET: X) ***
Sep 16 19:30:01 ntop00 sfacctd[48024]: INFO ( default_print/print ): *** Purging cache - START (PID: 59) ***
Sep 16 19:30:01 ntop00 sfacctd[48024]: INFO ( default_print/print ): *** Purging cache - END (PID: 59, QN: 6792/6792, ET: 0) ***
Sep 16 19:32:02 ntop00 nfacctd[9667]: INFO ( default_print/print ): *** Purging cache - START (PID: 84) ***
Sep 16 19:32:02 ntop00 nfacctd[9667]: INFO ( default_print/print ): *** Purging cache - END (PID: 84, QN: 0/0, ET: X) ***
Sep 16 19:35:01 ntop00 sfacctd[48024]: INFO ( default_print/print ): *** Purging cache - START (PID: 60) ***
Sep 16 19:35:01 ntop00 sfacctd[48024]: INFO ( default_print/print ): *** Purging cache - END (PID: 60, QN: 4272/4272, ET: 0) ***
Sep 16 19:37:01 ntop00 nfacctd[9667]: INFO ( default_print/print ): *** Purging cache - START (PID: 85) ***
Sep 16 19:37:01 ntop00 nfacctd[9667]: INFO ( default_print/print ): *** Purging cache - END (PID: 85, QN: 0/0, ET: X) ***
Sep 16 19:40:01 ntop00 sfacctd[48024]: INFO ( default_print/print ): *** Purging cache - START (PID: 61) ***
Sep 16 19:40:01 ntop00 sfacctd[48024]: INFO ( default_print/print ): *** Purging cache - END (PID: 61, QN: 9088/9088, ET: 0) ***
Sep 16 19:42:01 ntop00 nfacctd[9667]: INFO ( default_print/print ): *** Purging cache - START (PID: 86) ***
Sep 16 19:42:01 ntop00 nfacctd[9667]: INFO ( default_print/print ): *** Purging cache - END (PID: 86, QN: 0/0, ET: X) ***
... 18 more distinct messages not shown
== outbound00.cs.umd.edu (1 distinct, 6 total) ==
Sep 16 19:09:09 outbound00.cs.umd.edu python3[771587]: ldapdb [x6]
== outbound01.cs.umd.edu (1 distinct, 6 total) ==
Sep 16 19:13:06 outbound01.cs.umd.edu python3[3031522]: ldapdb [x6]
== sentry-docker00.cs.umd.edu (36 distinct, 36 total) ==
Sep 16 19:20:32 sentry-docker00.cs.umd.edu systemd-udevd[1791551]: link_config: could not get ethtool features for veth03543c0
Sep 16 19:20:32 sentry-docker00.cs.umd.edu systemd-udevd[1791551]: Could not set offload features of veth03543c0: No such device
Sep 16 19:20:33 sentry-docker00.cs.umd.edu systemd-udevd[1791584]: Could not generate persistent MAC address for veth860cdf3: No such file or directory
Sep 16 19:20:33 sentry-docker00.cs.umd.edu systemd-udevd[1791585]: Could not generate persistent MAC address for vethc45ed71: No such file or directory
Sep 16 19:20:33 sentry-docker00.cs.umd.edu systemd-udevd[1791588]: Could not generate persistent MAC address for vethcf9497d: No such file or directory
Sep 16 19:20:33 sentry-docker00.cs.umd.edu systemd-udevd[1791589]: Could not generate persistent MAC address for vethab97785: No such file or directory
Sep 16 19:20:33 sentry-docker00.cs.umd.edu systemd-udevd[1791595]: Could not generate persistent MAC address for vetha750d4b: No such file or directory
Sep 16 19:20:33 sentry-docker00.cs.umd.edu systemd-udevd[1791598]: Could not generate persistent MAC address for veth7b2ef0f: No such file or directory
Sep 16 19:20:33 sentry-docker00.cs.umd.edu systemd-udevd[1791614]: Could not generate persistent MAC address for veth4cf86a0: No such file or directory
Sep 16 19:20:33 sentry-docker00.cs.umd.edu systemd-udevd[1791615]: Could not generate persistent MAC address for veth3705c8d: No such file or directory
Sep 16 19:20:33 sentry-docker00.cs.umd.edu systemd-udevd[1791633]: Could not generate persistent MAC address for vethf958fe4: No such file or directory
Sep 16 19:20:33 sentry-docker00.cs.umd.edu systemd-udevd[1791615]: Could not generate persistent MAC address for veth064ebc2: No such file or directory
Sep 16 19:40:41 sentry-docker00.cs.umd.edu systemd-udevd[1800671]: link_config: could not get ethtool features for veth4cf86a0
Sep 16 19:40:41 sentry-docker00.cs.umd.edu systemd-udevd[1800671]: Could not set offload features of veth4cf86a0: No such device
Sep 16 19:40:41 sentry-docker00.cs.umd.edu systemd-udevd[1800701]: Could not generate persistent MAC address for vethbc2e08a: No such file or directory
Sep 16 19:40:41 sentry-docker00.cs.umd.edu systemd-udevd[1800702]: Could not generate persistent MAC address for veth8783c81: No such file or directory
Sep 16 19:40:41 sentry-docker00.cs.umd.edu systemd-udevd[1800705]: Could not generate persistent MAC address for veth0d4033e: No such file or directory
Sep 16 19:40:41 sentry-docker00.cs.umd.edu systemd-udevd[1800706]: Could not generate persistent MAC address for vethbcda6c5: No such file or directory
Sep 16 19:40:41 sentry-docker00.cs.umd.edu systemd-udevd[1800729]: Could not generate persistent MAC address for veth5b25de3: No such file or directory
Sep 16 19:40:41 sentry-docker00.cs.umd.edu systemd-udevd[1800730]: Could not generate persistent MAC address for veth44174d5: No such file or directory
Sep 16 19:40:41 sentry-docker00.cs.umd.edu systemd-udevd[1800732]: Could not generate persistent MAC address for vethdf411a6: No such file or directory
Sep 16 19:40:41 sentry-docker00.cs.umd.edu systemd-udevd[1800733]: Could not generate persistent MAC address for veth6779eb0: No such file or directory
Sep 16 19:40:41 sentry-docker00.cs.umd.edu systemd-udevd[1800761]: Could not generate persistent MAC address for vethc7b101f: No such file or directory
Sep 16 19:40:41 sentry-docker00.cs.umd.edu systemd-udevd[1800765]: Could not generate persistent MAC address for veth1de8568: No such file or directory
Sep 16 20:00:49 sentry-docker00.cs.umd.edu systemd-udevd[1810111]: link_config: could not get ethtool features for vethdf411a6
Sep 16 20:00:49 sentry-docker00.cs.umd.edu systemd-udevd[1810111]: Could not set offload features of vethdf411a6: No such device
Sep 16 20:00:49 sentry-docker00.cs.umd.edu systemd-udevd[1810146]: Could not generate persistent MAC address for veth4c24588: No such file or directory
Sep 16 20:00:49 sentry-docker00.cs.umd.edu systemd-udevd[1810147]: Could not generate persistent MAC address for veth51b5b1f: No such file or directory
Sep 16 20:00:49 sentry-docker00.cs.umd.edu systemd-udevd[1810150]: Could not generate persistent MAC address for veth9536f3e: No such file or directory
Sep 16 20:00:49 sentry-docker00.cs.umd.edu systemd-udevd[1810147]: Could not generate persistent MAC address for veth289ce04: No such file or directory
... 6 more distinct messages not shown
== strawberry (7 distinct, 38 total) ==
Sep 16 19:07:04 strawberry kernel: I/O error, dev sda, sector 206848 op 0x0:(READ) flags 0x80700 phys_seg 1 prio class 2 [x6]
Sep 16 19:07:04 strawberry kernel: I/O error, dev sda, sector 206848 op 0x0:(READ) flags 0x0 phys_seg 1 prio class 2 [x6]
Sep 16 19:07:04 strawberry kernel: Buffer I/O error on dev sda2, logical block 0, async page read [x6]
Sep 16 19:07:04 strawberry kernel: I/O error, dev sda, sector 2048 op 0x0:(READ) flags 0x80700 phys_seg 1 prio class 2 [x6]
Sep 16 19:07:04 strawberry kernel: I/O error, dev sda, sector 2048 op 0x0:(READ) flags 0x0 phys_seg 1 prio class 2 [x6]
Sep 16 19:07:04 strawberry kernel: Buffer I/O error on dev sda1, logical block 0, async page read [x6]
Sep 16 19:34:42 strawberry smartd[5314]: Device: /dev/sda [SAT], failed to read SMART Attribute Data [x2]
== submit26-b9-f4 (1 distinct, 2 total) ==
Sep 16 19:33:06 submit26-b9-f4 systemd[1]: user(a)1001.service: Main process exited, code=killed, status=9/KILL [x2]
== wraith (1 distinct, 1 total) ==
Sep 16 19:35:11 wraith kernel: kauditd_printk_skb: 29 callbacks suppressed
1
0
Command: /usr/local/sbin/syslog-digest.py
Time : 0.0440s
Status : exited 0
Output :
Syslog digest — 2026-09-16 19:05 EDT
Processed 1,872 lines, filtered 1,522 (81%). 350 unknown (137 distinct) from 19 host(s).
== b0b02.cs.umd.edu (4 distinct, 4 total) ==
Sep 16 18:10:59 b0b02.cs.umd.edu csregistry[5224]: time="2026-09-16T22:10:59.424627816Z" level=info msg="PurgeUploads starting: olderThan=2026-09-09 22:10:59.424513292 +0000 UTC m=+3803820.184441630, actuallyDelete=true"
Sep 16 18:10:59 b0b02.cs.umd.edu csregistry[5224]: time="2026-09-16T22:10:59.425235721Z" level=info msg="Purge uploads finished. Num deleted=0, num errors=1"
Sep 16 18:10:59 b0b02.cs.umd.edu csregistry[5224]: time="2026-09-16T22:10:59.425260779Z" level=info msg="Starting upload purge in 24h0m0s" go.version=go1.11.2 instance.id=68469aa4-7857-4a69-bf12-c2190b4f96d8 service=registry version=v2.7.1
Sep 16 18:46:49 b0b02.cs.umd.edu rustdesk[1880279]: cannot open display:
== biggulp.cs.umd.edu (3 distinct, 3 total) ==
Sep 16 18:20:57 biggulp.cs.umd.edu sshd-session[1844007]: pam_access(sshd:auth): access denied for user `root' from `158.173.89.129'
Sep 16 18:20:59 biggulp.cs.umd.edu sshd-session[1844005]: error: PAM: Authentication failure for root from 158.173.89.129
Sep 16 18:28:42 biggulp.cs.umd.edu sshd-session[1845813]: pam_access(sshd:auth): access denied for user `rztao' from `71.178.33.59'
== csfw00a (2 distinct, 135 total) ==
Sep 16 18:03:58 csfw00a kernel: bnxt_en 0000:09:00.0 eth3: NIC Link is Down [x133]
Sep 16 18:36:23 csfw00a ospf6d[1477]: [EC 100663307] Could not send entire message [x2]
== galax (1 distinct, 1 total) ==
Sep 16 18:17:54 galax kernel: workqueue: dm_irq_work_func [amdgpu] hogged CPU for >10000us 2051 times, consider switching to WQ_UNBOUND
== hazfs.cs.umd.edu (1 distinct, 1 total) ==
Sep 16 18:12:01 hazfs.cs.umd.edu rpc.mountd[1586325]: /export/home exported to both 10.73.255.0/24 and 10.73.0.0/16, arbitrarily choosing options from first
== idm00 (1 distinct, 1 total) ==
Sep 16 18:53:56 idm00 named[4166701]: client @0x7f11a93f3e08 10.73.240.42#60262: update '73.10.in-addr.arpa/IN' denied
== idmp0 (1 distinct, 1 total) ==
Sep 16 18:37:37 idmp0 named[1598691]: client @0x7f2d20030738 10.73.240.43#57744: update '73.10.in-addr.arpa/IN' denied
== inbound01.cs.umd.edu (3 distinct, 15 total) ==
Sep 16 18:47:17 inbound01.cs.umd.edu krb5_child[3108141]: Client 'admin(a)UMD.EDU' not found in Kerberos database [x12]
Sep 16 18:50:22 inbound01.cs.umd.edu krb5_child[3108852]: Client 'massa(a)UMD.EDU' not found in Kerberos database
Sep 16 18:54:21 inbound01.cs.umd.edu krb5_child[3109707]: Preauthentication failed [x2]
== itmon02 (1 distinct, 1 total) ==
Sep 16 18:58:45 itmon02 sshd[1750555]: error: beginning MaxStartups throttling
== krispykreme.cs.umd.edu (1 distinct, 1 total) ==
Sep 16 19:03:14 krispykreme.cs.umd.edu sshd-session[3003841]: pam_access(sshd:auth): access denied for user `pugh' from `108.45.150.204'
== munin (2 distinct, 2 total) ==
Sep 16 19:03:11 munin sudo[3038995]: pam_systemd(sudo:session): Failed to stat() runtime directory '/run/user/0': No such file or directory
Sep 16 19:03:11 munin sudo[3038995]: pam_systemd(sudo:session): Not setting $XDG_RUNTIME_DIR, as the directory is not in order.
== newhonors2 (1 distinct, 24 total) ==
Sep 16 18:13:03 newhonors2 dhcpcd[2733281]: dhcpcd is not running [x24]
== ntop00 (50 distinct, 50 total) ==
Sep 16 18:05:01 ntop00 sfacctd[48024]: INFO ( default_print/print ): *** Purging cache - START (PID: 42) ***
Sep 16 18:05:01 ntop00 sfacctd[48024]: INFO ( default_print/print ): *** Purging cache - END (PID: 42, QN: 3130/3130, ET: 0) ***
Sep 16 18:07:01 ntop00 nfacctd[9667]: INFO ( default_print/print ): *** Purging cache - START (PID: 67) ***
Sep 16 18:07:01 ntop00 nfacctd[9667]: INFO ( default_print/print ): *** Purging cache - END (PID: 67, QN: 0/0, ET: X) ***
Sep 16 18:10:01 ntop00 sfacctd[48024]: INFO ( default_print/print ): *** Purging cache - START (PID: 43) ***
Sep 16 18:10:01 ntop00 sfacctd[48024]: INFO ( default_print/print ): *** Purging cache - END (PID: 43, QN: 3295/3295, ET: 0) ***
Sep 16 18:12:01 ntop00 nfacctd[9667]: INFO ( default_print/print ): *** Purging cache - START (PID: 68) ***
Sep 16 18:12:01 ntop00 nfacctd[9667]: INFO ( default_print/print ): *** Purging cache - END (PID: 68, QN: 0/0, ET: X) ***
Sep 16 18:15:01 ntop00 sfacctd[48024]: INFO ( default_print/print ): *** Purging cache - START (PID: 44) ***
Sep 16 18:15:01 ntop00 sfacctd[48024]: INFO ( default_print/print ): *** Purging cache - END (PID: 44, QN: 2608/2608, ET: 0) ***
Sep 16 18:17:01 ntop00 nfacctd[9667]: INFO ( default_print/print ): *** Purging cache - START (PID: 69) ***
Sep 16 18:17:01 ntop00 nfacctd[9667]: INFO ( default_print/print ): *** Purging cache - END (PID: 69, QN: 0/0, ET: X) ***
Sep 16 18:20:01 ntop00 sfacctd[48024]: INFO ( default_print/print ): *** Purging cache - START (PID: 45) ***
Sep 16 18:20:01 ntop00 sfacctd[48024]: INFO ( default_print/print ): *** Purging cache - END (PID: 45, QN: 1592/1592, ET: 0) ***
Sep 16 18:22:01 ntop00 nfacctd[9667]: INFO ( default_print/print ): *** Purging cache - START (PID: 70) ***
Sep 16 18:22:01 ntop00 nfacctd[9667]: INFO ( default_print/print ): *** Purging cache - END (PID: 70, QN: 0/0, ET: X) ***
Sep 16 18:25:01 ntop00 sfacctd[48024]: INFO ( default_print/print ): *** Purging cache - START (PID: 46) ***
Sep 16 18:25:01 ntop00 sfacctd[48024]: INFO ( default_print/print ): *** Purging cache - END (PID: 46, QN: 1657/1657, ET: 0) ***
Sep 16 18:27:01 ntop00 nfacctd[9667]: INFO ( default_print/print ): *** Purging cache - START (PID: 71) ***
Sep 16 18:27:01 ntop00 nfacctd[9667]: INFO ( default_print/print ): *** Purging cache - END (PID: 71, QN: 0/0, ET: X) ***
Sep 16 18:30:01 ntop00 sfacctd[48024]: INFO ( default_print/print ): *** Purging cache - START (PID: 47) ***
Sep 16 18:30:01 ntop00 sfacctd[48024]: INFO ( default_print/print ): *** Purging cache - END (PID: 47, QN: 1826/1826, ET: 0) ***
Sep 16 18:32:01 ntop00 nfacctd[9667]: INFO ( default_print/print ): *** Purging cache - START (PID: 72) ***
Sep 16 18:32:01 ntop00 nfacctd[9667]: INFO ( default_print/print ): *** Purging cache - END (PID: 72, QN: 0/0, ET: X) ***
Sep 16 18:35:01 ntop00 sfacctd[48024]: INFO ( default_print/print ): *** Purging cache - START (PID: 48) ***
Sep 16 18:35:01 ntop00 sfacctd[48024]: INFO ( default_print/print ): *** Purging cache - END (PID: 48, QN: 1783/1783, ET: 0) ***
Sep 16 18:37:01 ntop00 nfacctd[9667]: INFO ( default_print/print ): *** Purging cache - START (PID: 73) ***
Sep 16 18:37:01 ntop00 nfacctd[9667]: INFO ( default_print/print ): *** Purging cache - END (PID: 73, QN: 0/0, ET: X) ***
Sep 16 18:40:01 ntop00 sfacctd[48024]: INFO ( default_print/print ): *** Purging cache - START (PID: 49) ***
Sep 16 18:40:01 ntop00 sfacctd[48024]: INFO ( default_print/print ): *** Purging cache - END (PID: 49, QN: 1650/1650, ET: 0) ***
... 20 more distinct messages not shown
== outbound00.cs.umd.edu (1 distinct, 6 total) ==
Sep 16 18:09:09 outbound00.cs.umd.edu python3[757502]: ldapdb [x6]
== outbound01.cs.umd.edu (1 distinct, 6 total) ==
Sep 16 18:13:06 outbound01.cs.umd.edu python3[3017635]: ldapdb [x6]
== sentry-docker00.cs.umd.edu (38 distinct, 38 total) ==
Sep 16 18:20:07 sentry-docker00.cs.umd.edu systemd-udevd[1762954]: link_config: could not get ethtool features for veth350ab34
Sep 16 18:20:07 sentry-docker00.cs.umd.edu systemd-udevd[1762954]: Could not set offload features of veth350ab34: No such device
Sep 16 18:20:08 sentry-docker00.cs.umd.edu systemd-udevd[1762989]: Could not generate persistent MAC address for veth3e30455: No such file or directory
Sep 16 18:20:08 sentry-docker00.cs.umd.edu systemd-udevd[1762990]: Could not generate persistent MAC address for veth2b5a155: No such file or directory
Sep 16 18:20:08 sentry-docker00.cs.umd.edu systemd-udevd[1762993]: Could not generate persistent MAC address for veth36e84a9: No such file or directory
Sep 16 18:20:08 sentry-docker00.cs.umd.edu systemd-udevd[1762994]: Could not generate persistent MAC address for veth368cb4e: No such file or directory
Sep 16 18:20:08 sentry-docker00.cs.umd.edu systemd-udevd[1763018]: Could not generate persistent MAC address for vethd77a1a5: No such file or directory
Sep 16 18:20:08 sentry-docker00.cs.umd.edu systemd-udevd[1763017]: Could not generate persistent MAC address for vethd794555: No such file or directory
Sep 16 18:20:08 sentry-docker00.cs.umd.edu systemd-udevd[1763017]: Could not generate persistent MAC address for veth797a47f: No such file or directory
Sep 16 18:20:08 sentry-docker00.cs.umd.edu systemd-udevd[1763026]: Could not generate persistent MAC address for veth8b0295e: No such file or directory
Sep 16 18:20:08 sentry-docker00.cs.umd.edu systemd-udevd[1763017]: Could not generate persistent MAC address for veth4e60020: No such file or directory
Sep 16 18:20:08 sentry-docker00.cs.umd.edu systemd-udevd[1763042]: Could not generate persistent MAC address for vetha5df13e: No such file or directory
Sep 16 18:40:16 sentry-docker00.cs.umd.edu systemd-udevd[1772375]: link_config: could not get ethtool features for veth797a47f
Sep 16 18:40:16 sentry-docker00.cs.umd.edu systemd-udevd[1772375]: Could not set offload features of veth797a47f: No such device
Sep 16 18:40:16 sentry-docker00.cs.umd.edu systemd-udevd[1772401]: Could not generate persistent MAC address for veth4374c39: No such file or directory
Sep 16 18:40:16 sentry-docker00.cs.umd.edu systemd-udevd[1772402]: Could not generate persistent MAC address for veth99a41bb: No such file or directory
Sep 16 18:40:16 sentry-docker00.cs.umd.edu systemd-udevd[1772424]: Could not generate persistent MAC address for veth92d483b: No such file or directory
Sep 16 18:40:16 sentry-docker00.cs.umd.edu systemd-udevd[1772418]: Could not generate persistent MAC address for veth3ef37fe: No such file or directory
Sep 16 18:40:16 sentry-docker00.cs.umd.edu systemd-udevd[1772424]: Could not generate persistent MAC address for veth37e12f6: No such file or directory
Sep 16 18:40:16 sentry-docker00.cs.umd.edu systemd-udevd[1772418]: Could not generate persistent MAC address for veth98ee242: No such file or directory
Sep 16 18:40:16 sentry-docker00.cs.umd.edu systemd-udevd[1772418]: Could not generate persistent MAC address for veth2bbc7b4: No such file or directory
Sep 16 18:40:16 sentry-docker00.cs.umd.edu systemd-udevd[1772416]: Could not generate persistent MAC address for veth2f384f3: No such file or directory
Sep 16 18:40:16 sentry-docker00.cs.umd.edu systemd-udevd[1772497]: Could not generate persistent MAC address for vethc5ddb01: No such file or directory
Sep 16 18:40:16 sentry-docker00.cs.umd.edu systemd-udevd[1772499]: Could not generate persistent MAC address for vethe0ca0d8: No such file or directory
Sep 16 19:00:24 sentry-docker00.cs.umd.edu systemd-udevd[1781844]: link_config: could not get ethtool features for veth4374c39
Sep 16 19:00:24 sentry-docker00.cs.umd.edu systemd-udevd[1781844]: Could not set offload features of veth4374c39: No such device
Sep 16 19:00:24 sentry-docker00.cs.umd.edu systemd-udevd[1781933]: link_config: could not get ethtool features for veth98ee242
Sep 16 19:00:24 sentry-docker00.cs.umd.edu systemd-udevd[1781933]: Could not set offload features of veth98ee242: No such device
Sep 16 19:00:24 sentry-docker00.cs.umd.edu systemd-udevd[1781959]: Could not generate persistent MAC address for veth9c73725: No such file or directory
Sep 16 19:00:24 sentry-docker00.cs.umd.edu systemd-udevd[1781960]: Could not generate persistent MAC address for vetha31b202: No such file or directory
... 8 more distinct messages not shown
== strawberry (7 distinct, 38 total) ==
Sep 16 18:07:04 strawberry kernel: I/O error, dev sda, sector 206848 op 0x0:(READ) flags 0x80700 phys_seg 1 prio class 2 [x6]
Sep 16 18:07:04 strawberry kernel: I/O error, dev sda, sector 206848 op 0x0:(READ) flags 0x0 phys_seg 1 prio class 2 [x6]
Sep 16 18:07:04 strawberry kernel: Buffer I/O error on dev sda2, logical block 0, async page read [x6]
Sep 16 18:07:04 strawberry kernel: I/O error, dev sda, sector 2048 op 0x0:(READ) flags 0x80700 phys_seg 1 prio class 2 [x6]
Sep 16 18:07:04 strawberry kernel: I/O error, dev sda, sector 2048 op 0x0:(READ) flags 0x0 phys_seg 1 prio class 2 [x6]
Sep 16 18:07:04 strawberry kernel: Buffer I/O error on dev sda1, logical block 0, async page read [x6]
Sep 16 18:34:42 strawberry smartd[5314]: Device: /dev/sda [SAT], failed to read SMART Attribute Data [x2]
== submit26-b9-f1 (10 distinct, 14 total) ==
Sep 16 18:25:52 submit26-b9-f1 setroubleshoot[1990259]: SELinux is preventing /usr/bin/python3.9 from create access on the directory /(null). For complete SELinux messages run: sealert -l 3ef7d677-731f-46bf-9c34-c2c55fea665c [x2]
Sep 16 18:25:52 submit26-b9-f1 setroubleshoot[1990259]: SELinux is preventing /usr/bin/python3.9 from add_name access on the directory /(null). For complete SELinux messages run: sealert -l aa60e26f-72e1-45f1-bc12-aa8b3b669e36 [x2]
Sep 16 18:25:52 submit26-b9-f1 setroubleshoot[1990259]: SELinux is preventing /usr/bin/python3.9 from create access on the file /(null). For complete SELinux messages run: sealert -l d088fb43-23ee-4ae8-ae6a-5d1c041ee2d6
Sep 16 18:25:52 submit26-b9-f1 setroubleshoot[1990259]: SELinux is preventing /usr/bin/python3.9 from open access on the file /tmp/libdnf.RwCaHw/repodata/repomd.xml. For complete SELinux messages run: sealert -l 3b0d8c9a-6637-4d6e-a864-f1dd7c00377d
Sep 16 18:25:52 submit26-b9-f1 setroubleshoot[1990259]: SELinux is preventing /usr/bin/python3.9 from setattr access on the file repomd.xml. For complete SELinux messages run: sealert -l 0fd3339f-3ef2-45f3-9e58-65a58b42f3ee
Sep 16 18:25:52 submit26-b9-f1 setroubleshoot[1990259]: SELinux is preventing /usr/bin/python3.9 from read access on the directory libdnf.RwCaHw. For complete SELinux messages run: sealert -l 0d661d88-dc9e-469d-986b-52e29b353aa8
Sep 16 18:25:52 submit26-b9-f1 setroubleshoot[1990259]: SELinux is preventing /usr/bin/python3.9 from remove_name access on the directory repomd.xml. For complete SELinux messages run: sealert -l 405a8556-cf9f-4ef4-8525-0dca18d4259d [x2]
Sep 16 18:25:52 submit26-b9-f1 setroubleshoot[1990259]: SELinux is preventing /usr/bin/python3.9 from unlink access on the file repomd.xml. For complete SELinux messages run: sealert -l 3c38e23e-3631-4cb5-81c7-992675c836d9
Sep 16 18:25:52 submit26-b9-f1 setroubleshoot[1990259]: SELinux is preventing /usr/bin/python3.9 from rmdir access on the directory repodata. For complete SELinux messages run: sealert -l a070e9b5-2867-47d6-b2e3-3b7d99725848 [x2]
Sep 16 18:25:53 submit26-b9-f1 setroubleshoot[1990259]: SELinux is preventing /usr/bin/python3.9 from read access on the directory libdnf.jF46RB. For complete SELinux messages run: sealert -l 0d661d88-dc9e-469d-986b-52e29b353aa8
== submit26-b9-f2 (9 distinct, 9 total) ==
Sep 16 18:06:48 submit26-b9-f2 setroubleshoot[1124468]: SELinux is preventing /usr/bin/python3.9 from create access on the directory /(null). For complete SELinux messages run: sealert -l 0659d546-3107-4f75-b00f-008c85f41dc6
Sep 16 18:06:48 submit26-b9-f2 setroubleshoot[1124468]: SELinux is preventing /usr/bin/python3.9 from add_name access on the directory /(null). For complete SELinux messages run: sealert -l 156d9270-3466-4356-b86f-1a128825961a
Sep 16 18:06:48 submit26-b9-f2 setroubleshoot[1124468]: SELinux is preventing /usr/bin/python3.9 from create access on the file /(null). For complete SELinux messages run: sealert -l c8a40bf5-2fc4-46b3-b813-8592b3523339
Sep 16 18:06:48 submit26-b9-f2 setroubleshoot[1124468]: SELinux is preventing /usr/bin/python3.9 from open access on the file /tmp/libdnf.4SSfvY/repodata/repomd.xml. For complete SELinux messages run: sealert -l 7f4c3a8e-0f99-47c4-9baf-e1336fe24876
Sep 16 18:06:48 submit26-b9-f2 setroubleshoot[1124468]: SELinux is preventing /usr/bin/python3.9 from setattr access on the file repomd.xml. For complete SELinux messages run: sealert -l 988123da-b724-4e6a-900c-33a2723fdaf1
Sep 16 18:06:48 submit26-b9-f2 setroubleshoot[1124468]: SELinux is preventing /usr/bin/python3.9 from read access on the directory libdnf.4SSfvY. For complete SELinux messages run: sealert -l ca585e2b-d50f-4264-8127-6b3fa04070c8
Sep 16 18:06:48 submit26-b9-f2 setroubleshoot[1124468]: SELinux is preventing /usr/bin/python3.9 from remove_name access on the directory repomd.xml. For complete SELinux messages run: sealert -l 3a749560-1cec-40ca-a4dc-596841be3885
Sep 16 18:06:48 submit26-b9-f2 setroubleshoot[1124468]: SELinux is preventing /usr/bin/python3.9 from unlink access on the file repomd.xml. For complete SELinux messages run: sealert -l 0aa52f08-94f8-474e-96d8-e818846941af
Sep 16 18:06:48 submit26-b9-f2 setroubleshoot[1124468]: SELinux is preventing /usr/bin/python3.9 from rmdir access on the directory repodata. For complete SELinux messages run: sealert -l de019dc4-408f-439c-902a-676d18dfe8e7
1
0
Command: /usr/local/sbin/syslog-digest.py
Time : 0.0606s
Status : exited 0
Output :
Syslog digest — 2026-09-16 18:05 EDT
Processed 3,407 lines, filtered 2,666 (78%). 741 unknown (523 distinct) from 26 host(s).
== b0b02.cs.umd.edu (1 distinct, 1 total) ==
Sep 16 17:46:46 b0b02.cs.umd.edu rustdesk[1865113]: cannot open display:
== bachata (10 distinct, 10 total) ==
Sep 16 17:43:14 bachata smbd[663453]: [2026/09/16 17:43:14.806850, 0] ../../source3/smbd/smb2_service.c:117(chdir_current_service)
Sep 16 17:43:14 bachata smbd[663453]: chdir_current_service: vfs_ChDir(/fs/junkfood/mount) failed: Permission denied. Current token: uid=11255, gid=11255, 12 groups: 11255 319000009 25038 15294 15229 755 25030 25025 30880 25029 770 15026
Sep 16 17:43:14 bachata smbd[663453]: [2026/09/16 17:43:14.807179, 0] ../../source3/smbd/smbXsrv_tcon.c:914(smbXsrv_tcon_disconnect)
Sep 16 17:43:14 bachata smbd[663453]: smbXsrv_tcon_disconnect: disconnect(0x39ad6053, 'mount'): chdir_current_service() failed: NT_STATUS_INTERNAL_ERROR
Sep 16 17:43:14 bachata smbd[663453]: [2026/09/16 17:43:14.808205, 0] ../../source3/smbd/smbXsrv_tcon.c:1028(smbXsrv_tcon_disconnect_all)
Sep 16 17:43:14 bachata smbd[663453]: smbXsrv_tcon_disconnect_all: count[2] errors[1] first[NT_STATUS_INTERNAL_ERROR]
Sep 16 17:43:14 bachata smbd[663453]: [2026/09/16 17:43:14.808255, 0] ../../source3/smbd/smbXsrv_session.c:1900(smbXsrv_session_logoff)
Sep 16 17:43:14 bachata smbd[663453]: smbXsrv_session_logoff: smbXsrv_session_logoff(0x922d5e2e): smb2srv_tcon_disconnect_all() failed: NT_STATUS_INTERNAL_ERROR
Sep 16 17:43:14 bachata smbd[663453]: [2026/09/16 17:43:14.808281, 0] ../../source3/smbd/smbXsrv_session.c:1728(smbXsrv_session_remove_channel_done)
Sep 16 17:43:14 bachata smbd[663453]: smbXsrv_session_remove_channel_done: smbXsrv_session_logoff(2452446766) failed: NT_STATUS_INTERNAL_ERROR
== biggulp.cs.umd.edu (6 distinct, 7 total) ==
Sep 16 17:05:50 biggulp.cs.umd.edu sshd-session[1831002]: pam_access(sshd:auth): access denied for user `root' from `158.173.89.41'
Sep 16 17:05:52 biggulp.cs.umd.edu sshd-session[1831000]: error: PAM: Authentication failure for root from 158.173.89.41
Sep 16 17:14:43 biggulp.cs.umd.edu sshd-session[1831992]: pam_access(sshd:auth): access denied for user `anwar' from `71.241.227.222' [x2]
Sep 16 17:30:44 biggulp.cs.umd.edu sshd-session[1835107]: pam_access(sshd:auth): access denied for user `admin' from `158.173.89.41'
Sep 16 17:30:44 biggulp.cs.umd.edu krb5_child[1835109]: Client 'admin(a)UMD.EDU' not found in Kerberos database
Sep 16 17:30:44 biggulp.cs.umd.edu sshd-session[1835105]: error: PAM: System error for admin from 158.173.89.41
== csfw00a (2 distinct, 141 total) ==
Sep 16 17:03:47 csfw00a kernel: bnxt_en 0000:09:00.0 eth3: NIC Link is Down [x133]
Sep 16 17:04:37 csfw00a ospf6d[1477]: [EC 100663307] Could not send entire message [x8]
== frozone (1 distinct, 1 total) ==
Sep 16 17:35:35 frozone systemd-tmpfiles[1815199]: Failed to remove "/var/tmp/test.log", ignoring: Operation not permitted
== haproxy03.cs.umd.edu (1 distinct, 1 total) ==
Sep 16 17:58:47 haproxy03.cs.umd.edu sshd-session[470043]: error: Certificate does not contain an authorized principal
== hazfs.cs.umd.edu (1 distinct, 1 total) ==
Sep 16 17:28:40 hazfs.cs.umd.edu sshd-session[1709848]: error: maximum authentication attempts exceeded for root from 10.227.96.11 port 49114 ssh2 [preauth]
== idm00 (1 distinct, 1 total) ==
Sep 16 17:53:56 idm00 named[4166701]: client @0x7f119806de18 10.73.240.42#57036: update '73.10.in-addr.arpa/IN' denied
== idmp0 (1 distinct, 1 total) ==
Sep 16 17:37:37 idmp0 named[1598691]: client @0x7f2d1c033de8 10.73.240.43#54228: update '73.10.in-addr.arpa/IN' denied
== inbound00.cs.umd.edu (1 distinct, 1 total) ==
Sep 16 17:10:48 inbound00.cs.umd.edu systemd[1]: Configuration file /usr/lib/systemd/system/authentication_milter.service is marked executable. Please remove executable permission bits. Proceeding anyway.
== inbound01.cs.umd.edu (2 distinct, 2 total) ==
Sep 16 17:10:33 inbound01.cs.umd.edu systemd[1]: Configuration file /usr/lib/systemd/system/authentication_milter.service is marked executable. Please remove executable permission bits. Proceeding anyway.
Sep 16 17:10:33 inbound01.cs.umd.edu systemd[1]: resmon.service: Supervising process 3085520 which is not our child. We'll most likely not notice when it exits.
== itmon02 (1 distinct, 4 total) ==
Sep 16 17:12:59 itmon02 sshd[1750555]: error: beginning MaxStartups throttling [x4]
== kc01 (1 distinct, 1 total) ==
Sep 16 17:17:22 kc01 systemd[1]: resmon.service: Supervising process 254609 which is not our child. We'll most likely not notice when it exits.
== mailman3 (1 distinct, 1 total) ==
Sep 16 17:18:45 mailman3 systemd[1]: resmon.service: Supervising process 3589847 which is not our child. We'll most likely not notice when it exits.
== munin (3 distinct, 7 total) ==
Sep 16 17:08:09 munin sudo[2997078]: pam_systemd(sudo:session): Failed to stat() runtime directory '/run/user/0': No such file or directory [x3]
Sep 16 17:08:09 munin sudo[2997078]: pam_systemd(sudo:session): Not setting $XDG_RUNTIME_DIR, as the directory is not in order. [x3]
Sep 16 17:17:36 munin systemd[1]: resmon.service: Supervising process 3000312 which is not our child. We'll most likely not notice when it exits.
== newhonors2 (1 distinct, 24 total) ==
Sep 16 17:13:03 newhonors2 dhcpcd[2731461]: dhcpcd is not running [x24]
== ntop00 (414 distinct, 414 total) ==
Sep 16 17:05:01 ntop00 laughing_brown[37089]: INFO ( default_print/print ): *** Purging cache - START (PID: 1054) ***
Sep 16 17:05:01 ntop00 laughing_brown[37089]: INFO ( default_print/print ): *** Purging cache - END (PID: 1054, QN: 0/0, ET: X) ***
Sep 16 17:05:02 ntop00 sfacctd[48024]: INFO ( default_print/print ): *** Purging cache - START (PID: 30) ***
Sep 16 17:05:02 ntop00 sfacctd[48024]: INFO ( default_print/print ): *** Purging cache - END (PID: 30, QN: 0/0, ET: X) ***
Sep 16 17:05:11 ntop00 laughing_brown[37089]: INFO ( default_print/print ): *** Purging cache - START (PID: 1055) ***
Sep 16 17:05:11 ntop00 laughing_brown[37089]: INFO ( default_print/print ): *** Purging cache - END (PID: 1055, QN: 0/0, ET: X) ***
Sep 16 17:05:21 ntop00 laughing_brown[37089]: INFO ( default_print/print ): *** Purging cache - START (PID: 1056) ***
Sep 16 17:05:21 ntop00 laughing_brown[37089]: INFO ( default_print/print ): *** Purging cache - END (PID: 1056, QN: 0/0, ET: X) ***
Sep 16 17:05:31 ntop00 laughing_brown[37089]: INFO ( default_print/print ): *** Purging cache - START (PID: 1057) ***
Sep 16 17:05:31 ntop00 laughing_brown[37089]: INFO ( default_print/print ): *** Purging cache - END (PID: 1057, QN: 0/0, ET: X) ***
Sep 16 17:05:41 ntop00 laughing_brown[37089]: INFO ( default_print/print ): *** Purging cache - START (PID: 1058) ***
Sep 16 17:05:41 ntop00 laughing_brown[37089]: INFO ( default_print/print ): *** Purging cache - END (PID: 1058, QN: 0/0, ET: X) ***
Sep 16 17:05:51 ntop00 laughing_brown[37089]: INFO ( default_print/print ): *** Purging cache - START (PID: 1059) ***
Sep 16 17:05:51 ntop00 laughing_brown[37089]: INFO ( default_print/print ): *** Purging cache - END (PID: 1059, QN: 0/0, ET: X) ***
Sep 16 17:06:01 ntop00 laughing_brown[37089]: INFO ( default_print/print ): *** Purging cache - START (PID: 1060) ***
Sep 16 17:06:01 ntop00 laughing_brown[37089]: INFO ( default_print/print ): *** Purging cache - END (PID: 1060, QN: 0/0, ET: X) ***
Sep 16 17:06:11 ntop00 laughing_brown[37089]: INFO ( default_print/print ): *** Purging cache - START (PID: 1061) ***
Sep 16 17:06:11 ntop00 laughing_brown[37089]: INFO ( default_print/print ): *** Purging cache - END (PID: 1061, QN: 0/0, ET: X) ***
Sep 16 17:06:21 ntop00 laughing_brown[37089]: INFO ( default_print/print ): *** Purging cache - START (PID: 1062) ***
Sep 16 17:06:21 ntop00 laughing_brown[37089]: INFO ( default_print/print ): *** Purging cache - END (PID: 1062, QN: 0/0, ET: X) ***
Sep 16 17:06:31 ntop00 laughing_brown[37089]: INFO ( default_print/print ): *** Purging cache - START (PID: 1063) ***
Sep 16 17:06:31 ntop00 laughing_brown[37089]: INFO ( default_print/print ): *** Purging cache - END (PID: 1063, QN: 0/0, ET: X) ***
Sep 16 17:06:41 ntop00 laughing_brown[37089]: INFO ( default_print/print ): *** Purging cache - START (PID: 1064) ***
Sep 16 17:06:41 ntop00 laughing_brown[37089]: INFO ( default_print/print ): *** Purging cache - END (PID: 1064, QN: 0/0, ET: X) ***
Sep 16 17:06:51 ntop00 laughing_brown[37089]: INFO ( default_print/print ): *** Purging cache - START (PID: 1065) ***
Sep 16 17:06:51 ntop00 laughing_brown[37089]: INFO ( default_print/print ): *** Purging cache - END (PID: 1065, QN: 0/0, ET: X) ***
Sep 16 17:07:01 ntop00 nfacctd[9667]: INFO ( default_print/print ): *** Purging cache - START (PID: 55) ***
Sep 16 17:07:01 ntop00 nfacctd[9667]: INFO ( default_print/print ): *** Purging cache - END (PID: 55, QN: 0/0, ET: X) ***
Sep 16 17:07:01 ntop00 laughing_brown[37089]: INFO ( default_print/print ): *** Purging cache - START (PID: 1066) ***
Sep 16 17:07:01 ntop00 laughing_brown[37089]: INFO ( default_print/print ): *** Purging cache - END (PID: 1066, QN: 0/0, ET: X) ***
... 384 more distinct messages not shown
== openvox08-cmp0 (1 distinct, 1 total) ==
Sep 16 17:46:03 openvox08-cmp0 setroubleshoot[1150094]: SELinux is preventing /usr/bin/who from getattr access on the chr_file /dev/pts/1. For complete SELinux messages run: sealert -l 3339fa05-becf-48e4-be60-ae2e0c9ae2fb
== outbound00.cs.umd.edu (3 distinct, 9 total) ==
Sep 16 17:09:09 outbound00.cs.umd.edu python3[742609]: ldapdb [x7]
Sep 16 17:11:59 outbound00.cs.umd.edu systemd[1]: Configuration file /usr/lib/systemd/system/authentication_milter.service is marked executable. Please remove executable permission bits. Proceeding anyway.
Sep 16 17:12:01 outbound00.cs.umd.edu systemd[1]: resmon.service: Supervising process 744002 which is not our child. We'll most likely not notice when it exits.
== outbound01.cs.umd.edu (3 distinct, 9 total) ==
Sep 16 17:09:47 outbound01.cs.umd.edu python3[3001958]: ldapdb [x7]
Sep 16 17:10:58 outbound01.cs.umd.edu systemd[1]: Configuration file /usr/lib/systemd/system/authentication_milter.service is marked executable. Please remove executable permission bits. Proceeding anyway.
Sep 16 17:10:59 outbound01.cs.umd.edu systemd[1]: resmon.service: Supervising process 3002866 which is not our child. We'll most likely not notice when it exits.
== sentry-docker00.cs.umd.edu (36 distinct, 36 total) ==
Sep 16 17:19:42 sentry-docker00.cs.umd.edu systemd-udevd[1734462]: link_config: could not get ethtool features for veth64755f0
Sep 16 17:19:42 sentry-docker00.cs.umd.edu systemd-udevd[1734462]: Could not set offload features of veth64755f0: No such device
Sep 16 17:19:43 sentry-docker00.cs.umd.edu systemd-udevd[1734493]: Could not generate persistent MAC address for veth0aaf67f: No such file or directory
Sep 16 17:19:43 sentry-docker00.cs.umd.edu systemd-udevd[1734494]: Could not generate persistent MAC address for vethfd8ff52: No such file or directory
Sep 16 17:19:43 sentry-docker00.cs.umd.edu systemd-udevd[1734497]: Could not generate persistent MAC address for veth008b1bb: No such file or directory
Sep 16 17:19:43 sentry-docker00.cs.umd.edu systemd-udevd[1734508]: Could not generate persistent MAC address for veth405676e: No such file or directory
Sep 16 17:19:43 sentry-docker00.cs.umd.edu systemd-udevd[1734501]: Could not generate persistent MAC address for vetha0801f3: No such file or directory
Sep 16 17:19:43 sentry-docker00.cs.umd.edu systemd-udevd[1734509]: Could not generate persistent MAC address for vethf166381: No such file or directory
Sep 16 17:19:43 sentry-docker00.cs.umd.edu systemd-udevd[1734523]: Could not generate persistent MAC address for vethd25ab08: No such file or directory
Sep 16 17:19:43 sentry-docker00.cs.umd.edu systemd-udevd[1734524]: Could not generate persistent MAC address for veth519010e: No such file or directory
Sep 16 17:19:43 sentry-docker00.cs.umd.edu systemd-udevd[1734546]: Could not generate persistent MAC address for vethd9659f7: No such file or directory
Sep 16 17:19:43 sentry-docker00.cs.umd.edu systemd-udevd[1734528]: Could not generate persistent MAC address for veth7f7be9e: No such file or directory
Sep 16 17:39:51 sentry-docker00.cs.umd.edu systemd-udevd[1744059]: link_config: could not get ethtool features for veth0aaf67f
Sep 16 17:39:51 sentry-docker00.cs.umd.edu systemd-udevd[1744059]: Could not set offload features of veth0aaf67f: No such device
Sep 16 17:39:52 sentry-docker00.cs.umd.edu systemd-udevd[1744107]: Could not generate persistent MAC address for veth1aa9e3b: No such file or directory
Sep 16 17:39:52 sentry-docker00.cs.umd.edu systemd-udevd[1744108]: Could not generate persistent MAC address for vethb7bb494: No such file or directory
Sep 16 17:39:52 sentry-docker00.cs.umd.edu systemd-udevd[1744111]: Could not generate persistent MAC address for veth27be5af: No such file or directory
Sep 16 17:39:52 sentry-docker00.cs.umd.edu systemd-udevd[1744112]: Could not generate persistent MAC address for vethaaf6c8c: No such file or directory
Sep 16 17:39:52 sentry-docker00.cs.umd.edu systemd-udevd[1744129]: Could not generate persistent MAC address for veth571e844: No such file or directory
Sep 16 17:39:52 sentry-docker00.cs.umd.edu systemd-udevd[1744108]: Could not generate persistent MAC address for vethd3f699e: No such file or directory
Sep 16 17:39:52 sentry-docker00.cs.umd.edu systemd-udevd[1744133]: Could not generate persistent MAC address for veth3232b1f: No such file or directory
Sep 16 17:39:52 sentry-docker00.cs.umd.edu systemd-udevd[1744124]: Could not generate persistent MAC address for veth65c1bf7: No such file or directory
Sep 16 17:39:52 sentry-docker00.cs.umd.edu systemd-udevd[1744169]: Could not generate persistent MAC address for veth6b1c482: No such file or directory
Sep 16 17:39:52 sentry-docker00.cs.umd.edu systemd-udevd[1744176]: Could not generate persistent MAC address for veth51b2691: No such file or directory
Sep 16 17:59:59 sentry-docker00.cs.umd.edu systemd-udevd[1753451]: link_config: could not get ethtool features for veth27be5af
Sep 16 17:59:59 sentry-docker00.cs.umd.edu systemd-udevd[1753451]: Could not set offload features of veth27be5af: No such device
Sep 16 18:00:00 sentry-docker00.cs.umd.edu systemd-udevd[1753484]: Could not generate persistent MAC address for veth319eb75: No such file or directory
Sep 16 18:00:00 sentry-docker00.cs.umd.edu systemd-udevd[1753485]: Could not generate persistent MAC address for veth6a5b4d1: No such file or directory
Sep 16 18:00:00 sentry-docker00.cs.umd.edu systemd-udevd[1753488]: Could not generate persistent MAC address for vetha7a87a5: No such file or directory
Sep 16 18:00:00 sentry-docker00.cs.umd.edu systemd-udevd[1753489]: Could not generate persistent MAC address for veth72110bf: No such file or directory
... 6 more distinct messages not shown
== strawberry (7 distinct, 38 total) ==
Sep 16 17:07:03 strawberry kernel: I/O error, dev sda, sector 206848 op 0x0:(READ) flags 0x80700 phys_seg 1 prio class 2 [x6]
Sep 16 17:07:03 strawberry kernel: I/O error, dev sda, sector 206848 op 0x0:(READ) flags 0x0 phys_seg 1 prio class 2 [x6]
Sep 16 17:07:03 strawberry kernel: Buffer I/O error on dev sda2, logical block 0, async page read [x6]
Sep 16 17:07:03 strawberry kernel: I/O error, dev sda, sector 2048 op 0x0:(READ) flags 0x80700 phys_seg 1 prio class 2 [x6]
Sep 16 17:07:03 strawberry kernel: I/O error, dev sda, sector 2048 op 0x0:(READ) flags 0x0 phys_seg 1 prio class 2 [x6]
Sep 16 17:07:03 strawberry kernel: Buffer I/O error on dev sda1, logical block 0, async page read [x6]
Sep 16 17:34:42 strawberry smartd[5314]: Device: /dev/sda [SAT], failed to read SMART Attribute Data [x2]
== submit26-b9-f3 (9 distinct, 9 total) ==
Sep 16 17:06:41 submit26-b9-f3 setroubleshoot[1353063]: SELinux is preventing /usr/bin/python3.9 from create access on the directory /(null). For complete SELinux messages run: sealert -l a653b772-cbcd-438b-bae5-23c3dc69b31b
Sep 16 17:06:41 submit26-b9-f3 setroubleshoot[1353063]: SELinux is preventing /usr/bin/python3.9 from add_name access on the directory /(null). For complete SELinux messages run: sealert -l 3e904634-6caa-4202-8c92-f139db798859
Sep 16 17:06:41 submit26-b9-f3 setroubleshoot[1353063]: SELinux is preventing /usr/bin/python3.9 from create access on the file /(null). For complete SELinux messages run: sealert -l 580b20e4-ec2c-433d-905c-5bd417fba033
Sep 16 17:06:41 submit26-b9-f3 setroubleshoot[1353063]: SELinux is preventing /usr/bin/python3.9 from open access on the file /tmp/libdnf.rUldNZ/repodata/repomd.xml. For complete SELinux messages run: sealert -l 27f29d48-5e7c-4db7-b051-8ac055737d6f
Sep 16 17:06:41 submit26-b9-f3 setroubleshoot[1353063]: SELinux is preventing /usr/bin/python3.9 from setattr access on the file repomd.xml. For complete SELinux messages run: sealert -l bff72452-d40a-430b-9060-dd0a48f5b6ba
Sep 16 17:06:41 submit26-b9-f3 setroubleshoot[1353063]: SELinux is preventing /usr/bin/python3.9 from read access on the directory libdnf.rUldNZ. For complete SELinux messages run: sealert -l 9638d396-8ce5-4e6a-ae47-45cd3985e1cd
Sep 16 17:06:41 submit26-b9-f3 setroubleshoot[1353063]: SELinux is preventing /usr/bin/python3.9 from remove_name access on the directory repomd.xml. For complete SELinux messages run: sealert -l 6da64b94-7024-45a9-b8c2-3b9812517407
Sep 16 17:06:41 submit26-b9-f3 setroubleshoot[1353063]: SELinux is preventing /usr/bin/python3.9 from unlink access on the file repomd.xml. For complete SELinux messages run: sealert -l 64cbe179-abf1-4d5a-bade-bb164897ee65
Sep 16 17:06:41 submit26-b9-f3 setroubleshoot[1353063]: SELinux is preventing /usr/bin/python3.9 from rmdir access on the directory repodata. For complete SELinux messages run: sealert -l d2e35b1a-e27c-4f91-9217-2bb1204e1e68
== submit26-b9-f4 (10 distinct, 14 total) ==
Sep 16 17:24:46 submit26-b9-f4 setroubleshoot[1007999]: SELinux is preventing /usr/bin/python3.9 from create access on the directory /(null). For complete SELinux messages run: sealert -l ee160f23-b161-4f4a-9985-c4edfd3a5beb [x2]
Sep 16 17:24:46 submit26-b9-f4 setroubleshoot[1007999]: SELinux is preventing /usr/bin/python3.9 from add_name access on the directory /(null). For complete SELinux messages run: sealert -l 89a83821-4b24-4081-9973-0a79ca6ed5b4 [x2]
Sep 16 17:24:46 submit26-b9-f4 setroubleshoot[1007999]: SELinux is preventing /usr/bin/python3.9 from create access on the file /(null). For complete SELinux messages run: sealert -l f73955d6-1416-45f9-bab6-ff1f3ea07e9d
Sep 16 17:24:46 submit26-b9-f4 setroubleshoot[1007999]: SELinux is preventing /usr/bin/python3.9 from open access on the file /tmp/libdnf.9uht7u/repodata/repomd.xml. For complete SELinux messages run: sealert -l 9f8f24a0-8fb6-454d-a103-31a8f7a6efa0
Sep 16 17:24:46 submit26-b9-f4 setroubleshoot[1007999]: SELinux is preventing /usr/bin/python3.9 from setattr access on the file repomd.xml. For complete SELinux messages run: sealert -l 20293136-86a3-40ba-a651-cff48d36059e
Sep 16 17:24:46 submit26-b9-f4 setroubleshoot[1007999]: SELinux is preventing /usr/bin/python3.9 from read access on the directory libdnf.9uht7u. For complete SELinux messages run: sealert -l 25f86b49-4ee7-4f60-ad1c-73a70032560c
Sep 16 17:24:46 submit26-b9-f4 setroubleshoot[1007999]: SELinux is preventing /usr/bin/python3.9 from remove_name access on the directory repomd.xml. For complete SELinux messages run: sealert -l eec250fb-073f-456d-93bc-f98776fd476d [x2]
Sep 16 17:24:46 submit26-b9-f4 setroubleshoot[1007999]: SELinux is preventing /usr/bin/python3.9 from unlink access on the file repomd.xml. For complete SELinux messages run: sealert -l c9209e04-a349-43d5-8cb2-3e303e48df74
Sep 16 17:24:46 submit26-b9-f4 setroubleshoot[1007999]: SELinux is preventing /usr/bin/python3.9 from rmdir access on the directory repodata. For complete SELinux messages run: sealert -l 3178d5f5-80e9-404b-92b7-9bef397a8915 [x2]
Sep 16 17:24:46 submit26-b9-f4 setroubleshoot[1007999]: SELinux is preventing /usr/bin/python3.9 from read access on the directory libdnf.NdtgAS. For complete SELinux messages run: sealert -l 25f86b49-4ee7-4f60-ad1c-73a70032560c
== whiffle.cs.umd.edu (5 distinct, 6 total) ==
Sep 16 17:55:21 whiffle.cs.umd.edu kernel: ipmi_si dmi-ipmi-si.0: BMC returned incorrect response, expected netfn 7 cmd 1, got netfn 0 cmd 0
Sep 16 17:55:21 whiffle.cs.umd.edu kernel: hid-generic 0003:0624:0248.0001: usb_submit_urb(ctrl) failed: -19
Sep 16 17:55:23 whiffle.cs.umd.edu ipmievd[1428]: No data available
Sep 16 17:55:23 whiffle.cs.umd.edu ipmievd[1428]: Get SEL Info command failed
Sep 16 17:55:39 whiffle.cs.umd.edu ipmievd[1428]: Get SEL Info command failed: Node busy [x2]
== yogurt (1 distinct, 1 total) ==
Sep 16 17:58:01 yogurt xdg-desktop-por[1084445]: Backend call failed: Cannot invoke method; proxy is for the well-known name org.freedesktop.ScreenSaver without an owner, and proxy was constructed with the G_DBUS_PROXY_FLAGS_DO_NOT_AUTO_START flag
1
0
Command: /usr/local/sbin/syslog-digest.py
Time : 0.0749s
Status : exited 0
Output :
Syslog digest — 2026-09-16 17:05 EDT
Processed 3,163 lines, filtered 2,136 (67%). 1,027 unknown (856 distinct) from 24 host(s).
== abadi-computer (2 distinct, 4 total) ==
Sep 16 16:52:13 abadi-computer falcon-sensor-bpf[529]: CrowdStrike(4): Could not retrieve DisableProxy value: c0000225 [x2]
Sep 16 16:52:13 abadi-computer falcon-sensor-bpf[529]: CrowdStrike(4): ConnectWithProxy: Unable to get application proxy host from CsConfig: c0000225 [x2]
== alec.cs.umd.edu (1 distinct, 1 total) ==
Sep 16 17:02:24 alec.cs.umd.edu systemd[1]: resmon.service: Supervising process 1670734 which is not our child. We'll most likely not notice when it exits.
== b0b02.cs.umd.edu (1 distinct, 1 total) ==
Sep 16 16:46:42 b0b02.cs.umd.edu rustdesk[1849970]: cannot open display:
== bachata (10 distinct, 10 total) ==
Sep 16 17:03:55 bachata smbd[663822]: [2026/09/16 17:03:55.512311, 0] ../../source3/smbd/smb2_service.c:117(chdir_current_service)
Sep 16 17:03:55 bachata smbd[663822]: chdir_current_service: vfs_ChDir(/fs/junkfood/nelson) failed: Permission denied. Current token: uid=20608, gid=20608, 20 groups: 20608 319050000 25274 319000009 25057 30872 25195 30043 25038 15228 31006 15294 15206 15248 25025 30742 25200 319100011 30871 30736
Sep 16 17:03:55 bachata smbd[663822]: [2026/09/16 17:03:55.513087, 0] ../../source3/smbd/smbXsrv_tcon.c:914(smbXsrv_tcon_disconnect)
Sep 16 17:03:55 bachata smbd[663822]: smbXsrv_tcon_disconnect: disconnect(0x30fee00c, 'nelson'): chdir_current_service() failed: NT_STATUS_INTERNAL_ERROR
Sep 16 17:03:55 bachata smbd[663822]: [2026/09/16 17:03:55.514558, 0] ../../source3/smbd/smbXsrv_tcon.c:1028(smbXsrv_tcon_disconnect_all)
Sep 16 17:03:55 bachata smbd[663822]: smbXsrv_tcon_disconnect_all: count[2] errors[1] first[NT_STATUS_INTERNAL_ERROR]
Sep 16 17:03:55 bachata smbd[663822]: [2026/09/16 17:03:55.514646, 0] ../../source3/smbd/smbXsrv_session.c:1900(smbXsrv_session_logoff)
Sep 16 17:03:55 bachata smbd[663822]: smbXsrv_session_logoff: smbXsrv_session_logoff(0x6c6b77c8): smb2srv_tcon_disconnect_all() failed: NT_STATUS_INTERNAL_ERROR
Sep 16 17:03:55 bachata smbd[663822]: [2026/09/16 17:03:55.514715, 0] ../../source3/smbd/smbXsrv_session.c:1728(smbXsrv_session_remove_channel_done)
Sep 16 17:03:55 bachata smbd[663822]: smbXsrv_session_remove_channel_done: smbXsrv_session_logoff(1818982344) failed: NT_STATUS_INTERNAL_ERROR
== biggulp.cs.umd.edu (6 distinct, 7 total) ==
Sep 16 16:14:39 biggulp.cs.umd.edu sshd-session[1821593]: pam_access(sshd:auth): access denied for user `root' from `158.173.89.129'
Sep 16 16:14:41 biggulp.cs.umd.edu sshd-session[1821590]: error: PAM: Authentication failure for root from 158.173.89.129
Sep 16 16:40:19 biggulp.cs.umd.edu sshd-session[1826317]: pam_access(sshd:auth): access denied for user `root' from `158.173.89.41'
Sep 16 16:40:22 biggulp.cs.umd.edu sshd-session[1826315]: error: PAM: Authentication failure for root from 158.173.89.41
Sep 16 16:45:56 biggulp.cs.umd.edu sshd-session[1827062]: pam_access(sshd:auth): access denied for user `bhatele' from `172.58.244.184'
Sep 16 16:51:12 biggulp.cs.umd.edu sshd-session[1827978]: pam_access(sshd:auth): access denied for user `anwar' from `71.241.227.222' [x2]
== borealis (6 distinct, 6 total) ==
Sep 16 16:59:51 borealis gsd-subman[376140]: g_atomic_ref_count_dec: assertion 'g_atomic_int_get (arc) > 0' failed
Sep 16 16:59:53 borealis org.gnome.Shell.desktop[414486]: The XKEYBOARD keymap compiler (xkbcomp) reports:
Sep 16 16:59:53 borealis org.gnome.Shell.desktop[414486]: > Warning: Unsupported maximum keycode 708, clipping.
Sep 16 16:59:53 borealis org.gnome.Shell.desktop[414486]: > X11 cannot support keycodes above 255.
Sep 16 16:59:53 borealis org.gnome.Shell.desktop[414486]: Errors from xkbcomp are not fatal to the X server
Sep 16 16:59:59 borealis systemd-coredump[414152]: Process 376702 (firefox) of user 119431696 dumped core.#012#012Stack trace of thread 376730:#012#0 0x00007f5c54c8d38c __pthread_kill_implementation (libc.so.6 + 0x8d38c)#012#1 0x00007f5c54c3fa86 raise (libc.so.6 + 0x3fa86)#012#2 0x00007f5c4977a055 _ZN13nsProfileLock18FatalSignalHandlerEiP9siginfo_tPv (libxul.so + 0x597a055)#012#3 0x00007f5c54c3fb30 __restore_rt (libc.so.6 + 0x3fb30)#012#4 0x00007f5c48c1af86 _ZN7mozilla6widget24WlCompositorCrashHandlerEv (libxul.so + 0x4e1af86)#012#5 0x00007f5c48c1cd3c _ZN17ProxiedConnection14ProcessFailureEv (libxul.so + 0x4e1cd3c)#012#6 0x00007f5c48c1ee49 _ZN12WaylandProxy18ProcessConnectionsEv (libxul.so + 0x4e1ee49)#012#7 0x00007f5c48c1ef44 _ZN12WaylandProxy3RunEv (libxul.so + 0x4e1ef44)#012#8 0x00007f5c48c1efc4 _ZN12WaylandProxy14RunProxyThreadEPS_ (libxul.so + 0x4e1efc4)#012#9 0x00007f5c54c8b569 start_thread (libc.so.6 + 0x8b569)#012#10 0x00007f5c54d10760 __clone3 (libc.so.6 + 0x110760
)#012#012Stack trace of thread 376702:#012#0 0x00007f5c54c8854a __futex_abstimed_wait_common (libc.so.6 + 0x8854a)#012#1 0x00007f5c54c8ab32 pthread_cond_wait@@GLIBC_2.3.2 (libc.so.6 + 0x8ab32)#012#2 0x0000562ef8046ddb _ZN7mozilla6detail21ConditionVariableImpl4waitERNS0_9MutexImplE (firefox + 0x5fddb)#012#3 0x0000562ef8046fd8 _ZN7mozilla6detail21ConditionVariableImpl8wait_forERNS0_9MutexImplERKNS_16BaseTimeDurationINS_27TimeDurationValueCalculatorEEE (firefox + 0x5ffd8)#012#4 0x00007f5c456b566c _ZN7mozilla3ipc14MessageChannel17WaitForSyncNotifyEv (libxul.so + 0x18b566c)#012#5 0x00007f5c456cac77 _ZN7mozilla3ipc14MessageChannel4SendENS_9UniquePtrIN3IPC7MessageENS_13DefaultDeleteIS4_EEEEPS7_ (libxul.so + 0x18cac77)#012#6 0x00007f5c456cb099 _ZN7mozilla3ipc9IProtocol11ChannelSendENS_9UniquePtrIN3IPC7MessageENS_13DefaultDeleteIS4_EEEEPS7_ (libxul.so + 0x18cb099)#012#7 0x00007f5c45bd6462 _ZN7mozilla6layers22PCompositorBridgeChild10SendResumeEv (libxul.so + 0x1dd6462)#012#8 0x00007f
5c48ba4588 _Z19moz_container_unmapP10_GtkWidget (libxul.so + 0x4da4588)#012#9 0x00007f5c48ba4663 _Z27moz_container_wayland_unmapP10_GtkWidget (libxul.so + 0x4da4663)#012#10 0x00007f5c54eb9bbc g_closure_invoke (libgobject-2.0.so.0 + 0x13bbc)#012#11 0x00007f5c54ed5bf5 signal_emit_unlocked_R (libgobject-2.0.so.0 + 0x2fbf5)#012#12 0x00007f5c54ed785a g_signal_emit_valist (libgobject-2.0.so.0 + 0x3185a)#012#13 0x00007f5c54ed7a73 g_signal_emit (libgobject-2.0.so.0 + 0x31a73)#012#14 0x00007f5c52f66f54 gtk_widget_unmap (libgtk-3.so.0 + 0x366f54)#012#15 0x00007f5c54eb9c7f g_closure_invoke (libgobject-2.0.so.0 + 0x13c7f)#012#16 0x00007f5c54ed5bf5 signal_emit_unlocked_R (libgobject-2.0.so.0 + 0x2fbf5)#012#17 0x00007f5c54ed785a g_signal_emit_valist (libgobject-2.0.so.0 + 0x3185a)#012#18 0x00007f5c54ed7a73 g_signal_emit (libgobject-2.0.so.0 + 0x31a73)#012#19 0x00007f5c52f66f54 gtk_widget_unmap (libgtk-3.so.0 + 0x366f54)#012#20 0x00007f5c52f87a3b gtk_window_hide.lto_priv.0 (libgtk-3.so.0 + 0x387a
3b)#012#21 0x00007f5c54eb9c7f g_closure_invoke (libgobject-2.0.so.0 + 0x13c7f)#012#22 0x00007f5c54ed5bf5 signal_emit_unlocked_R (libgobject-2.0.so.0 + 0x2fbf5)#012#23 0x00007f5c54ed785a g_signal_emit_valist (libgobject-2.0.so.0 + 0x3185a)#012#24 0x00007f5c54ed7a73 g_signal_emit (libgobject-2.0.so.0 + 0x31a73)#012#25 0x00007f5c52f6e330 gtk_widget_hide (libgtk-3.so.0 + 0x36e330)#012#26 0x00007f5c48b88248 _ZN8nsWindow4ShowEb (libxul.so + 0x4d88248)#012#27 0x00007f5c49289890 _ZN7mozilla9AppWindow13SetVisibilityEb (libxul.so + 0x5489890)#012#28 0x00007f5c44ee55f6 NS_InvokeByIndex (libxul.so + 0x10e55f6)#012#29 0x00007f5c457b9c8f _ZN16XPCWrappedNative10CallMethodER14XPCCallContextNS_8CallModeE (libxul.so + 0x19b9c8f)#012#30 0x00007f5c457bf4b5 _Z19XPC_WN_GetterSetterP9JSContextjPN2JS5ValueE (libxul.so + 0x19bf4b5)#012#31 0x00007f5c4a3a720d _ZN2js23InternalCallOrConstructEP9JSContextRKN2JS8CallArgsENS_14MaybeConstructENS_10CallReasonE (libxul.so + 0x65a720d)#012#32 0x00007f5c4a3a90f7 _ZN2js
10CallSetterEP9JSContextN2JS6HandleINS2_5ValueEEES5_S5_ (libxul.so + 0x65a90f7)#012#33 0x00007f5c499dc336 _ZL19SetExistingPropertyP9JSContextN2JS6HandleINS1_11PropertyKeyEEENS2_INS1_5ValueEEES6_NS2_IPN2js12NativeObjectEEERKNS7_14PropertyResultERNS1_14ObjectOpResultE (libxul.so + 0x5bdc336)#012#34 0x00007f5c499e2883 _ZN2js17NativeSetPropertyILNS_13QualifiedBoolE1EEEbP9JSContextN2JS6HandleIPNS_12NativeObjectEEENS5_INS4_11PropertyKeyEEENS5_INS4_5ValueEEESC_RNS4_14ObjectOpResultE (libxul.so + 0x5be2883)#012#35 0x00007f5c4a3a2571 _ZN2js9InterpretEP9JSContextRNS_8RunStateE (libxul.so + 0x65a2571)#012#36 0x00007f5c4a3a6d7b _ZN2js9RunScriptEP9JSContextRNS_8RunStateE (libxul.so + 0x65a6d7b)#012#37 0x00007f5c4a3a7322 _ZN2js23InternalCallOrConstructEP9JSContextRKN2JS8CallArgsENS_14MaybeConstructENS_10CallReasonE (libxul.so + 0x65a7322)#012#38 0x00007f5c49e33ea1 _ZN2js3jit14DoCallFallbackEP9JSContextPNS0_13BaselineFrameEPNS0_14ICFallbackStubEjPN2JS5ValueENS7_13MutableHandleIS8_EE (libxul.so + 0
x6033ea1)#012#39 0x000000c0a60807f4 n/a (n/a + 0x0)#012#40 0x000000c0a6086196 n/a (n/a + 0x0)#012#41 0x000000c0a6088687 n/a (n/a + 0x0)#012#42 0x000000c0a607e4e6 n/a (n/a + 0x0)#012#43 0x00007f5c4a0c9101 _ZL8EnterJitP9JSContextRN2js8RunStateEPh (libxul.so + 0x62c9101)#012#44 0x00007f5c4a3a6d09 _ZN2js9RunScriptEP9JSContextRNS_8RunStateE (libxul.so + 0x65a6d09)#012#45 0x00007f5c4a3a7322 _ZN2js23InternalCallOrConstructEP9JSContextRKN2JS8CallArgsENS_14MaybeConstructENS_10CallReasonE (libxul.so + 0x65a7322)#012#46 0x00007f5c4a3a769d _ZN2js4CallEP9JSContextN2JS6HandleINS2_5ValueEEES5_RKNS_13AnyInvokeArgsENS2_13MutableHandleIS4_EENS_10CallReasonE (libxul.so + 0x65a769d)#012#47 0x00007f5c498ff267 _Z20JS_CallFunctionValueP9JSContextN2JS6HandleIP8JSObjectEENS2_INS1_5ValueEEERKNS1_16HandleValueArrayENS1_13MutableHandleIS6_EE (libxul.so + 0x5aff267)#012#48 0x00007f5c457bc783 _ZN14nsXPCWrappedJS10CallMethodEtPK15nsXPTMethodInfoP17nsXPTCMiniVariant (libxul.so + 0x19bc783)#012#49 0x00007f5c44ee62a
d PrepareAndDispatch (libxul.so + 0x10e62ad)#012#50 0x00007f5c44ee578d SharedStub (libxul.so + 0x10e578d)#012#51 0x00007f5c44e5d9a3 _ZN14nsObserverList15NotifyObserversEP11nsISupportsPKcPKDs (libxul.so + 0x105d9a3)#012#52 0x00007f5c44e5db7e _ZN17nsObserverService15NotifyObserversEP11nsISupportsPKcPKDs (libxul.so + 0x105db7e)#012#53 0x00007f5c496a6896 _ZN12nsAppStartup4QuitEjiPb (libxul.so + 0x58a6896)#012#54 0x00007f5c49797543 _ZN22nsNativeAppSupportUnix5DieCBEP8_SmcConnPv (libxul.so + 0x5997543)#012#55 0x00007f5c43a25396 IceProcessMessages (libICE.so.6 + 0x12396)#012#56 0x00007f5c49797d55 _ZL19ice_iochannel_watchP11_GIOChannel12GIOConditionPv (libxul.so + 0x5997d55)#012#57 0x00007f5c52b1afbf g_main_context_dispatch (libglib-2.0.so.0 + 0x54fbf)#012#58 0x00007f5c52b70428 g_main_context_iterate.constprop.0 (libglib-2.0.so.0 + 0xaa428)#012#59 0x00007f5c52b18783 g_main_context_iteration (libglib-2.0.so.0 + 0x52783)#012#60 0x00007f5c48be3caf _ZN10nsAppShell22ProcessNextNativeEventEb (lib
xul.so + 0x4de3caf)#012#61 0x00007f5c48b301b4 _ZN14nsBaseAppShell18OnProcessNextEventEP17nsIThreadInternalb (libxul.so + 0x4d301b4)#012#62 0x00007f5c44ed90ec _ZN8nsThread16ProcessNextEventEbPb (libxul.so + 0x10d90ec)#012#63 0x00007f5c44ecbadf _Z19NS_ProcessNextEventP9nsIThreadb (libxul.so + 0x10cbadf)#012#012Stack trace of thread 376726:#012#0 0x00007f5c54cff44c read (libc.so.6 + 0xff44c)#012#1 0x00007f5c493d9993 _ZN24AsyncSignalControlThread5WatchEv (libxul.so + 0x55d9993)#012#2 0x00007f5c493d9b4c _ZL29AsyncSignalControlThreadEntryPv (libxul.so + 0x55d9b4c)#012#3 0x00007f5c54c8b569 start_thread (libc.so.6 + 0x8b569)#012#4 0x00007f5c54d10760 __clone3 (libc.so.6 + 0x110760)#012#012Stack trace of thread 376738:#012#0 0x00007f5c54c8854a __futex_abstimed_wait_common (libc.so.6 + 0x8854a)#012#1 0x00007f5c54c8ad1f pthread_cond_timedwait@@GLIBC_2.3.2 (libc.so.6 + 0x8ad1f)#012#2 0x0000562ef8046f25 _ZN7mozilla6detail21ConditionVariableImpl8wait_forERNS0_9MutexImplERKNS_16BaseTimeDura
tionINS_27TimeDurationValueCalculatorEEE (firefox + 0x5ff25)#012#3 0x00007f5c44ed02f9 _ZN11TimerT
== csfw00a (1 distinct, 100 total) ==
Sep 16 16:04:20 csfw00a kernel: bnxt_en 0000:09:00.0 eth3: NIC Link is Down [x100]
== hazfs.cs.umd.edu (1 distinct, 1 total) ==
Sep 16 16:49:20 hazfs.cs.umd.edu rpc.mountd[1586325]: /raid/instruct exported to both 10.227.96.0/19 and 10.227.102.0/23, arbitrarily choosing options from first
== idm00 (1 distinct, 1 total) ==
Sep 16 16:53:56 idm00 named[4166701]: client @0x7f11a402f3b8 10.73.240.42#63504: update '73.10.in-addr.arpa/IN' denied
== idmp0 (1 distinct, 1 total) ==
Sep 16 16:37:37 idmp0 named[1598691]: client @0x7f2d50022b88 10.73.240.43#58736: update '73.10.in-addr.arpa/IN' denied
== inbound00.cs.umd.edu (2 distinct, 4 total) ==
Sep 16 16:05:43 inbound00.cs.umd.edu systemd[1]: Configuration file /usr/lib/systemd/system/authentication_milter.service is marked executable. Please remove executable permission bits. Proceeding anyway. [x3]
Sep 16 17:02:44 inbound00.cs.umd.edu systemd[1]: resmon.service: Supervising process 863805 which is not our child. We'll most likely not notice when it exits.
== inbound01.cs.umd.edu (1 distinct, 2 total) ==
Sep 16 16:06:39 inbound01.cs.umd.edu systemd[1]: Configuration file /usr/lib/systemd/system/authentication_milter.service is marked executable. Please remove executable permission bits. Proceeding anyway. [x2]
== itmon02 (1 distinct, 1 total) ==
Sep 16 16:18:12 itmon02 sshd[1750555]: error: beginning MaxStartups throttling
== jaws.cs.umd.edu (3 distinct, 3 total) ==
Sep 16 17:01:26 jaws.cs.umd.edu systemd-coredump[1470637]: Process 1470622 (podman) of user 0 dumped core.#012#012Stack trace of thread 1470622:#012#0 0x0000556a30bff46e internal/runtime/syscall/linux.Syscall6 (podman + 0x48c46e)#012#1 0x0000556a30cdf326 syscall.Syscall (podman + 0x56c326)#012#2 0x0000556a30cdfed0 syscall.Syscall.abi0 (podman + 0x56ced0)#012#3 0x0000556a30e4a36e github.com/containers/podman/vendor/golang.org/x/sys/unix.OpenTree (podman + 0x6d736e)#012#4 0x0000556a314a744b github.com/containers/podman/vendor/github.com/cyphar/filepath-securejoin/p… (podman + 0xd3444b)#012#5 0x0000556a314a7354 github.com/containers/podman/vendor/github.com/cyphar/filepath-securejoin/p… (podman + 0xd34354)#012#6 0x0000556a30c92f8c sync.(*Once).doSlow (podman + 0x51ff8c)#012#7 0x0000556a30c92eb9 sync.(*Once).Do (podman + 0x51feb9)#012#8 0x0000556a314a72c5
github.com/containers/podman/vendor/github.com/cyphar/filepath-securejoin/p… (podman + 0xd342c5)#012#9 0x0000556a314a88e2 github.com/containers/podman/vendor/github.com/cyphar/filepath-securejoin/p… (podman + 0xd358e2)#012#10 0x0000556a314a8cf3 github.com/containers/podman/vendor/github.com/cyphar/filepath-securejoin/p… (podman + 0xd35cf3)#012#11 0x0000556a314a7e1c github.com/containers/podman/vendor/github.com/cyphar/filepath-securejoin/p… (podman + 0xd34e1c)#012#12 0x0000556a314a7858 github.com/containers/podman/vendor/github.com/cyphar/filepath-securejoin/p… (podman + 0xd34858)#012#13 0x0000556a30c92f8c sync.(*Once).doSlow (podman + 0x51ff8c)#012#14 0x0000556a30c92eb9 sync.(*Once).Do
(podman + 0x51feb9)#012#15 0x0000556a314a77c5 github.com/containers/podman/vendor/github.com/cyphar/filepath-securejoin/p… (podman + 0xd347c5)#012#16 0x0000556a314a8c9a github.com/containers/podman/vendor/github.com/cyphar/filepath-securejoin/p… (podman + 0xd35c9a)#012#17 0x0000556a314af84e github.com/containers/podman/vendor/github.com/opencontainers/selinux/go-se… (podman + 0xd3c84e)#012#18 0x0000556a314afd38 github.com/containers/podman/vendor/github.com/opencontainers/selinux/go-se… (podman + 0xd3cd38)#012#19 0x0000556a314aeadf github.com/containers/podman/vendor/github.com/opencontainers/selinux/go-se… (podman + 0xd3badf)#012#20 0x0000556a314aed73 github.com/containers/podman/vendor/github.com/opencontainers/selinux/go-se… (podman + 0xd3bd73)#012#21 0x00005
56a316a86cb github.com/containers/podman/vendor/go.podman.io/common/pkg/config.defaultC… (podman + 0xf356cb)#012#22 0x0000556a316ac0b2 github.com/containers/podman/vendor/go.podman.io/common/pkg/config.newLocked (podman + 0xf390b2)#012#23 0x0000556a316abda5 github.com/containers/podman/vendor/go.podman.io/common/pkg/config.New (podman + 0xf38da5)#012#24 0x0000556a31e287d3 github.com/containers/podman/cmd/podman/registry.newPodmanConfig (podman + 0x16b57d3)#012#25 0x0000556a30c92f8c sync.(*Once).doSlow (podman + 0x51ff8c)#012#26 0x0000556a31e49550 github.com/containers/podman/cmd/podman/common.init (podman + 0x16d6550)#012#27 0x0000556a30c58af7 runtime.doInit1 (podman + 0x4e5af7)#012#28 0x0000556a30c49030 runtime.main (podman + 0x4d6030)#012#29 0x0000556a30c89061 runtime.goexit.abi0 (podman + 0x516061)#012ELF object binary architecture: AMD x86-64
Sep 16 17:01:27 jaws.cs.umd.edu systemd-coredump[1470659]: Process 1470643 (podman) of user 0 dumped core.#012#012Stack trace of thread 1470643:#012#0 0x0000560dc40dd46e internal/runtime/syscall/linux.Syscall6 (podman + 0x48c46e)#012#1 0x0000560dc41bd326 syscall.Syscall (podman + 0x56c326)#012#2 0x0000560dc41bded0 syscall.Syscall.abi0 (podman + 0x56ced0)#012#3 0x0000560dc432836e github.com/containers/podman/vendor/golang.org/x/sys/unix.OpenTree (podman + 0x6d736e)#012#4 0x0000560dc498544b github.com/containers/podman/vendor/github.com/cyphar/filepath-securejoin/p… (podman + 0xd3444b)#012#5 0x0000560dc4985354 github.com/containers/podman/vendor/github.com/cyphar/filepath-securejoin/p… (podman + 0xd34354)#012#6 0x0000560dc4170f8c sync.(*Once).doSlow (podman + 0x51ff8c)#012#7 0x0000560dc4170eb9 sync.(*Once).Do (podman + 0x51feb9)#012#8 0x0000560dc49852c5
github.com/containers/podman/vendor/github.com/cyphar/filepath-securejoin/p… (podman + 0xd342c5)#012#9 0x0000560dc49868e2 github.com/containers/podman/vendor/github.com/cyphar/filepath-securejoin/p… (podman + 0xd358e2)#012#10 0x0000560dc4986cf3 github.com/containers/podman/vendor/github.com/cyphar/filepath-securejoin/p… (podman + 0xd35cf3)#012#11 0x0000560dc4985e1c github.com/containers/podman/vendor/github.com/cyphar/filepath-securejoin/p… (podman + 0xd34e1c)#012#12 0x0000560dc4985858 github.com/containers/podman/vendor/github.com/cyphar/filepath-securejoin/p… (podman + 0xd34858)#012#13 0x0000560dc4170f8c sync.(*Once).doSlow (podman + 0x51ff8c)#012#14 0x0000560dc4170eb9 sync.(*Once).Do
(podman + 0x51feb9)#012#15 0x0000560dc49857c5 github.com/containers/podman/vendor/github.com/cyphar/filepath-securejoin/p… (podman + 0xd347c5)#012#16 0x0000560dc4986c9a github.com/containers/podman/vendor/github.com/cyphar/filepath-securejoin/p… (podman + 0xd35c9a)#012#17 0x0000560dc498d84e github.com/containers/podman/vendor/github.com/opencontainers/selinux/go-se… (podman + 0xd3c84e)#012#18 0x0000560dc498dd38 github.com/containers/podman/vendor/github.com/opencontainers/selinux/go-se… (podman + 0xd3cd38)#012#19 0x0000560dc498cadf github.com/containers/podman/vendor/github.com/opencontainers/selinux/go-se… (podman + 0xd3badf)#012#20 0x0000560dc498cd73 github.com/containers/podman/vendor/github.com/opencontainers/selinux/go-se… (podman + 0xd3bd73)#012#21 0x00005
60dc4b866cb github.com/containers/podman/vendor/go.podman.io/common/pkg/config.defaultC… (podman + 0xf356cb)#012#22 0x0000560dc4b8a0b2 github.com/containers/podman/vendor/go.podman.io/common/pkg/config.newLocked (podman + 0xf390b2)#012#23 0x0000560dc4b89da5 github.com/containers/podman/vendor/go.podman.io/common/pkg/config.New (podman + 0xf38da5)#012#24 0x0000560dc53067d3 github.com/containers/podman/cmd/podman/registry.newPodmanConfig (podman + 0x16b57d3)#012#25 0x0000560dc4170f8c sync.(*Once).doSlow (podman + 0x51ff8c)#012#26 0x0000560dc5327550 github.com/containers/podman/cmd/podman/common.init (podman + 0x16d6550)#012#27 0x0000560dc4136af7 runtime.doInit1 (podman + 0x4e5af7)#012#28 0x0000560dc4127030 runtime.main (podman + 0x4d6030)#012#29 0x0000560dc4167061 runtime.goexit.abi0 (podman + 0x516061)#012ELF object binary architecture: AMD x86-64
Sep 16 17:01:29 jaws.cs.umd.edu systemd-coredump[1470681]: Process 1470664 (podman) of user 0 dumped core.#012#012Stack trace of thread 1470664:#012#0 0x0000564d7f1d546e internal/runtime/syscall/linux.Syscall6 (podman + 0x48c46e)#012#1 0x0000564d7f2b5326 syscall.Syscall (podman + 0x56c326)#012#2 0x0000564d7f2b5ed0 syscall.Syscall.abi0 (podman + 0x56ced0)#012#3 0x0000564d7f42036e github.com/containers/podman/vendor/golang.org/x/sys/unix.OpenTree (podman + 0x6d736e)#012#4 0x0000564d7fa7d44b github.com/containers/podman/vendor/github.com/cyphar/filepath-securejoin/p… (podman + 0xd3444b)#012#5 0x0000564d7fa7d354 github.com/containers/podman/vendor/github.com/cyphar/filepath-securejoin/p… (podman + 0xd34354)#012#6 0x0000564d7f268f8c sync.(*Once).doSlow (podman + 0x51ff8c)#012#7 0x0000564d7f268eb9 sync.(*Once).Do (podman + 0x51feb9)#012#8 0x0000564d7fa7d2c5
github.com/containers/podman/vendor/github.com/cyphar/filepath-securejoin/p… (podman + 0xd342c5)#012#9 0x0000564d7fa7e8e2 github.com/containers/podman/vendor/github.com/cyphar/filepath-securejoin/p… (podman + 0xd358e2)#012#10 0x0000564d7fa7ecf3 github.com/containers/podman/vendor/github.com/cyphar/filepath-securejoin/p… (podman + 0xd35cf3)#012#11 0x0000564d7fa7de1c github.com/containers/podman/vendor/github.com/cyphar/filepath-securejoin/p… (podman + 0xd34e1c)#012#12 0x0000564d7fa7d858 github.com/containers/podman/vendor/github.com/cyphar/filepath-securejoin/p… (podman + 0xd34858)#012#13 0x0000564d7f268f8c sync.(*Once).doSlow (podman + 0x51ff8c)#012#14 0x0000564d7f268eb9 sync.(*Once).Do
(podman + 0x51feb9)#012#15 0x0000564d7fa7d7c5 github.com/containers/podman/vendor/github.com/cyphar/filepath-securejoin/p… (podman + 0xd347c5)#012#16 0x0000564d7fa7ec9a github.com/containers/podman/vendor/github.com/cyphar/filepath-securejoin/p… (podman + 0xd35c9a)#012#17 0x0000564d7fa8584e github.com/containers/podman/vendor/github.com/opencontainers/selinux/go-se… (podman + 0xd3c84e)#012#18 0x0000564d7fa85d38 github.com/containers/podman/vendor/github.com/opencontainers/selinux/go-se… (podman + 0xd3cd38)#012#19 0x0000564d7fa84adf github.com/containers/podman/vendor/github.com/opencontainers/selinux/go-se… (podman + 0xd3badf)#012#20 0x0000564d7fa84d73 github.com/containers/podman/vendor/github.com/opencontainers/selinux/go-se… (podman + 0xd3bd73)#012#21 0x00005
64d7fc7e6cb github.com/containers/podman/vendor/go.podman.io/common/pkg/config.defaultC… (podman + 0xf356cb)#012#22 0x0000564d7fc820b2 github.com/containers/podman/vendor/go.podman.io/common/pkg/config.newLocked (podman + 0xf390b2)#012#23 0x0000564d7fc81da5 github.com/containers/podman/vendor/go.podman.io/common/pkg/config.New (podman + 0xf38da5)#012#24 0x0000564d803fe7d3 github.com/containers/podman/cmd/podman/registry.newPodmanConfig (podman + 0x16b57d3)#012#25 0x0000564d7f268f8c sync.(*Once).doSlow (podman + 0x51ff8c)#012#26 0x0000564d8041f550 github.com/containers/podman/cmd/podman/common.init (podman + 0x16d6550)#012#27 0x0000564d7f22eaf7 runtime.doInit1 (podman + 0x4e5af7)#012#28 0x0000564d7f21f030 runtime.main (podman + 0x4d6030)#012#29 0x0000564d7f25f061 runtime.goexit.abi0 (podman + 0x516061)#012ELF object binary architecture: AMD x86-64
== librenms (1 distinct, 1 total) ==
Sep 16 16:15:40 librenms puppet-agent[76614]: The directory '/opt/librenms/rrd' contains 16517 entries, which exceeds the default soft limit 1000 and may cause excessive resource consumption and degraded performance. To remove this warning set a value for `max_files` parameter or consider using an alternate method to manage large directory trees
== munin (2 distinct, 2 total) ==
Sep 16 17:03:54 munin sudo[2994823]: pam_systemd(sudo:session): Failed to stat() runtime directory '/run/user/0': No such file or directory
Sep 16 17:03:54 munin sudo[2994823]: pam_systemd(sudo:session): Not setting $XDG_RUNTIME_DIR, as the directory is not in order.
== newhonors2 (1 distinct, 24 total) ==
Sep 16 16:13:02 newhonors2 dhcpcd[2729599]: dhcpcd is not running [x24]
== nightingale (1 distinct, 1 total) ==
Sep 16 16:47:38 nightingale systemd-coredump[2111670]: Process 731944 (firefox) of user 120942471 dumped core.#012#012Stack trace of thread 731944:#012#0 0x00007f52de3974ab _ZN2js9InterpretEP9JSContextRNS_8RunStateE (libxul.so + 0x65974ab)#012#1 0x00007f52de3a20e3 _ZN2js9RunScriptEP9JSContextRNS_8RunStateE (libxul.so + 0x65a20e3)#012#2 0x00007f52de3a26e2 _ZN2js23InternalCallOrConstructEP9JSContextRKN2JS8CallArgsENS_14MaybeConstructENS_10CallReasonE (libxul.so + 0x65a26e2)#012#3 0x00007f52de3a2a5d _ZN2js4CallEP9JSContextN2JS6HandleINS2_5ValueEEES5_RKNS_13AnyInvokeArgsENS2_13MutableHandleIS4_EENS_10CallReasonE (libxul.so + 0x65a2a5d)#012#4 0x00007f52dd8fb061 _ZN2JS4CallEP9JSContextNS_6HandleINS_5ValueEEES4_RKNS_16HandleValueArrayENS_13MutableHandleIS3_EE (libxul.so + 0x5afb061)#012#5 0x00007f52daeab865 _ZN7mozilla3dom13EventListener11HandleEventERNS0_18BindingCallContextEN2JS6HandleINS4_5ValueEEERNS0_5EventERNS_11ErrorResultE (libxul.so + 0x30ab865)#012#6 0x00007f52db5d4a46 _ZN7
mozilla20EventListenerManager25HandleEventSingleListenerEPNS0_8ListenerEP6nsAtomPNS_11WidgetEventEPNS_3dom5EventEPNS7_11EventTargetEb (libxul.so + 0x37d4a46)#012#7 0x00007f52db5d4f4d _ZN7mozilla20EventListenerManager28HandleEventWithListenerArrayEPNS0_13ListenerArrayEP6nsAtomNS_12EventMessageEP13nsPresContextPNS_11WidgetEventEPPNS_3dom5EventEPNSA_11EventTargetEb (libxul.so + 0x37d4f4d)#012#8 0x00007f52db5d58fd _ZN7mozilla20EventListenerManager19HandleEventInternalEP13nsPresContextPNS_11WidgetEventEPPNS_3dom5EventEPNS5_11EventTargetEP13nsEventStatusb (libxul.so + 0x37d58fd)#012#9 0x00007f52db5d6073 _ZN7mozilla20EventTargetChainItem11HandleEventERNS_21EventChainPostVisitorERNS_19ELMCreationDetectorE (libxul.so + 0x37d6073)#012#10 0x00007f52db5d66a8 _ZN7mozilla20EventTargetChainItem22HandleEventTargetChainER8nsTArrayIS0_ERNS_21EventChainPostVisitorEPNS_24EventDispatchingCallbackERNS_19ELMCreationDetectorE (libxul.so + 0x37d66a8)#012#11 0x00007f52db5d888e _ZN7mozilla15EventDispatcher
8DispatchEPNS_3dom11EventTargetEP13nsPresContextPNS_11WidgetEventEPNS1_5EventEP13nsEventStatusPNS_24EventDispatchingCallbackEP8nsTArrayIS3_E (libxul.so + 0x37d888e)#012#12 0x00007f52db5d8f2a _ZN7mozilla15EventDispatcher16DispatchDOMEventEPNS_3dom11EventTargetEPNS_11WidgetEventEPNS1_5EventEP13nsPresContextP13nsEventStatus (libxul.so + 0x37d8f2a)#012#13 0x00007f52da5383a0 _ZN7nsINode13DispatchEventERN7mozilla3dom5EventENS1_10CallerTypeERNS0_11ErrorResultE (libxul.so + 0x27383a0)#012#14 0x00007f52db5ba70c _ZN7mozilla3dom11EventTarget13DispatchEventERNS0_5EventE (libxul.so + 0x37ba70c)#012#15 0x00007f52db588ef5 _ZN7mozilla20AsyncEventDispatcher21DispatchEventOnTargetEPNS_3dom11EventTargetERK12nsTSubstringIDsENS_9CanBubbleENS_18ChromeOnlyDispatchENS_8ComposedE (libxul.so + 0x3788ef5)#012#16 0x00007f52db58924c _ZN7mozilla20AsyncEventDispatcher19RunDOMEventWhenSafeERNS_3dom11EventTargetERK12nsTSubstringIDsENS_9CanBubbleENS_18ChromeOnlyDispatchENS_8ComposedE (libxul.so + 0x378924c)#012#17 0
x00007f52da51a4cf _ZN18nsFrameLoaderOwner23ChangeFrameLoaderCommonEPN7mozilla3dom7ElementEb (libxul.so + 0x271a4cf)#012#18 0x00007f52da54e62f _ZN18nsFrameLoaderOwner22ChangeRemotenessCommonERKNS_27ChangeRemotenessContextTypeERKN7mozilla3dom26NavigationIsolationOptionsEbbPNS4_20BrowsingContextGroupERSt8functionIFvvEERNS3_11ErrorResultE (libxul.so + 0x274e62f)#012#19 0x00007f52da54ed9c _ZN18nsFrameLoaderOwner25ChangeRemotenessToProcessEPN7mozilla3dom13ContentParentERKNS1_26NavigationIsolationOptionsEPNS1_20BrowsingContextGroupERNS0_11ErrorResultE (libxul.so + 0x274ed9c)#012#20 0x00007f52dd21844b _ZN7mozilla3dom24CanonicalBrowsingContext23PendingRemotenessChange16FinishTopContentEv.part.0 (libxul.so + 0x541844b)#012#21 0x00007f52dd226a29 _ZN7mozilla3dom24CanonicalBrowsingContext23PendingRemotenessChange11MaybeFinishEv.part.0 (libxul.so + 0x5426a29)#012#22 0x00007f52dd227a98 _ZN7mozilla3dom24CanonicalBrowsingContext16ChangeRemotenessERKNS0_26NavigationIsolationOptionsEm (libxul.so + 0x5
427a98)#012#23 0x00007f52d95687b5 _ZN7mozilla3net20DocumentLoadListener20TriggerProcessSwitchEPNS_3dom24CanonicalBrowsingContextERKNS2_26NavigationIsolationOptionsEb (libxul.so + 0x17687b5)#012#24 0x00007f52d957019a _ZN7mozilla3net20DocumentLoadListener25MaybeTriggerProcessSwitchEPb (libxul.so + 0x177019a)#012#25 0x00007f52d9572702 _ZN7mozilla3net20DocumentLoadListener16DoOnStartRequestEP10nsIRequest (libxul.so + 0x1772702)#012#26 0x00007f52d94244e3 _ZN7mozilla3net21ParentChannelListener14OnStartRequestEP10nsIRequest (libxul.so + 0x16244e3)#012#27 0x00007f52d9890170 _ZN18nsDocumentOpenInfo14OnStartRequestEP10nsIRequest (libxul.so + 0x1a90170)#012#28 0x00007f52d9568068 _ZN7mozilla3net29ParentProcessDocumentOpenInfo14OnStartRequestEP10nsIRequest (libxul.so + 0x1768068)#012#29 0x00007f52d9488983 _ZN7mozilla3net13nsHttpChannel18CallOnStartRequestEv (libxul.so + 0x1688983)#012#30 0x00007f52d948947b _ZN7mozilla3net13nsHttpChannel21ContinueProcessNormalE8nsresult (libxul.so + 0x168947b)#01
2#31 0x00007f52d948ab78 _ZN7mozilla3net13nsHttpChannel24ContinueProcessResponse3E8nsresult (libxul.so + 0x168ab78)#012#32 0x00007f52d948bb22 _ZN7mozilla3net13nsHttpChannel15ProcessResponseEPNS0_20nsHttpConnectionInfoE (libxul.so + 0x168bb22)#012#33 0x00007f52d948d1ba _ZN7mozilla3net13nsHttpChannel14OnStartRequestEP10nsIRequest (libxul.so + 0x168d1ba)#012#34 0x00007f52d905b7df _ZN17nsInputStreamPump12OnStateStartEv (libxul.so + 0x125b7df)#012#35 0x00007f52d9063abd _ZN17nsInputStreamPump18OnInputStreamReadyEP19nsIAsyncInputStream (libxul.so + 0x1263abd)#012#36 0x00007f52d8e728cf _ZZ32NS_NewCancelableRunnableFunctionIZN14CallbackHolderC4EP19nsIAsyncInputStreamP22nsIInputStreamCallbackjP14nsIEventTargetEUlvE_E16already_AddRefedIN7mozilla18CancelableRunnableEEPKcOT_EN22FuncCancelableRunnable3RunEv (libxul.so + 0x10728cf)#012#37 0x00007f52d8eb312f _ZN7mozilla14TaskController39DoExecuteNextTaskOnlyMainThreadInternalERKNS_6detail12BaseAutoLockIRNS_5MutexEEE (libxul.so + 0x10b312f)#012#38 0x
00007f52d8eb38ab _ZN7mozilla14TaskController37ExecuteNextTaskOnlyMainThreadInternalERKNS_6detail12BaseAutoLockIRNS_5MutexEEE (libxul.so + 0x10b38ab)#012#39 0x00007f52d8eb3afb _ZN7mozilla14TaskController20ProcessPendingMTTaskEb (libxul.so + 0x10b3afb)#012#40 0x00007f52d8eb3c16 _ZN7mozilla6detail16RunnableFunctionIZNS_14TaskControllerC4EvEUlvE_E3RunEv (libxul.so + 0x10b3c16)#012#41 0x00007f52d8ed931f _ZN8nsThread16ProcessNextEventEbPb (libxul.so + 0x10d931f)#012#42 0x00007f52d8ecb8df _Z19NS_ProcessNextEventP9nsIThreadb (libxul.so + 0x10cb8df)#012#43 0x00007f52d96ae32a _ZN7mozilla3ipc11MessagePump3RunEPN4base11MessagePump8DelegateE (libxul.so + 0x18ae32a)#012#44 0x00007f52d9656adb _ZN11MessageLoop3RunEv (libxul.so + 0x1856adb)#012#45 0x00007f52dcb1f49c _ZN14nsBaseAppShell3RunEv (libxul.so + 0x4d1f49c)#012#46 0x00007f52dcc0c91e _ZN10nsAppShell3RunEv (libxul.so + 0x4e0c91e)#012#47 0x00007f52dd6a2eee _ZN12nsAppStartup3RunEv (libxul.so + 0x58a2eee)#012#48 0x00007f52dd78f98a _ZN7XREMain11XR
E_mainRunEv (libxul.so + 0x598f98a)#012#49 0x00007f52dd7904ea _ZN7XREMain8XRE_mainEiPPcRKN7mozilla15BootstrapConfigE (libxul.so + 0x59904ea)#012#50 0x00007f52dd790c3f _Z8XRE_mainiPPcRKN7mozilla15BootstrapConfigE (libxul.so + 0x5990c3f)#012#51 0x0000556d6c2fa635 _ZL7do_mainiPPcS0_ (firefox + 0x10635)#012#52 0x0000556d6c2f9881 main (firefox + 0xf881)#012#53 0x00007f52e8c2a610 __libc_start_call_main (libc.so.6 + 0x2a610)#012#54 0x00007f52e8c2a6c0 __libc_start_main@@GLIBC_2.34 (libc.so.6 + 0x2a6c0)#012#55 0x0000556d6c2f9dd5 _start (firefox + 0xfdd5)#012#012Stack trace of thread 731964:#012#0 0x00007f52e8d0345f __poll (libc.so.6 + 0x10345f)#012#1 0x00007f52e6b703bc g_main_context_iterate.constprop.0 (libglib-2.0.so.0 + 0xaa3bc)#012#2 0x00007f52e6b18783 g_main_context_iteration (libglib-2.0.so.0 + 0x52783)#012#3 0x00007f52e6b187d1 glib_worker_main (libglib-2.0.so.0 + 0x527d1)#012#4 0x00007f52e6b49902 g_thread_proxy (libglib-2.0.so.0 + 0x83902)#012#5 0x00007f52e8c8b569 start_thread (
libc.so.6 + 0x8b569)#012#6 0x00007f52e8d10760 __clone3 (libc.so.6 + 0x110760)#012#012Stack trace
== ntop00 (766 distinct, 766 total) ==
Sep 16 16:05:01 ntop00 laughing_brown[37089]: INFO ( default_print/print ): *** Purging cache - START (PID: 694) ***
Sep 16 16:05:01 ntop00 laughing_brown[37089]: INFO ( default_print/print ): *** Purging cache - END (PID: 694, QN: 0/0, ET: X) ***
Sep 16 16:05:11 ntop00 laughing_brown[37089]: INFO ( default_print/print ): *** Purging cache - START (PID: 695) ***
Sep 16 16:05:11 ntop00 laughing_brown[37089]: INFO ( default_print/print ): *** Purging cache - END (PID: 695, QN: 0/0, ET: X) ***
Sep 16 16:05:21 ntop00 laughing_brown[37089]: INFO ( default_print/print ): *** Purging cache - START (PID: 696) ***
Sep 16 16:05:21 ntop00 laughing_brown[37089]: INFO ( default_print/print ): *** Purging cache - END (PID: 696, QN: 0/0, ET: X) ***
Sep 16 16:05:32 ntop00 laughing_brown[37089]: INFO ( default_print/print ): *** Purging cache - START (PID: 697) ***
Sep 16 16:05:32 ntop00 laughing_brown[37089]: INFO ( default_print/print ): *** Purging cache - END (PID: 697, QN: 0/0, ET: X) ***
Sep 16 16:05:41 ntop00 laughing_brown[37089]: INFO ( default_print/print ): *** Purging cache - START (PID: 698) ***
Sep 16 16:05:41 ntop00 laughing_brown[37089]: INFO ( default_print/print ): *** Purging cache - END (PID: 698, QN: 0/0, ET: X) ***
Sep 16 16:05:51 ntop00 laughing_brown[37089]: INFO ( default_print/print ): *** Purging cache - START (PID: 699) ***
Sep 16 16:05:51 ntop00 laughing_brown[37089]: INFO ( default_print/print ): *** Purging cache - END (PID: 699, QN: 0/0, ET: X) ***
Sep 16 16:06:01 ntop00 laughing_brown[37089]: INFO ( default_print/print ): *** Purging cache - START (PID: 700) ***
Sep 16 16:06:01 ntop00 laughing_brown[37089]: INFO ( default_print/print ): *** Purging cache - END (PID: 700, QN: 0/0, ET: X) ***
Sep 16 16:06:11 ntop00 laughing_brown[37089]: INFO ( default_print/print ): *** Purging cache - START (PID: 701) ***
Sep 16 16:06:11 ntop00 laughing_brown[37089]: INFO ( default_print/print ): *** Purging cache - END (PID: 701, QN: 0/0, ET: X) ***
Sep 16 16:06:21 ntop00 laughing_brown[37089]: INFO ( default_print/print ): *** Purging cache - START (PID: 702) ***
Sep 16 16:06:21 ntop00 laughing_brown[37089]: INFO ( default_print/print ): *** Purging cache - END (PID: 702, QN: 0/0, ET: X) ***
Sep 16 16:06:31 ntop00 laughing_brown[37089]: INFO ( default_print/print ): *** Purging cache - START (PID: 703) ***
Sep 16 16:06:31 ntop00 laughing_brown[37089]: INFO ( default_print/print ): *** Purging cache - END (PID: 703, QN: 0/0, ET: X) ***
Sep 16 16:06:41 ntop00 laughing_brown[37089]: INFO ( default_print/print ): *** Purging cache - START (PID: 704) ***
Sep 16 16:06:41 ntop00 laughing_brown[37089]: INFO ( default_print/print ): *** Purging cache - END (PID: 704, QN: 0/0, ET: X) ***
Sep 16 16:06:51 ntop00 laughing_brown[37089]: INFO ( default_print/print ): *** Purging cache - START (PID: 705) ***
Sep 16 16:06:51 ntop00 laughing_brown[37089]: INFO ( default_print/print ): *** Purging cache - END (PID: 705, QN: 0/0, ET: X) ***
Sep 16 16:07:01 ntop00 laughing_brown[37089]: INFO ( default_print/print ): *** Purging cache - START (PID: 706) ***
Sep 16 16:07:01 ntop00 laughing_brown[37089]: INFO ( default_print/print ): *** Purging cache - END (PID: 706, QN: 0/0, ET: X) ***
Sep 16 16:07:01 ntop00 nfacctd[9667]: INFO ( default_print/print ): *** Purging cache - START (PID: 43) ***
Sep 16 16:07:01 ntop00 nfacctd[9667]: INFO ( default_print/print ): *** Purging cache - END (PID: 43, QN: 0/0, ET: X) ***
Sep 16 16:07:11 ntop00 laughing_brown[37089]: INFO ( default_print/print ): *** Purging cache - START (PID: 707) ***
Sep 16 16:07:11 ntop00 laughing_brown[37089]: INFO ( default_print/print ): *** Purging cache - END (PID: 707, QN: 0/0, ET: X) ***
... 736 more distinct messages not shown
== outbound00.cs.umd.edu (2 distinct, 8 total) ==
Sep 16 16:09:09 outbound00.cs.umd.edu python3[727668]: ldapdb [x7]
Sep 16 16:27:00 outbound00.cs.umd.edu systemd[1]: Configuration file /usr/lib/systemd/system/authentication_milter.service is marked executable. Please remove executable permission bits. Proceeding anyway.
== outbound01.cs.umd.edu (2 distinct, 8 total) ==
Sep 16 16:13:06 outbound01.cs.umd.edu python3[2987669]: ldapdb [x7]
Sep 16 16:27:42 outbound01.cs.umd.edu systemd[1]: Configuration file /usr/lib/systemd/system/authentication_milter.service is marked executable. Please remove executable permission bits. Proceeding anyway.
== sentry-docker00.cs.umd.edu (36 distinct, 36 total) ==
Sep 16 16:19:17 sentry-docker00.cs.umd.edu systemd-udevd[1706092]: link_config: could not get ethtool features for veth4d96ee7
Sep 16 16:19:17 sentry-docker00.cs.umd.edu systemd-udevd[1706092]: Could not set offload features of veth4d96ee7: No such device
Sep 16 16:19:18 sentry-docker00.cs.umd.edu systemd-udevd[1706141]: Could not generate persistent MAC address for veth11b313b: No such file or directory
Sep 16 16:19:18 sentry-docker00.cs.umd.edu systemd-udevd[1706142]: Could not generate persistent MAC address for veth3203465: No such file or directory
Sep 16 16:19:18 sentry-docker00.cs.umd.edu systemd-udevd[1706145]: Could not generate persistent MAC address for veth1beef5d: No such file or directory
Sep 16 16:19:18 sentry-docker00.cs.umd.edu systemd-udevd[1706146]: Could not generate persistent MAC address for veth33f987e: No such file or directory
Sep 16 16:19:18 sentry-docker00.cs.umd.edu systemd-udevd[1706155]: Could not generate persistent MAC address for vethc1a2502: No such file or directory
Sep 16 16:19:18 sentry-docker00.cs.umd.edu systemd-udevd[1706156]: Could not generate persistent MAC address for vethe5fc6d2: No such file or directory
Sep 16 16:19:18 sentry-docker00.cs.umd.edu systemd-udevd[1706159]: Could not generate persistent MAC address for vethf718d91: No such file or directory
Sep 16 16:19:18 sentry-docker00.cs.umd.edu systemd-udevd[1706165]: Could not generate persistent MAC address for veth6560bda: No such file or directory
Sep 16 16:19:18 sentry-docker00.cs.umd.edu systemd-udevd[1706155]: Could not generate persistent MAC address for veth559992f: No such file or directory
Sep 16 16:19:18 sentry-docker00.cs.umd.edu systemd-udevd[1706142]: Could not generate persistent MAC address for veth954a913: No such file or directory
Sep 16 16:39:26 sentry-docker00.cs.umd.edu systemd-udevd[1715530]: link_config: could not get ethtool features for veth11b313b
Sep 16 16:39:26 sentry-docker00.cs.umd.edu systemd-udevd[1715530]: Could not set offload features of veth11b313b: No such device
Sep 16 16:39:26 sentry-docker00.cs.umd.edu systemd-udevd[1715567]: Could not generate persistent MAC address for veth3644d1b: No such file or directory
Sep 16 16:39:26 sentry-docker00.cs.umd.edu systemd-udevd[1715568]: Could not generate persistent MAC address for veth8bec4a7: No such file or directory
Sep 16 16:39:26 sentry-docker00.cs.umd.edu systemd-udevd[1715571]: Could not generate persistent MAC address for veth4ef660a: No such file or directory
Sep 16 16:39:26 sentry-docker00.cs.umd.edu systemd-udevd[1715572]: Could not generate persistent MAC address for vethb98b048: No such file or directory
Sep 16 16:39:26 sentry-docker00.cs.umd.edu systemd-udevd[1715595]: Could not generate persistent MAC address for veth300bb1a: No such file or directory
Sep 16 16:39:26 sentry-docker00.cs.umd.edu systemd-udevd[1715596]: Could not generate persistent MAC address for vethe00f3b6: No such file or directory
Sep 16 16:39:26 sentry-docker00.cs.umd.edu systemd-udevd[1715620]: Could not generate persistent MAC address for vethd6a4a61: No such file or directory
Sep 16 16:39:26 sentry-docker00.cs.umd.edu systemd-udevd[1715614]: Could not generate persistent MAC address for vethfdb1e30: No such file or directory
Sep 16 16:39:26 sentry-docker00.cs.umd.edu systemd-udevd[1715624]: Could not generate persistent MAC address for vethd60e733: No such file or directory
Sep 16 16:39:26 sentry-docker00.cs.umd.edu systemd-udevd[1715623]: Could not generate persistent MAC address for veth21c9ed3: No such file or directory
Sep 16 16:59:34 sentry-docker00.cs.umd.edu systemd-udevd[1724986]: link_config: could not get ethtool features for vethfdb1e30
Sep 16 16:59:34 sentry-docker00.cs.umd.edu systemd-udevd[1724986]: Could not set offload features of vethfdb1e30: No such device
Sep 16 16:59:35 sentry-docker00.cs.umd.edu systemd-udevd[1725040]: Could not generate persistent MAC address for vethbabbca3: No such file or directory
Sep 16 16:59:35 sentry-docker00.cs.umd.edu systemd-udevd[1725041]: Could not generate persistent MAC address for veth208cc24: No such file or directory
Sep 16 16:59:35 sentry-docker00.cs.umd.edu systemd-udevd[1725066]: Could not generate persistent MAC address for veth57c3972: No such file or directory
Sep 16 16:59:35 sentry-docker00.cs.umd.edu systemd-udevd[1725067]: Could not generate persistent MAC address for veth07bf34c: No such file or directory
... 6 more distinct messages not shown
== strawberry (7 distinct, 38 total) ==
Sep 16 16:07:03 strawberry kernel: I/O error, dev sda, sector 206848 op 0x0:(READ) flags 0x80700 phys_seg 1 prio class 2 [x6]
Sep 16 16:07:03 strawberry kernel: I/O error, dev sda, sector 206848 op 0x0:(READ) flags 0x0 phys_seg 1 prio class 2 [x6]
Sep 16 16:07:03 strawberry kernel: Buffer I/O error on dev sda2, logical block 0, async page read [x6]
Sep 16 16:07:03 strawberry kernel: I/O error, dev sda, sector 2048 op 0x0:(READ) flags 0x80700 phys_seg 1 prio class 2 [x6]
Sep 16 16:07:03 strawberry kernel: I/O error, dev sda, sector 2048 op 0x0:(READ) flags 0x0 phys_seg 1 prio class 2 [x6]
Sep 16 16:07:03 strawberry kernel: Buffer I/O error on dev sda1, logical block 0, async page read [x6]
Sep 16 16:34:42 strawberry smartd[5314]: Device: /dev/sda [SAT], failed to read SMART Attribute Data [x2]
== submit26-b9-f2 (1 distinct, 1 total) ==
Sep 16 16:09:25 submit26-b9-f2 systemd[1]: user(a)1001.service: Main process exited, code=killed, status=9/KILL
1
0
Command: /usr/local/sbin/syslog-digest.py
Time : 0.0728s
Status : exited 0
Output :
Syslog digest — 2026-09-16 16:05 EDT
Processed 3,519 lines, filtered 2,429 (69%). 1,090 unknown (870 distinct) from 37 host(s).
== b0b02.cs.umd.edu (2 distinct, 2 total) ==
Sep 16 15:20:31 b0b02.cs.umd.edu systemd[1]: resmon.service: Supervising process 1827136 which is not our child. We'll most likely not notice when it exits.
Sep 16 15:46:38 b0b02.cs.umd.edu rustdesk[1833593]: cannot open display:
== biggulp.cs.umd.edu (2 distinct, 2 total) ==
Sep 16 15:49:30 biggulp.cs.umd.edu sshd-session[1817253]: pam_access(sshd:auth): access denied for user `root' from `158.173.89.129'
Sep 16 15:49:32 biggulp.cs.umd.edu sshd-session[1817251]: error: PAM: Authentication failure for root from 158.173.89.129
== bigtuna (6 distinct, 6 total) ==
Sep 16 16:01:26 bigtuna xdg-desktop-por[577773]: Caught PipeWire error: connection error
Sep 16 16:01:43 bigtuna systemd-coredump[689396]: Process 578122 (firefox) of user 119773055 dumped core.#012#012Stack trace of thread 578151:#012#0 0x00007feb7268d38c __pthread_kill_implementation (libc.so.6 + 0x8d38c)#012#1 0x00007feb7263fa86 raise (libc.so.6 + 0x3fa86)#012#2 0x00007feb66f76155 _ZN13nsProfileLock18FatalSignalHandlerEiP9siginfo_tPv (libxul.so + 0x5976155)#012#3 0x00007feb7263fb30 __restore_rt (libc.so.6 + 0x3fb30)#012#4 0x00007feb66417446 _ZN7mozilla6widget24WlCompositorCrashHandlerEv (libxul.so + 0x4e17446)#012#5 0x00007feb664191fc _ZN17ProxiedConnection14ProcessFailureEv (libxul.so + 0x4e191fc)#012#6 0x00007feb6641b309 _ZN12WaylandProxy18ProcessConnectionsEv (libxul.so + 0x4e1b309)#012#7 0x00007feb6641b404 _ZN12WaylandProxy3RunEv (libxul.so + 0x4e1b404)#012#8 0x00007feb6641b484 _ZN12WaylandProxy14RunProxyThreadEPS_ (libxul.so + 0x4e1b484)#012#9 0x00007feb7268b569 start_thread (libc.so.6 + 0x8b569)#012#10 0x00007feb72710760 __clone3 (libc.so.6 + 0x110760)
#012#012Stack trace of thread 578434:#012#0 0x00007feb72708b8d syscall (libc.so.6 + 0x108b8d)#012#1 0x00007feb62e771ce epoll_wait (libxul.so + 0x18771ce)#012#2 0x00007feb67c48d29 _ZN9audioipc27ipccore9EventLoop4poll17h411822f41293a3afE (libxul.so + 0x6648d29)#012#3 0x00007feb67c5d9e5 _ZN3std3sys9backtrace28__rust_begin_short_backtrace17h987cbc7020e89934E (libxul.so + 0x665d9e5)#012#4 0x00007feb67c6b24d _ZN4core3ops8function6FnOnce40call_once$u7b$$u7b$vtable.shim$u7d$$u7d$17hf2652de70bacd243E (libxul.so + 0x666b24d)#012#5 0x00007feb68af1331 _ZN3std3sys6thread4unix6Thread3new12thread_start17h82f636742a8325cbE (libxul.so + 0x74f1331)#012#6 0x00007feb7268b569 start_thread (libc.so.6 + 0x8b569)#012#7 0x00007feb72710760 __clone3 (libc.so.6 + 0x110760)#012#012Stack trace of thread 578148:#012#0 0x00007feb726ff44c read (libc.so.6 + 0xff44c)#012#1 0x00007feb66bd5cd3 _ZN24AsyncSignalControlThread5WatchEv (libxul.so + 0x55d5cd3)#012#2 0x00007feb66bd5e8c _ZL29AsyncSignalControlThread
EntryPv (libxul.so + 0x55d5e8c)#012#3 0x00007feb7268b569 start_thread (libc.so.6 + 0x8b569)#012#4 0x00007feb72710760 __clone3 (libc.so.6 + 0x110760)#012#012Stack trace of thread 578149:#012#0 0x00007feb7270345f __poll (libc.so.6 + 0x10345f)#012#1 0x00007feb705703bc g_main_context_iterate.constprop.0 (libglib-2.0.so.0 + 0xaa3bc)#012#2 0x00007feb70518783 g_main_context_iteration (libglib-2.0.so.0 + 0x52783)#012#3 0x00007feb705187d1 glib_worker_main (libglib-2.0.so.0 + 0x527d1)#012#4 0x00007feb70549902 g_thread_proxy (libglib-2.0.so.0 + 0x83902)#012#5 0x00007feb7268b569 start_thread (libc.so.6 + 0x8b569)#012#6 0x00007feb72710760 __clone3 (libc.so.6 + 0x110760)#012#012Stack trace of thread 578188:#012#0 0x00007feb7268854a __futex_abstimed_wait_common (libc.so.6 + 0x8854a)#012#1 0x00007feb7268ab32 pthread_cond_wait@@GLIBC_2.3.2 (libc.so.6 + 0x8ab32)#012#2 0x000055aae7df5ddb _ZN7mozilla6detail21ConditionVariableImpl4waitERNS0_9MutexImplE (firefox + 0x5fddb)#012#3 0x00007feb62
6b2961 _ZN7mozilla14TaskController13RunPoolThreadEPNS_10PoolThreadE (libxul.so + 0x10b2961)#012#4 0x00007feb7290cbd4 _pt_root (libnspr4.so + 0x2cbd4)#012#5 0x00007feb7268b569 start_thread (libc.so.6 + 0x8b569)#012#6 0x00007feb72710760 __clone3 (libc.so.6 + 0x110760)#012#012Stack trace of thread 578157:#012#0 0x00007feb72708b8d syscall (libc.so.6 + 0x108b8d)#012#1 0x00007feb62e771ce epoll_wait (libxul.so + 0x18771ce)#012#2 0x00007feb62e794b0 epoll_dispatch (libxul.so + 0x18794b0)#012#3 0x00007feb62e7b918 event_base_loop (libxul.so + 0x187b918)#012#4 0x00007feb62e573af _ZN4base19MessagePumpLibevent3RunEPNS_11MessagePump8DelegateE (libxul.so + 0x18573af)#012#5 0x00007feb62e56adb _ZN11MessageLoop3RunEv (libxul.so + 0x1856adb)#012#6 0x00007feb62e6c250 _ZN4base6Thread10ThreadMainEv (libxul.so + 0x186c250)#012#7 0x00007feb62e52c9e _ZL10ThreadFuncPv (libxul.so + 0x1852c9e)#012#8 0x00007feb7268b569 start_thread (libc.so.6 + 0x8b569)#012#9 0x00007feb72710760 __clone3 (libc.so.6 +
0x110760)#012#012Stack trace of thread 578122:#012#0 0x00007feb7268854a __futex_abstimed_wait_common (libc.so.6 + 0x8854a)#012#1 0x00007feb7268ab32 pthread_cond_wait@@GLIBC_2.3.2 (libc.so.6 + 0x8ab32)#012#2 0x000055aae7df5ddb _ZN7mozilla6detail21ConditionVariableImpl4waitERNS0_9MutexImplE (firefox + 0x5fddb)#012#3 0x000055aae7df5fd8 _ZN7mozilla6detail21ConditionVariableImpl8wait_forERNS0_9MutexImplERKNS_16BaseTimeDurationINS_27TimeDurationValueCalculatorEEE (firefox + 0x5ffd8)#012#4 0x00007feb62eb43ec _ZN7mozilla3ipc14MessageChannel17WaitForSyncNotifyEv (libxul.so + 0x18b43ec)#012#5 0x00007feb62ec99f7 _ZN7mozilla3ipc14MessageChannel4SendENS_9UniquePtrIN3IPC7MessageENS_13DefaultDeleteIS4_EEEEPS7_ (libxul.so + 0x18c99f7)#012#6 0x00007feb62ec9e19 _ZN7mozilla3ipc9IProtocol11ChannelSendENS_9UniquePtrIN3IPC7MessageENS_13DefaultDeleteIS4_EEEEPS7_ (libxul.so + 0x18c9e19)#012#7 0x00007feb633d4fa2 _ZN7mozilla6layers22PCompositorBridgeChild10SendResumeEv (libxul.so + 0x1dd4fa2)#012#8
0x00007feb663a0a48 _Z19moz_container_unmapP10_GtkWidget (libxul.so + 0x4da0a48)#012#9 0x00007feb663a0b23 _Z27moz_container_wayland_unmapP10_GtkWidget (libxul.so + 0x4da0b23)#012#10 0x00007feb7286dbbc g_closure_invoke (libgobject-2.0.so.0 + 0x13bbc)#012#11 0x00007feb72889bf5 signal_emit_unlocked_R (libgobject-2.0.so.0 + 0x2fbf5)#012#12 0x00007feb7288b85a g_signal_emit_valist (libgobject-2.0.so.0 + 0x3185a)#012#13 0x00007feb7288ba73 g_signal_emit (libgobject-2.0.so.0 + 0x31a73)#012#14 0x00007feb70966f54 gtk_widget_unmap (libgtk-3.so.0 + 0x366f54)#012#15 0x00007feb7286dc7f g_closure_invoke (libgobject-2.0.so.0 + 0x13c7f)#012#16 0x00007feb72889bf5 signal_emit_unlocked_R (libgobject-2.0.so.0 + 0x2fbf5)#012#17 0x00007feb7288b85a g_signal_emit_valist (libgobject-2.0.so.0 + 0x3185a)#012#18 0x00007feb7288ba73 g_signal_emit (libgobject-2.0.so.0 + 0x31a73)#012#19 0x00007feb70966f54 gtk_widget_unmap (libgtk-3.so.0 + 0x366f54)#012#20 0x00007feb70987a3b gtk_window_hide.lto_priv.0 (libgtk-3.so.0
+ 0x387a3b)#012#21 0x00007feb7286dc7f g_closure_invoke (libgobject-2.0.so.0 + 0x13c7f)#012#22 0x00007feb72889bf5 signal_emit_unlocked_R (libgobject-2.0.so.0 + 0x2fbf5)#012#23 0x00007feb7288b85a g_signal_emit_valist (libgobject-2.0.so.0 + 0x3185a)#012#24 0x00007feb7288ba73 g_signal_emit (libgobject-2.0.so.0 + 0x31a73)#012#25 0x00007feb7096e330 gtk_widget_hide (libgtk-3.so.0 + 0x36e330)#012#26 0x00007feb66384708 _ZN8nsWindow4ShowEb (libxul.so + 0x4d84708)#012#27 0x00007feb66a85bd0 _ZN7mozilla9AppWindow13SetVisibilityEb (libxul.so + 0x5485bd0)#012#28 0x00007feb626e53f6 NS_InvokeByIndex (libxul.so + 0x10e53f6)#012#29 0x00007feb62fb898f _ZN16XPCWrappedNative10CallMethodER14XPCCallContextNS_8CallModeE (libxul.so + 0x19b898f)#012#30 0x00007feb62fbe1b5 _Z19XPC_WN_GetterSetterP9JSContextjPN2JS5ValueE (libxul.so + 0x19be1b5)#012#31 0x00007feb67ba25cd _ZN2js23InternalCallOrConstructEP9JSContextRKN2JS8CallArgsENS_14MaybeConstructENS_10CallReasonE (libxul.so + 0x65a25cd)#012#32 0x00007feb67ba44
b7 _ZN2js10CallSetterEP9JSContextN2JS6HandleINS2_5ValueEEES5_S5_ (libxul.so + 0x65a44b7)#012#33 0x00007feb671d8376 _ZL19SetExistingPropertyP9JSContextN2JS6HandleINS1_11PropertyKeyEEENS2_INS1_5ValueEEES6_NS2_IPN2js12NativeObjectEEERKNS7_14PropertyResultERNS1_14ObjectOpResultE (libxul.so + 0x5bd8376)#012#34 0x00007feb671de8c3 _ZN2js17NativeSetPropertyILNS_13QualifiedBoolE1EEEbP9JSContextN2JS6HandleIPNS_12NativeObjectEEENS5_INS4_11PropertyKeyEEENS5_INS4_5ValueEEESC_RNS4_14ObjectOpResultE (libxul.so + 0x5bde8c3)#012#35 0x00007feb67b9d931 _ZN2js9InterpretEP9JSContextRNS_8RunStateE (libxul.so + 0x659d931)#012#36 0x00007feb67ba20e3 _ZN2js9RunScriptEP9JSContextRNS_8RunStateE (libxul.so + 0x65a20e3)#012#37 0x00007feb67ba26e2 _ZN2js23InternalCallOrConstructEP9JSContextRKN2JS8CallArgsENS_14MaybeConstructENS_10CallReasonE (libxul.so + 0x65a26e2)#012#38 0x00007feb67ba2a5d _ZN2js4CallEP9JSContextN2JS6HandleINS2_5ValueEEES5_RKNS_13AnyInvokeArgsENS2_13MutableHandleIS4_EENS_10CallReasonE (libxul.so
+ 0x65a2a5d)#012#39 0x00007feb670fb367 _Z20JS_CallFunctionValueP9JSContextN2JS6HandleIP8JSObjectEE
Sep 16 16:01:43 bigtuna org.gnome.Shell.desktop[690063]: The XKEYBOARD keymap compiler (xkbcomp) reports:
Sep 16 16:01:43 bigtuna org.gnome.Shell.desktop[690063]: > Warning: Unsupported maximum keycode 708, clipping.
Sep 16 16:01:43 bigtuna org.gnome.Shell.desktop[690063]: > X11 cannot support keycodes above 255.
Sep 16 16:01:43 bigtuna org.gnome.Shell.desktop[690063]: Errors from xkbcomp are not fatal to the X server
== borealis (8 distinct, 10 total) ==
Sep 16 15:06:04 borealis goa-identity-se[376056]: GoaKerberosIdentityManager: Using polling for change notification for credential cache type 'KCM'
Sep 16 15:06:04 borealis vmware-user.desktop[376191]: vmware-user: could not open /proc/fs/vmblock/dev
Sep 16 15:06:05 borealis gsd-usb-protect[376141]: Failed to fetch USBGuard parameters: GDBus.Error:org.freedesktop.DBus.Error.ServiceUnknown: The name is not activatable
Sep 16 15:06:06 borealis gsd-rfkill[359646]: Error releasing name org.gnome.SettingsDaemon.Rfkill: The connection is closed
Sep 16 15:06:06 borealis gsd-color[376108]: failed to connect to device: Failed to connect to missing device /org/freedesktop/ColorManager/devices/xrandr_Dell_Inc__DELL_U2412M_7WFG152E149L_gdm_42
Sep 16 15:06:06 borealis gsd-color[376108]: failed to connect to device: Failed to connect to missing device /org/freedesktop/ColorManager/devices/xrandr_Dell_Inc__DELL_U2412M_4V35D7133HNU_gdm_42
Sep 16 15:06:07 borealis gnome-software[376197]: Only 0 apps for recent list, hiding [x3]
Sep 16 15:07:43 borealis packagekitd[376076]: Failed to get cache filename for firefox
== csfw00a (2 distinct, 140 total) ==
Sep 16 15:03:59 csfw00a kernel: bnxt_en 0000:09:00.0 eth3: NIC Link is Down [x138]
Sep 16 15:52:52 csfw00a ospf6d[1477]: [EC 100663307] Could not send entire message [x2]
== cskayako (1 distinct, 1 total) ==
Sep 16 15:19:50 cskayako systemd[1]: resmon.service: Supervising process 358752 which is not our child. We'll most likely not notice when it exits.
== forge00 (1 distinct, 1 total) ==
Sep 16 15:19:40 forge00 systemd[1]: resmon.service: Supervising process 4045948 which is not our child. We'll most likely not notice when it exits.
== galax (1 distinct, 1 total) ==
Sep 16 15:12:46 galax kernel: workqueue: dm_irq_work_func [amdgpu] hogged CPU for >10000us 1027 times, consider switching to WQ_UNBOUND
== grades01.cs.umd.edu (3 distinct, 5 total) ==
Sep 16 15:06:20 grades01.cs.umd.edu sudo[24161]: csdlocaladmin : problem with defaults entries ; TTY=pts/0 ; PWD=/home/csdlocaladmin ; USER=root ; [x2]
Sep 16 15:22:32 grades01.cs.umd.edu puppet-agent[26062]: The directory '/srv/grades' contains 2471 entries, which exceeds the default soft limit 1000 and may cause excessive resource consumption and degraded performance. To remove this warning set a value for `max_files` parameter or consider using an alternate method to manage large directory trees [x2]
Sep 16 15:24:16 grades01.cs.umd.edu systemd[1]: resmon.service: Supervising process 27875 which is not our child. We'll most likely not notice when it exits.
== grafana (1 distinct, 1 total) ==
Sep 16 15:19:58 grafana systemd[1]: resmon.service: Supervising process 3444004 which is not our child. We'll most likely not notice when it exits.
== idm00 (1 distinct, 1 total) ==
Sep 16 15:54:04 idm00 named[4166701]: client @0x7f11a0064678 10.73.240.42#51566: update '73.10.in-addr.arpa/IN' denied
== idmp0 (2 distinct, 2 total) ==
Sep 16 15:37:37 idmp0 named[1598691]: client @0x7f2d28007ab8 10.73.240.43#61080: update '73.10.in-addr.arpa/IN' denied
Sep 16 15:52:24 idmp0 named[1598691]: client @0x7f2d088aa828 10.73.245.12#56680: update '73.10.in-addr.arpa/IN' denied
== inbound00.cs.umd.edu (1 distinct, 1 total) ==
Sep 16 15:20:19 inbound00.cs.umd.edu systemd[1]: Configuration file /usr/lib/systemd/system/authentication_milter.service is marked executable. Please remove executable permission bits. Proceeding anyway.
== inbound01.cs.umd.edu (1 distinct, 1 total) ==
Sep 16 15:18:56 inbound01.cs.umd.edu systemd[1]: Configuration file /usr/lib/systemd/system/authentication_milter.service is marked executable. Please remove executable permission bits. Proceeding anyway.
== itmon02 (2 distinct, 8 total) ==
Sep 16 15:08:17 itmon02 sshd[1750555]: error: beginning MaxStartups throttling [x7]
Sep 16 15:19:30 itmon02 systemd[1]: resmon.service: Supervising process 442686 which is not our child. We'll most likely not notice when it exits.
== itmon03 (1 distinct, 1 total) ==
Sep 16 15:20:49 itmon03 systemd[1]: resmon.service: Supervising process 3701418 which is not our child. We'll most likely not notice when it exits.
== krispykreme.cs.umd.edu (2 distinct, 6 total) ==
Sep 16 15:52:52 krispykreme.cs.umd.edu systemd-coredump[2951467]: Process 2951460 (xpdf) of user 20263 dumped core.
Sep 16 15:52:52 krispykreme.cs.umd.edu xdg-desktop-por[2951501]: cannot open display: [x5]
== librenms (2 distinct, 2 total) ==
Sep 16 15:19:24 librenms systemd[1]: resmon.service: Supervising process 28939 which is not our child. We'll most likely not notice when it exits.
Sep 16 15:19:30 librenms puppet-agent[28190]: The directory '/opt/librenms/rrd' contains 16517 entries, which exceeds the default soft limit 1000 and may cause excessive resource consumption and degraded performance. To remove this warning set a value for `max_files` parameter or consider using an alternate method to manage large directory trees
== misty.cs.umd.edu (1 distinct, 1 total) ==
Sep 16 16:00:29 misty.cs.umd.edu kernel: perf: interrupt took too long (9826 > 9822), lowering kernel.perf_event_max_sample_rate to 20000
== neograd (1 distinct, 1 total) ==
Sep 16 15:19:16 neograd systemd[1]: resmon.service: Supervising process 1836908 which is not our child. We'll most likely not notice when it exits.
== netbox (1 distinct, 1 total) ==
Sep 16 15:19:22 netbox systemd[1]: resmon.service: Supervising process 3543327 which is not our child. We'll most likely not notice when it exits.
== newhonors2 (1 distinct, 24 total) ==
Sep 16 15:13:03 newhonors2 dhcpcd[2727755]: dhcpcd is not running [x24]
== ntop00 (768 distinct, 768 total) ==
Sep 16 15:05:01 ntop00 laughing_brown[37089]: INFO ( default_print/print ): *** Purging cache - START (PID: 334) ***
Sep 16 15:05:01 ntop00 laughing_brown[37089]: INFO ( default_print/print ): *** Purging cache - END (PID: 334, QN: 0/0, ET: X) ***
Sep 16 15:05:11 ntop00 laughing_brown[37089]: INFO ( default_print/print ): *** Purging cache - START (PID: 335) ***
Sep 16 15:05:11 ntop00 laughing_brown[37089]: INFO ( default_print/print ): *** Purging cache - END (PID: 335, QN: 0/0, ET: X) ***
Sep 16 15:05:21 ntop00 laughing_brown[37089]: INFO ( default_print/print ): *** Purging cache - START (PID: 336) ***
Sep 16 15:05:21 ntop00 laughing_brown[37089]: INFO ( default_print/print ): *** Purging cache - END (PID: 336, QN: 0/0, ET: X) ***
Sep 16 15:05:31 ntop00 laughing_brown[37089]: INFO ( default_print/print ): *** Purging cache - START (PID: 337) ***
Sep 16 15:05:31 ntop00 laughing_brown[37089]: INFO ( default_print/print ): *** Purging cache - END (PID: 337, QN: 0/0, ET: X) ***
Sep 16 15:05:41 ntop00 laughing_brown[37089]: INFO ( default_print/print ): *** Purging cache - START (PID: 338) ***
Sep 16 15:05:41 ntop00 laughing_brown[37089]: INFO ( default_print/print ): *** Purging cache - END (PID: 338, QN: 0/0, ET: X) ***
Sep 16 15:05:51 ntop00 laughing_brown[37089]: INFO ( default_print/print ): *** Purging cache - START (PID: 339) ***
Sep 16 15:05:51 ntop00 laughing_brown[37089]: INFO ( default_print/print ): *** Purging cache - END (PID: 339, QN: 0/0, ET: X) ***
Sep 16 15:06:01 ntop00 laughing_brown[37089]: INFO ( default_print/print ): *** Purging cache - START (PID: 340) ***
Sep 16 15:06:01 ntop00 laughing_brown[37089]: INFO ( default_print/print ): *** Purging cache - END (PID: 340, QN: 0/0, ET: X) ***
Sep 16 15:06:11 ntop00 laughing_brown[37089]: INFO ( default_print/print ): *** Purging cache - START (PID: 341) ***
Sep 16 15:06:11 ntop00 laughing_brown[37089]: INFO ( default_print/print ): *** Purging cache - END (PID: 341, QN: 0/0, ET: X) ***
Sep 16 15:06:21 ntop00 laughing_brown[37089]: INFO ( default_print/print ): *** Purging cache - START (PID: 342) ***
Sep 16 15:06:21 ntop00 laughing_brown[37089]: INFO ( default_print/print ): *** Purging cache - END (PID: 342, QN: 0/0, ET: X) ***
Sep 16 15:06:31 ntop00 laughing_brown[37089]: INFO ( default_print/print ): *** Purging cache - START (PID: 343) ***
Sep 16 15:06:31 ntop00 laughing_brown[37089]: INFO ( default_print/print ): *** Purging cache - END (PID: 343, QN: 0/0, ET: X) ***
Sep 16 15:06:41 ntop00 laughing_brown[37089]: INFO ( default_print/print ): *** Purging cache - START (PID: 344) ***
Sep 16 15:06:41 ntop00 laughing_brown[37089]: INFO ( default_print/print ): *** Purging cache - END (PID: 344, QN: 0/0, ET: X) ***
Sep 16 15:06:51 ntop00 laughing_brown[37089]: INFO ( default_print/print ): *** Purging cache - START (PID: 345) ***
Sep 16 15:06:51 ntop00 laughing_brown[37089]: INFO ( default_print/print ): *** Purging cache - END (PID: 345, QN: 0/0, ET: X) ***
Sep 16 15:07:01 ntop00 laughing_brown[37089]: INFO ( default_print/print ): *** Purging cache - START (PID: 346) ***
Sep 16 15:07:01 ntop00 laughing_brown[37089]: INFO ( default_print/print ): *** Purging cache - END (PID: 346, QN: 0/0, ET: X) ***
Sep 16 15:07:01 ntop00 nfacctd[9667]: INFO ( default_print/print ): *** Purging cache - START (PID: 31) ***
Sep 16 15:07:01 ntop00 nfacctd[9667]: INFO ( default_print/print ): *** Purging cache - END (PID: 31, QN: 0/0, ET: X) ***
Sep 16 15:07:11 ntop00 laughing_brown[37089]: INFO ( default_print/print ): *** Purging cache - START (PID: 347) ***
Sep 16 15:07:11 ntop00 laughing_brown[37089]: INFO ( default_print/print ): *** Purging cache - END (PID: 347, QN: 0/0, ET: X) ***
... 738 more distinct messages not shown
== openvox08-board (1 distinct, 1 total) ==
Sep 16 15:20:05 openvox08-board systemd[1]: resmon.service: Supervising process 1448899 which is not our child. We'll most likely not notice when it exits.
== outbound00.cs.umd.edu (2 distinct, 8 total) ==
Sep 16 15:09:09 outbound00.cs.umd.edu python3[712913]: ldapdb [x7]
Sep 16 15:20:59 outbound00.cs.umd.edu systemd[1]: Configuration file /usr/lib/systemd/system/authentication_milter.service is marked executable. Please remove executable permission bits. Proceeding anyway.
== outbound01.cs.umd.edu (2 distinct, 8 total) ==
Sep 16 15:13:07 outbound01.cs.umd.edu python3[2972880]: ldapdb [x7]
Sep 16 15:20:35 outbound01.cs.umd.edu systemd[1]: Configuration file /usr/lib/systemd/system/authentication_milter.service is marked executable. Please remove executable permission bits. Proceeding anyway.
== sentry-docker00.cs.umd.edu (38 distinct, 38 total) ==
Sep 16 15:18:53 sentry-docker00.cs.umd.edu systemd-udevd[1677899]: link_config: could not get ethtool features for vethda81e11
Sep 16 15:18:53 sentry-docker00.cs.umd.edu systemd-udevd[1677899]: Could not set offload features of vethda81e11: No such device
Sep 16 15:18:53 sentry-docker00.cs.umd.edu systemd-udevd[1677932]: Could not generate persistent MAC address for vethc7fda07: No such file or directory
Sep 16 15:18:53 sentry-docker00.cs.umd.edu systemd-udevd[1677933]: Could not generate persistent MAC address for vetha2b9d63: No such file or directory
Sep 16 15:18:53 sentry-docker00.cs.umd.edu systemd-udevd[1677936]: Could not generate persistent MAC address for veth70cad10: No such file or directory
Sep 16 15:18:53 sentry-docker00.cs.umd.edu systemd-udevd[1677937]: Could not generate persistent MAC address for veth2fda705: No such file or directory
Sep 16 15:18:53 sentry-docker00.cs.umd.edu systemd-udevd[1677960]: Could not generate persistent MAC address for vethcd66e1f: No such file or directory
Sep 16 15:18:53 sentry-docker00.cs.umd.edu systemd-udevd[1677961]: Could not generate persistent MAC address for veth85598ef: No such file or directory
Sep 16 15:18:53 sentry-docker00.cs.umd.edu systemd-udevd[1677979]: Could not generate persistent MAC address for veth07fdbe7: No such file or directory
Sep 16 15:18:53 sentry-docker00.cs.umd.edu systemd-udevd[1677960]: Could not generate persistent MAC address for veth595ae56: No such file or directory
Sep 16 15:18:53 sentry-docker00.cs.umd.edu systemd-udevd[1677970]: Could not generate persistent MAC address for vethd9f39d5: No such file or directory
Sep 16 15:18:53 sentry-docker00.cs.umd.edu systemd-udevd[1677983]: Could not generate persistent MAC address for vethfef6d55: No such file or directory
Sep 16 15:39:01 sentry-docker00.cs.umd.edu systemd-udevd[1687344]: link_config: could not get ethtool features for vethfef6d55
Sep 16 15:39:01 sentry-docker00.cs.umd.edu systemd-udevd[1687344]: Could not set offload features of vethfef6d55: No such device
Sep 16 15:39:01 sentry-docker00.cs.umd.edu systemd-udevd[1687347]: link_config: could not set ethtool features for vethcd66e1f
Sep 16 15:39:01 sentry-docker00.cs.umd.edu systemd-udevd[1687347]: Could not set offload features of vethcd66e1f: Operation not permitted
Sep 16 15:39:02 sentry-docker00.cs.umd.edu systemd-udevd[1687375]: Could not generate persistent MAC address for vethd76c6df: No such file or directory
Sep 16 15:39:02 sentry-docker00.cs.umd.edu systemd-udevd[1687376]: Could not generate persistent MAC address for veth8e3357d: No such file or directory
Sep 16 15:39:02 sentry-docker00.cs.umd.edu systemd-udevd[1687401]: Could not generate persistent MAC address for veth04b1ce8: No such file or directory
Sep 16 15:39:02 sentry-docker00.cs.umd.edu systemd-udevd[1687402]: Could not generate persistent MAC address for vethede81f1: No such file or directory
Sep 16 15:39:02 sentry-docker00.cs.umd.edu systemd-udevd[1687420]: Could not generate persistent MAC address for veth213648e: No such file or directory
Sep 16 15:39:02 sentry-docker00.cs.umd.edu systemd-udevd[1687419]: Could not generate persistent MAC address for veth9b03d1f: No such file or directory
Sep 16 15:39:02 sentry-docker00.cs.umd.edu systemd-udevd[1687421]: Could not generate persistent MAC address for veth59b589f: No such file or directory
Sep 16 15:39:02 sentry-docker00.cs.umd.edu systemd-udevd[1687425]: Could not generate persistent MAC address for vethd4e06c1: No such file or directory
Sep 16 15:39:02 sentry-docker00.cs.umd.edu systemd-udevd[1687419]: Could not generate persistent MAC address for veth229943e: No such file or directory
Sep 16 15:39:02 sentry-docker00.cs.umd.edu systemd-udevd[1687425]: Could not generate persistent MAC address for veth24f45b4: No such file or directory
Sep 16 15:59:09 sentry-docker00.cs.umd.edu systemd-udevd[1696707]: link_config: could not get ethtool features for veth59b589f
Sep 16 15:59:09 sentry-docker00.cs.umd.edu systemd-udevd[1696707]: Could not set offload features of veth59b589f: No such device
Sep 16 15:59:10 sentry-docker00.cs.umd.edu systemd-udevd[1696738]: Could not generate persistent MAC address for veth4d96ee7: No such file or directory
Sep 16 15:59:10 sentry-docker00.cs.umd.edu systemd-udevd[1696739]: Could not generate persistent MAC address for veth1d7e487: No such file or directory
... 8 more distinct messages not shown
== strawberry (7 distinct, 38 total) ==
Sep 16 15:07:03 strawberry kernel: I/O error, dev sda, sector 206848 op 0x0:(READ) flags 0x80700 phys_seg 1 prio class 2 [x6]
Sep 16 15:07:03 strawberry kernel: I/O error, dev sda, sector 206848 op 0x0:(READ) flags 0x0 phys_seg 1 prio class 2 [x6]
Sep 16 15:07:03 strawberry kernel: Buffer I/O error on dev sda2, logical block 0, async page read [x6]
Sep 16 15:07:03 strawberry kernel: I/O error, dev sda, sector 2048 op 0x0:(READ) flags 0x80700 phys_seg 1 prio class 2 [x6]
Sep 16 15:07:03 strawberry kernel: I/O error, dev sda, sector 2048 op 0x0:(READ) flags 0x0 phys_seg 1 prio class 2 [x6]
Sep 16 15:07:03 strawberry kernel: Buffer I/O error on dev sda1, logical block 0, async page read [x6]
Sep 16 15:34:42 strawberry smartd[5314]: Device: /dev/sda [SAT], failed to read SMART Attribute Data [x2]
== submit26-b9-f1 (1 distinct, 2 total) ==
Sep 16 15:38:06 submit26-b9-f1 systemd[1]: user(a)1001.service: Main process exited, code=killed, status=9/KILL [x2]
== submit26-b9-f2 (1 distinct, 2 total) ==
Sep 16 15:15:46 submit26-b9-f2 systemd[1]: user(a)1001.service: Main process exited, code=killed, status=9/KILL [x2]
== submit26-b9-f3 (1 distinct, 1 total) ==
Sep 16 15:29:07 submit26-b9-f3 systemd[1]: user(a)1001.service: Main process exited, code=killed, status=9/KILL
== submit26-b9-f4 (1 distinct, 1 total) ==
Sep 16 15:09:35 submit26-b9-f4 systemd[1]: user(a)1001.service: Main process exited, code=killed, status=9/KILL
== submit9 (1 distinct, 1 total) ==
Sep 16 15:21:32 submit9 systemd[1]: resmon.service: Supervising process 1438372 which is not our child. We'll most likely not notice when it exits.
== teaching-awards (1 distinct, 1 total) ==
Sep 16 15:20:46 teaching-awards systemd[1]: resmon.service: Supervising process 889060 which is not our child. We'll most likely not notice when it exits.
== test-ipv6 (1 distinct, 1 total) ==
Sep 16 15:19:18 test-ipv6 systemd[1]: resmon.service: Supervising process 1826784 which is not our child. We'll most likely not notice when it exits.
== tlsrpt (1 distinct, 1 total) ==
Sep 16 15:20:01 tlsrpt systemd[1]: resmon.service: Supervising process 2751533 which is not our child. We'll most likely not notice when it exits.
== vault (1 distinct, 1 total) ==
Sep 16 15:20:28 vault systemd[1]: resmon.service: Supervising process 3936538 which is not our child. We'll most likely not notice when it exits.
1
0
Command: /usr/local/sbin/syslog-digest.py
Time : 0.0821s
Status : exited 0
Output :
Syslog digest — 2026-09-16 15:05 EDT
Processed 3,908 lines, filtered 2,458 (62%). 1,450 unknown (1228 distinct) from 21 host(s).
== abadi-computer (2 distinct, 6 total) ==
Sep 16 14:08:55 abadi-computer falcon-sensor-bpf[529]: CrowdStrike(4): Could not retrieve DisableProxy value: c0000225 [x3]
Sep 16 14:08:55 abadi-computer falcon-sensor-bpf[529]: CrowdStrike(4): ConnectWithProxy: Unable to get application proxy host from CsConfig: c0000225 [x3]
== atif01.cs.umd.edu (2 distinct, 3 total) ==
Sep 16 14:07:12 atif01.cs.umd.edu kernel: net_ratelimit: 10 callbacks suppressed
Sep 16 14:07:30 atif01.cs.umd.edu kernel: net_ratelimit: 9 callbacks suppressed [x2]
== b0b02.cs.umd.edu (1 distinct, 1 total) ==
Sep 16 14:46:36 b0b02.cs.umd.edu rustdesk[1817431]: cannot open display:
== biggulp.cs.umd.edu (4 distinct, 6 total) ==
Sep 16 14:11:10 biggulp.cs.umd.edu falcon-sensor-bpf[834]: CrowdStrike(4): Could not retrieve DisableProxy value: c0000225
Sep 16 14:11:10 biggulp.cs.umd.edu falcon-sensor-bpf[834]: CrowdStrike(4): ConnectWithProxy: Unable to get application proxy host from CsConfig: c0000225
Sep 16 14:33:55 biggulp.cs.umd.edu sshd-session[1804980]: pam_access(sshd:auth): access denied for user `root' from `158.173.89.129' [x2]
Sep 16 14:33:57 biggulp.cs.umd.edu sshd-session[1804978]: error: PAM: Authentication failure for root from 158.173.89.129 [x2]
== csfw00a (1 distinct, 135 total) ==
Sep 16 14:03:50 csfw00a kernel: bnxt_en 0000:09:00.0 eth3: NIC Link is Down [x135]
== idm00 (2 distinct, 2 total) ==
Sep 16 14:50:31 idm00 named[4166701]: zone csic.umd.edu/IN: zone_journal_compact: could not get zone size: not found
Sep 16 14:54:04 idm00 named[4166701]: client @0x7f11980696f8 10.73.240.42#58502: update '73.10.in-addr.arpa/IN' denied
== idmh1 (1 distinct, 1 total) ==
Sep 16 14:50:30 idmh1 named[3565631]: zone csic.umd.edu/IN: zone_journal_compact: could not get zone size: not found
== idmp0 (2 distinct, 2 total) ==
Sep 16 14:37:36 idmp0 named[1598691]: client @0x7f2d14025948 10.73.240.43#57529: update '73.10.in-addr.arpa/IN' denied
Sep 16 14:50:50 idmp0 named[1598691]: zone csic.umd.edu/IN: zone_journal_compact: could not get zone size: not found
== idmv0 (1 distinct, 1 total) ==
Sep 16 14:51:53 idmv0 named[3973338]: zone csic.umd.edu/IN: zone_journal_compact: could not get zone size: not found
== itmon02 (1 distinct, 3 total) ==
Sep 16 14:28:43 itmon02 sshd[1750555]: error: beginning MaxStartups throttling [x3]
== munin (2 distinct, 6 total) ==
Sep 16 14:08:04 munin sudo[2930581]: pam_systemd(sudo:session): Failed to stat() runtime directory '/run/user/0': No such file or directory [x3]
Sep 16 14:08:04 munin sudo[2930581]: pam_systemd(sudo:session): Not setting $XDG_RUNTIME_DIR, as the directory is not in order. [x3]
== newhonors2 (1 distinct, 24 total) ==
Sep 16 14:13:03 newhonors2 dhcpcd[2725905]: dhcpcd is not running [x24]
== ntop00 (1141 distinct, 1149 total) ==
Sep 16 14:07:01 ntop00 nfacctd[9667]: INFO ( default_print/print ): *** Purging cache - START (PID: 19) ***
Sep 16 14:07:01 ntop00 nfacctd[9667]: INFO ( default_print/print ): *** Purging cache - END (PID: 19, QN: 0/0, ET: X) ***
Sep 16 14:07:01 ntop00 sfacctd[9517]: INFO ( default_print/print ): *** Purging cache - START (PID: 19) ***
Sep 16 14:07:01 ntop00 sfacctd[9517]: INFO ( default_print/print ): *** Purging cache - END (PID: 19, QN: 0/0, ET: X) ***
Sep 16 14:09:48 ntop00 laughing_brown[37089]: DEBUG: [cmdline] plugin name/type: 'default'/'core'.
Sep 16 14:09:48 ntop00 laughing_brown[37089]: DEBUG: [cmdline] plugin name/type: 'default_print'/'print'.
Sep 16 14:09:48 ntop00 laughing_brown[37089]: DEBUG: [cmdline] sfacctd_port:6343
Sep 16 14:09:48 ntop00 laughing_brown[37089]: DEBUG: [cmdline] print_output:json
Sep 16 14:09:48 ntop00 laughing_brown[37089]: DEBUG: [cmdline] print_output_file:/tmp/debugtest.json
Sep 16 14:09:48 ntop00 laughing_brown[37089]: DEBUG: [cmdline] print_output_file_append:true
Sep 16 14:09:48 ntop00 laughing_brown[37089]: DEBUG: [cmdline] sql_refresh_time:10
Sep 16 14:09:48 ntop00 laughing_brown[37089]: DEBUG: [cmdline] aggregate:src_host,dst_host,src_port,dst_port,proto,tcpflags
Sep 16 14:09:48 ntop00 laughing_brown[37089]: DEBUG: [cmdline] debug:true
Sep 16 14:09:48 ntop00 laughing_brown[37089]: INFO ( default/core ): sFlow Accounting Daemon, sfacctd 1.7.9-git (20240801-0 (32fd57eb))
Sep 16 14:09:48 ntop00 laughing_brown[37089]: INFO ( default/core ): '--enable-mysql' '--enable-pgsql' '--enable-sqlite3' '--enable-kafka' '--enable-geoipv2' '--enable-jansson' '--enable-rabbitmq' '--enable-nflog' '--enable-ndpi' '--enable-zmq' '--enable-avro' '--enable-serdes' '--enable-redis' '--enable-gnutls' 'AVRO_CFLAGS=-I/usr/local/avro/include' 'AVRO_LIBS=-L/usr/local/avro/lib -lavro' '--enable-l2' '--enable-traffic-bins' '--enable-bgp-bins' '--enable-bmp-bins' '--enable-st-bins'
Sep 16 14:09:48 ntop00 laughing_brown[37089]: INFO ( default/core ): Reading configuration from cmdline.
Sep 16 14:09:48 ntop00 laughing_brown[37089]: INFO ( default_print/print ): plugin_pipe_size=4096000 bytes plugin_buffer_size=344 bytes
Sep 16 14:09:48 ntop00 laughing_brown[37089]: INFO ( default_print/print ): ctrl channel: obtained=212992 bytes target=95248 bytes
Sep 16 14:09:48 ntop00 laughing_brown[37089]: INFO ( default/core ): waiting for sFlow data on interface=all ip=:: port=6343/udp
Sep 16 14:09:48 ntop00 laughing_brown[37089]: INFO ( default_print/print ): cache entries=16411 base cache memory=72208400 bytes
Sep 16 14:09:48 ntop00 laughing_brown[37089]: INFO ( default_print/print ): JSON: setting object handlers.
Sep 16 14:09:51 ntop00 laughing_brown[37089]: INFO ( default_print/print ): *** Purging cache - START (PID: 3) ***
Sep 16 14:09:51 ntop00 laughing_brown[37089]: INFO ( default_print/print ): *** Purging cache - END (PID: 3, QN: 0/0, ET: X) ***
Sep 16 14:10:01 ntop00 laughing_brown[37089]: INFO ( default_print/print ): *** Purging cache - START (PID: 4) ***
Sep 16 14:10:01 ntop00 laughing_brown[37089]: INFO ( default_print/print ): *** Purging cache - END (PID: 4, QN: 0/0, ET: X) ***
Sep 16 14:10:11 ntop00 laughing_brown[37089]: INFO ( default_print/print ): *** Purging cache - START (PID: 5) ***
Sep 16 14:10:11 ntop00 laughing_brown[37089]: INFO ( default_print/print ): *** Purging cache - END (PID: 5, QN: 0/0, ET: X) ***
Sep 16 14:10:21 ntop00 laughing_brown[37089]: INFO ( default_print/print ): *** Purging cache - START (PID: 6) ***
Sep 16 14:10:21 ntop00 laughing_brown[37089]: INFO ( default_print/print ): *** Purging cache - END (PID: 6, QN: 0/0, ET: X) ***
Sep 16 14:10:31 ntop00 laughing_brown[37089]: INFO ( default_print/print ): *** Purging cache - START (PID: 7) ***
... 1111 more distinct messages not shown
== outbound00.cs.umd.edu (1 distinct, 6 total) ==
Sep 16 14:09:09 outbound00.cs.umd.edu python3[698083]: ldapdb [x6]
== outbound01.cs.umd.edu (1 distinct, 6 total) ==
Sep 16 14:13:06 outbound01.cs.umd.edu python3[2958342]: ldapdb [x6]
== portal (1 distinct, 1 total) ==
Sep 16 14:34:41 portal setroubleshoot[1225635]: SELinux is preventing /usr/bin/podman from using the nnp_transition access on a process. For complete SELinux messages run: sealert -l 7fd47d7d-0597-41f1-9a89-8a4911d8024d
== sentry-docker00.cs.umd.edu (36 distinct, 36 total) ==
Sep 16 14:18:28 sentry-docker00.cs.umd.edu systemd-udevd[1649628]: link_config: could not get ethtool features for veth631a61a
Sep 16 14:18:28 sentry-docker00.cs.umd.edu systemd-udevd[1649628]: Could not set offload features of veth631a61a: No such device
Sep 16 14:18:28 sentry-docker00.cs.umd.edu systemd-udevd[1649632]: link_config: could not get ethtool features for veth48b3654
Sep 16 14:18:28 sentry-docker00.cs.umd.edu systemd-udevd[1649632]: Could not set offload features of veth48b3654: No such device
Sep 16 14:18:28 sentry-docker00.cs.umd.edu systemd-udevd[1649681]: Could not generate persistent MAC address for veth5428930: No such file or directory
Sep 16 14:18:28 sentry-docker00.cs.umd.edu systemd-udevd[1649682]: Could not generate persistent MAC address for veth748c7c0: No such file or directory
Sep 16 14:18:28 sentry-docker00.cs.umd.edu systemd-udevd[1649700]: Could not generate persistent MAC address for vethffff6cb: No such file or directory
Sep 16 14:18:28 sentry-docker00.cs.umd.edu systemd-udevd[1649701]: Could not generate persistent MAC address for vethd1fd8ed: No such file or directory
Sep 16 14:18:28 sentry-docker00.cs.umd.edu systemd-udevd[1649728]: Could not generate persistent MAC address for vethd56e67b: No such file or directory
Sep 16 14:18:28 sentry-docker00.cs.umd.edu systemd-udevd[1649729]: Could not generate persistent MAC address for veth430d93a: No such file or directory
Sep 16 14:18:28 sentry-docker00.cs.umd.edu systemd-udevd[1649747]: Could not generate persistent MAC address for veth627e79a: No such file or directory
Sep 16 14:18:28 sentry-docker00.cs.umd.edu systemd-udevd[1649740]: Could not generate persistent MAC address for veth0f5679c: No such file or directory
Sep 16 14:18:28 sentry-docker00.cs.umd.edu systemd-udevd[1649751]: Could not generate persistent MAC address for veth2be5b88: No such file or directory
Sep 16 14:18:28 sentry-docker00.cs.umd.edu systemd-udevd[1649746]: Could not generate persistent MAC address for vethd57ffe8: No such file or directory
Sep 16 14:38:36 sentry-docker00.cs.umd.edu systemd-udevd[1659112]: Could not generate persistent MAC address for veth55defdc: No such file or directory
Sep 16 14:38:36 sentry-docker00.cs.umd.edu systemd-udevd[1659113]: Could not generate persistent MAC address for vethfd7f9bf: No such file or directory
Sep 16 14:38:36 sentry-docker00.cs.umd.edu systemd-udevd[1659116]: Could not generate persistent MAC address for vethd6bd879: No such file or directory
Sep 16 14:38:36 sentry-docker00.cs.umd.edu systemd-udevd[1659117]: Could not generate persistent MAC address for vethb294773: No such file or directory
Sep 16 14:38:36 sentry-docker00.cs.umd.edu systemd-udevd[1659141]: Could not generate persistent MAC address for veth98dc9ed: No such file or directory
Sep 16 14:38:36 sentry-docker00.cs.umd.edu systemd-udevd[1659140]: Could not generate persistent MAC address for vethde49011: No such file or directory
Sep 16 14:38:36 sentry-docker00.cs.umd.edu systemd-udevd[1659159]: Could not generate persistent MAC address for vethb098c60: No such file or directory
Sep 16 14:38:36 sentry-docker00.cs.umd.edu systemd-udevd[1659144]: Could not generate persistent MAC address for vethc69dde2: No such file or directory
Sep 16 14:38:36 sentry-docker00.cs.umd.edu systemd-udevd[1659154]: Could not generate persistent MAC address for vethd06ae03: No such file or directory
Sep 16 14:38:36 sentry-docker00.cs.umd.edu systemd-udevd[1659144]: Could not generate persistent MAC address for vethbaa541c: No such file or directory
Sep 16 14:58:44 sentry-docker00.cs.umd.edu systemd-udevd[1668447]: link_config: could not get ethtool features for vethbaa541c
Sep 16 14:58:44 sentry-docker00.cs.umd.edu systemd-udevd[1668447]: Could not set offload features of vethbaa541c: No such device
Sep 16 14:58:45 sentry-docker00.cs.umd.edu systemd-udevd[1668480]: Could not generate persistent MAC address for veth2173c71: No such file or directory
Sep 16 14:58:45 sentry-docker00.cs.umd.edu systemd-udevd[1668481]: Could not generate persistent MAC address for veth05b4132: No such file or directory
Sep 16 14:58:45 sentry-docker00.cs.umd.edu systemd-udevd[1668484]: Could not generate persistent MAC address for vetha6ff858: No such file or directory
Sep 16 14:58:45 sentry-docker00.cs.umd.edu systemd-udevd[1668485]: Could not generate persistent MAC address for veth01c6506: No such file or directory
... 6 more distinct messages not shown
== strawberry (7 distinct, 38 total) ==
Sep 16 14:07:03 strawberry kernel: I/O error, dev sda, sector 206848 op 0x0:(READ) flags 0x80700 phys_seg 1 prio class 2 [x6]
Sep 16 14:07:03 strawberry kernel: I/O error, dev sda, sector 206848 op 0x0:(READ) flags 0x0 phys_seg 1 prio class 2 [x6]
Sep 16 14:07:03 strawberry kernel: Buffer I/O error on dev sda2, logical block 0, async page read [x6]
Sep 16 14:07:03 strawberry kernel: I/O error, dev sda, sector 2048 op 0x0:(READ) flags 0x80700 phys_seg 1 prio class 2 [x6]
Sep 16 14:07:03 strawberry kernel: I/O error, dev sda, sector 2048 op 0x0:(READ) flags 0x0 phys_seg 1 prio class 2 [x6]
Sep 16 14:07:03 strawberry kernel: Buffer I/O error on dev sda1, logical block 0, async page read [x6]
Sep 16 14:34:42 strawberry smartd[5314]: Device: /dev/sda [SAT], failed to read SMART Attribute Data [x2]
== submit26-b9-f1 (10 distinct, 12 total) ==
Sep 16 14:15:06 submit26-b9-f1 systemd[1]: user(a)1001.service: Main process exited, code=killed, status=9/KILL [x3]
Sep 16 14:25:52 submit26-b9-f1 setroubleshoot[1947246]: SELinux is preventing /usr/bin/python3.9 from create access on the directory /(null). For complete SELinux messages run: sealert -l 3ef7d677-731f-46bf-9c34-c2c55fea665c
Sep 16 14:25:52 submit26-b9-f1 setroubleshoot[1947246]: SELinux is preventing /usr/bin/python3.9 from add_name access on the directory /(null). For complete SELinux messages run: sealert -l aa60e26f-72e1-45f1-bc12-aa8b3b669e36
Sep 16 14:25:52 submit26-b9-f1 setroubleshoot[1947246]: SELinux is preventing /usr/bin/python3.9 from create access on the file /(null). For complete SELinux messages run: sealert -l d088fb43-23ee-4ae8-ae6a-5d1c041ee2d6
Sep 16 14:25:52 submit26-b9-f1 setroubleshoot[1947246]: SELinux is preventing /usr/bin/python3.9 from open access on the file /tmp/libdnf.3RhMDB/repodata/repomd.xml. For complete SELinux messages run: sealert -l 3b0d8c9a-6637-4d6e-a864-f1dd7c00377d
Sep 16 14:25:52 submit26-b9-f1 setroubleshoot[1947246]: SELinux is preventing /usr/bin/python3.9 from setattr access on the file repomd.xml. For complete SELinux messages run: sealert -l 0fd3339f-3ef2-45f3-9e58-65a58b42f3ee
Sep 16 14:25:52 submit26-b9-f1 setroubleshoot[1947246]: SELinux is preventing /usr/bin/python3.9 from read access on the directory libdnf.3RhMDB. For complete SELinux messages run: sealert -l 0d661d88-dc9e-469d-986b-52e29b353aa8
Sep 16 14:25:52 submit26-b9-f1 setroubleshoot[1947246]: SELinux is preventing /usr/bin/python3.9 from remove_name access on the directory repomd.xml. For complete SELinux messages run: sealert -l 405a8556-cf9f-4ef4-8525-0dca18d4259d
Sep 16 14:25:52 submit26-b9-f1 setroubleshoot[1947246]: SELinux is preventing /usr/bin/python3.9 from unlink access on the file repomd.xml. For complete SELinux messages run: sealert -l 3c38e23e-3631-4cb5-81c7-992675c836d9
Sep 16 14:25:52 submit26-b9-f1 setroubleshoot[1947246]: SELinux is preventing /usr/bin/python3.9 from rmdir access on the directory repodata. For complete SELinux messages run: sealert -l a070e9b5-2867-47d6-b2e3-3b7d99725848
== submit26-b9-f2 (10 distinct, 11 total) ==
Sep 16 14:06:47 submit26-b9-f2 setroubleshoot[1083777]: SELinux is preventing /usr/bin/python3.9 from create access on the directory /(null). For complete SELinux messages run: sealert -l 0659d546-3107-4f75-b00f-008c85f41dc6
Sep 16 14:06:48 submit26-b9-f2 setroubleshoot[1083777]: SELinux is preventing /usr/bin/python3.9 from add_name access on the directory /(null). For complete SELinux messages run: sealert -l 156d9270-3466-4356-b86f-1a128825961a
Sep 16 14:06:48 submit26-b9-f2 setroubleshoot[1083777]: SELinux is preventing /usr/bin/python3.9 from create access on the file /(null). For complete SELinux messages run: sealert -l c8a40bf5-2fc4-46b3-b813-8592b3523339
Sep 16 14:06:48 submit26-b9-f2 setroubleshoot[1083777]: SELinux is preventing /usr/bin/python3.9 from open access on the file /tmp/libdnf.CYHj18/repodata/repomd.xml. For complete SELinux messages run: sealert -l 7f4c3a8e-0f99-47c4-9baf-e1336fe24876
Sep 16 14:06:48 submit26-b9-f2 setroubleshoot[1083777]: SELinux is preventing /usr/bin/python3.9 from setattr access on the file repomd.xml. For complete SELinux messages run: sealert -l 988123da-b724-4e6a-900c-33a2723fdaf1
Sep 16 14:06:48 submit26-b9-f2 setroubleshoot[1083777]: SELinux is preventing /usr/bin/python3.9 from read access on the directory libdnf.CYHj18. For complete SELinux messages run: sealert -l ca585e2b-d50f-4264-8127-6b3fa04070c8
Sep 16 14:06:48 submit26-b9-f2 setroubleshoot[1083777]: SELinux is preventing /usr/bin/python3.9 from remove_name access on the directory repomd.xml. For complete SELinux messages run: sealert -l 3a749560-1cec-40ca-a4dc-596841be3885
Sep 16 14:06:48 submit26-b9-f2 setroubleshoot[1083777]: SELinux is preventing /usr/bin/python3.9 from unlink access on the file repomd.xml. For complete SELinux messages run: sealert -l 0aa52f08-94f8-474e-96d8-e818846941af
Sep 16 14:06:48 submit26-b9-f2 setroubleshoot[1083777]: SELinux is preventing /usr/bin/python3.9 from rmdir access on the directory repodata. For complete SELinux messages run: sealert -l de019dc4-408f-439c-902a-676d18dfe8e7
Sep 16 14:28:19 submit26-b9-f2 systemd[1]: user(a)1001.service: Main process exited, code=killed, status=9/KILL [x2]
== submit26-b9-f3 (1 distinct, 1 total) ==
Sep 16 14:20:04 submit26-b9-f3 systemd[1]: user(a)1001.service: Main process exited, code=killed, status=9/KILL
1
0