Command: /usr/local/sbin/syslog-digest.py
Time : 0.5037s
Status : exited 0
Output :
Syslog digest — 2026-08-02 07:05 EDT
Processed 4,230 lines, filtered 3,398 (80%). 832 unknown (124 distinct) from 22 host(s).
== abadi-computer (2 distinct, 2 total) ==
Aug 2 06:15:00 abadi-computer nologin[672330]: Attempted login by UNKNOWN (UID: 65534) on UNKNOWN
Aug 2 06:15:00 abadi-computer pipewire[672328]: mod.jackdbus-detect: Failed to receive jackdbus reply: org.freedesktop.DBus.Error.ServiceUnknown: The name org.jackaudio.service was not provided by any .service files
== abuse (1 distinct, 346 total) ==
Aug 2 06:05:06 abuse rsyslogd[21745]: imjournal: open() failed for path: '/var/lib/rsyslog/imjournal.state.tmp': Input/output error [v8.2404.0 try https://www.rsyslog.com/e/2433 ] [x346]
== atif01.cs.umd.edu (4 distinct, 6 total) ==
Aug 2 06:31:33 atif01.cs.umd.edu sshd[47851]: error: maximum authentication attempts exceeded for root from 1.209.124.248 port 63225 ssh2 [preauth]
Aug 2 06:31:33 atif01.cs.umd.edu sshd[47851]: PAM service(sshd) ignoring max retries; 6 > 3 [x3]
Aug 2 06:31:50 atif01.cs.umd.edu sshd[47859]: error: maximum authentication attempts exceeded for root from 1.209.124.248 port 56090 ssh2 [preauth]
Aug 2 06:32:06 atif01.cs.umd.edu sshd[47869]: error: maximum authentication attempts exceeded for root from 1.209.124.248 port 49344 ssh2 [preauth]
== b0b02.cs.umd.edu (4 distinct, 4 total) ==
Aug 2 06:41:44 b0b02.cs.umd.edu rustdesk[2033189]: cannot open display:
Aug 2 06:56:05 b0b02.cs.umd.edu setroubleshoot[2036936]: SELinux is preventing /usr/bin/python3.9 from getattr access on the file /etc/authselect/nsswitch.conf. For complete SELinux messages run: sealert -l 9a1e2952-3fde-4937-a8ab-f7f59791a458
Aug 2 06:56:08 b0b02.cs.umd.edu setroubleshoot[2036936]: SELinux is preventing /usr/bin/python3.9 from read access on the file /etc/authselect/nsswitch.conf. For complete SELinux messages run: sealert -l 97d74423-e027-4cd6-8810-ad80944900b5
Aug 2 06:56:11 b0b02.cs.umd.edu setroubleshoot[2036936]: SELinux is preventing /usr/bin/python3.9 from open access on the file /etc/authselect/nsswitch.conf. For complete SELinux messages run: sealert -l 4f253f6a-62d6-46dd-8eaf-0b4d29df41c6
== contest (1 distinct, 33 total) ==
Aug 2 06:06:19 contest goferd[1007]: [ERROR][worker-0] gofer.messaging.adapter.connect:33 - connect: proton+amqps://satellite8.cs.umd.edu:5647, failed: Connection amqps://satellite8.cs.umd.edu:5647 disconnected: Condition('proton.pythonio', 'Connection refused to all addresses') [x33]
== csfw00a (2 distinct, 254 total) ==
Aug 2 06:04:51 csfw00a kernel: bnxt_en 0000:09:00.0 eth3: NIC Link is Down [x238]
Aug 2 06:47:20 csfw00a ospf6d[1477]: [EC 100663307] Could not send entire message [x16]
== hackerman (7 distinct, 12 total) ==
Aug 2 06:20:04 hackerman gnome-software[2060381]: can't reliably fixup error code 4 in domain g-io-error-quark: Not a directory [x4]
Aug 2 06:20:12 hackerman gnome-software[2060381]: Only 0 apps for recent list, hiding
Aug 2 06:20:32 hackerman packagekitd[3057661]: Failed to get cache filename for libreoffice [x2]
Aug 2 06:20:32 hackerman packagekitd[3057661]: Failed to get cache filename for kernel [x2]
Aug 2 06:20:36 hackerman gnome-software[2060381]: failed to commit changes to dconf: GDBus.Error:org.gtk.GDBus.UnmappedGError.Quark._g_2dfile_2derror_2dquark.Code2: Failed to create file “/adminhomes/sajith/.config/dconf/user.IXS7S3”: Permission denied
Aug 2 06:20:39 hackerman packagekitd[3057661]: failed to parse public key for /etc/pki/rpm-gpg/RPM-GPG-KEY-PQC-redhat-release
Aug 2 06:46:27 hackerman systemd[1]: insights-client.service: Start request repeated too quickly.
== idm00 (1 distinct, 1 total) ==
Aug 2 06:51:14 idm00 named[1455]: client @0x7f3315b04908 10.73.240.42#54622: update '73.10.in-addr.arpa/IN' denied
== idmp0 (1 distinct, 1 total) ==
Aug 2 06:36:02 idmp0 named[5198]: client @0x7f9910038388 10.73.240.43#53564: update '73.10.in-addr.arpa/IN' denied
== inbound00.cs.umd.edu (1 distinct, 1 total) ==
Aug 2 06:06:54 inbound00.cs.umd.edu systemd[1]: Configuration file /usr/lib/systemd/system/authentication_milter.service is marked executable. Please remove executable permission bits. Proceeding anyway.
== inbound01.cs.umd.edu (1 distinct, 1 total) ==
Aug 2 06:17:56 inbound01.cs.umd.edu systemd[1]: Configuration file /usr/lib/systemd/system/authentication_milter.service is marked executable. Please remove executable permission bits. Proceeding anyway.
== itmon02 (1 distinct, 29 total) ==
Aug 2 06:07:48 itmon02 sshd[1750555]: error: beginning MaxStartups throttling [x29]
== matrix (1 distinct, 1 total) ==
Aug 2 06:54:53 matrix sshd[3368012]: error: beginning MaxStartups throttling
== neodontcare.cs.umd.edu (5 distinct, 6 total) ==
Aug 2 06:13:30 neodontcare.cs.umd.edu gnome-software[7556]: Only 0 apps for recent list, hiding
Aug 2 06:13:34 neodontcare.cs.umd.edu packagekitd[1586613]: Failed to get cache filename for gnu-free-mono-fonts
Aug 2 06:13:34 neodontcare.cs.umd.edu packagekitd[1586613]: Failed to get cache filename for gnu-free-serif-fonts
Aug 2 06:13:34 neodontcare.cs.umd.edu packagekitd[1586613]: Failed to get cache filename for libreoffice [x2]
Aug 2 06:13:38 neodontcare.cs.umd.edu packagekitd[1586613]: failed to parse public key for /etc/pki/rpm-gpg/RPM-GPG-KEY-PQC-redhat-release
== netman.cs.umd.edu (7 distinct, 7 total) ==
Aug 2 06:37:41 netman.cs.umd.edu sshd[4005335]: error: maximum authentication attempts exceeded for root from 1.209.124.248 port 55830 ssh2 [preauth]
Aug 2 06:38:01 netman.cs.umd.edu sshd[4005381]: error: maximum authentication attempts exceeded for root from 1.209.124.248 port 50599 ssh2 [preauth]
Aug 2 06:38:21 netman.cs.umd.edu sshd[4005393]: error: maximum authentication attempts exceeded for root from 1.209.124.248 port 61413 ssh2 [preauth]
Aug 2 06:38:41 netman.cs.umd.edu sshd[4005440]: error: maximum authentication attempts exceeded for root from 1.209.124.248 port 56204 ssh2 [preauth]
Aug 2 06:39:01 netman.cs.umd.edu sshd[4005485]: error: maximum authentication attempts exceeded for root from 1.209.124.248 port 50018 ssh2 [preauth]
Aug 2 06:39:21 netman.cs.umd.edu sshd[4005497]: error: maximum authentication attempts exceeded for root from 1.209.124.248 port 60455 ssh2 [preauth]
Aug 2 06:39:42 netman.cs.umd.edu sshd[4005527]: error: maximum authentication attempts exceeded for root from 1.209.124.248 port 54703 ssh2 [preauth]
== newhonors2 (38 distinct, 65 total) ==
Aug 2 06:13:03 newhonors2 dhcpcd[622210]: dhcpcd is not running [x28]
Aug 2 06:48:23 newhonors2 puppet-agent[623376]: Could not update: Execution of '/usr/bin/apt-get -q -y -o DPkg::Options::=--force-confold --force-yes install openvox-agent=8.27.0-1+ubuntu24.04' returned 100: Reading package lists...
Aug 2 06:48:23 newhonors2 puppet-agent[623376]: Building dependency tree...
Aug 2 06:48:23 newhonors2 puppet-agent[623376]: Reading state information...
Aug 2 06:48:23 newhonors2 puppet-agent[623376]: Package openvox-agent is not available, but is referred to by another package.
Aug 2 06:48:23 newhonors2 puppet-agent[623376]: This may mean that the package is missing, has been obsoleted, or
Aug 2 06:48:23 newhonors2 puppet-agent[623376]: is only available from another source
Aug 2 06:48:23 newhonors2 puppet-agent[623376]:
Aug 2 06:48:23 newhonors2 puppet-agent[623376]: W: --force-yes is deprecated, use one of the options starting with --allow instead.
Aug 2 06:48:23 newhonors2 puppet-agent[623376]: E: Version '8.27.0-1+ubuntu24.04' for 'openvox-agent' was not found
Aug 2 06:48:23 newhonors2 puppet-agent[623376]: (/Stage[main]/Puppet::Agent::Install/Package[openvox-agent]/ensure) change from '7.37.2-1+ubuntu24.04' to '8.27.0-1+ubuntu24.04' failed: Could not update: Execution of '/usr/bin/apt-get -q -y -o DPkg::Options::=--force-confold --force-yes install openvox-agent=8.27.0-1+ubuntu24.04' returned 100: Reading package lists...
Aug 2 06:48:23 newhonors2 puppet-agent[623376]: (/Stage[main]/Puppet::Agent::Install/Package[openvox-agent]/ensure) Building dependency tree...
Aug 2 06:48:23 newhonors2 puppet-agent[623376]: (/Stage[main]/Puppet::Agent::Install/Package[openvox-agent]/ensure) Reading state information...
Aug 2 06:48:23 newhonors2 puppet-agent[623376]: (/Stage[main]/Puppet::Agent::Install/Package[openvox-agent]/ensure) Package openvox-agent is not available, but is referred to by another package.
Aug 2 06:48:23 newhonors2 puppet-agent[623376]: (/Stage[main]/Puppet::Agent::Install/Package[openvox-agent]/ensure) This may mean that the package is missing, has been obsoleted, or
Aug 2 06:48:23 newhonors2 puppet-agent[623376]: (/Stage[main]/Puppet::Agent::Install/Package[openvox-agent]/ensure) is only available from another source
Aug 2 06:48:23 newhonors2 puppet-agent[623376]: (/Stage[main]/Puppet::Agent::Install/Package[openvox-agent]/ensure)
Aug 2 06:48:23 newhonors2 puppet-agent[623376]: (/Stage[main]/Puppet::Agent::Install/Package[openvox-agent]/ensure) W: --force-yes is deprecated, use one of the options starting with --allow instead.
Aug 2 06:48:23 newhonors2 puppet-agent[623376]: (/Stage[main]/Puppet::Agent::Install/Package[openvox-agent]/ensure) E: Version '8.27.0-1+ubuntu24.04' for 'openvox-agent' was not found
Aug 2 06:48:47 newhonors2 puppet-agent[623376]: (/Stage[main]/Puppet::Agent::Config/Puppet::Config::Agent[classfile]/Puppet::Config::Entry[agent_classfile]/Concat::Fragment[puppet.conf_agent]/Concat_fragment[puppet.conf_agent]) Skipping because of failed dependencies
Aug 2 06:48:47 newhonors2 puppet-agent[623376]: (/Stage[main]/Puppet::Agent::Config/Puppet::Config::Agent[classfile]/Puppet::Config::Entry[agent_classfile]/Concat::Fragment[puppet.conf_agent_end]/Concat_fragment[puppet.conf_agent_end]) Skipping because of failed dependencies
Aug 2 06:48:47 newhonors2 puppet-agent[623376]: (/Stage[main]/Puppet::Agent::Config/Puppet::Config::Agent[classfile]/Puppet::Config::Entry[agent_classfile]/Concat::Fragment[puppet.conf_agent_classfile]/Concat_fragment[puppet.conf_agent_classfile]) Skipping because of failed dependencies
Aug 2 06:48:47 newhonors2 puppet-agent[623376]: (/Stage[main]/Puppet::Agent::Config/Puppet::Config::Agent[default_schedules]/Puppet::Config::Entry[agent_default_schedules]/Concat::Fragment[puppet.conf_agent_default_schedules]/Concat_fragment[puppet.conf_agent_default_schedules]) Skipping because of failed dependencies
Aug 2 06:48:47 newhonors2 puppet-agent[623376]: (/Stage[main]/Puppet::Agent::Config/Puppet::Config::Agent[report]/Puppet::Config::Entry[agent_report]/Concat::Fragment[puppet.conf_agent_report]/Concat_fragment[puppet.conf_agent_report]) Skipping because of failed dependencies
Aug 2 06:48:47 newhonors2 puppet-agent[623376]: (/Stage[main]/Puppet::Agent::Config/Puppet::Config::Agent[masterport]/Puppet::Config::Entry[agent_masterport]/Concat::Fragment[puppet.conf_agent_masterport]/Concat_fragment[puppet.conf_agent_masterport]) Skipping because of failed dependencies
Aug 2 06:48:47 newhonors2 puppet-agent[623376]: (/Stage[main]/Puppet::Agent::Config/Puppet::Config::Agent[splay]/Puppet::Config::Entry[agent_splay]/Concat::Fragment[puppet.conf_agent_splay]/Concat_fragment[puppet.conf_agent_splay]) Skipping because of failed dependencies
Aug 2 06:48:47 newhonors2 puppet-agent[623376]: (/Stage[main]/Puppet::Agent::Config/Puppet::Config::Agent[splaylimit]/Puppet::Config::Entry[agent_splaylimit]/Concat::Fragment[puppet.conf_agent_splaylimit]/Concat_fragment[puppet.conf_agent_splaylimit]) Skipping because of failed dependencies
Aug 2 06:48:47 newhonors2 puppet-agent[623376]: (/Stage[main]/Puppet::Agent::Config/Puppet::Config::Agent[runinterval]/Puppet::Config::Entry[agent_runinterval]/Concat::Fragment[puppet.conf_agent_runinterval]/Concat_fragment[puppet.conf_agent_runinterval]) Skipping because of failed dependencies
Aug 2 06:48:47 newhonors2 puppet-agent[623376]: (/Stage[main]/Puppet::Agent::Config/Puppet::Config::Agent[noop]/Puppet::Config::Entry[agent_noop]/Concat::Fragment[puppet.conf_agent_noop]/Concat_fragment[puppet.conf_agent_noop]) Skipping because of failed dependencies
Aug 2 06:48:47 newhonors2 puppet-agent[623376]: (/Stage[main]/Puppet::Agent::Config/Puppet::Config::Agent[usecacheonfailure]/Puppet::Config::Entry[agent_usecacheonfailure]/Concat::Fragment[puppet.conf_agent_usecacheonfailure]/Concat_fragment[puppet.conf_agent_usecacheonfailure]) Skipping because of failed dependencies
... 8 more distinct messages not shown
== orchids (4 distinct, 4 total) ==
Aug 2 06:11:31 orchids gnome-software[1516991]: Only 0 apps for recent list, hiding
Aug 2 06:11:31 orchids packagekitd[1670521]: LRO_METALINKURL processing failed: Curl error (42): Operation was aborted by an application callback for https://mirrors.fedoraproject.org/metalink?repo=epel-9&arch=x86_64 [Callback aborted]
Aug 2 06:11:34 orchids packagekitd[1670521]: Failed to get cache filename for libreoffice
Aug 2 06:11:36 orchids packagekitd[1670521]: failed to parse public key for /etc/pki/rpm-gpg/RPM-GPG-KEY-PQC-redhat-release
== outbound00.cs.umd.edu (1 distinct, 6 total) ==
Aug 2 06:09:09 outbound00.cs.umd.edu python3[2057923]: ldapdb [x6]
== outbound01.cs.umd.edu (1 distinct, 6 total) ==
Aug 2 06:13:06 outbound01.cs.umd.edu python3[90882]: ldapdb [x6]
== sentry-docker00.cs.umd.edu (36 distinct, 36 total) ==
Aug 2 06:08:13 sentry-docker00.cs.umd.edu systemd-udevd[201632]: link_config: could not get ethtool features for vethc7c3892
Aug 2 06:08:13 sentry-docker00.cs.umd.edu systemd-udevd[201632]: Could not set offload features of vethc7c3892: No such device
Aug 2 06:08:13 sentry-docker00.cs.umd.edu systemd-udevd[201662]: Could not generate persistent MAC address for vethf57a71a: No such file or directory
Aug 2 06:08:13 sentry-docker00.cs.umd.edu systemd-udevd[201663]: Could not generate persistent MAC address for veth518bdba: No such file or directory
Aug 2 06:08:13 sentry-docker00.cs.umd.edu systemd-udevd[201666]: Could not generate persistent MAC address for vethe471346: No such file or directory
Aug 2 06:08:13 sentry-docker00.cs.umd.edu systemd-udevd[201688]: Could not generate persistent MAC address for veth9daea6e: No such file or directory
Aug 2 06:08:13 sentry-docker00.cs.umd.edu systemd-udevd[201681]: Could not generate persistent MAC address for vethdb2293c: No such file or directory
Aug 2 06:08:13 sentry-docker00.cs.umd.edu systemd-udevd[201672]: Could not generate persistent MAC address for veth067832e: No such file or directory
Aug 2 06:08:13 sentry-docker00.cs.umd.edu systemd-udevd[201692]: Could not generate persistent MAC address for vethb22be3d: No such file or directory
Aug 2 06:08:13 sentry-docker00.cs.umd.edu systemd-udevd[201693]: Could not generate persistent MAC address for vethc9eb56a: No such file or directory
Aug 2 06:10:37 sentry-docker00.cs.umd.edu systemd-udevd[203040]: Could not generate persistent MAC address for veth347207f: No such file or directory
Aug 2 06:10:37 sentry-docker00.cs.umd.edu systemd-udevd[203041]: Could not generate persistent MAC address for veth80f5769: No such file or directory
Aug 2 06:28:21 sentry-docker00.cs.umd.edu systemd-udevd[211024]: link_config: could not get ethtool features for vethb22be3d
Aug 2 06:28:21 sentry-docker00.cs.umd.edu systemd-udevd[211024]: Could not set offload features of vethb22be3d: No such device
Aug 2 06:28:22 sentry-docker00.cs.umd.edu systemd-udevd[211122]: Could not generate persistent MAC address for veth879e0b5: No such file or directory
Aug 2 06:28:22 sentry-docker00.cs.umd.edu systemd-udevd[211123]: Could not generate persistent MAC address for veth9fa6d07: No such file or directory
Aug 2 06:28:22 sentry-docker00.cs.umd.edu systemd-udevd[211126]: Could not generate persistent MAC address for veth31d0f8a: No such file or directory
Aug 2 06:28:22 sentry-docker00.cs.umd.edu systemd-udevd[211133]: Could not generate persistent MAC address for veth2899125: No such file or directory
Aug 2 06:28:22 sentry-docker00.cs.umd.edu systemd-udevd[211140]: Could not generate persistent MAC address for veth3f3c8a1: No such file or directory
Aug 2 06:28:22 sentry-docker00.cs.umd.edu systemd-udevd[211126]: Could not generate persistent MAC address for vethdaa3b64: No such file or directory
Aug 2 06:28:22 sentry-docker00.cs.umd.edu systemd-udevd[211152]: Could not generate persistent MAC address for veth5bb190d: No such file or directory
Aug 2 06:28:22 sentry-docker00.cs.umd.edu systemd-udevd[211153]: Could not generate persistent MAC address for vethb43fa59: No such file or directory
Aug 2 06:30:45 sentry-docker00.cs.umd.edu systemd-udevd[212527]: Could not generate persistent MAC address for veth904b93b: No such file or directory
Aug 2 06:30:45 sentry-docker00.cs.umd.edu systemd-udevd[212528]: Could not generate persistent MAC address for veth70819b3: No such file or directory
Aug 2 06:48:30 sentry-docker00.cs.umd.edu systemd-udevd[220541]: link_config: could not get ethtool features for veth3f3c8a1
Aug 2 06:48:30 sentry-docker00.cs.umd.edu systemd-udevd[220541]: Could not set offload features of veth3f3c8a1: No such device
Aug 2 06:48:30 sentry-docker00.cs.umd.edu systemd-udevd[220571]: Could not generate persistent MAC address for vethd3baea5: No such file or directory
Aug 2 06:48:30 sentry-docker00.cs.umd.edu systemd-udevd[220572]: Could not generate persistent MAC address for veth59e82a0: No such file or directory
Aug 2 06:48:30 sentry-docker00.cs.umd.edu systemd-udevd[220597]: Could not generate persistent MAC address for veth99ea233: No such file or directory
Aug 2 06:48:30 sentry-docker00.cs.umd.edu systemd-udevd[220598]: Could not generate persistent MAC address for vethcba8a5f: No such file or directory
... 6 more distinct messages not shown
== strawberry (4 distinct, 10 total) ==
Aug 2 06:09:44 strawberry udisksd[1067]: Error performing housekeeping for drive /org/freedesktop/UDisks2/drives/ST2000DM001_1CH164_W1E8J5KJ: Error updating SMART data: Error sending ATA command CHECK POWER MODE: Unexpected sense data returned:#0120000: 00 00 00 00 00 00 00 00 00 00 00 00 00 00 00 00 ................#0120010: 00 00 00 00 00 00 00 00 00 00 00 00 00 00 00 00 ................#012 (g-io-error-quark, 0) [x6]
Aug 2 06:31:04 strawberry nologin[3383743]: Attempted login by UNKNOWN (UID: 65534) on UNKNOWN
Aug 2 06:31:04 strawberry pipewire[3383742]: mod.jackdbus-detect: Failed to receive jackdbus reply: org.freedesktop.DBus.Error.ServiceUnknown: The name org.jackaudio.service was not provided by any .service files
Aug 2 06:34:42 strawberry smartd[5314]: Device: /dev/sda [SAT], failed to read SMART Attribute Data [x2]
== tlsrpt (1 distinct, 1 total) ==
Aug 2 06:38:04 tlsrpt (httpd)[559964]: httpd.service: Referenced but unset environment variable evaluates to an empty string: OPTIONS
1
0
Command: /usr/local/sbin/syslog-digest.py
Time : 0.5074s
Status : exited 0
Output :
Syslog digest — 2026-08-02 06:05 EDT
Processed 4,220 lines, filtered 3,378 (80%). 842 unknown (103 distinct) from 21 host(s).
== abuse (1 distinct, 346 total) ==
Aug 2 05:05:06 abuse rsyslogd[21745]: imjournal: open() failed for path: '/var/lib/rsyslog/imjournal.state.tmp': Input/output error [v8.2404.0 try https://www.rsyslog.com/e/2433 ] [x346]
== b0b02.cs.umd.edu (4 distinct, 4 total) ==
Aug 2 05:41:41 b0b02.cs.umd.edu rustdesk[2018061]: cannot open display:
Aug 2 05:56:01 b0b02.cs.umd.edu setroubleshoot[2021775]: SELinux is preventing /usr/bin/python3.9 from getattr access on the file /etc/authselect/nsswitch.conf. For complete SELinux messages run: sealert -l 9a1e2952-3fde-4937-a8ab-f7f59791a458
Aug 2 05:56:04 b0b02.cs.umd.edu setroubleshoot[2021775]: SELinux is preventing /usr/bin/python3.9 from read access on the file /etc/authselect/nsswitch.conf. For complete SELinux messages run: sealert -l 97d74423-e027-4cd6-8810-ad80944900b5
Aug 2 05:56:06 b0b02.cs.umd.edu setroubleshoot[2021775]: SELinux is preventing /usr/bin/python3.9 from open access on the file /etc/authselect/nsswitch.conf. For complete SELinux messages run: sealert -l 4f253f6a-62d6-46dd-8eaf-0b4d29df41c6
== contest (9 distinct, 42 total) ==
Aug 2 05:05:37 contest goferd[1007]: [ERROR][worker-0] gofer.messaging.adapter.connect:33 - connect: proton+amqps://satellite8.cs.umd.edu:5647, failed: Connection amqps://satellite8.cs.umd.edu:5647 disconnected: Condition('proton.pythonio', 'Connection refused to all addresses') [x34]
Aug 2 05:48:16 contest setroubleshoot[489946]: SELinux is preventing /usr/libexec/platform-python3.6 from create access on the directory libdnf.ntAoKu. For complete SELinux messages run: sealert -l cb6b25c6-4765-4cf2-88a0-9b3b508e94e9
Aug 2 05:48:16 contest setroubleshoot[489946]: SELinux is preventing /usr/bin/gpgconf from add_name access on the directory repodata. For complete SELinux messages run: sealert -l 41cf7b1b-0f34-4609-98f2-b66e7825fef7
Aug 2 05:48:16 contest setroubleshoot[489946]: SELinux is preventing /usr/libexec/platform-python3.6 from create access on the file mirrorlist. For complete SELinux messages run: sealert -l fc20ff92-ea83-4f38-a24b-ddfd737a3141
Aug 2 05:48:16 contest setroubleshoot[489946]: SELinux is preventing /usr/libexec/platform-python3.6 from setattr access on the file repomd.xml. For complete SELinux messages run: sealert -l ac675631-fa35-4e93-adc9-b692b18e53e5
Aug 2 05:48:16 contest setroubleshoot[489946]: SELinux is preventing /usr/libexec/platform-python3.6 from read access on the directory libdnf.ntAoKu. For complete SELinux messages run: sealert -l 45d103b6-0810-4890-a705-990118577ce8
Aug 2 05:48:21 contest setroubleshoot[489946]: SELinux is preventing /usr/libexec/platform-python3.6 from remove_name access on the directory repomd.xml. For complete SELinux messages run: sealert -l 7e499113-2fd7-4f67-bec6-3521efbe3637
Aug 2 05:48:24 contest setroubleshoot[489946]: SELinux is preventing rhsmcertd-worke from unlink access on the file repomd.xml. For complete SELinux messages run: sealert -l 22835727-7fef-4cfb-b3b5-881f66888317
Aug 2 05:48:37 contest setroubleshoot[489999]: SELinux is preventing /usr/libexec/platform-python3.6 from rmdir access on the directory repodata. For complete SELinux messages run: sealert -l 3928930b-a1ed-448d-950b-0665ac2adef8
== csfw00a (1 distinct, 290 total) ==
Aug 2 05:04:35 csfw00a kernel: bnxt_en 0000:09:00.0 eth3: NIC Link is Down [x290]
== dhcp01a.cs.umd.edu (1 distinct, 1 total) ==
Aug 2 05:55:10 dhcp01a.cs.umd.edu kernel: clocksource: timekeeping watchdog on CPU1: kvm-clock retried 1 times before success
== grades01.cs.umd.edu (1 distinct, 1 total) ==
Aug 2 05:48:49 grades01.cs.umd.edu puppet-agent[6205]: The directory '/srv/grades' contains 2471 entries, which exceeds the default soft limit 1000 and may cause excessive resource consumption and degraded performance. To remove this warning set a value for `max_files` parameter or consider using an alternate method to manage large directory trees
== hackerman (1 distinct, 1 total) ==
Aug 2 05:19:01 hackerman gnome-software[2060381]: failed to commit changes to dconf: GDBus.Error:org.gtk.GDBus.UnmappedGError.Quark._g_2dfile_2derror_2dquark.Code2: Failed to create file “/adminhomes/sajith/.config/dconf/user.NBN0S3”: Permission denied
== idm00 (1 distinct, 1 total) ==
Aug 2 05:51:14 idm00 named[1455]: client @0x7f331451ad28 10.73.240.42#56291: update '73.10.in-addr.arpa/IN' denied
== idmp0 (1 distinct, 1 total) ==
Aug 2 05:36:02 idmp0 named[5198]: client @0x7f990c020208 10.73.240.43#62968: update '73.10.in-addr.arpa/IN' denied
== itmon02 (1 distinct, 28 total) ==
Aug 2 05:07:54 itmon02 sshd[1750555]: error: beginning MaxStartups throttling [x28]
== newhonors2 (1 distinct, 24 total) ==
Aug 2 05:13:03 newhonors2 dhcpcd[619954]: dhcpcd is not running [x24]
== outbound00.cs.umd.edu (1 distinct, 6 total) ==
Aug 2 05:09:08 outbound00.cs.umd.edu python3[2044091]: ldapdb [x6]
== outbound01.cs.umd.edu (2 distinct, 8 total) ==
Aug 2 05:08:17 outbound01.cs.umd.edu python3[75208]: ldapdb [x7]
Aug 2 05:09:20 outbound01.cs.umd.edu systemd[1]: Configuration file /usr/lib/systemd/system/authentication_milter.service is marked executable. Please remove executable permission bits. Proceeding anyway.
== sentry-docker00.cs.umd.edu (42 distinct, 42 total) ==
Aug 2 05:07:48 sentry-docker00.cs.umd.edu systemd-udevd[172082]: link_config: could not get ethtool features for vethe74fa7d
Aug 2 05:07:48 sentry-docker00.cs.umd.edu systemd-udevd[172082]: Could not set offload features of vethe74fa7d: No such device
Aug 2 05:07:48 sentry-docker00.cs.umd.edu systemd-udevd[172097]: Could not generate persistent MAC address for veth9580d76: No such file or directory
Aug 2 05:07:48 sentry-docker00.cs.umd.edu systemd-udevd[172098]: Could not generate persistent MAC address for vethd8571a4: No such file or directory
Aug 2 05:07:48 sentry-docker00.cs.umd.edu systemd-udevd[172116]: Could not generate persistent MAC address for veth8fca9ff: No such file or directory
Aug 2 05:07:48 sentry-docker00.cs.umd.edu systemd-udevd[172098]: Could not generate persistent MAC address for veth9fb9832: No such file or directory
Aug 2 05:07:48 sentry-docker00.cs.umd.edu systemd-udevd[172125]: Could not generate persistent MAC address for veth3318700: No such file or directory
Aug 2 05:07:48 sentry-docker00.cs.umd.edu systemd-udevd[172126]: Could not generate persistent MAC address for vethc7e4fec: No such file or directory
Aug 2 05:07:48 sentry-docker00.cs.umd.edu systemd-udevd[172191]: Could not generate persistent MAC address for vethe25aec7: No such file or directory
Aug 2 05:07:48 sentry-docker00.cs.umd.edu systemd-udevd[172192]: Could not generate persistent MAC address for vethb3cf116: No such file or directory
Aug 2 05:10:16 sentry-docker00.cs.umd.edu systemd-udevd[174328]: Could not generate persistent MAC address for veth4044e6f: No such file or directory
Aug 2 05:10:16 sentry-docker00.cs.umd.edu systemd-udevd[174329]: Could not generate persistent MAC address for veth4649585: No such file or directory
Aug 2 05:27:57 sentry-docker00.cs.umd.edu systemd-udevd[181770]: link_config: could not get ethtool features for veth9580d76
Aug 2 05:27:57 sentry-docker00.cs.umd.edu systemd-udevd[181770]: Could not set offload features of veth9580d76: No such device
Aug 2 05:27:57 sentry-docker00.cs.umd.edu systemd-udevd[181794]: Could not generate persistent MAC address for veth4034d5b: No such file or directory
Aug 2 05:27:57 sentry-docker00.cs.umd.edu systemd-udevd[181795]: Could not generate persistent MAC address for veth96838c4: No such file or directory
Aug 2 05:27:57 sentry-docker00.cs.umd.edu systemd-udevd[181798]: Could not generate persistent MAC address for veth1d141fb: No such file or directory
Aug 2 05:27:57 sentry-docker00.cs.umd.edu systemd-udevd[181799]: Could not generate persistent MAC address for veth163d655: No such file or directory
Aug 2 05:27:57 sentry-docker00.cs.umd.edu systemd-udevd[181800]: Could not generate persistent MAC address for veth1d68548: No such file or directory
Aug 2 05:27:57 sentry-docker00.cs.umd.edu systemd-udevd[181810]: Could not generate persistent MAC address for veth50d0521: No such file or directory
Aug 2 05:27:57 sentry-docker00.cs.umd.edu systemd-udevd[181824]: Could not generate persistent MAC address for vethd8095bd: No such file or directory
Aug 2 05:27:57 sentry-docker00.cs.umd.edu systemd-udevd[181825]: Could not generate persistent MAC address for veth6b25a79: No such file or directory
Aug 2 05:30:20 sentry-docker00.cs.umd.edu systemd-udevd[183920]: link_config: could not get ethtool features for veth4044e6f
Aug 2 05:30:20 sentry-docker00.cs.umd.edu systemd-udevd[183920]: Could not set offload features of veth4044e6f: No such device
Aug 2 05:30:20 sentry-docker00.cs.umd.edu systemd-udevd[183930]: Could not generate persistent MAC address for veth070a5e8: No such file or directory
Aug 2 05:30:20 sentry-docker00.cs.umd.edu systemd-udevd[183931]: Could not generate persistent MAC address for vethc4e712b: No such file or directory
Aug 2 05:48:05 sentry-docker00.cs.umd.edu systemd-udevd[191161]: link_config: could not get ethtool features for veth4034d5b
Aug 2 05:48:05 sentry-docker00.cs.umd.edu systemd-udevd[191161]: Could not set offload features of veth4034d5b: No such device
Aug 2 05:48:05 sentry-docker00.cs.umd.edu systemd-udevd[191227]: link_config: could not get ethtool features for veth1d68548
Aug 2 05:48:05 sentry-docker00.cs.umd.edu systemd-udevd[191227]: Could not set offload features of veth1d68548: No such device
... 12 more distinct messages not shown
== strawberry (2 distinct, 8 total) ==
Aug 2 05:09:44 strawberry udisksd[1067]: Error performing housekeeping for drive /org/freedesktop/UDisks2/drives/ST2000DM001_1CH164_W1E8J5KJ: Error updating SMART data: Error sending ATA command CHECK POWER MODE: Unexpected sense data returned:#0120000: 00 00 00 00 00 00 00 00 00 00 00 00 00 00 00 00 ................#0120010: 00 00 00 00 00 00 00 00 00 00 00 00 00 00 00 00 ................#012 (g-io-error-quark, 0) [x6]
Aug 2 05:34:42 strawberry smartd[5314]: Device: /dev/sda [SAT], failed to read SMART Attribute Data [x2]
== submit26-b9-2 (10 distinct, 14 total) ==
Aug 2 05:12:51 submit26-b9-2 setroubleshoot[859907]: SELinux is preventing /usr/bin/python3.9 from create access on the directory /(null). For complete SELinux messages run: sealert -l d506243c-d61e-48f3-b42a-4592c913deb0 [x2]
Aug 2 05:12:52 submit26-b9-2 setroubleshoot[859907]: SELinux is preventing /usr/bin/python3.9 from add_name access on the directory /(null). For complete SELinux messages run: sealert -l 3b4752ac-1b9a-4af9-a05b-32e4c2eb13ab [x2]
Aug 2 05:12:52 submit26-b9-2 setroubleshoot[859907]: SELinux is preventing /usr/bin/python3.9 from create access on the file /(null). For complete SELinux messages run: sealert -l 29e5adbd-4381-4467-b40d-a2219101e096
Aug 2 05:12:52 submit26-b9-2 setroubleshoot[859907]: SELinux is preventing /usr/bin/python3.9 from open access on the file /tmp/libdnf.o1o5TB/repodata/repomd.xml. For complete SELinux messages run: sealert -l 1b38f2ec-01ce-4343-8059-ba7494ecc5c4
Aug 2 05:12:52 submit26-b9-2 setroubleshoot[859907]: SELinux is preventing /usr/bin/python3.9 from setattr access on the file repomd.xml. For complete SELinux messages run: sealert -l e5f9af40-1f63-4924-b012-27ab2a7b2266
Aug 2 05:12:52 submit26-b9-2 setroubleshoot[859907]: SELinux is preventing /usr/bin/python3.9 from read access on the directory libdnf.o1o5TB. For complete SELinux messages run: sealert -l 5c54db87-54a3-4a7c-97b4-b5c48d6c3543
Aug 2 05:12:52 submit26-b9-2 setroubleshoot[859907]: SELinux is preventing /usr/bin/python3.9 from remove_name access on the directory repomd.xml. For complete SELinux messages run: sealert -l 63cd60e1-1e61-4276-afea-dd8526ffe8b2 [x2]
Aug 2 05:12:52 submit26-b9-2 setroubleshoot[859907]: SELinux is preventing /usr/bin/python3.9 from unlink access on the file repomd.xml. For complete SELinux messages run: sealert -l 81c7e9ec-e023-4c6d-b1ad-c02a242e655e
Aug 2 05:12:52 submit26-b9-2 setroubleshoot[859907]: SELinux is preventing /usr/bin/python3.9 from rmdir access on the directory repodata. For complete SELinux messages run: sealert -l 6ae9a597-e123-4d74-8eec-a8ebe0f5e4d0 [x2]
Aug 2 05:12:52 submit26-b9-2 setroubleshoot[859907]: SELinux is preventing /usr/bin/python3.9 from read access on the directory libdnf.fvQ8ES. For complete SELinux messages run: sealert -l 5c54db87-54a3-4a7c-97b4-b5c48d6c3543
== submit26-b9-3 (9 distinct, 9 total) ==
Aug 2 05:20:38 submit26-b9-3 setroubleshoot[773291]: SELinux is preventing /usr/bin/python3.9 from create access on the directory /(null). For complete SELinux messages run: sealert -l 5b912a44-22fd-4560-b201-2a4e289b73f5
Aug 2 05:20:38 submit26-b9-3 setroubleshoot[773291]: SELinux is preventing /usr/bin/python3.9 from add_name access on the directory /(null). For complete SELinux messages run: sealert -l 7f1df1e4-725e-4953-98eb-1079f908f543
Aug 2 05:20:38 submit26-b9-3 setroubleshoot[773291]: SELinux is preventing /usr/bin/python3.9 from create access on the file /(null). For complete SELinux messages run: sealert -l 40b8852a-f77b-44b4-affe-5f11fa33de43
Aug 2 05:20:38 submit26-b9-3 setroubleshoot[773291]: SELinux is preventing /usr/bin/python3.9 from open access on the file /tmp/libdnf.GRlvui/repodata/repomd.xml. For complete SELinux messages run: sealert -l 45a8019e-f6b5-4baa-92c1-862594b40d46
Aug 2 05:20:38 submit26-b9-3 setroubleshoot[773291]: SELinux is preventing /usr/bin/python3.9 from setattr access on the file repomd.xml. For complete SELinux messages run: sealert -l e9f0bfff-7784-4126-baa4-2bb06da56591
Aug 2 05:20:38 submit26-b9-3 setroubleshoot[773291]: SELinux is preventing /usr/bin/python3.9 from read access on the directory libdnf.GRlvui. For complete SELinux messages run: sealert -l 0b17cc3d-cdc6-4fe2-a11f-3892e7c41dc7
Aug 2 05:20:38 submit26-b9-3 setroubleshoot[773291]: SELinux is preventing /usr/bin/python3.9 from remove_name access on the directory repomd.xml. For complete SELinux messages run: sealert -l 10e38c64-b65f-4cdd-901e-4375652d9a42
Aug 2 05:20:38 submit26-b9-3 setroubleshoot[773291]: SELinux is preventing /usr/bin/python3.9 from unlink access on the file repomd.xml. For complete SELinux messages run: sealert -l 7fd9cf72-ef38-48e1-b6aa-b571b26a7b22
Aug 2 05:20:38 submit26-b9-3 setroubleshoot[773291]: SELinux is preventing /usr/bin/python3.9 from rmdir access on the directory repodata. For complete SELinux messages run: sealert -l b9b11116-89bd-4a3c-980c-1d422c5dcee4
== submit26-clnb9 (9 distinct, 9 total) ==
Aug 2 05:31:56 submit26-clnb9 setroubleshoot[1671693]: SELinux is preventing /usr/bin/python3.9 from create access on the directory /(null). For complete SELinux messages run: sealert -l 6783ed2b-5ae4-42b5-975a-4bf50eec4658
Aug 2 05:31:56 submit26-clnb9 setroubleshoot[1671693]: SELinux is preventing /usr/bin/python3.9 from add_name access on the directory /(null). For complete SELinux messages run: sealert -l 9e7fa955-cc30-4804-ac8c-e1779e85946c
Aug 2 05:31:56 submit26-clnb9 setroubleshoot[1671693]: SELinux is preventing /usr/bin/python3.9 from create access on the file /(null). For complete SELinux messages run: sealert -l 69bfa6e3-089c-40ff-9563-fd30787d0774
Aug 2 05:31:56 submit26-clnb9 setroubleshoot[1671693]: SELinux is preventing /usr/bin/python3.9 from open access on the file /tmp/libdnf.ZFjTC9/repodata/repomd.xml. For complete SELinux messages run: sealert -l 001acdb5-31ef-4e52-b10b-90f467a89ddc
Aug 2 05:31:56 submit26-clnb9 setroubleshoot[1671693]: SELinux is preventing /usr/bin/python3.9 from setattr access on the file repomd.xml. For complete SELinux messages run: sealert -l edacddcf-16ed-4dc3-8d82-7c597d5dee23
Aug 2 05:31:56 submit26-clnb9 setroubleshoot[1671693]: SELinux is preventing /usr/bin/python3.9 from read access on the directory libdnf.ZFjTC9. For complete SELinux messages run: sealert -l 62b3782e-4730-4488-8178-94dafe9b552c
Aug 2 05:31:56 submit26-clnb9 setroubleshoot[1671693]: SELinux is preventing /usr/bin/python3.9 from remove_name access on the directory repomd.xml. For complete SELinux messages run: sealert -l 81cb3698-78f8-440a-8e3c-e5d1041e6b78
Aug 2 05:31:56 submit26-clnb9 setroubleshoot[1671693]: SELinux is preventing /usr/bin/python3.9 from unlink access on the file repomd.xml. For complete SELinux messages run: sealert -l 792b472a-115c-4799-9805-fc7436f916b9
Aug 2 05:31:56 submit26-clnb9 setroubleshoot[1671693]: SELinux is preventing /usr/bin/python3.9 from rmdir access on the directory repodata. For complete SELinux messages run: sealert -l 15c83a86-837b-41e2-b662-b39cd4e361cb
== talkhosts9 (1 distinct, 2 total) ==
Aug 2 05:06:17 talkhosts9 setroubleshoot[761288]: SELinux is preventing /usr/bin/lsof from getattr access on the unix_stream_socket unix_stream_socket. For complete SELinux messages run: sealert -l a6df89b3-c497-469c-8232-c4fde0508abf [x2]
== tma-0 (2 distinct, 2 total) ==
Aug 2 05:21:26 tma-0 sshd[32109]: error: maximum authentication attempts exceeded for root from 211.200.98.61 port 50788 ssh2 [preauth]
Aug 2 05:21:26 tma-0 sshd[32109]: PAM service(sshd) ignoring max retries; 6 > 3
== updates00.cs.umd.edu (3 distinct, 3 total) ==
Aug 2 05:18:31 updates00.cs.umd.edu puppet-agent[19680]: Could not retrieve catalog from remote server: Error 500 on SERVER: Server Error: Function lookup() did not find a value for the name 'vault::kerberos' on node updates00.cs.umd.edu
Aug 2 05:18:31 updates00.cs.umd.edu puppet-agent[19680]: Not using cache on failed catalog
Aug 2 05:18:31 updates00.cs.umd.edu puppet-agent[19680]: Could not retrieve catalog; skipping run
1
0
Command: /usr/local/sbin/syslog-digest.py
Time : 0.4926s
Status : exited 0
Output :
Syslog digest — 2026-08-02 05:05 EDT
Processed 4,198 lines, filtered 3,419 (81%). 779 unknown (103 distinct) from 19 host(s).
== abadi-computer (2 distinct, 2 total) ==
Aug 2 04:15:00 abadi-computer nologin[661732]: Attempted login by UNKNOWN (UID: 65534) on UNKNOWN
Aug 2 04:15:00 abadi-computer pipewire[661731]: mod.jackdbus-detect: Failed to receive jackdbus reply: org.freedesktop.DBus.Error.ServiceUnknown: The name org.jackaudio.service was not provided by any .service files
== abuse (1 distinct, 347 total) ==
Aug 2 04:05:04 abuse rsyslogd[21745]: imjournal: open() failed for path: '/var/lib/rsyslog/imjournal.state.tmp': Input/output error [v8.2404.0 try https://www.rsyslog.com/e/2433 ] [x347]
== b0b02.cs.umd.edu (4 distinct, 5 total) ==
Aug 2 04:41:37 b0b02.cs.umd.edu rustdesk[2003008]: cannot open display:
Aug 2 04:55:56 b0b02.cs.umd.edu setroubleshoot[2006719]: SELinux is preventing /usr/bin/python3.9 from getattr access on the file /etc/authselect/nsswitch.conf. For complete SELinux messages run: sealert -l 9a1e2952-3fde-4937-a8ab-f7f59791a458 [x2]
Aug 2 04:55:59 b0b02.cs.umd.edu setroubleshoot[2006719]: SELinux is preventing /usr/bin/python3.9 from read access on the file /etc/authselect/nsswitch.conf. For complete SELinux messages run: sealert -l 97d74423-e027-4cd6-8810-ad80944900b5
Aug 2 04:56:02 b0b02.cs.umd.edu setroubleshoot[2006719]: SELinux is preventing /usr/bin/python3.9 from open access on the file /etc/authselect/nsswitch.conf. For complete SELinux messages run: sealert -l 4f253f6a-62d6-46dd-8eaf-0b4d29df41c6
== contest (1 distinct, 33 total) ==
Aug 2 04:06:42 contest goferd[1007]: [ERROR][worker-0] gofer.messaging.adapter.connect:33 - connect: proton+amqps://satellite8.cs.umd.edu:5647, failed: Connection amqps://satellite8.cs.umd.edu:5647 disconnected: Condition('proton.pythonio', 'Connection refused to all addresses') [x33]
== csfw00a (1 distinct, 230 total) ==
Aug 2 04:05:17 csfw00a kernel: bnxt_en 0000:09:00.0 eth3: NIC Link is Down [x230]
== dojo (1 distinct, 1 total) ==
Aug 2 04:15:05 dojo nologin[880080]: Attempted login by UNKNOWN (UID: 65534) on UNKNOWN
== forge00 (1 distinct, 1 total) ==
Aug 2 04:09:02 forge00 (httpd)[1476960]: httpd.service: Referenced but unset environment variable evaluates to an empty string: OPTIONS
== idm00 (1 distinct, 1 total) ==
Aug 2 04:51:14 idm00 named[1455]: client @0x7f331054a7b8 10.73.240.42#55243: update '73.10.in-addr.arpa/IN' denied
== idmp0 (1 distinct, 1 total) ==
Aug 2 04:36:02 idmp0 named[5198]: client @0x7f9920001598 10.73.240.43#55235: update '73.10.in-addr.arpa/IN' denied
== itmon02 (1 distinct, 25 total) ==
Aug 2 04:07:50 itmon02 sshd[1750555]: error: beginning MaxStartups throttling [x25]
== matrix (12 distinct, 14 total) ==
Aug 2 04:40:59 matrix systemd[1]: networkd-dispatcher.service: Got notification message from PID 4145036, but reception only permitted for main PID 720
Aug 2 04:40:59 matrix systemd[1]: networkd-dispatcher.service: Got notification message from PID 4145049, but reception only permitted for main PID 720
Aug 2 04:41:07 matrix systemd[1]: networkd-dispatcher.service: Got notification message from PID 4145181, but reception only permitted for main PID 720
Aug 2 04:41:07 matrix systemd[1]: networkd-dispatcher.service: Got notification message from PID 4145187, but reception only permitted for main PID 720
Aug 2 04:41:07 matrix networkctl[4145197]: Interface "veth63130b5" not found.
Aug 2 04:41:07 matrix systemd[1]: networkd-dispatcher.service: Got notification message from PID 4145197, but reception only permitted for main PID 720 [x2]
Aug 2 04:41:07 matrix systemd[1]: networkd-dispatcher.service: Got notification message from PID 4145257, but reception only permitted for main PID 720
Aug 2 04:41:07 matrix systemd[1]: networkd-dispatcher.service: Got notification message from PID 4145269, but reception only permitted for main PID 720
Aug 2 04:41:17 matrix systemd[1]: networkd-dispatcher.service: Got notification message from PID 4145991, but reception only permitted for main PID 720
Aug 2 04:41:17 matrix systemd[1]: networkd-dispatcher.service: Got notification message from PID 4145997, but reception only permitted for main PID 720
Aug 2 04:41:17 matrix networkctl[4146007]: Interface "vethb18c622" not found.
Aug 2 04:41:17 matrix systemd[1]: networkd-dispatcher.service: Got notification message from PID 4146007, but reception only permitted for main PID 720 [x2]
== netman.cs.umd.edu (24 distinct, 24 total) ==
Aug 2 04:23:35 netman.cs.umd.edu sshd[3967582]: error: maximum authentication attempts exceeded for root from 203.83.186.105 port 52676 ssh2 [preauth]
Aug 2 04:23:56 netman.cs.umd.edu sshd[3967612]: error: maximum authentication attempts exceeded for root from 203.83.186.105 port 59736 ssh2 [preauth]
Aug 2 04:24:17 netman.cs.umd.edu sshd[3967657]: error: maximum authentication attempts exceeded for root from 203.83.186.105 port 49894 ssh2 [preauth]
Aug 2 04:24:38 netman.cs.umd.edu sshd[3967670]: error: maximum authentication attempts exceeded for root from 203.83.186.105 port 56757 ssh2 [preauth]
Aug 2 04:24:59 netman.cs.umd.edu sshd[3967731]: error: maximum authentication attempts exceeded for root from 203.83.186.105 port 63325 ssh2 [preauth]
Aug 2 04:25:21 netman.cs.umd.edu sshd[3967742]: error: maximum authentication attempts exceeded for root from 203.83.186.105 port 53613 ssh2 [preauth]
Aug 2 04:25:42 netman.cs.umd.edu sshd[3968231]: error: maximum authentication attempts exceeded for root from 203.83.186.105 port 60192 ssh2 [preauth]
Aug 2 04:26:03 netman.cs.umd.edu sshd[3968725]: error: maximum authentication attempts exceeded for root from 203.83.186.105 port 50621 ssh2 [preauth]
Aug 2 04:26:24 netman.cs.umd.edu sshd[3969013]: error: maximum authentication attempts exceeded for root from 203.83.186.105 port 57043 ssh2 [preauth]
Aug 2 04:26:45 netman.cs.umd.edu sshd[3969369]: error: maximum authentication attempts exceeded for root from 203.83.186.105 port 64086 ssh2 [preauth]
Aug 2 04:27:07 netman.cs.umd.edu sshd[3969434]: error: maximum authentication attempts exceeded for root from 203.83.186.105 port 54669 ssh2 [preauth]
Aug 2 04:27:26 netman.cs.umd.edu sshd[3969457]: error: maximum authentication attempts exceeded for root from 203.83.186.105 port 61710 ssh2 [preauth]
Aug 2 04:27:48 netman.cs.umd.edu sshd[3969488]: error: maximum authentication attempts exceeded for root from 203.83.186.105 port 52122 ssh2 [preauth]
Aug 2 04:28:09 netman.cs.umd.edu sshd[3969534]: error: maximum authentication attempts exceeded for root from 203.83.186.105 port 59517 ssh2 [preauth]
Aug 2 04:28:30 netman.cs.umd.edu sshd[3969669]: error: maximum authentication attempts exceeded for root from 203.83.186.105 port 50898 ssh2 [preauth]
Aug 2 04:28:51 netman.cs.umd.edu sshd[3969786]: error: maximum authentication attempts exceeded for root from 203.83.186.105 port 58117 ssh2 [preauth]
Aug 2 04:29:12 netman.cs.umd.edu sshd[3969832]: error: maximum authentication attempts exceeded for root from 203.83.186.105 port 49249 ssh2 [preauth]
Aug 2 04:29:32 netman.cs.umd.edu sshd[3969845]: error: maximum authentication attempts exceeded for root from 203.83.186.105 port 56563 ssh2 [preauth]
Aug 2 04:29:53 netman.cs.umd.edu sshd[3969875]: error: maximum authentication attempts exceeded for root from 203.83.186.105 port 63229 ssh2 [preauth]
Aug 2 04:29:59 netman.cs.umd.edu setroubleshoot[3970081]: SELinux is preventing /usr/bin/gpg from read access on the file gpg.conf. For complete SELinux messages run: sealert -l 019ad1da-a874-4814-8037-3b3e5f413ad2
Aug 2 04:29:59 netman.cs.umd.edu setroubleshoot[3970081]: SELinux is preventing /usr/bin/gpg from open access on the file /root/.gnupg/gpg.conf. For complete SELinux messages run: sealert -l cb54177e-d44c-46a1-b246-5c0bbb8343be
Aug 2 04:29:59 netman.cs.umd.edu setroubleshoot[3970081]: SELinux is preventing /usr/bin/gpg from getattr access on the file /root/.gnupg/gpg.conf. For complete SELinux messages run: sealert -l fbba2e30-b7ab-491c-9ec6-f553e9ef72af
Aug 2 04:30:14 netman.cs.umd.edu sshd[3970071]: error: maximum authentication attempts exceeded for root from 203.83.186.105 port 53917 ssh2 [preauth]
Aug 2 04:30:35 netman.cs.umd.edu sshd[3970138]: error: maximum authentication attempts exceeded for root from 203.83.186.105 port 60843 ssh2 [preauth]
== newhonors2 (1 distinct, 24 total) ==
Aug 2 04:13:02 newhonors2 dhcpcd[618094]: dhcpcd is not running [x24]
== outbound00.cs.umd.edu (1 distinct, 6 total) ==
Aug 2 04:09:09 outbound00.cs.umd.edu python3[2030220]: ldapdb [x6]
== outbound01.cs.umd.edu (1 distinct, 6 total) ==
Aug 2 04:13:06 outbound01.cs.umd.edu python3[62141]: ldapdb [x6]
== sentry-docker00.cs.umd.edu (36 distinct, 36 total) ==
Aug 2 04:07:23 sentry-docker00.cs.umd.edu systemd-udevd[143516]: link_config: could not get ethtool features for veth5e67004
Aug 2 04:07:23 sentry-docker00.cs.umd.edu systemd-udevd[143516]: Could not set offload features of veth5e67004: No such device
Aug 2 04:07:23 sentry-docker00.cs.umd.edu systemd-udevd[143548]: Could not generate persistent MAC address for veth295abdf: No such file or directory
Aug 2 04:07:23 sentry-docker00.cs.umd.edu systemd-udevd[143549]: Could not generate persistent MAC address for veth74cffc0: No such file or directory
Aug 2 04:07:23 sentry-docker00.cs.umd.edu systemd-udevd[143552]: Could not generate persistent MAC address for vethda62f5f: No such file or directory
Aug 2 04:07:23 sentry-docker00.cs.umd.edu systemd-udevd[143564]: Could not generate persistent MAC address for veth4bcfed1: No such file or directory
Aug 2 04:07:23 sentry-docker00.cs.umd.edu systemd-udevd[143576]: Could not generate persistent MAC address for veth7d28b81: No such file or directory
Aug 2 04:07:23 sentry-docker00.cs.umd.edu systemd-udevd[143577]: Could not generate persistent MAC address for vethe4d3d9d: No such file or directory
Aug 2 04:07:23 sentry-docker00.cs.umd.edu systemd-udevd[143599]: Could not generate persistent MAC address for veth6f7ba4d: No such file or directory
Aug 2 04:07:23 sentry-docker00.cs.umd.edu systemd-udevd[143580]: Could not generate persistent MAC address for veth8668ea1: No such file or directory
Aug 2 04:09:51 sentry-docker00.cs.umd.edu systemd-udevd[145681]: Could not generate persistent MAC address for veth84a9103: No such file or directory
Aug 2 04:09:51 sentry-docker00.cs.umd.edu systemd-udevd[145682]: Could not generate persistent MAC address for veth043797d: No such file or directory
Aug 2 04:27:32 sentry-docker00.cs.umd.edu systemd-udevd[153097]: link_config: could not get ethtool features for veth6f7ba4d
Aug 2 04:27:32 sentry-docker00.cs.umd.edu systemd-udevd[153097]: Could not set offload features of veth6f7ba4d: No such device
Aug 2 04:27:32 sentry-docker00.cs.umd.edu systemd-udevd[153116]: Could not generate persistent MAC address for veth57991d0: No such file or directory
Aug 2 04:27:32 sentry-docker00.cs.umd.edu systemd-udevd[153117]: Could not generate persistent MAC address for veth6860211: No such file or directory
Aug 2 04:27:32 sentry-docker00.cs.umd.edu systemd-udevd[153120]: Could not generate persistent MAC address for veth249df9c: No such file or directory
Aug 2 04:27:32 sentry-docker00.cs.umd.edu systemd-udevd[153121]: Could not generate persistent MAC address for veth69fca44: No such file or directory
Aug 2 04:27:32 sentry-docker00.cs.umd.edu systemd-udevd[153136]: Could not generate persistent MAC address for veth261de43: No such file or directory
Aug 2 04:27:32 sentry-docker00.cs.umd.edu systemd-udevd[153124]: Could not generate persistent MAC address for veth82b3a84: No such file or directory
Aug 2 04:27:32 sentry-docker00.cs.umd.edu systemd-udevd[153147]: Could not generate persistent MAC address for vethb252321: No such file or directory
Aug 2 04:27:32 sentry-docker00.cs.umd.edu systemd-udevd[153146]: Could not generate persistent MAC address for veth12fa41d: No such file or directory
Aug 2 04:29:59 sentry-docker00.cs.umd.edu systemd-udevd[155221]: Could not generate persistent MAC address for veth4f4cd46: No such file or directory
Aug 2 04:29:59 sentry-docker00.cs.umd.edu systemd-udevd[155222]: Could not generate persistent MAC address for veth3e4d89e: No such file or directory
Aug 2 04:47:40 sentry-docker00.cs.umd.edu systemd-udevd[162587]: link_config: could not set ethtool features for veth249df9c
Aug 2 04:47:40 sentry-docker00.cs.umd.edu systemd-udevd[162587]: Could not set offload features of veth249df9c: Operation not permitted
Aug 2 04:47:40 sentry-docker00.cs.umd.edu systemd-udevd[162619]: Could not generate persistent MAC address for veth4c0afe7: No such file or directory
Aug 2 04:47:40 sentry-docker00.cs.umd.edu systemd-udevd[162620]: Could not generate persistent MAC address for vethc602699: No such file or directory
Aug 2 04:47:40 sentry-docker00.cs.umd.edu systemd-udevd[162623]: Could not generate persistent MAC address for veth99a7e7a: No such file or directory
Aug 2 04:47:40 sentry-docker00.cs.umd.edu systemd-udevd[162624]: Could not generate persistent MAC address for veth6b94032: No such file or directory
... 6 more distinct messages not shown
== smokeping-slave (1 distinct, 1 total) ==
Aug 2 04:15:29 smokeping-slave nologin[512860]: Attempted login by UNKNOWN (UID: 65534) on UNKNOWN
== strawberry (4 distinct, 10 total) ==
Aug 2 04:09:44 strawberry udisksd[1067]: Error performing housekeeping for drive /org/freedesktop/UDisks2/drives/ST2000DM001_1CH164_W1E8J5KJ: Error updating SMART data: Error sending ATA command CHECK POWER MODE: Unexpected sense data returned:#0120000: 00 00 00 00 00 00 00 00 00 00 00 00 00 00 00 00 ................#0120010: 00 00 00 00 00 00 00 00 00 00 00 00 00 00 00 00 ................#012 (g-io-error-quark, 0) [x6]
Aug 2 04:15:04 strawberry nologin[3376319]: Attempted login by UNKNOWN (UID: 65534) on UNKNOWN
Aug 2 04:15:04 strawberry pipewire[3376318]: mod.jackdbus-detect: Failed to receive jackdbus reply: org.freedesktop.DBus.Error.ServiceUnknown: The name org.jackaudio.service was not provided by any .service files
Aug 2 04:34:42 strawberry smartd[5314]: Device: /dev/sda [SAT], failed to read SMART Attribute Data [x2]
== submit26-b9-4 (9 distinct, 12 total) ==
Aug 2 04:16:10 submit26-b9-4 setroubleshoot[854617]: SELinux is preventing /usr/bin/python3.9 from create access on the directory /(null). For complete SELinux messages run: sealert -l a4e66030-8621-4da9-bd27-5988bb1bf8ad
Aug 2 04:16:10 submit26-b9-4 setroubleshoot[854617]: SELinux is preventing /usr/bin/python3.9 from add_name access on the directory /(null). For complete SELinux messages run: sealert -l c055e37d-bbf5-4800-9083-d606f792c8c1
Aug 2 04:16:10 submit26-b9-4 setroubleshoot[854617]: SELinux is preventing /usr/bin/python3.9 from create access on the file /(null). For complete SELinux messages run: sealert -l e5bc3a56-6d6f-4776-954f-ddde1579648f [x2]
Aug 2 04:16:10 submit26-b9-4 setroubleshoot[854617]: SELinux is preventing /usr/bin/python3.9 from open access on the file /tmp/libdnf.N5ZRMl/repodata/repomd.xml. For complete SELinux messages run: sealert -l a8ec5e1b-49f9-4fbc-a8ae-22e800f7abf2 [x2]
Aug 2 04:16:10 submit26-b9-4 setroubleshoot[854617]: SELinux is preventing /usr/bin/python3.9 from setattr access on the file repomd.xml. For complete SELinux messages run: sealert -l 945db714-d0c0-4402-911e-932978b8b036 [x2]
Aug 2 04:16:10 submit26-b9-4 setroubleshoot[854617]: SELinux is preventing /usr/bin/python3.9 from read access on the directory libdnf.N5ZRMl. For complete SELinux messages run: sealert -l 463998a0-fb0d-463c-82b1-471135710a14
Aug 2 04:16:10 submit26-b9-4 setroubleshoot[854617]: SELinux is preventing /usr/bin/python3.9 from remove_name access on the directory repomd.xml. For complete SELinux messages run: sealert -l 473d2e21-15d8-407a-a9ee-2b842607fa00
Aug 2 04:16:10 submit26-b9-4 setroubleshoot[854617]: SELinux is preventing /usr/bin/python3.9 from unlink access on the file repomd.xml. For complete SELinux messages run: sealert -l 80c54d4f-bf4b-4501-addb-1627383587d0
Aug 2 04:16:10 submit26-b9-4 setroubleshoot[854617]: SELinux is preventing /usr/bin/python3.9 from rmdir access on the directory repodata. For complete SELinux messages run: sealert -l c63d3890-151e-49a0-83f0-3dfb69d051e5
1
0
Command: /usr/local/sbin/syslog-digest.py
Time : 0.4907s
Status : exited 0
Output :
Syslog digest — 2026-08-02 04:05 EDT
Processed 4,266 lines, filtered 3,476 (81%). 790 unknown (73 distinct) from 22 host(s).
== abuse (1 distinct, 346 total) ==
Aug 2 03:05:06 abuse rsyslogd[21745]: imjournal: open() failed for path: '/var/lib/rsyslog/imjournal.state.tmp': Input/output error [v8.2404.0 try https://www.rsyslog.com/e/2433 ] [x346]
== b0b02.cs.umd.edu (4 distinct, 4 total) ==
Aug 2 03:41:33 b0b02.cs.umd.edu rustdesk[1987650]: cannot open display:
Aug 2 03:55:51 b0b02.cs.umd.edu setroubleshoot[1991363]: SELinux is preventing /usr/bin/python3.9 from getattr access on the file /etc/authselect/nsswitch.conf. For complete SELinux messages run: sealert -l 9a1e2952-3fde-4937-a8ab-f7f59791a458
Aug 2 03:55:54 b0b02.cs.umd.edu setroubleshoot[1991363]: SELinux is preventing /usr/bin/python3.9 from read access on the file /etc/authselect/nsswitch.conf. For complete SELinux messages run: sealert -l 97d74423-e027-4cd6-8810-ad80944900b5
Aug 2 03:55:57 b0b02.cs.umd.edu setroubleshoot[1991363]: SELinux is preventing /usr/bin/python3.9 from open access on the file /etc/authselect/nsswitch.conf. For complete SELinux messages run: sealert -l 4f253f6a-62d6-46dd-8eaf-0b4d29df41c6
== cheezit.cs.umd.edu (1 distinct, 1 total) ==
Aug 2 03:08:51 cheezit.cs.umd.edu sshd-session[152589]: error: maximum authentication attempts exceeded for root from 166.155.49.234 port 37026 ssh2 [preauth]
== contest (1 distinct, 34 total) ==
Aug 2 03:06:00 contest goferd[1007]: [ERROR][worker-0] gofer.messaging.adapter.connect:33 - connect: proton+amqps://satellite8.cs.umd.edu:5647, failed: Connection amqps://satellite8.cs.umd.edu:5647 disconnected: Condition('proton.pythonio', 'Connection refused to all addresses') [x34]
== csfw00a (1 distinct, 262 total) ==
Aug 2 03:04:30 csfw00a kernel: bnxt_en 0000:09:00.0 eth3: NIC Link is Down [x262]
== dojo (1 distinct, 1 total) ==
Aug 2 03:21:44 dojo sshd[876687]: error: PAM: Authentication failure for root from 116.99.174.219
== hackerman (1 distinct, 1 total) ==
Aug 2 03:19:01 hackerman gnome-software[2060381]: failed to commit changes to dconf: GDBus.Error:org.gtk.GDBus.UnmappedGError.Quark._g_2dfile_2derror_2dquark.Code2: Failed to create file “/adminhomes/sajith/.config/dconf/user.TXG1S3”: Permission denied
== idm00 (1 distinct, 1 total) ==
Aug 2 03:51:14 idm00 named[1455]: client @0x7f330c0dc868 10.73.240.42#57575: update '73.10.in-addr.arpa/IN' denied
== idmp0 (1 distinct, 1 total) ==
Aug 2 03:36:02 idmp0 named[5198]: client @0x7f99000dfeb8 10.73.240.43#53317: update '73.10.in-addr.arpa/IN' denied
== inbound00.cs.umd.edu (2 distinct, 2 total) ==
Aug 2 03:20:28 inbound00.cs.umd.edu krb5_child[2051985]: Client 'admin(a)UMD.EDU' not found in Kerberos database
Aug 2 03:32:22 inbound00.cs.umd.edu krb5_child[2055454]: Client 'test1(a)UMD.EDU' not found in Kerberos database
== itmon02 (2 distinct, 36 total) ==
Aug 2 03:08:00 itmon02 sshd[1750555]: error: beginning MaxStartups throttling [x35]
Aug 2 03:15:03 itmon02 (httpd)[3152979]: httpd.service: Referenced but unset environment variable evaluates to an empty string: OPTIONS
== kadath.cs.umd.edu (1 distinct, 1 total) ==
Aug 2 03:47:30 kadath.cs.umd.edu puppet-agent[1366096]: (Facter) invalid or malformed lldp data: MalformedDataError: no lldp interface data found
== matrix (2 distinct, 3 total) ==
Aug 2 03:07:38 matrix krb5_child[4090436]: Client 'admin(a)UMD.EDU' not found in Kerberos database [x2]
Aug 2 03:07:39 matrix sshd[4090414]: error: PAM: Authentication failure for admin from 116.99.174.219
== netbox (1 distinct, 1 total) ==
Aug 2 03:08:02 netbox (httpd)[1329911]: httpd.service: Referenced but unset environment variable evaluates to an empty string: OPTIONS
== newhonors2 (1 distinct, 24 total) ==
Aug 2 03:13:03 newhonors2 dhcpcd[616259]: dhcpcd is not running [x24]
== outbound00.cs.umd.edu (3 distinct, 9 total) ==
Aug 2 03:09:09 outbound00.cs.umd.edu python3[2015607]: ldapdb [x7]
Aug 2 03:24:13 outbound00.cs.umd.edu systemd[1]: Configuration file /usr/lib/systemd/system/authentication_milter.service is marked executable. Please remove executable permission bits. Proceeding anyway.
Aug 2 03:24:38 outbound00.cs.umd.edu krb5_child[2019345]: Client 'kent(a)UMD.EDU' not found in Kerberos database
== outbound01.cs.umd.edu (2 distinct, 8 total) ==
Aug 2 03:06:02 outbound01.cs.umd.edu krb5_child[46975]: Client 'admin(a)UMD.EDU' not found in Kerberos database [x2]
Aug 2 03:13:06 outbound01.cs.umd.edu python3[48308]: ldapdb [x6]
== sentry-docker00.cs.umd.edu (42 distinct, 42 total) ==
Aug 2 03:06:58 sentry-docker00.cs.umd.edu systemd-udevd[115060]: link_config: could not get ethtool features for veth41f6fea
Aug 2 03:06:58 sentry-docker00.cs.umd.edu systemd-udevd[115060]: Could not set offload features of veth41f6fea: No such device
Aug 2 03:06:58 sentry-docker00.cs.umd.edu systemd-udevd[115140]: link_config: could not get ethtool features for veth638b4eb
Aug 2 03:06:58 sentry-docker00.cs.umd.edu systemd-udevd[115140]: Could not set offload features of veth638b4eb: No such device
Aug 2 03:06:58 sentry-docker00.cs.umd.edu systemd-udevd[115162]: Could not generate persistent MAC address for veth16a085c: No such file or directory
Aug 2 03:06:58 sentry-docker00.cs.umd.edu systemd-udevd[115163]: Could not generate persistent MAC address for vethc11f8b1: No such file or directory
Aug 2 03:06:58 sentry-docker00.cs.umd.edu systemd-udevd[115188]: Could not generate persistent MAC address for vetha845deb: No such file or directory
Aug 2 03:06:58 sentry-docker00.cs.umd.edu systemd-udevd[115189]: Could not generate persistent MAC address for veth0dc1622: No such file or directory
Aug 2 03:06:58 sentry-docker00.cs.umd.edu systemd-udevd[115205]: Could not generate persistent MAC address for veth425b3f2: No such file or directory
Aug 2 03:06:58 sentry-docker00.cs.umd.edu systemd-udevd[115194]: Could not generate persistent MAC address for veth51b2d23: No such file or directory
Aug 2 03:06:58 sentry-docker00.cs.umd.edu systemd-udevd[115205]: Could not generate persistent MAC address for veth3f00dde: No such file or directory
Aug 2 03:06:58 sentry-docker00.cs.umd.edu systemd-udevd[115203]: Could not generate persistent MAC address for veth871df5f: No such file or directory
Aug 2 03:09:30 sentry-docker00.cs.umd.edu systemd-udevd[117312]: link_config: could not get ethtool features for veth7162909
Aug 2 03:09:30 sentry-docker00.cs.umd.edu systemd-udevd[117312]: Could not set offload features of veth7162909: No such device
Aug 2 03:09:30 sentry-docker00.cs.umd.edu systemd-udevd[117328]: Could not generate persistent MAC address for veth816e550: No such file or directory
Aug 2 03:09:30 sentry-docker00.cs.umd.edu systemd-udevd[117329]: Could not generate persistent MAC address for veth39968c4: No such file or directory
Aug 2 03:27:07 sentry-docker00.cs.umd.edu systemd-udevd[124656]: link_config: could not get ethtool features for veth871df5f
Aug 2 03:27:07 sentry-docker00.cs.umd.edu systemd-udevd[124656]: Could not set offload features of veth871df5f: No such device
Aug 2 03:27:07 sentry-docker00.cs.umd.edu systemd-udevd[124679]: Could not generate persistent MAC address for vethf9afe98: No such file or directory
Aug 2 03:27:07 sentry-docker00.cs.umd.edu systemd-udevd[124680]: Could not generate persistent MAC address for veth98e2430: No such file or directory
Aug 2 03:27:07 sentry-docker00.cs.umd.edu systemd-udevd[124698]: Could not generate persistent MAC address for veth66ebc45: No such file or directory
Aug 2 03:27:07 sentry-docker00.cs.umd.edu systemd-udevd[124690]: Could not generate persistent MAC address for vethadf978d: No such file or directory
Aug 2 03:27:07 sentry-docker00.cs.umd.edu systemd-udevd[124690]: Could not generate persistent MAC address for vethb41daf9: No such file or directory
Aug 2 03:27:07 sentry-docker00.cs.umd.edu systemd-udevd[124700]: Could not generate persistent MAC address for veth928a749: No such file or directory
Aug 2 03:27:07 sentry-docker00.cs.umd.edu systemd-udevd[124709]: Could not generate persistent MAC address for veth7439252: No such file or directory
Aug 2 03:27:07 sentry-docker00.cs.umd.edu systemd-udevd[124710]: Could not generate persistent MAC address for veth6233f7d: No such file or directory
Aug 2 03:29:34 sentry-docker00.cs.umd.edu systemd-udevd[126766]: link_config: could not get ethtool features for veth816e550
Aug 2 03:29:34 sentry-docker00.cs.umd.edu systemd-udevd[126766]: Could not set offload features of veth816e550: No such device
Aug 2 03:29:34 sentry-docker00.cs.umd.edu systemd-udevd[126784]: Could not generate persistent MAC address for vetha92ad23: No such file or directory
Aug 2 03:29:34 sentry-docker00.cs.umd.edu systemd-udevd[126785]: Could not generate persistent MAC address for veth7cb9d53: No such file or directory
... 12 more distinct messages not shown
== soul (1 distinct, 3 total) ==
Aug 2 03:08:46 soul krb5_child[3131565]: Client 'admin(a)UMD.EDU' not found in Kerberos database [x3]
== strawberry (2 distinct, 8 total) ==
Aug 2 03:09:44 strawberry udisksd[1067]: Error performing housekeeping for drive /org/freedesktop/UDisks2/drives/ST2000DM001_1CH164_W1E8J5KJ: Error updating SMART data: Error sending ATA command CHECK POWER MODE: Unexpected sense data returned:#0120000: 00 00 00 00 00 00 00 00 00 00 00 00 00 00 00 00 ................#0120010: 00 00 00 00 00 00 00 00 00 00 00 00 00 00 00 00 ................#012 (g-io-error-quark, 0) [x6]
Aug 2 03:34:42 strawberry smartd[5314]: Device: /dev/sda [SAT], failed to read SMART Attribute Data [x2]
== whiffle.cs.umd.edu (1 distinct, 1 total) ==
Aug 2 03:42:02 whiffle.cs.umd.edu rsyslogd[1306]: imfile: poll_tree cannot stat file '/var/log/httpd/wwwold.cs.umd.edu_ssl-8446_error_ssl.log' - ignored: No such file or directory [v8.2404.0]
== zfs00.cs.umd.edu (1 distinct, 1 total) ==
Aug 2 03:25:23 zfs00.cs.umd.edu kernel: kauditd_printk_skb: 4 callbacks suppressed
1
0
Command: /usr/local/sbin/syslog-digest.py
Time : 0.4855s
Status : exited 0
Output :
Syslog digest — 2026-08-02 03:05 EDT
Processed 4,227 lines, filtered 3,430 (81%). 797 unknown (76 distinct) from 19 host(s).
== abuse (1 distinct, 347 total) ==
Aug 2 02:05:06 abuse rsyslogd[21745]: imjournal: open() failed for path: '/var/lib/rsyslog/imjournal.state.tmp': Input/output error [v8.2404.0 try https://www.rsyslog.com/e/2433 ] [x347]
== b0b02.cs.umd.edu (4 distinct, 4 total) ==
Aug 2 02:41:29 b0b02.cs.umd.edu rustdesk[1972530]: cannot open display:
Aug 2 02:55:47 b0b02.cs.umd.edu setroubleshoot[1976283]: SELinux is preventing /usr/bin/python3.9 from getattr access on the file /etc/authselect/nsswitch.conf. For complete SELinux messages run: sealert -l 9a1e2952-3fde-4937-a8ab-f7f59791a458
Aug 2 02:55:49 b0b02.cs.umd.edu setroubleshoot[1976283]: SELinux is preventing /usr/bin/python3.9 from read access on the file /etc/authselect/nsswitch.conf. For complete SELinux messages run: sealert -l 97d74423-e027-4cd6-8810-ad80944900b5
Aug 2 02:55:52 b0b02.cs.umd.edu setroubleshoot[1976283]: SELinux is preventing /usr/bin/python3.9 from open access on the file /etc/authselect/nsswitch.conf. For complete SELinux messages run: sealert -l 4f253f6a-62d6-46dd-8eaf-0b4d29df41c6
== contest (1 distinct, 34 total) ==
Aug 2 02:05:18 contest goferd[1007]: [ERROR][worker-0] gofer.messaging.adapter.connect:33 - connect: proton+amqps://satellite8.cs.umd.edu:5647, failed: Connection amqps://satellite8.cs.umd.edu:5647 disconnected: Condition('proton.pythonio', 'Connection refused to all addresses') [x34]
== csfw00a (1 distinct, 258 total) ==
Aug 2 02:05:08 csfw00a kernel: bnxt_en 0000:09:00.0 eth3: NIC Link is Down [x258]
== dojo (2 distinct, 2 total) ==
Aug 2 02:29:47 dojo sshd[872629]: error: PAM: Authentication failure for root from 116.110.23.176
Aug 2 02:48:45 dojo sshd[873879]: error: PAM: Authentication failure for root from 116.99.174.219
== frabjous (3 distinct, 3 total) ==
Aug 2 02:35:33 frabjous krb5_child[2643410]: Client 'admin(a)UMD.EDU' not found in Kerberos database
Aug 2 02:35:35 frabjous sshd-session[2643406]: error: PAM: Authentication failure for admin from 34.76.146.227
Aug 2 02:36:11 frabjous sshd-session[2643795]: error: Protocol major versions differ: 2 vs. 1
== idm00 (1 distinct, 1 total) ==
Aug 2 02:51:14 idm00 named[1455]: client @0x7f330424fbc8 10.73.240.42#54525: update '73.10.in-addr.arpa/IN' denied
== idmp0 (1 distinct, 1 total) ==
Aug 2 02:36:02 idmp0 named[5198]: client @0x7f9904040418 10.73.240.43#64435: update '73.10.in-addr.arpa/IN' denied
== inbound00.cs.umd.edu (1 distinct, 1 total) ==
Aug 2 02:15:58 inbound00.cs.umd.edu krb5_child[2037325]: Client 'admin(a)UMD.EDU' not found in Kerberos database
== itmon02 (1 distinct, 34 total) ==
Aug 2 02:07:59 itmon02 sshd[1750555]: error: beginning MaxStartups throttling [x34]
== matrix (6 distinct, 12 total) ==
Aug 2 02:25:46 matrix krb5_child[4066722]: Client 'admin(a)UMD.EDU' not found in Kerberos database [x6]
Aug 2 02:25:48 matrix sshd[4066715]: error: PAM: Authentication failure for admin from 116.110.23.176
Aug 2 02:28:55 matrix sshd[4067747]: error: PAM: Authentication failure for root from 116.99.174.219 [x2]
Aug 2 02:46:04 matrix sshd[4076976]: error: PAM: Authentication failure for root from 116.110.156.145
Aug 2 02:57:12 matrix sshd[4084483]: error: PAM: Authentication failure for admin from 116.110.156.145
Aug 2 03:02:03 matrix sshd[4087608]: error: PAM: Authentication failure for admin from 116.99.174.219
== newhonors2 (1 distinct, 24 total) ==
Aug 2 02:13:03 newhonors2 dhcpcd[614415]: dhcpcd is not running [x24]
== outbound00.cs.umd.edu (3 distinct, 9 total) ==
Aug 2 02:09:09 outbound00.cs.umd.edu python3[2001541]: ldapdb [x6]
Aug 2 02:19:26 outbound00.cs.umd.edu krb5_child[2003819]: Preauthentication failed
Aug 2 02:33:42 outbound00.cs.umd.edu krb5_child[2007591]: Client 'admin(a)UMD.EDU' not found in Kerberos database [x2]
== outbound01.cs.umd.edu (2 distinct, 12 total) ==
Aug 2 02:13:06 outbound01.cs.umd.edu python3[34422]: ldapdb [x6]
Aug 2 02:27:38 outbound01.cs.umd.edu krb5_child[37945]: Client 'admin(a)UMD.EDU' not found in Kerberos database [x6]
== peach.cs.umd.edu (2 distinct, 2 total) ==
Aug 2 02:12:09 peach.cs.umd.edu setroubleshoot[2174947]: SELinux is preventing /usr/bin/qemu-ga from search access on the directory /var/lib/containers/storage/overlay. For complete SELinux messages run: sealert -l ba415951-a2c6-424e-b17d-305c5300b9f3
Aug 2 02:12:09 peach.cs.umd.edu setroubleshoot[2174947]: SELinux is preventing /usr/bin/qemu-ga from search access on the directory /var/lib/containers/storage/overlay. For complete SELinux messages run: sealert -l 6aeb0956-fcf2-462a-ae4d-439b912c16d0
== sentry-docker00.cs.umd.edu (42 distinct, 42 total) ==
Aug 2 02:06:33 sentry-docker00.cs.umd.edu systemd-udevd[86185]: link_config: could not get ethtool features for veth013bddd
Aug 2 02:06:33 sentry-docker00.cs.umd.edu systemd-udevd[86185]: Could not set offload features of veth013bddd: No such device
Aug 2 02:06:34 sentry-docker00.cs.umd.edu systemd-udevd[86228]: Could not generate persistent MAC address for veth1cbf00a: No such file or directory
Aug 2 02:06:34 sentry-docker00.cs.umd.edu systemd-udevd[86229]: Could not generate persistent MAC address for veth9d0d4b0: No such file or directory
Aug 2 02:06:34 sentry-docker00.cs.umd.edu systemd-udevd[86232]: Could not generate persistent MAC address for veth23d1617: No such file or directory
Aug 2 02:06:34 sentry-docker00.cs.umd.edu systemd-udevd[86233]: Could not generate persistent MAC address for veth02a74b3: No such file or directory
Aug 2 02:06:34 sentry-docker00.cs.umd.edu systemd-udevd[86246]: Could not generate persistent MAC address for vethc908287: No such file or directory
Aug 2 02:06:34 sentry-docker00.cs.umd.edu systemd-udevd[86253]: Could not generate persistent MAC address for vethee2b2a1: No such file or directory
Aug 2 02:06:34 sentry-docker00.cs.umd.edu systemd-udevd[86302]: Could not generate persistent MAC address for veth0b1176f: No such file or directory
Aug 2 02:06:34 sentry-docker00.cs.umd.edu systemd-udevd[86303]: Could not generate persistent MAC address for veth965360d: No such file or directory
Aug 2 02:09:09 sentry-docker00.cs.umd.edu systemd-udevd[88390]: link_config: could not get ethtool features for vethb5aba8a
Aug 2 02:09:09 sentry-docker00.cs.umd.edu systemd-udevd[88390]: Could not set offload features of vethb5aba8a: No such device
Aug 2 02:09:09 sentry-docker00.cs.umd.edu systemd-udevd[88408]: Could not generate persistent MAC address for vethc933709: No such file or directory
Aug 2 02:09:09 sentry-docker00.cs.umd.edu systemd-udevd[88409]: Could not generate persistent MAC address for veth0ac0f9e: No such file or directory
Aug 2 02:26:42 sentry-docker00.cs.umd.edu systemd-udevd[95765]: link_config: could not get ethtool features for veth0b1176f
Aug 2 02:26:42 sentry-docker00.cs.umd.edu systemd-udevd[95765]: Could not set offload features of veth0b1176f: No such device
Aug 2 02:26:42 sentry-docker00.cs.umd.edu systemd-udevd[95790]: Could not generate persistent MAC address for vethb109575: No such file or directory
Aug 2 02:26:42 sentry-docker00.cs.umd.edu systemd-udevd[95791]: Could not generate persistent MAC address for vethfa729cf: No such file or directory
Aug 2 02:26:42 sentry-docker00.cs.umd.edu systemd-udevd[95794]: Could not generate persistent MAC address for veth5817f8f: No such file or directory
Aug 2 02:26:42 sentry-docker00.cs.umd.edu systemd-udevd[95795]: Could not generate persistent MAC address for vethff2cae3: No such file or directory
Aug 2 02:26:42 sentry-docker00.cs.umd.edu systemd-udevd[95816]: Could not generate persistent MAC address for veth038561d: No such file or directory
Aug 2 02:26:42 sentry-docker00.cs.umd.edu systemd-udevd[95803]: Could not generate persistent MAC address for veth2725bce: No such file or directory
Aug 2 02:26:42 sentry-docker00.cs.umd.edu systemd-udevd[95820]: Could not generate persistent MAC address for veth6df6b65: No such file or directory
Aug 2 02:26:42 sentry-docker00.cs.umd.edu systemd-udevd[95821]: Could not generate persistent MAC address for vethc121567: No such file or directory
Aug 2 02:29:17 sentry-docker00.cs.umd.edu systemd-udevd[98080]: Could not generate persistent MAC address for veth2dff983: No such file or directory
Aug 2 02:29:17 sentry-docker00.cs.umd.edu systemd-udevd[98081]: Could not generate persistent MAC address for veth17332f8: No such file or directory
Aug 2 02:46:50 sentry-docker00.cs.umd.edu systemd-udevd[105641]: link_config: could not get ethtool features for veth038561d
Aug 2 02:46:50 sentry-docker00.cs.umd.edu systemd-udevd[105641]: Could not set offload features of veth038561d: No such device
Aug 2 02:46:50 sentry-docker00.cs.umd.edu systemd-udevd[105665]: link_config: could not get ethtool features for veth6df6b65
Aug 2 02:46:50 sentry-docker00.cs.umd.edu systemd-udevd[105665]: Could not set offload features of veth6df6b65: No such device
... 12 more distinct messages not shown
== soul (1 distinct, 2 total) ==
Aug 2 02:25:55 soul krb5_child[3126539]: Client 'admin(a)UMD.EDU' not found in Kerberos database [x2]
== strawberry (2 distinct, 8 total) ==
Aug 2 02:09:44 strawberry udisksd[1067]: Error performing housekeeping for drive /org/freedesktop/UDisks2/drives/ST2000DM001_1CH164_W1E8J5KJ: Error updating SMART data: Error sending ATA command CHECK POWER MODE: Unexpected sense data returned:#0120000: 00 00 00 00 00 00 00 00 00 00 00 00 00 00 00 00 ................#0120010: 00 00 00 00 00 00 00 00 00 00 00 00 00 00 00 00 ................#012 (g-io-error-quark, 0) [x6]
Aug 2 02:34:42 strawberry smartd[5314]: Device: /dev/sda [SAT], failed to read SMART Attribute Data [x2]
== tma-0 (1 distinct, 1 total) ==
Aug 2 02:11:41 tma-0 sshd[25414]: error: PAM: Authentication failure for admin from 213.61.175.207.bc.googleusercontent.com
1
0
Command: /usr/local/sbin/syslog-digest.py
Time : 0.5066s
Status : exited 0
Output :
Syslog digest — 2026-08-02 02:05 EDT
Processed 4,114 lines, filtered 3,221 (78%). 893 unknown (122 distinct) from 22 host(s).
== abuse (1 distinct, 345 total) ==
Aug 2 01:05:06 abuse rsyslogd[21745]: imjournal: open() failed for path: '/var/lib/rsyslog/imjournal.state.tmp': Input/output error [v8.2404.0 try https://www.rsyslog.com/e/2433 ] [x345]
== b0b02.cs.umd.edu (1 distinct, 1 total) ==
Aug 2 01:41:25 b0b02.cs.umd.edu rustdesk[1957448]: cannot open display:
== cheezit.cs.umd.edu (11 distinct, 13 total) ==
Aug 2 01:30:36 cheezit.cs.umd.edu setroubleshoot[129145]: failed to retrieve rpm info for path '/var/log/falconctl.log':
Aug 2 01:30:37 cheezit.cs.umd.edu setroubleshoot[129145]: SELinux is preventing /opt/CrowdStrike/falconctl18708 from append access on the file /var/log/falconctl.log. For complete SELinux messages run: sealert -l 63f66d53-fcfc-44da-a79e-c789b1ce2ce8
Aug 2 01:30:39 cheezit.cs.umd.edu setroubleshoot[129145]: SELinux is preventing /opt/CrowdStrike/falconctl18708 from write access on the file falconstore. For complete SELinux messages run: sealert -l 386506af-597f-4357-89de-bc382f369a6e
Aug 2 01:30:50 cheezit.cs.umd.edu setroubleshoot[129517]: failed to retrieve rpm info for path '/var/lib/sss/pipes/nss': [x2]
Aug 2 01:30:51 cheezit.cs.umd.edu setroubleshoot[129517]: SELinux is preventing /usr/bin/lsof from write access on the sock_file /var/lib/sss/pipes/nss. For complete SELinux messages run: sealert -l f570494d-54d2-4dac-97e2-28395659abf1 [x2]
Aug 2 01:30:51 cheezit.cs.umd.edu setroubleshoot[129517]: SELinux is preventing /usr/bin/lsof from write access on the sock_file socket. For complete SELinux messages run: sealert -l 9ff2383b-9e1d-44ff-b8ae-af91637450ae
Aug 2 01:31:31 cheezit.cs.umd.edu setroubleshoot[129984]: SELinux is preventing /usr/bin/python3.9 from read access on the file /etc/selinux/targeted/contexts/files/file_contexts.subs_dist. For complete SELinux messages run: sealert -l 679eb260-cf5d-4783-99f4-ce308edb3295
Aug 2 01:31:31 cheezit.cs.umd.edu setroubleshoot[129984]: SELinux is preventing /usr/bin/python3.9 from open access on the file /etc/selinux/targeted/contexts/files/file_contexts.subs_dist. For complete SELinux messages run: sealert -l 77caba8a-5cd0-4e18-b188-6e35c461772d
Aug 2 01:31:31 cheezit.cs.umd.edu setroubleshoot[129984]: SELinux is preventing /usr/bin/python3.9 from read access on the file /etc/selinux/targeted/contexts/files/file_contexts.subs. For complete SELinux messages run: sealert -l d9c6dd0d-0a34-4430-a5ff-e985c55cb064
Aug 2 01:31:31 cheezit.cs.umd.edu setroubleshoot[129984]: SELinux is preventing /usr/bin/python3.9 from open access on the file /etc/selinux/targeted/contexts/files/file_contexts.subs. For complete SELinux messages run: sealert -l 8edbce57-8212-4ac8-af50-3fe403231eda
Aug 2 01:31:31 cheezit.cs.umd.edu setroubleshoot[129984]: SELinux is preventing /usr/bin/python3.9 from map access on the file /etc/selinux/targeted/contexts/files/file_contexts.bin. For complete SELinux messages run: sealert -l 4a0cbe3b-6f49-4c7e-95c6-380f7aef806e
== cmsc436-0101-redis (2 distinct, 2 total) ==
Aug 2 01:05:36 cmsc436-0101-redis krb5_child[670849]: Client 'admin(a)UMD.EDU' not found in Kerberos database
Aug 2 01:05:38 cmsc436-0101-redis sshd-session[670845]: error: PAM: Authentication failure for admin from 34.79.138.101
== contest (9 distinct, 43 total) ==
Aug 2 01:06:24 contest goferd[1007]: [ERROR][worker-0] gofer.messaging.adapter.connect:33 - connect: proton+amqps://satellite8.cs.umd.edu:5647, failed: Connection amqps://satellite8.cs.umd.edu:5647 disconnected: Condition('proton.pythonio', 'Connection refused to all addresses') [x33]
Aug 2 01:48:16 contest setroubleshoot[480656]: SELinux is preventing /usr/libexec/platform-python3.6 from create access on the directory libdnf.8paIYx. For complete SELinux messages run: sealert -l cb6b25c6-4765-4cf2-88a0-9b3b508e94e9
Aug 2 01:48:16 contest setroubleshoot[480656]: SELinux is preventing /usr/bin/gpgconf from add_name access on the directory repodata. For complete SELinux messages run: sealert -l 41cf7b1b-0f34-4609-98f2-b66e7825fef7 [x2]
Aug 2 01:48:16 contest setroubleshoot[480656]: SELinux is preventing /usr/libexec/platform-python3.6 from create access on the file mirrorlist. For complete SELinux messages run: sealert -l fc20ff92-ea83-4f38-a24b-ddfd737a3141
Aug 2 01:48:17 contest setroubleshoot[480656]: SELinux is preventing /usr/libexec/platform-python3.6 from setattr access on the file repomd.xml. For complete SELinux messages run: sealert -l ac675631-fa35-4e93-adc9-b692b18e53e5
Aug 2 01:48:17 contest setroubleshoot[480656]: SELinux is preventing /usr/libexec/platform-python3.6 from read access on the directory libdnf.8paIYx. For complete SELinux messages run: sealert -l 45d103b6-0810-4890-a705-990118577ce8
Aug 2 01:48:17 contest setroubleshoot[480656]: SELinux is preventing /usr/libexec/platform-python3.6 from remove_name access on the directory repomd.xml. For complete SELinux messages run: sealert -l 7e499113-2fd7-4f67-bec6-3521efbe3637 [x2]
Aug 2 01:48:17 contest setroubleshoot[480656]: SELinux is preventing /usr/libexec/platform-python3.6 from rmdir access on the directory repodata. For complete SELinux messages run: sealert -l 3928930b-a1ed-448d-950b-0665ac2adef8
Aug 2 01:48:17 contest setroubleshoot[480656]: SELinux is preventing /usr/libexec/platform-python3.6 from create access on the directory libdnf.LtLQCC. For complete SELinux messages run: sealert -l cb6b25c6-4765-4cf2-88a0-9b3b508e94e9
== csfw00a (1 distinct, 268 total) ==
Aug 2 01:04:34 csfw00a kernel: bnxt_en 0000:09:00.0 eth3: NIC Link is Down [x268]
== dojo (1 distinct, 1 total) ==
Aug 2 01:06:20 dojo sshd[867681]: error: Protocol major versions differ: 2 vs. 1
== hackerman (1 distinct, 1 total) ==
Aug 2 01:19:01 hackerman gnome-software[2060381]: failed to commit changes to dconf: GDBus.Error:org.gtk.GDBus.UnmappedGError.Quark._g_2dfile_2derror_2dquark.Code2: Failed to create file “/adminhomes/sajith/.config/dconf/user.QVQXS3”: Permission denied
== hazfs.cs.umd.edu (11 distinct, 66 total) ==
Aug 2 01:53:07 hazfs.cs.umd.edu snmpd[1431]: send response: Failure in sendto [x6]
Aug 2 01:53:07 hazfs.cs.umd.edu snmpd[1431]: -- NET-SNMP-EXTEND-MIB::nsExtendStatus."userweb" [x6]
Aug 2 01:53:07 hazfs.cs.umd.edu snmpd[1431]: -- NET-SNMP-EXTEND-MIB::nsExtendStatus."zfslist" [x6]
Aug 2 01:53:07 hazfs.cs.umd.edu snmpd[1431]: -- NET-SNMP-EXTEND-MIB::nsExtendStatus."userhome" [x6]
Aug 2 01:53:07 hazfs.cs.umd.edu snmpd[1431]: -- NET-SNMP-EXTEND-MIB::nsExtendOutput1Line."userweb" [x6]
Aug 2 01:53:07 hazfs.cs.umd.edu snmpd[1431]: -- NET-SNMP-EXTEND-MIB::nsExtendOutput1Line."zfslist" [x6]
Aug 2 01:53:07 hazfs.cs.umd.edu snmpd[1431]: -- NET-SNMP-EXTEND-MIB::nsExtendOutput1Line."userhome" [x6]
Aug 2 01:53:07 hazfs.cs.umd.edu snmpd[1431]: -- NET-SNMP-EXTEND-MIB::nsExtendOutputFull."userweb" [x6]
Aug 2 01:53:07 hazfs.cs.umd.edu snmpd[1431]: -- NET-SNMP-EXTEND-MIB::nsExtendOutputFull."zfslist" [x6]
Aug 2 01:53:07 hazfs.cs.umd.edu snmpd[1431]: -- NET-SNMP-EXTEND-MIB::nsExtendOutputFull."userhome" [x6]
Aug 2 01:53:07 hazfs.cs.umd.edu snmpd[1431]: -- NET-SNMP-EXTEND-MIB::nsExtendOutNumLines."userweb" [x6]
== idm00 (2 distinct, 2 total) ==
Aug 2 01:24:05 idm00 named[1455]: client @0x7f33048c7d98 10.73.245.12#63911: update '73.10.in-addr.arpa/IN' denied
Aug 2 01:51:14 idm00 named[1455]: client @0x7f331054a7b8 10.73.240.42#63714: update '73.10.in-addr.arpa/IN' denied
== idmp0 (1 distinct, 1 total) ==
Aug 2 01:36:02 idmp0 named[5198]: client @0x7f9924071208 10.73.240.43#55459: update '73.10.in-addr.arpa/IN' denied
== inbound00.cs.umd.edu (2 distinct, 2 total) ==
Aug 2 01:51:46 inbound00.cs.umd.edu krb5_child[2031598]: Preauthentication failed
Aug 2 02:03:52 inbound00.cs.umd.edu krb5_child[2034748]: Client 'admin(a)UMD.EDU' not found in Kerberos database
== itmon02 (1 distinct, 24 total) ==
Aug 2 01:08:13 itmon02 sshd[1750555]: error: beginning MaxStartups throttling [x24]
== netman.cs.umd.edu (2 distinct, 5 total) ==
Aug 2 01:32:43 netman.cs.umd.edu krb5_child[3918800]: Client 'admin(a)UMD.EDU' not found in Kerberos database [x4]
Aug 2 01:32:49 netman.cs.umd.edu sshd[3918797]: error: PAM: Authentication failure for admin from 34.76.146.227
== newhonors2 (1 distinct, 24 total) ==
Aug 2 01:13:03 newhonors2 dhcpcd[612575]: dhcpcd is not running [x24]
== outbound00.cs.umd.edu (1 distinct, 6 total) ==
Aug 2 01:09:09 outbound00.cs.umd.edu python3[1987698]: ldapdb [x6]
== outbound01.cs.umd.edu (4 distinct, 10 total) ==
Aug 2 01:13:07 outbound01.cs.umd.edu python3[20341]: ldapdb [x6]
Aug 2 01:31:42 outbound01.cs.umd.edu krb5_child[24843]: Preauthentication failed
Aug 2 01:34:10 outbound01.cs.umd.edu krb5_child[25453]: Client 'admin(a)UMD.EDU' not found in Kerberos database [x2]
Aug 2 01:36:04 outbound01.cs.umd.edu sshd-session[25987]: error: Protocol major versions differ: 2 vs. 1
== sentry-docker00.cs.umd.edu (40 distinct, 40 total) ==
Aug 2 01:06:08 sentry-docker00.cs.umd.edu systemd-udevd[57551]: link_config: could not get ethtool features for veth5e40234
Aug 2 01:06:08 sentry-docker00.cs.umd.edu systemd-udevd[57551]: Could not set offload features of veth5e40234: No such device
Aug 2 01:06:08 sentry-docker00.cs.umd.edu systemd-udevd[57577]: Could not generate persistent MAC address for veth05560d0: No such file or directory
Aug 2 01:06:08 sentry-docker00.cs.umd.edu systemd-udevd[57578]: Could not generate persistent MAC address for veth0e0928a: No such file or directory
Aug 2 01:06:08 sentry-docker00.cs.umd.edu systemd-udevd[57597]: Could not generate persistent MAC address for vethe1bedf4: No such file or directory
Aug 2 01:06:08 sentry-docker00.cs.umd.edu systemd-udevd[57592]: Could not generate persistent MAC address for veth587be9e: No such file or directory
Aug 2 01:06:08 sentry-docker00.cs.umd.edu systemd-udevd[57586]: Could not generate persistent MAC address for veth19554ab: No such file or directory
Aug 2 01:06:08 sentry-docker00.cs.umd.edu systemd-udevd[57581]: Could not generate persistent MAC address for veth2cd2c2d: No such file or directory
Aug 2 01:06:08 sentry-docker00.cs.umd.edu systemd-udevd[57607]: Could not generate persistent MAC address for veth1aae1b3: No such file or directory
Aug 2 01:06:08 sentry-docker00.cs.umd.edu systemd-udevd[57608]: Could not generate persistent MAC address for veth9b47e79: No such file or directory
Aug 2 01:08:48 sentry-docker00.cs.umd.edu systemd-udevd[59774]: link_config: could not get ethtool features for vethace7dd1
Aug 2 01:08:48 sentry-docker00.cs.umd.edu systemd-udevd[59774]: Could not set offload features of vethace7dd1: No such device
Aug 2 01:08:48 sentry-docker00.cs.umd.edu systemd-udevd[59792]: Could not generate persistent MAC address for veth9822b04: No such file or directory
Aug 2 01:08:48 sentry-docker00.cs.umd.edu systemd-udevd[59793]: Could not generate persistent MAC address for veth4991a70: No such file or directory
Aug 2 01:26:17 sentry-docker00.cs.umd.edu systemd-udevd[67262]: link_config: could not get ethtool features for vethe1bedf4
Aug 2 01:26:17 sentry-docker00.cs.umd.edu systemd-udevd[67262]: Could not set offload features of vethe1bedf4: No such device
Aug 2 01:26:17 sentry-docker00.cs.umd.edu systemd-udevd[67280]: Could not generate persistent MAC address for veth4c4e786: No such file or directory
Aug 2 01:26:17 sentry-docker00.cs.umd.edu systemd-udevd[67281]: Could not generate persistent MAC address for veth38b2f63: No such file or directory
Aug 2 01:26:17 sentry-docker00.cs.umd.edu systemd-udevd[67305]: Could not generate persistent MAC address for veth7b9efa4: No such file or directory
Aug 2 01:26:17 sentry-docker00.cs.umd.edu systemd-udevd[67289]: Could not generate persistent MAC address for vethd106a67: No such file or directory
Aug 2 01:26:17 sentry-docker00.cs.umd.edu systemd-udevd[67308]: Could not generate persistent MAC address for veth74a2b9e: No such file or directory
Aug 2 01:26:17 sentry-docker00.cs.umd.edu systemd-udevd[67309]: Could not generate persistent MAC address for vethe5061d8: No such file or directory
Aug 2 01:26:17 sentry-docker00.cs.umd.edu systemd-udevd[67340]: Could not generate persistent MAC address for veth63fa1f8: No such file or directory
Aug 2 01:26:17 sentry-docker00.cs.umd.edu systemd-udevd[67333]: Could not generate persistent MAC address for veth1b71459: No such file or directory
Aug 2 01:28:57 sentry-docker00.cs.umd.edu systemd-udevd[69470]: Could not generate persistent MAC address for vetha31675c: No such file or directory
Aug 2 01:28:57 sentry-docker00.cs.umd.edu systemd-udevd[69471]: Could not generate persistent MAC address for vethf1c8f46: No such file or directory
Aug 2 01:46:25 sentry-docker00.cs.umd.edu systemd-udevd[76665]: link_config: could not get ethtool features for veth4c4e786
Aug 2 01:46:25 sentry-docker00.cs.umd.edu systemd-udevd[76665]: Could not set offload features of veth4c4e786: No such device
Aug 2 01:46:25 sentry-docker00.cs.umd.edu systemd-udevd[76739]: link_config: could not get ethtool features for veth7b9efa4
Aug 2 01:46:25 sentry-docker00.cs.umd.edu systemd-udevd[76739]: Could not set offload features of veth7b9efa4: No such device
... 10 more distinct messages not shown
== strawberry (2 distinct, 8 total) ==
Aug 2 01:09:44 strawberry udisksd[1067]: Error performing housekeeping for drive /org/freedesktop/UDisks2/drives/ST2000DM001_1CH164_W1E8J5KJ: Error updating SMART data: Error sending ATA command CHECK POWER MODE: Unexpected sense data returned:#0120000: 00 00 00 00 00 00 00 00 00 00 00 00 00 00 00 00 ................#0120010: 00 00 00 00 00 00 00 00 00 00 00 00 00 00 00 00 ................#012 (g-io-error-quark, 0) [x6]
Aug 2 01:34:42 strawberry smartd[5314]: Device: /dev/sda [SAT], failed to read SMART Attribute Data [x2]
== submit26-b9-2 (10 distinct, 13 total) ==
Aug 2 01:12:51 submit26-b9-2 setroubleshoot[849556]: SELinux is preventing /usr/bin/python3.9 from create access on the directory /(null). For complete SELinux messages run: sealert -l d506243c-d61e-48f3-b42a-4592c913deb0 [x2]
Aug 2 01:12:51 submit26-b9-2 setroubleshoot[849556]: SELinux is preventing /usr/bin/python3.9 from add_name access on the directory /(null). For complete SELinux messages run: sealert -l 3b4752ac-1b9a-4af9-a05b-32e4c2eb13ab [x2]
Aug 2 01:12:51 submit26-b9-2 setroubleshoot[849556]: SELinux is preventing /usr/bin/python3.9 from create access on the file /(null). For complete SELinux messages run: sealert -l 29e5adbd-4381-4467-b40d-a2219101e096
Aug 2 01:12:51 submit26-b9-2 setroubleshoot[849556]: SELinux is preventing /usr/bin/python3.9 from open access on the file /tmp/libdnf.7u0BuT/repodata/repomd.xml. For complete SELinux messages run: sealert -l 1b38f2ec-01ce-4343-8059-ba7494ecc5c4
Aug 2 01:12:51 submit26-b9-2 setroubleshoot[849556]: SELinux is preventing /usr/bin/python3.9 from setattr access on the file repomd.xml. For complete SELinux messages run: sealert -l e5f9af40-1f63-4924-b012-27ab2a7b2266
Aug 2 01:12:51 submit26-b9-2 setroubleshoot[849556]: SELinux is preventing /usr/bin/python3.9 from read access on the directory libdnf.7u0BuT. For complete SELinux messages run: sealert -l 5c54db87-54a3-4a7c-97b4-b5c48d6c3543
Aug 2 01:12:51 submit26-b9-2 setroubleshoot[849556]: SELinux is preventing /usr/bin/python3.9 from remove_name access on the directory repomd.xml. For complete SELinux messages run: sealert -l 63cd60e1-1e61-4276-afea-dd8526ffe8b2
Aug 2 01:12:51 submit26-b9-2 setroubleshoot[849556]: SELinux is preventing /usr/bin/python3.9 from unlink access on the file repomd.xml. For complete SELinux messages run: sealert -l 81c7e9ec-e023-4c6d-b1ad-c02a242e655e
Aug 2 01:12:51 submit26-b9-2 setroubleshoot[849556]: SELinux is preventing /usr/bin/python3.9 from rmdir access on the directory repodata. For complete SELinux messages run: sealert -l 6ae9a597-e123-4d74-8eec-a8ebe0f5e4d0
Aug 2 01:18:06 submit26-b9-2 systemd[1]: user(a)1001.service: Main process exited, code=killed, status=9/KILL [x2]
== submit26-b9-3 (9 distinct, 9 total) ==
Aug 2 01:20:37 submit26-b9-3 setroubleshoot[769115]: SELinux is preventing /usr/bin/python3.9 from create access on the directory /(null). For complete SELinux messages run: sealert -l 5b912a44-22fd-4560-b201-2a4e289b73f5
Aug 2 01:20:37 submit26-b9-3 setroubleshoot[769115]: SELinux is preventing /usr/bin/python3.9 from add_name access on the directory /(null). For complete SELinux messages run: sealert -l 7f1df1e4-725e-4953-98eb-1079f908f543
Aug 2 01:20:37 submit26-b9-3 setroubleshoot[769115]: SELinux is preventing /usr/bin/python3.9 from create access on the file /(null). For complete SELinux messages run: sealert -l 40b8852a-f77b-44b4-affe-5f11fa33de43
Aug 2 01:20:37 submit26-b9-3 setroubleshoot[769115]: SELinux is preventing /usr/bin/python3.9 from open access on the file /tmp/libdnf.bCginX/repodata/repomd.xml. For complete SELinux messages run: sealert -l 45a8019e-f6b5-4baa-92c1-862594b40d46
Aug 2 01:20:37 submit26-b9-3 setroubleshoot[769115]: SELinux is preventing /usr/bin/python3.9 from setattr access on the file repomd.xml. For complete SELinux messages run: sealert -l e9f0bfff-7784-4126-baa4-2bb06da56591
Aug 2 01:20:37 submit26-b9-3 setroubleshoot[769115]: SELinux is preventing /usr/bin/python3.9 from read access on the directory libdnf.bCginX. For complete SELinux messages run: sealert -l 0b17cc3d-cdc6-4fe2-a11f-3892e7c41dc7
Aug 2 01:20:37 submit26-b9-3 setroubleshoot[769115]: SELinux is preventing /usr/bin/python3.9 from remove_name access on the directory repomd.xml. For complete SELinux messages run: sealert -l 10e38c64-b65f-4cdd-901e-4375652d9a42
Aug 2 01:20:38 submit26-b9-3 setroubleshoot[769115]: SELinux is preventing /usr/bin/python3.9 from unlink access on the file repomd.xml. For complete SELinux messages run: sealert -l 7fd9cf72-ef38-48e1-b6aa-b571b26a7b22
Aug 2 01:20:38 submit26-b9-3 setroubleshoot[769115]: SELinux is preventing /usr/bin/python3.9 from rmdir access on the directory repodata. For complete SELinux messages run: sealert -l b9b11116-89bd-4a3c-980c-1d422c5dcee4
== submit26-clnb9 (9 distinct, 9 total) ==
Aug 2 01:31:56 submit26-clnb9 setroubleshoot[1663424]: SELinux is preventing /usr/bin/python3.9 from create access on the directory /(null). For complete SELinux messages run: sealert -l 6783ed2b-5ae4-42b5-975a-4bf50eec4658
Aug 2 01:31:56 submit26-clnb9 setroubleshoot[1663424]: SELinux is preventing /usr/bin/python3.9 from add_name access on the directory /(null). For complete SELinux messages run: sealert -l 9e7fa955-cc30-4804-ac8c-e1779e85946c
Aug 2 01:31:56 submit26-clnb9 setroubleshoot[1663424]: SELinux is preventing /usr/bin/python3.9 from create access on the file /(null). For complete SELinux messages run: sealert -l 69bfa6e3-089c-40ff-9563-fd30787d0774
Aug 2 01:31:56 submit26-clnb9 setroubleshoot[1663424]: SELinux is preventing /usr/bin/python3.9 from open access on the file /tmp/libdnf.iUe7gw/repodata/repomd.xml. For complete SELinux messages run: sealert -l 001acdb5-31ef-4e52-b10b-90f467a89ddc
Aug 2 01:31:56 submit26-clnb9 setroubleshoot[1663424]: SELinux is preventing /usr/bin/python3.9 from setattr access on the file repomd.xml. For complete SELinux messages run: sealert -l edacddcf-16ed-4dc3-8d82-7c597d5dee23
Aug 2 01:31:56 submit26-clnb9 setroubleshoot[1663424]: SELinux is preventing /usr/bin/python3.9 from read access on the directory libdnf.iUe7gw. For complete SELinux messages run: sealert -l 62b3782e-4730-4488-8178-94dafe9b552c
Aug 2 01:31:56 submit26-clnb9 setroubleshoot[1663424]: SELinux is preventing /usr/bin/python3.9 from remove_name access on the directory repomd.xml. For complete SELinux messages run: sealert -l 81cb3698-78f8-440a-8e3c-e5d1041e6b78
Aug 2 01:31:56 submit26-clnb9 setroubleshoot[1663424]: SELinux is preventing /usr/bin/python3.9 from unlink access on the file repomd.xml. For complete SELinux messages run: sealert -l 792b472a-115c-4799-9805-fc7436f916b9
Aug 2 01:31:56 submit26-clnb9 setroubleshoot[1663424]: SELinux is preventing /usr/bin/python3.9 from rmdir access on the directory repodata. For complete SELinux messages run: sealert -l 15c83a86-837b-41e2-b662-b39cd4e361cb
1
0
Command: /usr/local/sbin/syslog-digest.py
Time : 0.4975s
Status : exited 0
Output :
Syslog digest — 2026-08-02 01:05 EDT
Processed 3,994 lines, filtered 3,198 (80%). 796 unknown (118 distinct) from 33 host(s).
== abuse (1 distinct, 348 total) ==
Aug 2 00:05:06 abuse rsyslogd[21745]: imjournal: open() failed for path: '/var/lib/rsyslog/imjournal.state.tmp': Input/output error [v8.2404.0 try https://www.rsyslog.com/e/2433 ] [x348]
== b0b02.cs.umd.edu (1 distinct, 1 total) ==
Aug 2 00:41:21 b0b02.cs.umd.edu rustdesk[1942406]: cannot open display:
== contest (1 distinct, 34 total) ==
Aug 2 00:05:42 contest goferd[1007]: [ERROR][worker-0] gofer.messaging.adapter.connect:33 - connect: proton+amqps://satellite8.cs.umd.edu:5647, failed: Connection amqps://satellite8.cs.umd.edu:5647 disconnected: Condition('proton.pythonio', 'Connection refused to all addresses') [x34]
== csfw00a (1 distinct, 214 total) ==
Aug 2 00:04:32 csfw00a kernel: bnxt_en 0000:09:00.0 eth3: NIC Link is Down [x214]
== cskayako (4 distinct, 6 total) ==
Aug 2 00:06:39 cskayako setroubleshoot[1694289]: SELinux is preventing /usr/bin/php from add_name access on the directory /var/www/html/(null). For complete SELinux messages run: sealert -l 5239c113-abc1-4953-a9c0-21d695a0d1bb [x2]
Aug 2 00:06:39 cskayako setroubleshoot[1694289]: SELinux is preventing /usr/bin/php from create access on the file /var/www/html/(null). For complete SELinux messages run: sealert -l cacf8f36-45b0-4374-9a33-d15de767aae7 [x2]
Aug 2 00:30:31 cskayako setroubleshoot[1696779]: failed to retrieve rpm info for path '/var/www/html/__swift/logs/log.cache_02_Aug_2026_eb2657f2e6.txt':
Aug 2 00:30:31 cskayako setroubleshoot[1696779]: SELinux is preventing /usr/sbin/sendmail.postfix from append access on the file /var/www/html/__swift/logs/log.cache_02_Aug_2026_eb2657f2e6.txt. For complete SELinux messages run: sealert -l c566b62c-2773-4bf0-808b-10f832f1eafb
== forge00 (1 distinct, 1 total) ==
Aug 2 00:35:52 forge00 (httpd)[1457003]: httpd.service: Referenced but unset environment variable evaluates to an empty string: OPTIONS
== grades01.cs.umd.edu (3 distinct, 4 total) ==
Aug 2 00:10:13 grades01.cs.umd.edu systemd[1]: New main PID 30552 does not belong to service, and PID file is not owned by root. Refusing. [x2]
Aug 2 00:10:37 grades01.cs.umd.edu systemd[1]: Daemon never wrote its PID file. Failing.
Aug 2 00:10:52 grades01.cs.umd.edu systemd[1]: pmlogger.service: Supervising process 5979 which is not our child. We'll most likely not notice when it exits.
== idm00 (1 distinct, 1 total) ==
Aug 2 00:51:13 idm00 named[1455]: client @0x7f33041b1a78 10.73.240.42#52182: update '73.10.in-addr.arpa/IN' denied
== idmp0 (1 distinct, 1 total) ==
Aug 2 00:36:02 idmp0 named[5198]: client @0x7f98f4021ea8 10.73.240.43#55593: update '73.10.in-addr.arpa/IN' denied
== inbound00.cs.umd.edu (1 distinct, 1 total) ==
Aug 2 00:39:56 inbound00.cs.umd.edu krb5_child[2014791]: Preauthentication failed
== itmon02 (1 distinct, 32 total) ==
Aug 2 00:08:15 itmon02 sshd[1750555]: error: beginning MaxStartups throttling [x32]
== jubjub.cs.umd.edu (3 distinct, 4 total) ==
Aug 2 00:10:13 jubjub.cs.umd.edu systemd[1]: New main PID 1072720 does not belong to service, and PID file is not owned by root. Refusing. [x2]
Aug 2 00:10:32 jubjub.cs.umd.edu systemd[1]: Daemon never wrote its PID file. Failing.
Aug 2 00:10:40 jubjub.cs.umd.edu systemd[1]: pmlogger.service: Supervising process 1079996 which is not our child. We'll most likely not notice when it exits.
== mirrors.cs.umd.edu (3 distinct, 4 total) ==
Aug 2 00:10:12 mirrors.cs.umd.edu systemd[1]: New main PID 19329 does not belong to service, and PID file is not owned by root. Refusing. [x2]
Aug 2 00:10:30 mirrors.cs.umd.edu systemd[1]: Daemon never wrote its PID file. Failing.
Aug 2 00:10:44 mirrors.cs.umd.edu systemd[1]: pmlogger.service: Supervising process 26374 which is not our child. We'll most likely not notice when it exits.
== misty.cs.umd.edu (3 distinct, 4 total) ==
Aug 2 00:10:14 misty.cs.umd.edu systemd[1]: New main PID 34264 does not belong to service, and PID file is not owned by root. Refusing. [x2]
Aug 2 00:10:35 misty.cs.umd.edu systemd[1]: Daemon never wrote its PID file. Failing.
Aug 2 00:10:50 misty.cs.umd.edu systemd[1]: pmlogger.service: Supervising process 1516 which is not our child. We'll most likely not notice when it exits.
== munin (1 distinct, 1 total) ==
Aug 2 00:58:21 munin (httpd)[374748]: httpd.service: Referenced but unset environment variable evaluates to an empty string: OPTIONS
== netbox (1 distinct, 1 total) ==
Aug 2 00:32:21 netbox (httpd)[1314800]: httpd.service: Referenced but unset environment variable evaluates to an empty string: OPTIONS
== netman.cs.umd.edu (3 distinct, 3 total) ==
Aug 2 00:30:00 netman.cs.umd.edu setroubleshoot[3901353]: SELinux is preventing /usr/bin/gpg from read access on the file gpg.conf. For complete SELinux messages run: sealert -l 019ad1da-a874-4814-8037-3b3e5f413ad2
Aug 2 00:30:01 netman.cs.umd.edu setroubleshoot[3901353]: SELinux is preventing /usr/bin/gpg from open access on the file /root/.gnupg/gpg.conf. For complete SELinux messages run: sealert -l cb54177e-d44c-46a1-b246-5c0bbb8343be
Aug 2 00:30:09 netman.cs.umd.edu setroubleshoot[3901353]: SELinux is preventing /usr/bin/gpg from getattr access on the file /root/.gnupg/gpg.conf. For complete SELinux messages run: sealert -l fbba2e30-b7ab-491c-9ec6-f553e9ef72af
== networkvm01.cs.umd.edu (9 distinct, 9 total) ==
Aug 2 00:35:55 networkvm01.cs.umd.edu setroubleshoot[3128092]: SELinux is preventing /usr/bin/gpg from write access on the directory /(null). For complete SELinux messages run: sealert -l 8ead1354-ae8a-4a17-bb3f-146ebf6c892c
Aug 2 00:35:55 networkvm01.cs.umd.edu setroubleshoot[3128092]: SELinux is preventing /usr/bin/gpg from add_name access on the directory /(null). For complete SELinux messages run: sealert -l f9b51e91-5dbc-455f-88c2-f0746a2f0f4c
Aug 2 00:35:55 networkvm01.cs.umd.edu setroubleshoot[3128092]: SELinux is preventing /usr/bin/gpg from create access on the file /(null). For complete SELinux messages run: sealert -l af0a60e6-c449-4bdd-bfb8-c69b58472884
Aug 2 00:35:55 networkvm01.cs.umd.edu setroubleshoot[3128092]: SELinux is preventing /usr/bin/gpg from link access on the file /(null). For complete SELinux messages run: sealert -l 3df452f6-4d9e-4e38-946b-ea8e1edd356c
Aug 2 00:35:55 networkvm01.cs.umd.edu setroubleshoot[3128092]: SELinux is preventing /usr/bin/gpg from remove_name access on the directory .#lk0x00005589ef81ded0.networkvm01.cs.umd.edu.3128091x. For complete SELinux messages run: sealert -l fcac71c9-c7c0-45a9-9dc2-a8dcbeccfc75
Aug 2 00:35:55 networkvm01.cs.umd.edu setroubleshoot[3128092]: SELinux is preventing /usr/bin/gpg from unlink access on the file .#lk0x00005589ef81ded0.networkvm01.cs.umd.edu.3128091x. For complete SELinux messages run: sealert -l a672ebb7-fa69-419c-b1f0-fb386b8b48a6
Aug 2 00:35:55 networkvm01.cs.umd.edu setroubleshoot[3128092]: SELinux is preventing /usr/bin/gpg from write access on the directory /(null). For complete SELinux messages run: sealert -l fec9104e-d27a-4fd4-9872-6b17088c2951
Aug 2 00:35:55 networkvm01.cs.umd.edu setroubleshoot[3128092]: SELinux is preventing /usr/bin/gpg from add_name access on the directory /(null). For complete SELinux messages run: sealert -l 26718b2a-493d-457d-818c-244bd8d4ec9d
Aug 2 00:35:55 networkvm01.cs.umd.edu setroubleshoot[3128092]: SELinux is preventing /usr/bin/gpg from remove_name access on the directory .#lk0x000055fa5ea38ee0.networkvm01.cs.umd.edu.3128109x. For complete SELinux messages run: sealert -l 80e6efe4-93f3-4219-8132-b2b52db1f517
== newhonors2 (1 distinct, 24 total) ==
Aug 2 00:13:02 newhonors2 dhcpcd[610726]: dhcpcd is not running [x24]
== openrepo (1 distinct, 1 total) ==
Aug 2 00:23:26 openrepo (nin-node)[881266]: munin-node.service: Referenced but unset environment variable evaluates to an empty string: DAEMON_ARGS
== outbound00.cs.umd.edu (1 distinct, 6 total) ==
Aug 2 00:09:09 outbound00.cs.umd.edu python3[1973297]: ldapdb [x6]
== outbound01.cs.umd.edu (1 distinct, 6 total) ==
Aug 2 00:13:06 outbound01.cs.umd.edu python3[6477]: ldapdb [x6]
== sentry-docker00.cs.umd.edu (40 distinct, 40 total) ==
Aug 2 00:05:43 sentry-docker00.cs.umd.edu systemd-udevd[29196]: link_config: could not get ethtool features for veth837fcbd
Aug 2 00:05:43 sentry-docker00.cs.umd.edu systemd-udevd[29196]: Could not set offload features of veth837fcbd: No such device
Aug 2 00:05:44 sentry-docker00.cs.umd.edu systemd-udevd[29230]: Could not generate persistent MAC address for veth981406c: No such file or directory
Aug 2 00:05:44 sentry-docker00.cs.umd.edu systemd-udevd[29231]: Could not generate persistent MAC address for veth568f0c2: No such file or directory
Aug 2 00:05:44 sentry-docker00.cs.umd.edu systemd-udevd[29234]: Could not generate persistent MAC address for veth5fe84cf: No such file or directory
Aug 2 00:05:44 sentry-docker00.cs.umd.edu systemd-udevd[29235]: Could not generate persistent MAC address for vethe261b97: No such file or directory
Aug 2 00:05:44 sentry-docker00.cs.umd.edu systemd-udevd[29258]: Could not generate persistent MAC address for vethf5628be: No such file or directory
Aug 2 00:05:44 sentry-docker00.cs.umd.edu systemd-udevd[29259]: Could not generate persistent MAC address for vethc9b4523: No such file or directory
Aug 2 00:05:44 sentry-docker00.cs.umd.edu systemd-udevd[29262]: Could not generate persistent MAC address for veth8e62fda: No such file or directory
Aug 2 00:05:44 sentry-docker00.cs.umd.edu systemd-udevd[29271]: Could not generate persistent MAC address for veth51ce3ef: No such file or directory
Aug 2 00:08:31 sentry-docker00.cs.umd.edu systemd-udevd[31430]: Could not generate persistent MAC address for veth4ee29f3: No such file or directory
Aug 2 00:08:31 sentry-docker00.cs.umd.edu systemd-udevd[31431]: Could not generate persistent MAC address for veth39666b4: No such file or directory
Aug 2 00:25:52 sentry-docker00.cs.umd.edu systemd-udevd[38593]: link_config: could not get ethtool features for veth8e62fda
Aug 2 00:25:52 sentry-docker00.cs.umd.edu systemd-udevd[38593]: Could not set offload features of veth8e62fda: No such device
Aug 2 00:25:52 sentry-docker00.cs.umd.edu systemd-udevd[38669]: link_config: could not get ethtool features for veth981406c
Aug 2 00:25:52 sentry-docker00.cs.umd.edu systemd-udevd[38669]: Could not set offload features of veth981406c: No such device
Aug 2 00:25:52 sentry-docker00.cs.umd.edu systemd-udevd[38694]: Could not generate persistent MAC address for veth5667503: No such file or directory
Aug 2 00:25:52 sentry-docker00.cs.umd.edu systemd-udevd[38695]: Could not generate persistent MAC address for veth4b10fa9: No such file or directory
Aug 2 00:25:52 sentry-docker00.cs.umd.edu systemd-udevd[38724]: Could not generate persistent MAC address for veth6a2ad35: No such file or directory
Aug 2 00:25:52 sentry-docker00.cs.umd.edu systemd-udevd[38725]: Could not generate persistent MAC address for veth0be797f: No such file or directory
Aug 2 00:25:52 sentry-docker00.cs.umd.edu systemd-udevd[38761]: Could not generate persistent MAC address for veth3efd8c5: No such file or directory
Aug 2 00:25:52 sentry-docker00.cs.umd.edu systemd-udevd[38756]: Could not generate persistent MAC address for vethb604904: No such file or directory
Aug 2 00:25:52 sentry-docker00.cs.umd.edu systemd-udevd[38757]: Could not generate persistent MAC address for vetha790e52: No such file or directory
Aug 2 00:25:52 sentry-docker00.cs.umd.edu systemd-udevd[38725]: Could not generate persistent MAC address for veth2ed2509: No such file or directory
Aug 2 00:28:40 sentry-docker00.cs.umd.edu systemd-udevd[40852]: Could not generate persistent MAC address for veth22f731f: No such file or directory
Aug 2 00:28:40 sentry-docker00.cs.umd.edu systemd-udevd[40853]: Could not generate persistent MAC address for vethee80de5: No such file or directory
Aug 2 00:46:00 sentry-docker00.cs.umd.edu systemd-udevd[47993]: link_config: could not get ethtool features for vetha790e52
Aug 2 00:46:00 sentry-docker00.cs.umd.edu systemd-udevd[47993]: Could not set offload features of vetha790e52: No such device
Aug 2 00:46:00 sentry-docker00.cs.umd.edu systemd-udevd[48085]: Could not generate persistent MAC address for veth6638325: No such file or directory
Aug 2 00:46:00 sentry-docker00.cs.umd.edu systemd-udevd[48084]: Could not generate persistent MAC address for vethf80562f: No such file or directory
... 10 more distinct messages not shown
== strawberry (3 distinct, 9 total) ==
Aug 2 00:09:44 strawberry udisksd[1067]: Error performing housekeeping for drive /org/freedesktop/UDisks2/drives/ST2000DM001_1CH164_W1E8J5KJ: Error updating SMART data: Error sending ATA command CHECK POWER MODE: Unexpected sense data returned:#0120000: 00 00 00 00 00 00 00 00 00 00 00 00 00 00 00 00 ................#0120010: 00 00 00 00 00 00 00 00 00 00 00 00 00 00 00 00 ................#012 (g-io-error-quark, 0) [x6]
Aug 2 00:34:42 strawberry smartd[5314]: Device: /dev/sda [SAT], failed to read SMART Attribute Data [x2]
Aug 2 01:04:42 strawberry smartd[5314]: Device: /dev/sda [SAT], not capable of Offline or Self-Testing.
== submit10-cln25 (3 distinct, 4 total) ==
Aug 2 00:10:12 submit10-cln25 systemd: New main PID 6970 does not belong to service, and PID file is not owned by root. Refusing. [x2]
Aug 2 00:10:31 submit10-cln25 systemd: Daemon never wrote its PID file. Failing.
Aug 2 00:10:37 submit10-cln25 systemd: pmlogger.service: Supervising process 13895 which is not our child. We'll most likely not notice when it exits.
== submit26-b9-4 (11 distinct, 14 total) ==
Aug 2 00:15:28 submit26-b9-4 setroubleshoot[844504]: SELinux is preventing /usr/bin/python3.9 from create access on the directory /(null). For complete SELinux messages run: sealert -l a4e66030-8621-4da9-bd27-5988bb1bf8ad
Aug 2 00:15:28 submit26-b9-4 setroubleshoot[844504]: SELinux is preventing /usr/bin/python3.9 from add_name access on the directory /(null). For complete SELinux messages run: sealert -l c055e37d-bbf5-4800-9083-d606f792c8c1
Aug 2 00:15:28 submit26-b9-4 setroubleshoot[844504]: SELinux is preventing /usr/bin/python3.9 from create access on the file /(null). For complete SELinux messages run: sealert -l e5bc3a56-6d6f-4776-954f-ddde1579648f [x2]
Aug 2 00:15:28 submit26-b9-4 setroubleshoot[844504]: SELinux is preventing /usr/bin/python3.9 from open access on the file /tmp/libdnf.sZFxHD/repodata/repomd.xml. For complete SELinux messages run: sealert -l a8ec5e1b-49f9-4fbc-a8ae-22e800f7abf2
Aug 2 00:15:28 submit26-b9-4 setroubleshoot[844504]: SELinux is preventing /usr/bin/python3.9 from setattr access on the file repomd.xml. For complete SELinux messages run: sealert -l 945db714-d0c0-4402-911e-932978b8b036 [x2]
Aug 2 00:15:28 submit26-b9-4 setroubleshoot[844504]: SELinux is preventing /usr/bin/python3.9 from read access on the directory libdnf.sZFxHD. For complete SELinux messages run: sealert -l 463998a0-fb0d-463c-82b1-471135710a14
Aug 2 00:15:28 submit26-b9-4 setroubleshoot[844504]: SELinux is preventing /usr/bin/python3.9 from remove_name access on the directory repomd.xml. For complete SELinux messages run: sealert -l 473d2e21-15d8-407a-a9ee-2b842607fa00
Aug 2 00:15:28 submit26-b9-4 setroubleshoot[844504]: SELinux is preventing /usr/bin/python3.9 from unlink access on the file repomd.xml. For complete SELinux messages run: sealert -l 80c54d4f-bf4b-4501-addb-1627383587d0 [x2]
Aug 2 00:15:28 submit26-b9-4 setroubleshoot[844504]: SELinux is preventing /usr/bin/python3.9 from rmdir access on the directory repodata. For complete SELinux messages run: sealert -l c63d3890-151e-49a0-83f0-3dfb69d051e5
Aug 2 00:15:28 submit26-b9-4 setroubleshoot[844504]: SELinux is preventing /usr/bin/python3.9 from open access on the file /tmp/libdnf.oMzqSl/repodata/repomd.xml. For complete SELinux messages run: sealert -l a8ec5e1b-49f9-4fbc-a8ae-22e800f7abf2
Aug 2 00:57:10 submit26-b9-4 systemd[1]: user(a)1001.service: Main process exited, code=killed, status=9/KILL
== teaching-awards (2 distinct, 2 total) ==
Aug 2 00:52:27 teaching-awards krb5_child[1735631]: Client 'admin(a)UMD.EDU' not found in Kerberos database
Aug 2 00:52:50 teaching-awards sshd-session[1735645]: error: Protocol major versions differ: 2 vs. 1
== tlsrpt (1 distinct, 1 total) ==
Aug 2 00:18:25 tlsrpt (httpd)[547426]: httpd.service: Referenced but unset environment variable evaluates to an empty string: OPTIONS
== tma-0 (3 distinct, 4 total) ==
Aug 2 00:10:13 tma-0 systemd[1]: New main PID 24858 does not belong to service, and PID file is not owned by root. Refusing. [x2]
Aug 2 00:10:30 tma-0 systemd[1]: Daemon never wrote its PID file. Failing.
Aug 2 00:10:38 tma-0 systemd[1]: pmlogger.service: Supervising process 32492 which is not our child. We'll most likely not notice when it exits.
== uffish.cs.umd.edu (3 distinct, 4 total) ==
Aug 2 00:10:13 uffish.cs.umd.edu systemd[1]: New main PID 445897 does not belong to service, and PID file is not owned by root. Refusing. [x2]
Aug 2 00:10:35 uffish.cs.umd.edu systemd[1]: Daemon never wrote its PID file. Failing.
Aug 2 00:10:51 uffish.cs.umd.edu systemd[1]: pmlogger.service: Supervising process 453480 which is not our child. We'll most likely not notice when it exits.
== updates00.cs.umd.edu (3 distinct, 4 total) ==
Aug 2 00:10:12 updates00.cs.umd.edu systemd[1]: New main PID 20778 does not belong to service, and PID file is not owned by root. Refusing. [x2]
Aug 2 00:10:30 updates00.cs.umd.edu systemd[1]: Daemon never wrote its PID file. Failing.
Aug 2 00:10:37 updates00.cs.umd.edu systemd[1]: pmlogger.service: Supervising process 27746 which is not our child. We'll most likely not notice when it exits.
== vacuum.cs.umd.edu (3 distinct, 4 total) ==
Aug 2 00:10:14 vacuum.cs.umd.edu systemd[1]: New main PID 32714 does not belong to service, and PID file is not owned by root. Refusing. [x2]
Aug 2 00:10:33 vacuum.cs.umd.edu systemd[1]: Daemon never wrote its PID file. Failing.
Aug 2 00:10:44 vacuum.cs.umd.edu systemd[1]: pmlogger.service: Supervising process 8155 which is not our child. We'll most likely not notice when it exits.
== whiffle.cs.umd.edu (3 distinct, 4 total) ==
Aug 2 00:10:13 whiffle.cs.umd.edu systemd[1]: New main PID 256995 does not belong to service, and PID file is not owned by root. Refusing. [x2]
Aug 2 00:10:39 whiffle.cs.umd.edu systemd[1]: Daemon never wrote its PID file. Failing.
Aug 2 00:10:52 whiffle.cs.umd.edu systemd[1]: pmlogger.service: Supervising process 264669 which is not our child. We'll most likely not notice when it exits.
1
0
Command: /usr/local/sbin/syslog-digest.py
Time : 0.5091s
Status : exited 0
Output :
Syslog digest — 2026-08-02 00:05 EDT
Processed 4,124 lines, filtered 3,304 (80%). 820 unknown (97 distinct) from 29 host(s).
== abuse (1 distinct, 347 total) ==
Aug 1 23:05:06 abuse rsyslogd[21745]: imjournal: open() failed for path: '/var/lib/rsyslog/imjournal.state.tmp': Input/output error [v8.2404.0 try https://www.rsyslog.com/e/2433 ] [x347]
== b0b02.cs.umd.edu (1 distinct, 1 total) ==
Aug 1 23:41:17 b0b02.cs.umd.edu rustdesk[1926410]: cannot open display:
== biggulp.cs.umd.edu (3 distinct, 3 total) ==
Aug 1 23:53:03 biggulp.cs.umd.edu sshd-session[2204371]: pam_access(sshd:auth): access denied for user `admin' from `34.156.12.51'
Aug 1 23:53:04 biggulp.cs.umd.edu krb5_child[2204373]: Client 'admin(a)UMD.EDU' not found in Kerberos database
Aug 1 23:53:04 biggulp.cs.umd.edu sshd-session[2204369]: error: PAM: System error for admin from 34.156.12.51
== contest (1 distinct, 33 total) ==
Aug 1 23:06:47 contest goferd[1007]: [ERROR][worker-0] gofer.messaging.adapter.connect:33 - connect: proton+amqps://satellite8.cs.umd.edu:5647, failed: Connection amqps://satellite8.cs.umd.edu:5647 disconnected: Condition('proton.pythonio', 'Connection refused to all addresses') [x33]
== csfw00a (2 distinct, 260 total) ==
Aug 1 23:04:36 csfw00a kernel: bnxt_en 0000:09:00.0 eth3: NIC Link is Down [x244]
Aug 1 23:24:33 csfw00a ospf6d[1477]: [EC 100663307] Could not send entire message [x16]
== hackerman (7 distinct, 12 total) ==
Aug 1 23:19:01 hackerman gnome-software[2060381]: failed to commit changes to dconf: GDBus.Error:org.gtk.GDBus.UnmappedGError.Quark._g_2dfile_2derror_2dquark.Code2: Failed to create file “/adminhomes/sajith/.config/dconf/user.H0KZS3”: Permission denied
Aug 1 23:20:04 hackerman gnome-software[2060381]: can't reliably fixup error code 4 in domain g-io-error-quark: Not a directory [x4]
Aug 1 23:20:12 hackerman gnome-software[2060381]: Only 0 apps for recent list, hiding
Aug 1 23:20:29 hackerman gnome-software[2060381]: failed to commit changes to dconf: GDBus.Error:org.gtk.GDBus.UnmappedGError.Quark._g_2dfile_2derror_2dquark.Code2: Failed to create file “/adminhomes/sajith/.config/dconf/user.MGZ0S3”: Permission denied
Aug 1 23:20:30 hackerman packagekitd[2959835]: Failed to get cache filename for libreoffice [x2]
Aug 1 23:20:30 hackerman packagekitd[2959835]: Failed to get cache filename for kernel [x2]
Aug 1 23:20:40 hackerman packagekitd[2959835]: failed to parse public key for /etc/pki/rpm-gpg/RPM-GPG-KEY-PQC-redhat-release
== hspc (1 distinct, 1 total) ==
Aug 2 00:00:01 hspc kernel: kauditd_printk_skb: 4 callbacks suppressed
== idm00 (2 distinct, 4 total) ==
Aug 1 23:51:13 idm00 named[1455]: client @0x7f330cb79628 10.73.240.42#54400: update '73.10.in-addr.arpa/IN' denied
Aug 2 00:00:01 idm00 named[1455]: checkhints: unable to get root NS rrset from cache: not found [x3]
== idmh1 (1 distinct, 2 total) ==
Aug 2 00:00:00 idmh1 named[73276]: checkhints: unable to get root NS rrset from cache: not found [x2]
== idmp0 (2 distinct, 3 total) ==
Aug 1 23:36:02 idmp0 named[5198]: client @0x7f9904008048 10.73.240.43#55780: update '73.10.in-addr.arpa/IN' denied
Aug 2 00:00:01 idmp0 named[5198]: checkhints: unable to get root NS rrset from cache: not found [x2]
== idmv0 (1 distinct, 2 total) ==
Aug 2 00:00:01 idmv0 named[1889]: checkhints: unable to get root NS rrset from cache: not found [x2]
== inbound00.cs.umd.edu (1 distinct, 1 total) ==
Aug 1 23:49:51 inbound00.cs.umd.edu krb5_child[2001872]: Client 'gitlab(a)UMD.EDU' not found in Kerberos database
== inbound01.cs.umd.edu (2 distinct, 2 total) ==
Aug 1 23:45:28 inbound01.cs.umd.edu krb5_child[18514]: Client 'admin(a)UMD.EDU' not found in Kerberos database
Aug 1 23:46:00 inbound01.cs.umd.edu sshd-session[18884]: error: Protocol major versions differ: 2 vs. 1
== itmon02 (2 distinct, 38 total) ==
Aug 1 23:08:07 itmon02 sshd[1750555]: error: beginning MaxStartups throttling [x37]
Aug 2 00:00:58 itmon02 (httpd)[2929803]: httpd.service: Referenced but unset environment variable evaluates to an empty string: OPTIONS
== jaws.cs.umd.edu (2 distinct, 2 total) ==
Aug 2 00:00:04 jaws.cs.umd.edu setroubleshoot[4035047]: failed to retrieve rpm info for path '/var/log/php84-fpm_error.log':
Aug 2 00:00:06 jaws.cs.umd.edu setroubleshoot[4035047]: SELinux is preventing /opt/remi/php82/root/usr/sbin/php-fpm from open access on the file /var/log/php84-fpm_error.log. For complete SELinux messages run: sealert -l 437208fc-38c0-4c0e-84e9-08e0f801111e
== matrix (4 distinct, 5 total) ==
Aug 1 23:57:42 matrix krb5_child[3980390]: Client 'admin(a)UMD.EDU' not found in Kerberos database [x2]
Aug 1 23:57:45 matrix sshd[3980384]: error: PAM: Authentication failure for admin from 34.76.249.187
Aug 2 00:00:16 matrix (nin-node)[3982252]: munin-node.service: Referenced but unset environment variable evaluates to an empty string: DAEMON_ARGS
Aug 2 00:00:40 matrix sshd[3983076]: error: Protocol major versions differ: 2 vs. 1
== neo-gizmonic (1 distinct, 1 total) ==
Aug 2 00:00:24 neo-gizmonic (nin-node)[290187]: munin-node.service: Referenced but unset environment variable evaluates to an empty string: DAEMON_ARGS
== neoavion (1 distinct, 1 total) ==
Aug 2 00:00:28 neoavion (nin-node)[2965541]: munin-node.service: Referenced but unset environment variable evaluates to an empty string: DAEMON_ARGS
== newhonors.cs.umd.edu (4 distinct, 4 total) ==
Aug 1 23:22:53 newhonors.cs.umd.edu sshd[14741]: fatal: Unable to negotiate with 207.175.11.160 port 40970: no matching host key type found. Their offer: ssh-dss [preauth]
Aug 1 23:22:55 newhonors.cs.umd.edu sshd[14747]: fatal: Unable to negotiate with 207.175.11.160 port 40996: no matching host key type found. Their offer: ecdsa-sha2-nistp384 [preauth]
Aug 1 23:22:55 newhonors.cs.umd.edu sshd[14749]: fatal: Unable to negotiate with 207.175.11.160 port 41002: no matching host key type found. Their offer: ecdsa-sha2-nistp521 [preauth]
Aug 1 23:23:07 newhonors.cs.umd.edu sshd[14753]: fatal: Unable to negotiate with 207.175.11.160 port 10962: no matching key exchange method found. Their offer: diffie-hellman-group1-sha1 [preauth]
== newhonors2 (2 distinct, 25 total) ==
Aug 1 23:13:03 newhonors2 dhcpcd[608665]: dhcpcd is not running [x24]
Aug 2 00:00:39 newhonors2 (nin-node)[610182]: munin-node.service: Referenced but unset environment variable evaluates to an empty string: DAEMON_ARGS
== openvox08-board (1 distinct, 1 total) ==
Aug 2 00:00:51 openvox08-board (httpd)[1069764]: httpd.service: Referenced but unset environment variable evaluates to an empty string: OPTIONS
== outbound00.cs.umd.edu (1 distinct, 6 total) ==
Aug 1 23:09:09 outbound00.cs.umd.edu python3[1959148]: ldapdb [x6]
== outbound01.cs.umd.edu (1 distinct, 6 total) ==
Aug 1 23:13:07 outbound01.cs.umd.edu python3[4185644]: ldapdb [x6]
== sebatinsky.cs.umd.edu (1 distinct, 1 total) ==
Aug 1 23:09:50 sebatinsky.cs.umd.edu kernel: hpet1: lost 1 rtc interrupts
== sentry-docker00.cs.umd.edu (46 distinct, 46 total) ==
Aug 1 23:05:19 sentry-docker00.cs.umd.edu systemd-udevd[4193895]: link_config: could not get ethtool features for vetha5a0c8c
Aug 1 23:05:19 sentry-docker00.cs.umd.edu systemd-udevd[4193895]: Could not set offload features of vetha5a0c8c: No such device
Aug 1 23:05:19 sentry-docker00.cs.umd.edu systemd-udevd[4193929]: Could not generate persistent MAC address for veth2dc3817: No such file or directory
Aug 1 23:05:19 sentry-docker00.cs.umd.edu systemd-udevd[4193930]: Could not generate persistent MAC address for veth17a251b: No such file or directory
Aug 1 23:05:19 sentry-docker00.cs.umd.edu systemd-udevd[4193948]: Could not generate persistent MAC address for vethba00858: No such file or directory
Aug 1 23:05:19 sentry-docker00.cs.umd.edu systemd-udevd[4193934]: Could not generate persistent MAC address for veth1a7d0b8: No such file or directory
Aug 1 23:05:19 sentry-docker00.cs.umd.edu systemd-udevd[4193957]: Could not generate persistent MAC address for veth1285f77: No such file or directory
Aug 1 23:05:19 sentry-docker00.cs.umd.edu systemd-udevd[4193959]: Could not generate persistent MAC address for veth7d062ad: No such file or directory
Aug 1 23:05:19 sentry-docker00.cs.umd.edu systemd-udevd[4194012]: Could not generate persistent MAC address for vethff1cf70: No such file or directory
Aug 1 23:05:19 sentry-docker00.cs.umd.edu systemd-udevd[4194010]: Could not generate persistent MAC address for veth4e50800: No such file or directory
Aug 1 23:08:06 sentry-docker00.cs.umd.edu systemd-udevd[1374]: link_config: could not get ethtool features for veth8682ebb
Aug 1 23:08:06 sentry-docker00.cs.umd.edu systemd-udevd[1374]: Could not set offload features of veth8682ebb: No such device
Aug 1 23:08:07 sentry-docker00.cs.umd.edu systemd-udevd[1384]: Could not generate persistent MAC address for vethd2daf94: No such file or directory
Aug 1 23:08:07 sentry-docker00.cs.umd.edu systemd-udevd[1385]: Could not generate persistent MAC address for vethf9e5323: No such file or directory
Aug 1 23:25:27 sentry-docker00.cs.umd.edu systemd-udevd[10141]: link_config: could not get ethtool features for veth2dc3817
Aug 1 23:25:27 sentry-docker00.cs.umd.edu systemd-udevd[10141]: Could not set offload features of veth2dc3817: No such device
Aug 1 23:25:27 sentry-docker00.cs.umd.edu systemd-udevd[10211]: link_config: could not get ethtool features for veth4e50800
Aug 1 23:25:27 sentry-docker00.cs.umd.edu systemd-udevd[10211]: Could not set offload features of veth4e50800: No such device
Aug 1 23:25:27 sentry-docker00.cs.umd.edu systemd-udevd[10231]: Could not generate persistent MAC address for veth2e696b7: No such file or directory
Aug 1 23:25:27 sentry-docker00.cs.umd.edu systemd-udevd[10232]: Could not generate persistent MAC address for veth7cc7e49: No such file or directory
Aug 1 23:25:27 sentry-docker00.cs.umd.edu systemd-udevd[10257]: Could not generate persistent MAC address for vethdb086e9: No such file or directory
Aug 1 23:25:27 sentry-docker00.cs.umd.edu systemd-udevd[10258]: Could not generate persistent MAC address for veth5d54983: No such file or directory
Aug 1 23:25:27 sentry-docker00.cs.umd.edu systemd-udevd[10302]: Could not generate persistent MAC address for veth36a1a25: No such file or directory
Aug 1 23:25:27 sentry-docker00.cs.umd.edu systemd-udevd[10303]: Could not generate persistent MAC address for vetha9d82b5: No such file or directory
Aug 1 23:25:27 sentry-docker00.cs.umd.edu systemd-udevd[10332]: Could not generate persistent MAC address for vethde6a703: No such file or directory
Aug 1 23:25:27 sentry-docker00.cs.umd.edu systemd-udevd[10312]: Could not generate persistent MAC address for vethf9e79e9: No such file or directory
Aug 1 23:28:15 sentry-docker00.cs.umd.edu systemd-udevd[12407]: link_config: could not get ethtool features for vethd2daf94
Aug 1 23:28:15 sentry-docker00.cs.umd.edu systemd-udevd[12407]: Could not set offload features of vethd2daf94: No such device
Aug 1 23:28:15 sentry-docker00.cs.umd.edu systemd-udevd[12442]: Could not generate persistent MAC address for veth38ad905: No such file or directory
Aug 1 23:28:15 sentry-docker00.cs.umd.edu systemd-udevd[12443]: Could not generate persistent MAC address for vethb582a6f: No such file or directory
... 16 more distinct messages not shown
== strawberry (2 distinct, 8 total) ==
Aug 1 23:09:44 strawberry udisksd[1067]: Error performing housekeeping for drive /org/freedesktop/UDisks2/drives/ST2000DM001_1CH164_W1E8J5KJ: Error updating SMART data: Error sending ATA command CHECK POWER MODE: Unexpected sense data returned:#0120000: 00 00 00 00 00 00 00 00 00 00 00 00 00 00 00 00 ................#0120010: 00 00 00 00 00 00 00 00 00 00 00 00 00 00 00 00 ................#012 (g-io-error-quark, 0) [x6]
Aug 1 23:34:42 strawberry smartd[5314]: Device: /dev/sda [SAT], failed to read SMART Attribute Data [x2]
== talkhosts9 (1 distinct, 2 total) ==
Aug 1 23:06:06 talkhosts9 setroubleshoot[706560]: SELinux is preventing /usr/bin/lsof from getattr access on the unix_stream_socket unix_stream_socket. For complete SELinux messages run: sealert -l a6df89b3-c497-469c-8232-c4fde0508abf [x2]
== tulgey.cs.umd.edu (2 distinct, 2 total) ==
Aug 2 00:00:04 tulgey.cs.umd.edu setroubleshoot[2079614]: failed to retrieve rpm info for path '/var/log/php74-fpm_error.log':
Aug 2 00:00:04 tulgey.cs.umd.edu setroubleshoot[2079614]: SELinux is preventing /opt/remi/php74/root/usr/sbin/php-fpm from open access on the file /var/log/php74-fpm_error.log. For complete SELinux messages run: sealert -l 3912ba6e-61a1-44ae-b56d-ee09e1c984b8
== wraith (1 distinct, 1 total) ==
Aug 2 00:00:22 wraith (nin-node)[1011130]: munin-node.service: Referenced but unset environment variable evaluates to an empty string: DAEMON_ARGS
1
0
Command: /usr/local/sbin/syslog-digest.py
Time : 0.4951s
Status : exited 0
Output :
Syslog digest — 2026-08-01 23:05 EDT
Processed 4,304 lines, filtered 3,446 (80%). 858 unknown (110 distinct) from 21 host(s).
== abuse (1 distinct, 346 total) ==
Aug 1 22:05:06 abuse rsyslogd[21745]: imjournal: open() failed for path: '/var/lib/rsyslog/imjournal.state.tmp': Input/output error [v8.2404.0 try https://www.rsyslog.com/e/2433 ] [x346]
== atif01.cs.umd.edu (40 distinct, 78 total) ==
Aug 1 22:05:11 atif01.cs.umd.edu sshd[38819]: error: maximum authentication attempts exceeded for root from 122.155.168.16 port 63658 ssh2 [preauth]
Aug 1 22:05:11 atif01.cs.umd.edu sshd[38819]: PAM service(sshd) ignoring max retries; 6 > 3 [x39]
Aug 1 22:05:27 atif01.cs.umd.edu sshd[38829]: error: maximum authentication attempts exceeded for root from 122.155.168.16 port 65361 ssh2 [preauth]
Aug 1 22:05:42 atif01.cs.umd.edu sshd[38837]: error: maximum authentication attempts exceeded for root from 122.155.168.16 port 50555 ssh2 [preauth]
Aug 1 22:05:58 atif01.cs.umd.edu sshd[38856]: error: maximum authentication attempts exceeded for root from 122.155.168.16 port 52020 ssh2 [preauth]
Aug 1 22:06:14 atif01.cs.umd.edu sshd[38866]: error: maximum authentication attempts exceeded for root from 122.155.168.16 port 53586 ssh2 [preauth]
Aug 1 22:06:29 atif01.cs.umd.edu sshd[38874]: error: maximum authentication attempts exceeded for root from 122.155.168.16 port 55205 ssh2 [preauth]
Aug 1 22:06:45 atif01.cs.umd.edu sshd[38884]: error: maximum authentication attempts exceeded for root from 122.155.168.16 port 56808 ssh2 [preauth]
Aug 1 22:06:59 atif01.cs.umd.edu sshd[38900]: error: maximum authentication attempts exceeded for root from 122.155.168.16 port 58354 ssh2 [preauth]
Aug 1 22:07:15 atif01.cs.umd.edu sshd[38910]: error: maximum authentication attempts exceeded for root from 122.155.168.16 port 59862 ssh2 [preauth]
Aug 1 22:07:31 atif01.cs.umd.edu sshd[38926]: error: maximum authentication attempts exceeded for root from 122.155.168.16 port 61405 ssh2 [preauth]
Aug 1 22:07:46 atif01.cs.umd.edu sshd[38938]: error: maximum authentication attempts exceeded for root from 122.155.168.16 port 62919 ssh2 [preauth]
Aug 1 22:08:04 atif01.cs.umd.edu sshd[38956]: error: maximum authentication attempts exceeded for root from 122.155.168.16 port 64476 ssh2 [preauth]
Aug 1 22:08:19 atif01.cs.umd.edu sshd[38964]: error: maximum authentication attempts exceeded for root from 122.155.168.16 port 49762 ssh2 [preauth]
Aug 1 22:08:36 atif01.cs.umd.edu sshd[38974]: error: maximum authentication attempts exceeded for root from 122.155.168.16 port 51307 ssh2 [preauth]
Aug 1 22:08:52 atif01.cs.umd.edu sshd[38992]: error: maximum authentication attempts exceeded for root from 122.155.168.16 port 52891 ssh2 [preauth]
Aug 1 22:09:10 atif01.cs.umd.edu sshd[39000]: error: maximum authentication attempts exceeded for root from 122.155.168.16 port 54485 ssh2 [preauth]
Aug 1 22:09:26 atif01.cs.umd.edu sshd[39010]: error: maximum authentication attempts exceeded for root from 122.155.168.16 port 56105 ssh2 [preauth]
Aug 1 22:09:44 atif01.cs.umd.edu sshd[39020]: error: maximum authentication attempts exceeded for root from 122.155.168.16 port 57593 ssh2 [preauth]
Aug 1 22:10:01 atif01.cs.umd.edu sshd[39036]: error: maximum authentication attempts exceeded for root from 122.155.168.16 port 59192 ssh2 [preauth]
Aug 1 22:10:18 atif01.cs.umd.edu sshd[39055]: error: maximum authentication attempts exceeded for root from 122.155.168.16 port 60747 ssh2 [preauth]
Aug 1 22:10:34 atif01.cs.umd.edu sshd[39065]: error: maximum authentication attempts exceeded for root from 122.155.168.16 port 62315 ssh2 [preauth]
Aug 1 22:10:50 atif01.cs.umd.edu sshd[39081]: error: maximum authentication attempts exceeded for root from 122.155.168.16 port 63774 ssh2 [preauth]
Aug 1 22:11:06 atif01.cs.umd.edu sshd[39091]: error: maximum authentication attempts exceeded for root from 122.155.168.16 port 65428 ssh2 [preauth]
Aug 1 22:11:23 atif01.cs.umd.edu sshd[39099]: error: maximum authentication attempts exceeded for root from 122.155.168.16 port 50560 ssh2 [preauth]
Aug 1 22:11:40 atif01.cs.umd.edu sshd[39110]: error: maximum authentication attempts exceeded for root from 122.155.168.16 port 52212 ssh2 [preauth]
Aug 1 22:11:56 atif01.cs.umd.edu sshd[39128]: error: maximum authentication attempts exceeded for root from 122.155.168.16 port 53843 ssh2 [preauth]
Aug 1 22:12:11 atif01.cs.umd.edu sshd[39136]: error: maximum authentication attempts exceeded for root from 122.155.168.16 port 55462 ssh2 [preauth]
Aug 1 22:12:25 atif01.cs.umd.edu sshd[39147]: error: maximum authentication attempts exceeded for root from 122.155.168.16 port 56915 ssh2 [preauth]
Aug 1 22:12:39 atif01.cs.umd.edu sshd[39163]: error: maximum authentication attempts exceeded for root from 122.155.168.16 port 58285 ssh2 [preauth]
... 10 more distinct messages not shown
== b0b02.cs.umd.edu (1 distinct, 1 total) ==
Aug 1 22:41:14 b0b02.cs.umd.edu rustdesk[1911315]: cannot open display:
== bale (1 distinct, 1 total) ==
Aug 1 22:05:40 bale setroubleshoot[3438512]: SELinux is preventing /usr/bin/tar from using the fowner capability. For complete SELinux messages run: sealert -l 8f58859c-1c63-4aee-afff-7c8e1dd95f45
== cheezit.cs.umd.edu (6 distinct, 7 total) ==
Aug 1 22:46:24 cheezit.cs.umd.edu sshd-session[86566]: pam_access(sshd:auth): access denied for user `admin' from `34.79.45.154'
Aug 1 22:46:24 cheezit.cs.umd.edu krb5_child[86568]: Client 'admin(a)UMD.EDU' not found in Kerberos database [x2]
Aug 1 22:46:24 cheezit.cs.umd.edu sshd-session[86564]: error: PAM: System error for admin from 34.79.45.154
Aug 1 22:47:07 cheezit.cs.umd.edu sshd-session[86626]: error: Protocol major versions differ: 2 vs. 1
Aug 1 22:53:59 cheezit.cs.umd.edu sshd-session[87850]: pam_access(sshd:auth): access denied for user `admin' from `34.156.126.43'
Aug 1 22:53:59 cheezit.cs.umd.edu sshd-session[87847]: error: PAM: System error for admin from 34.156.126.43
== contest (1 distinct, 34 total) ==
Aug 1 22:06:05 contest goferd[1007]: [ERROR][worker-0] gofer.messaging.adapter.connect:33 - connect: proton+amqps://satellite8.cs.umd.edu:5647, failed: Connection amqps://satellite8.cs.umd.edu:5647 disconnected: Condition('proton.pythonio', 'Connection refused to all addresses') [x34]
== csfw00a (1 distinct, 252 total) ==
Aug 1 22:04:46 csfw00a kernel: bnxt_en 0000:09:00.0 eth3: NIC Link is Down [x252]
== hackerman (6 distinct, 11 total) ==
Aug 1 22:20:04 hackerman gnome-software[2060381]: can't reliably fixup error code 4 in domain g-io-error-quark: Not a directory [x4]
Aug 1 22:20:12 hackerman gnome-software[2060381]: Only 0 apps for recent list, hiding
Aug 1 22:20:28 hackerman gnome-software[2060381]: failed to commit changes to dconf: GDBus.Error:org.gtk.GDBus.UnmappedGError.Quark._g_2dfile_2derror_2dquark.Code2: Failed to create file “/adminhomes/sajith/.config/dconf/user.FMQ7S3”: Permission denied
Aug 1 22:20:29 hackerman packagekitd[2945563]: Failed to get cache filename for libreoffice [x2]
Aug 1 22:20:29 hackerman packagekitd[2945563]: Failed to get cache filename for kernel [x2]
Aug 1 22:20:38 hackerman packagekitd[2945563]: failed to parse public key for /etc/pki/rpm-gpg/RPM-GPG-KEY-PQC-redhat-release
== idm00 (1 distinct, 1 total) ==
Aug 1 22:51:13 idm00 named[1455]: client @0x7f33043296c8 10.73.240.42#59678: update '73.10.in-addr.arpa/IN' denied
== idmp0 (1 distinct, 1 total) ==
Aug 1 22:36:02 idmp0 named[5198]: client @0x7f991003a0f8 10.73.240.43#58198: update '73.10.in-addr.arpa/IN' denied
== inbound00.cs.umd.edu (2 distinct, 2 total) ==
Aug 1 22:32:33 inbound00.cs.umd.edu krb5_child[1984761]: Client 'admin(a)UMD.EDU' not found in Kerberos database
Aug 1 22:33:41 inbound00.cs.umd.edu sshd-session[1984897]: error: Protocol major versions differ: 2 vs. 1
== itmon02 (1 distinct, 32 total) ==
Aug 1 22:07:51 itmon02 sshd[1750555]: error: beginning MaxStartups throttling [x32]
== krispykreme.cs.umd.edu (6 distinct, 8 total) ==
Aug 1 22:48:50 krispykreme.cs.umd.edu sshd-session[2174338]: pam_access(sshd:auth): access denied for user `admin' from `34.156.246.83'
Aug 1 22:48:51 krispykreme.cs.umd.edu krb5_child[2174340]: Client 'admin(a)UMD.EDU' not found in Kerberos database [x2]
Aug 1 22:48:51 krispykreme.cs.umd.edu sshd-session[2174321]: error: PAM: System error for admin from 34.156.246.83
Aug 1 22:50:50 krispykreme.cs.umd.edu sshd-session[2175088]: error: Protocol major versions differ: 2 vs. 1 [x2]
Aug 1 22:58:50 krispykreme.cs.umd.edu sshd-session[2177753]: pam_access(sshd:auth): access denied for user `admin' from `34.14.78.28'
Aug 1 22:58:51 krispykreme.cs.umd.edu sshd-session[2177751]: error: PAM: System error for admin from 34.14.78.28
== mcstic (2 distinct, 5 total) ==
Aug 1 22:35:02 mcstic krb5_child[1986597]: Client 'admin(a)UMD.EDU' not found in Kerberos database [x4]
Aug 1 22:35:07 mcstic sshd[1986586]: error: PAM: Authentication failure for admin from 34.156.12.51
== newhonors2 (1 distinct, 24 total) ==
Aug 1 22:13:03 newhonors2 dhcpcd[606823]: dhcpcd is not running [x24]
== outbound00.cs.umd.edu (2 distinct, 7 total) ==
Aug 1 22:09:09 outbound00.cs.umd.edu python3[1945080]: ldapdb [x6]
Aug 1 22:46:27 outbound00.cs.umd.edu krb5_child[1953687]: Client 'admin(a)UMD.EDU' not found in Kerberos database
== outbound01.cs.umd.edu (1 distinct, 6 total) ==
Aug 1 22:13:06 outbound01.cs.umd.edu python3[4171822]: ldapdb [x6]
== sentry-docker00.cs.umd.edu (28 distinct, 28 total) ==
Aug 1 22:07:42 sentry-docker00.cs.umd.edu systemd-udevd[4166868]: Could not generate persistent MAC address for veth185a4d3: No such file or directory
Aug 1 22:07:42 sentry-docker00.cs.umd.edu systemd-udevd[4166869]: Could not generate persistent MAC address for vethd9af5db: No such file or directory
Aug 1 22:25:02 sentry-docker00.cs.umd.edu systemd-udevd[4174834]: link_config: could not get ethtool features for veth449bd2a
Aug 1 22:25:02 sentry-docker00.cs.umd.edu systemd-udevd[4174834]: Could not set offload features of veth449bd2a: No such device
Aug 1 22:25:02 sentry-docker00.cs.umd.edu systemd-udevd[4174858]: Could not generate persistent MAC address for veth05d7894: No such file or directory
Aug 1 22:25:02 sentry-docker00.cs.umd.edu systemd-udevd[4174859]: Could not generate persistent MAC address for vetha9ef2df: No such file or directory
Aug 1 22:25:02 sentry-docker00.cs.umd.edu systemd-udevd[4174862]: Could not generate persistent MAC address for veth26da103: No such file or directory
Aug 1 22:25:02 sentry-docker00.cs.umd.edu systemd-udevd[4174863]: Could not generate persistent MAC address for vethd1e3f79: No such file or directory
Aug 1 22:25:02 sentry-docker00.cs.umd.edu systemd-udevd[4174874]: Could not generate persistent MAC address for veth4e8b001: No such file or directory
Aug 1 22:25:02 sentry-docker00.cs.umd.edu systemd-udevd[4174885]: Could not generate persistent MAC address for vetha2f7df5: No such file or directory
Aug 1 22:25:02 sentry-docker00.cs.umd.edu systemd-udevd[4174867]: Could not generate persistent MAC address for veth78cffec: No such file or directory
Aug 1 22:25:02 sentry-docker00.cs.umd.edu systemd-udevd[4174874]: Could not generate persistent MAC address for veth97b43e6: No such file or directory
Aug 1 22:27:50 sentry-docker00.cs.umd.edu systemd-udevd[4176297]: Could not generate persistent MAC address for vethc20b635: No such file or directory
Aug 1 22:27:50 sentry-docker00.cs.umd.edu systemd-udevd[4176298]: Could not generate persistent MAC address for veth0e20442: No such file or directory
Aug 1 22:45:10 sentry-docker00.cs.umd.edu systemd-udevd[4184505]: link_config: could not get ethtool features for veth78cffec
Aug 1 22:45:10 sentry-docker00.cs.umd.edu systemd-udevd[4184505]: Could not set offload features of veth78cffec: No such device
Aug 1 22:45:10 sentry-docker00.cs.umd.edu systemd-udevd[4184534]: Could not generate persistent MAC address for vetha5a0c8c: No such file or directory
Aug 1 22:45:10 sentry-docker00.cs.umd.edu systemd-udevd[4184535]: Could not generate persistent MAC address for veth253b9d0: No such file or directory
Aug 1 22:45:10 sentry-docker00.cs.umd.edu systemd-udevd[4184538]: Could not generate persistent MAC address for veth09cd29c: No such file or directory
Aug 1 22:45:10 sentry-docker00.cs.umd.edu systemd-udevd[4184555]: Could not generate persistent MAC address for veth4d9f212: No such file or directory
Aug 1 22:45:10 sentry-docker00.cs.umd.edu systemd-udevd[4184541]: Could not generate persistent MAC address for vetha741434: No such file or directory
Aug 1 22:45:10 sentry-docker00.cs.umd.edu systemd-udevd[4184542]: Could not generate persistent MAC address for veth9be7448: No such file or directory
Aug 1 22:45:10 sentry-docker00.cs.umd.edu systemd-udevd[4184546]: Could not generate persistent MAC address for vethc4ba2de: No such file or directory
Aug 1 22:45:10 sentry-docker00.cs.umd.edu systemd-udevd[4184549]: Could not generate persistent MAC address for veth06cde19: No such file or directory
Aug 1 22:47:58 sentry-docker00.cs.umd.edu systemd-udevd[4185701]: link_config: could not get ethtool features for vethc20b635
Aug 1 22:47:58 sentry-docker00.cs.umd.edu systemd-udevd[4185701]: Could not set offload features of vethc20b635: No such device
Aug 1 22:47:58 sentry-docker00.cs.umd.edu systemd-udevd[4185717]: Could not generate persistent MAC address for veth8682ebb: No such file or directory
Aug 1 22:47:58 sentry-docker00.cs.umd.edu systemd-udevd[4185718]: Could not generate persistent MAC address for veth22ca94a: No such file or directory
== soul (2 distinct, 2 total) ==
Aug 1 22:32:56 soul krb5_child[3097541]: Client 'admin(a)UMD.EDU' not found in Kerberos database
Aug 1 22:35:51 soul sshd-session[3097696]: error: Protocol major versions differ: 2 vs. 1
== strawberry (2 distinct, 8 total) ==
Aug 1 22:09:44 strawberry udisksd[1067]: Error performing housekeeping for drive /org/freedesktop/UDisks2/drives/ST2000DM001_1CH164_W1E8J5KJ: Error updating SMART data: Error sending ATA command CHECK POWER MODE: Unexpected sense data returned:#0120000: 00 00 00 00 00 00 00 00 00 00 00 00 00 00 00 00 ................#0120010: 00 00 00 00 00 00 00 00 00 00 00 00 00 00 00 00 ................#012 (g-io-error-quark, 0) [x6]
Aug 1 22:34:42 strawberry smartd[5314]: Device: /dev/sda [SAT], failed to read SMART Attribute Data [x2]
== vacuum.cs.umd.edu (4 distinct, 4 total) ==
Aug 1 22:11:58 vacuum.cs.umd.edu abrt-hook-ccpp[2213]: Process 30047 (driver) of user 33 killed by SIGABRT - dumping core
Aug 1 22:11:58 vacuum.cs.umd.edu abrt-server[2215]: Package 'amanda-backup_server' isn't signed with proper key
Aug 1 22:11:58 vacuum.cs.umd.edu abrt-server[2215]: 'post-create' on '/var/spool/abrt/ccpp-2026-08-01-22:11:58-30047' exited with 1
Aug 1 22:11:58 vacuum.cs.umd.edu abrt-server[2215]: Deleting problem directory '/var/spool/abrt/ccpp-2026-08-01-22:11:58-30047'
1
0
Command: /usr/local/sbin/syslog-digest.py
Time : 0.5004s
Status : exited 0
Output :
Syslog digest — 2026-08-01 22:05 EDT
Processed 4,305 lines, filtered 3,482 (80%). 823 unknown (112 distinct) from 19 host(s).
== abuse (1 distinct, 347 total) ==
Aug 1 21:05:04 abuse rsyslogd[21745]: imjournal: open() failed for path: '/var/lib/rsyslog/imjournal.state.tmp': Input/output error [v8.2404.0 try https://www.rsyslog.com/e/2433 ] [x347]
== atif01.cs.umd.edu (12 distinct, 22 total) ==
Aug 1 22:02:04 atif01.cs.umd.edu sshd[38678]: error: maximum authentication attempts exceeded for root from 122.155.168.16 port 62365 ssh2 [preauth]
Aug 1 22:02:04 atif01.cs.umd.edu sshd[38678]: PAM service(sshd) ignoring max retries; 6 > 3 [x11]
Aug 1 22:02:21 atif01.cs.umd.edu sshd[38688]: error: maximum authentication attempts exceeded for root from 122.155.168.16 port 64167 ssh2 [preauth]
Aug 1 22:02:38 atif01.cs.umd.edu sshd[38704]: error: maximum authentication attempts exceeded for root from 122.155.168.16 port 49401 ssh2 [preauth]
Aug 1 22:02:55 atif01.cs.umd.edu sshd[38722]: error: maximum authentication attempts exceeded for root from 122.155.168.16 port 50973 ssh2 [preauth]
Aug 1 22:03:11 atif01.cs.umd.edu sshd[38736]: error: maximum authentication attempts exceeded for root from 122.155.168.16 port 52536 ssh2 [preauth]
Aug 1 22:03:29 atif01.cs.umd.edu sshd[38746]: error: maximum authentication attempts exceeded for root from 122.155.168.16 port 54056 ssh2 [preauth]
Aug 1 22:03:45 atif01.cs.umd.edu sshd[38756]: error: maximum authentication attempts exceeded for root from 122.155.168.16 port 55657 ssh2 [preauth]
Aug 1 22:04:01 atif01.cs.umd.edu sshd[38773]: error: maximum authentication attempts exceeded for root from 122.155.168.16 port 57190 ssh2 [preauth]
Aug 1 22:04:18 atif01.cs.umd.edu sshd[38783]: error: maximum authentication attempts exceeded for root from 122.155.168.16 port 58709 ssh2 [preauth]
Aug 1 22:04:37 atif01.cs.umd.edu sshd[38793]: error: maximum authentication attempts exceeded for root from 122.155.168.16 port 60337 ssh2 [preauth]
Aug 1 22:04:53 atif01.cs.umd.edu sshd[38809]: error: maximum authentication attempts exceeded for root from 122.155.168.16 port 62075 ssh2 [preauth]
== b0b02.cs.umd.edu (1 distinct, 1 total) ==
Aug 1 21:41:09 b0b02.cs.umd.edu rustdesk[1896258]: cannot open display:
== contest (9 distinct, 44 total) ==
Aug 1 21:05:23 contest goferd[1007]: [ERROR][worker-0] gofer.messaging.adapter.connect:33 - connect: proton+amqps://satellite8.cs.umd.edu:5647, failed: Connection amqps://satellite8.cs.umd.edu:5647 disconnected: Condition('proton.pythonio', 'Connection refused to all addresses') [x34]
Aug 1 21:48:16 contest setroubleshoot[471464]: SELinux is preventing /usr/libexec/platform-python3.6 from create access on the directory libdnf.hljRlU. For complete SELinux messages run: sealert -l cb6b25c6-4765-4cf2-88a0-9b3b508e94e9
Aug 1 21:48:16 contest setroubleshoot[471464]: SELinux is preventing /usr/bin/gpgconf from add_name access on the directory repodata. For complete SELinux messages run: sealert -l 41cf7b1b-0f34-4609-98f2-b66e7825fef7 [x2]
Aug 1 21:48:16 contest setroubleshoot[471464]: SELinux is preventing /usr/libexec/platform-python3.6 from create access on the file mirrorlist. For complete SELinux messages run: sealert -l fc20ff92-ea83-4f38-a24b-ddfd737a3141
Aug 1 21:48:16 contest setroubleshoot[471464]: SELinux is preventing /usr/libexec/platform-python3.6 from setattr access on the file repomd.xml. For complete SELinux messages run: sealert -l ac675631-fa35-4e93-adc9-b692b18e53e5
Aug 1 21:48:17 contest setroubleshoot[471464]: SELinux is preventing /usr/libexec/platform-python3.6 from read access on the directory libdnf.hljRlU. For complete SELinux messages run: sealert -l 45d103b6-0810-4890-a705-990118577ce8
Aug 1 21:48:17 contest setroubleshoot[471464]: SELinux is preventing /usr/libexec/platform-python3.6 from remove_name access on the directory repomd.xml. For complete SELinux messages run: sealert -l 7e499113-2fd7-4f67-bec6-3521efbe3637 [x2]
Aug 1 21:48:17 contest setroubleshoot[471464]: SELinux is preventing /usr/libexec/platform-python3.6 from rmdir access on the directory repodata. For complete SELinux messages run: sealert -l 3928930b-a1ed-448d-950b-0665ac2adef8
Aug 1 21:48:17 contest setroubleshoot[471464]: SELinux is preventing /usr/libexec/platform-python3.6 from create access on the directory libdnf.61Dbal. For complete SELinux messages run: sealert -l cb6b25c6-4765-4cf2-88a0-9b3b508e94e9
== csfw00a (2 distinct, 242 total) ==
Aug 1 21:04:45 csfw00a kernel: bnxt_en 0000:09:00.0 eth3: NIC Link is Down [x234]
Aug 1 21:15:08 csfw00a ospf6d[1477]: [EC 100663307] Could not send entire message [x8]
== hackerman (6 distinct, 8 total) ==
Aug 1 21:19:01 hackerman gnome-software[2060381]: failed to commit changes to dconf: GDBus.Error:org.gtk.GDBus.UnmappedGError.Quark._g_2dfile_2derror_2dquark.Code2: Failed to create file “/adminhomes/sajith/.config/dconf/user.JFTXS3”: Permission denied
Aug 1 21:20:04 hackerman gnome-software[2060381]: can't reliably fixup error code 4 in domain g-io-error-quark: Not a directory [x3]
Aug 1 21:20:12 hackerman gnome-software[2060381]: Only 0 apps for recent list, hiding
Aug 1 21:20:28 hackerman gnome-software[2060381]: failed to commit changes to dconf: GDBus.Error:org.gtk.GDBus.UnmappedGError.Quark._g_2dfile_2derror_2dquark.Code2: Failed to create file “/adminhomes/sajith/.config/dconf/user.6251S3”: Permission denied
Aug 1 21:20:29 hackerman packagekitd[2931112]: Failed to get cache filename for libreoffice
Aug 1 21:20:29 hackerman packagekitd[2931112]: Failed to get cache filename for kernel
== idm00 (1 distinct, 1 total) ==
Aug 1 21:51:13 idm00 named[1455]: client @0x7f330c465cd8 10.73.240.42#50668: update '73.10.in-addr.arpa/IN' denied
== idmp0 (1 distinct, 1 total) ==
Aug 1 21:36:02 idmp0 named[5198]: client @0x7f990804b868 10.73.240.43#55839: update '73.10.in-addr.arpa/IN' denied
== itmon02 (1 distinct, 30 total) ==
Aug 1 21:07:55 itmon02 sshd[1750555]: error: beginning MaxStartups throttling [x30]
== neodontcare.cs.umd.edu (1 distinct, 1 total) ==
Aug 1 21:28:06 neodontcare.cs.umd.edu tracker-extract[1479918]: tracker_module_manager_load_modules: assertion 'initialized == TRUE' failed
== newhonors2 (1 distinct, 24 total) ==
Aug 1 21:13:02 newhonors2 dhcpcd[604980]: dhcpcd is not running [x24]
== outbound00.cs.umd.edu (3 distinct, 11 total) ==
Aug 1 21:09:09 outbound00.cs.umd.edu python3[1931072]: ldapdb [x6]
Aug 1 21:59:23 outbound00.cs.umd.edu cockpit-ws[1942852]: Received unexpected TLS connection; use cockpit-tls for TLS termination [x3]
Aug 1 22:01:13 outbound00.cs.umd.edu sshd-session[1943584]: error: Protocol major versions differ: 2 vs. 1 [x2]
== outbound01.cs.umd.edu (1 distinct, 6 total) ==
Aug 1 21:13:06 outbound01.cs.umd.edu python3[4157806]: ldapdb [x6]
== peach.cs.umd.edu (4 distinct, 4 total) ==
Aug 1 21:12:10 peach.cs.umd.edu setroubleshoot[2133843]: SELinux is preventing /usr/bin/qemu-ga from search access on the directory /var/lib/containers/storage/overlay. For complete SELinux messages run: sealert -l ba415951-a2c6-424e-b17d-305c5300b9f3
Aug 1 21:12:10 peach.cs.umd.edu setroubleshoot[2133843]: SELinux is preventing /usr/bin/qemu-ga from search access on the directory /var/lib/containers/storage/overlay. For complete SELinux messages run: sealert -l 6aeb0956-fcf2-462a-ae4d-439b912c16d0
Aug 1 21:32:10 peach.cs.umd.edu setroubleshoot[602808]: SELinux is preventing /usr/bin/qemu-ga from search access on the directory /var/lib/containers/storage/overlay. For complete SELinux messages run: sealert -l 007f2494-1b82-4ff6-bd59-5f449ab9de99
Aug 1 21:32:10 peach.cs.umd.edu setroubleshoot[602808]: SELinux is preventing /usr/bin/qemu-ga from search access on the directory /var/lib/containers/storage/overlay. For complete SELinux messages run: sealert -l a801d9aa-5cee-4f5c-b9a9-bd22e572596b
== sentry-docker00.cs.umd.edu (38 distinct, 38 total) ==
Aug 1 21:07:25 sentry-docker00.cs.umd.edu systemd-udevd[4138354]: Could not generate persistent MAC address for vethf114d5e: No such file or directory
Aug 1 21:07:25 sentry-docker00.cs.umd.edu systemd-udevd[4138355]: Could not generate persistent MAC address for vethfb7f18c: No such file or directory
Aug 1 21:24:37 sentry-docker00.cs.umd.edu systemd-udevd[4146502]: link_config: could not get ethtool features for vethd6d16ab
Aug 1 21:24:37 sentry-docker00.cs.umd.edu systemd-udevd[4146502]: Could not set offload features of vethd6d16ab: No such device
Aug 1 21:24:37 sentry-docker00.cs.umd.edu systemd-udevd[4146528]: Could not generate persistent MAC address for veth1d9ba84: No such file or directory
Aug 1 21:24:37 sentry-docker00.cs.umd.edu systemd-udevd[4146529]: Could not generate persistent MAC address for veth9225473: No such file or directory
Aug 1 21:24:37 sentry-docker00.cs.umd.edu systemd-udevd[4146532]: Could not generate persistent MAC address for veth982595c: No such file or directory
Aug 1 21:24:37 sentry-docker00.cs.umd.edu systemd-udevd[4146533]: Could not generate persistent MAC address for veth6c8606d: No such file or directory
Aug 1 21:24:37 sentry-docker00.cs.umd.edu systemd-udevd[4146556]: Could not generate persistent MAC address for veth8fb42d8: No such file or directory
Aug 1 21:24:37 sentry-docker00.cs.umd.edu systemd-udevd[4146557]: Could not generate persistent MAC address for veth488fb69: No such file or directory
Aug 1 21:24:37 sentry-docker00.cs.umd.edu systemd-udevd[4146566]: Could not generate persistent MAC address for veth82f6e44: No such file or directory
Aug 1 21:24:37 sentry-docker00.cs.umd.edu systemd-udevd[4146565]: Could not generate persistent MAC address for veth6ec3527: No such file or directory
Aug 1 21:27:29 sentry-docker00.cs.umd.edu systemd-udevd[4148011]: link_config: could not get ethtool features for vethf114d5e
Aug 1 21:27:29 sentry-docker00.cs.umd.edu systemd-udevd[4148011]: Could not set offload features of vethf114d5e: No such device
Aug 1 21:27:29 sentry-docker00.cs.umd.edu systemd-udevd[4148029]: Could not generate persistent MAC address for veth82d7d0e: No such file or directory
Aug 1 21:27:29 sentry-docker00.cs.umd.edu systemd-udevd[4148030]: Could not generate persistent MAC address for veth68b879b: No such file or directory
Aug 1 21:44:45 sentry-docker00.cs.umd.edu systemd-udevd[4155936]: Could not generate persistent MAC address for veth3c1d40e: No such file or directory
Aug 1 21:44:45 sentry-docker00.cs.umd.edu systemd-udevd[4155937]: Could not generate persistent MAC address for vethd98c0aa: No such file or directory
Aug 1 21:44:45 sentry-docker00.cs.umd.edu systemd-udevd[4155940]: Could not generate persistent MAC address for vethfd0faf4: No such file or directory
Aug 1 21:44:45 sentry-docker00.cs.umd.edu systemd-udevd[4155941]: Could not generate persistent MAC address for vetha740af4: No such file or directory
Aug 1 21:44:45 sentry-docker00.cs.umd.edu systemd-udevd[4155955]: Could not generate persistent MAC address for veth4daef1f: No such file or directory
Aug 1 21:44:45 sentry-docker00.cs.umd.edu systemd-udevd[4155956]: Could not generate persistent MAC address for veth6d89eec: No such file or directory
Aug 1 21:44:45 sentry-docker00.cs.umd.edu systemd-udevd[4155966]: Could not generate persistent MAC address for vethdd7f7c3: No such file or directory
Aug 1 21:44:45 sentry-docker00.cs.umd.edu systemd-udevd[4155967]: Could not generate persistent MAC address for veth7c6e6ff: No such file or directory
Aug 1 21:47:37 sentry-docker00.cs.umd.edu systemd-udevd[4157431]: link_config: could not get ethtool features for veth82d7d0e
Aug 1 21:47:37 sentry-docker00.cs.umd.edu systemd-udevd[4157431]: Could not set offload features of veth82d7d0e: No such device
Aug 1 21:47:37 sentry-docker00.cs.umd.edu systemd-udevd[4157447]: Could not generate persistent MAC address for veth686344d: No such file or directory
Aug 1 21:47:37 sentry-docker00.cs.umd.edu systemd-udevd[4157448]: Could not generate persistent MAC address for veth78cea76: No such file or directory
Aug 1 22:04:53 sentry-docker00.cs.umd.edu systemd-udevd[4165352]: link_config: could not get ethtool features for veth3c1d40e
Aug 1 22:04:53 sentry-docker00.cs.umd.edu systemd-udevd[4165352]: Could not set offload features of veth3c1d40e: No such device
... 8 more distinct messages not shown
== strawberry (2 distinct, 8 total) ==
Aug 1 21:09:44 strawberry udisksd[1067]: Error performing housekeeping for drive /org/freedesktop/UDisks2/drives/ST2000DM001_1CH164_W1E8J5KJ: Error updating SMART data: Error sending ATA command CHECK POWER MODE: Unexpected sense data returned:#0120000: 00 00 00 00 00 00 00 00 00 00 00 00 00 00 00 00 ................#0120010: 00 00 00 00 00 00 00 00 00 00 00 00 00 00 00 00 ................#012 (g-io-error-quark, 0) [x6]
Aug 1 21:34:42 strawberry smartd[5314]: Device: /dev/sda [SAT], failed to read SMART Attribute Data [x2]
== submit26-b9-2 (9 distinct, 12 total) ==
Aug 1 21:12:51 submit26-b9-2 setroubleshoot[839782]: SELinux is preventing /usr/bin/python3.9 from create access on the directory /(null). For complete SELinux messages run: sealert -l d506243c-d61e-48f3-b42a-4592c913deb0
Aug 1 21:12:51 submit26-b9-2 setroubleshoot[839782]: SELinux is preventing /usr/bin/python3.9 from add_name access on the directory /(null). For complete SELinux messages run: sealert -l 3b4752ac-1b9a-4af9-a05b-32e4c2eb13ab
Aug 1 21:12:51 submit26-b9-2 setroubleshoot[839782]: SELinux is preventing /usr/bin/python3.9 from create access on the file /(null). For complete SELinux messages run: sealert -l 29e5adbd-4381-4467-b40d-a2219101e096 [x2]
Aug 1 21:12:51 submit26-b9-2 setroubleshoot[839782]: SELinux is preventing /usr/bin/python3.9 from open access on the file /tmp/libdnf.5Pq1mt/repodata/repomd.xml. For complete SELinux messages run: sealert -l 1b38f2ec-01ce-4343-8059-ba7494ecc5c4 [x2]
Aug 1 21:12:51 submit26-b9-2 setroubleshoot[839782]: SELinux is preventing /usr/bin/python3.9 from setattr access on the file repomd.xml. For complete SELinux messages run: sealert -l e5f9af40-1f63-4924-b012-27ab2a7b2266 [x2]
Aug 1 21:12:51 submit26-b9-2 setroubleshoot[839782]: SELinux is preventing /usr/bin/python3.9 from read access on the directory libdnf.5Pq1mt. For complete SELinux messages run: sealert -l 5c54db87-54a3-4a7c-97b4-b5c48d6c3543
Aug 1 21:12:51 submit26-b9-2 setroubleshoot[839782]: SELinux is preventing /usr/bin/python3.9 from remove_name access on the directory repomd.xml. For complete SELinux messages run: sealert -l 63cd60e1-1e61-4276-afea-dd8526ffe8b2
Aug 1 21:12:51 submit26-b9-2 setroubleshoot[839782]: SELinux is preventing /usr/bin/python3.9 from unlink access on the file repomd.xml. For complete SELinux messages run: sealert -l 81c7e9ec-e023-4c6d-b1ad-c02a242e655e
Aug 1 21:12:51 submit26-b9-2 setroubleshoot[839782]: SELinux is preventing /usr/bin/python3.9 from rmdir access on the directory repodata. For complete SELinux messages run: sealert -l 6ae9a597-e123-4d74-8eec-a8ebe0f5e4d0
== submit26-b9-3 (10 distinct, 14 total) ==
Aug 1 21:20:37 submit26-b9-3 setroubleshoot[765002]: SELinux is preventing /usr/bin/python3.9 from create access on the directory /(null). For complete SELinux messages run: sealert -l 5b912a44-22fd-4560-b201-2a4e289b73f5 [x2]
Aug 1 21:20:37 submit26-b9-3 setroubleshoot[765002]: SELinux is preventing /usr/bin/python3.9 from add_name access on the directory /(null). For complete SELinux messages run: sealert -l 7f1df1e4-725e-4953-98eb-1079f908f543 [x2]
Aug 1 21:20:37 submit26-b9-3 setroubleshoot[765002]: SELinux is preventing /usr/bin/python3.9 from create access on the file /(null). For complete SELinux messages run: sealert -l 40b8852a-f77b-44b4-affe-5f11fa33de43
Aug 1 21:20:37 submit26-b9-3 setroubleshoot[765002]: SELinux is preventing /usr/bin/python3.9 from open access on the file /tmp/libdnf.epfUp6/repodata/repomd.xml. For complete SELinux messages run: sealert -l 45a8019e-f6b5-4baa-92c1-862594b40d46
Aug 1 21:20:37 submit26-b9-3 setroubleshoot[765002]: SELinux is preventing /usr/bin/python3.9 from setattr access on the file repomd.xml. For complete SELinux messages run: sealert -l e9f0bfff-7784-4126-baa4-2bb06da56591
Aug 1 21:20:37 submit26-b9-3 setroubleshoot[765002]: SELinux is preventing /usr/bin/python3.9 from read access on the directory libdnf.epfUp6. For complete SELinux messages run: sealert -l 0b17cc3d-cdc6-4fe2-a11f-3892e7c41dc7
Aug 1 21:20:37 submit26-b9-3 setroubleshoot[765002]: SELinux is preventing /usr/bin/python3.9 from remove_name access on the directory repomd.xml. For complete SELinux messages run: sealert -l 10e38c64-b65f-4cdd-901e-4375652d9a42 [x2]
Aug 1 21:20:38 submit26-b9-3 setroubleshoot[765002]: SELinux is preventing /usr/bin/python3.9 from unlink access on the file repomd.xml. For complete SELinux messages run: sealert -l 7fd9cf72-ef38-48e1-b6aa-b571b26a7b22
Aug 1 21:20:38 submit26-b9-3 setroubleshoot[765002]: SELinux is preventing /usr/bin/python3.9 from rmdir access on the directory repodata. For complete SELinux messages run: sealert -l b9b11116-89bd-4a3c-980c-1d422c5dcee4 [x2]
Aug 1 21:20:38 submit26-b9-3 setroubleshoot[765002]: SELinux is preventing /usr/bin/python3.9 from read access on the directory libdnf.zHBraw. For complete SELinux messages run: sealert -l 0b17cc3d-cdc6-4fe2-a11f-3892e7c41dc7
== submit26-clnb9 (9 distinct, 9 total) ==
Aug 1 21:31:56 submit26-clnb9 setroubleshoot[1655255]: SELinux is preventing /usr/bin/python3.9 from create access on the directory /(null). For complete SELinux messages run: sealert -l 6783ed2b-5ae4-42b5-975a-4bf50eec4658
Aug 1 21:31:56 submit26-clnb9 setroubleshoot[1655255]: SELinux is preventing /usr/bin/python3.9 from add_name access on the directory /(null). For complete SELinux messages run: sealert -l 9e7fa955-cc30-4804-ac8c-e1779e85946c
Aug 1 21:31:56 submit26-clnb9 setroubleshoot[1655255]: SELinux is preventing /usr/bin/python3.9 from create access on the file /(null). For complete SELinux messages run: sealert -l 69bfa6e3-089c-40ff-9563-fd30787d0774
Aug 1 21:31:56 submit26-clnb9 setroubleshoot[1655255]: SELinux is preventing /usr/bin/python3.9 from open access on the file /tmp/libdnf.pbwrFa/repodata/repomd.xml. For complete SELinux messages run: sealert -l 001acdb5-31ef-4e52-b10b-90f467a89ddc
Aug 1 21:31:56 submit26-clnb9 setroubleshoot[1655255]: SELinux is preventing /usr/bin/python3.9 from setattr access on the file repomd.xml. For complete SELinux messages run: sealert -l edacddcf-16ed-4dc3-8d82-7c597d5dee23
Aug 1 21:31:56 submit26-clnb9 setroubleshoot[1655255]: SELinux is preventing /usr/bin/python3.9 from read access on the directory libdnf.pbwrFa. For complete SELinux messages run: sealert -l 62b3782e-4730-4488-8178-94dafe9b552c
Aug 1 21:31:56 submit26-clnb9 setroubleshoot[1655255]: SELinux is preventing /usr/bin/python3.9 from remove_name access on the directory repomd.xml. For complete SELinux messages run: sealert -l 81cb3698-78f8-440a-8e3c-e5d1041e6b78
Aug 1 21:31:56 submit26-clnb9 setroubleshoot[1655255]: SELinux is preventing /usr/bin/python3.9 from unlink access on the file repomd.xml. For complete SELinux messages run: sealert -l 792b472a-115c-4799-9805-fc7436f916b9
Aug 1 21:31:56 submit26-clnb9 setroubleshoot[1655255]: SELinux is preventing /usr/bin/python3.9 from rmdir access on the directory repodata. For complete SELinux messages run: sealert -l 15c83a86-837b-41e2-b662-b39cd4e361cb
1
0