Command: /usr/local/sbin/syslog-digest.py
Time : 0.5073s
Status : exited 0
Output :
Syslog digest — 2026-08-01 11:05 EDT
Processed 4,611 lines, filtered 3,832 (83%). 779 unknown (83 distinct) from 22 host(s).
== abuse (1 distinct, 346 total) ==
Aug 1 10:05:06 abuse rsyslogd[21745]: imjournal: open() failed for path: '/var/lib/rsyslog/imjournal.state.tmp': Input/output error [v8.2404.0 try https://www.rsyslog.com/e/2433 ] [x346]
== b0b02.cs.umd.edu (1 distinct, 1 total) ==
Aug 1 10:40:31 b0b02.cs.umd.edu rustdesk[1730086]: cannot open display:
== bac102 (1 distinct, 1 total) ==
Aug 1 11:00:05 bac102 (da-udp.*)[228329]: amanda-udp-restart.service: Failed at step EXEC spawning /usr/bin/systemctl restart amanda-udp.*: No such file or directory
== bachata (5 distinct, 13 total) ==
Aug 1 10:51:33 bachata setroubleshoot[2279979]: SELinux is preventing /usr/sbin/smbd from name_bind access on the udp_socket port 714. For complete SELinux messages run: sealert -l 8f7247f1-69a5-4a62-a4f0-88a324bfd75c
Aug 1 10:51:33 bachata setroubleshoot[2279979]: SELinux is preventing /usr/sbin/smbd from getattr access on the lnk_file /fs/junkfood/nelson/ClassRelated. For complete SELinux messages run: sealert -l fcd56e6d-4082-40d2-8d07-7512890e4b51 [x3]
Aug 1 10:51:33 bachata setroubleshoot[2279979]: SELinux is preventing /usr/sbin/smbd from read access on the lnk_file ClassRelated. For complete SELinux messages run: sealert -l 8052e635-6f2f-45b1-a983-55d5d837ba65 [x3]
Aug 1 10:51:33 bachata setroubleshoot[2279979]: SELinux is preventing /usr/sbin/smbd from getattr access on the file /fs/junkfood/nelson/VirtualDesktop/ClassRelated/cmsc216Summer2026/216_SUMMER_2026. For complete SELinux messages run: sealert -l 278fa2f7-7c6d-4613-8831-0c7902342a33 [x3]
Aug 1 10:51:34 bachata setroubleshoot[2279979]: SELinux is preventing /usr/sbin/smbd from read access on the file 216_SUMMER_2026. For complete SELinux messages run: sealert -l a2f5acec-ed56-4193-b84b-9c355ad24121 [x3]
== cmsc436-0101-redis (6 distinct, 7 total) ==
Aug 1 10:05:53 cmsc436-0101-redis krb5_child[638204]: Client 'admin(a)UMD.EDU' not found in Kerberos database [x2]
Aug 1 10:05:55 cmsc436-0101-redis sshd-session[638189]: error: PAM: Authentication failure for admin from 116.110.144.94
Aug 1 10:07:06 cmsc436-0101-redis sshd-session[638217]: error: PAM: Authentication failure for admin from 116.110.151.49
Aug 1 10:14:35 cmsc436-0101-redis sshd-session[638558]: error: PAM: Authentication failure for ftp from 116.110.144.94
Aug 1 10:15:07 cmsc436-0101-redis sshd-session[638562]: error: PAM: Authentication failure for operator from 116.110.144.94
Aug 1 10:21:39 cmsc436-0101-redis sshd-session[638889]: error: PAM: Authentication failure for root from 116.110.144.94
== contest (1 distinct, 33 total) ==
Aug 1 10:06:37 contest goferd[1007]: [ERROR][worker-0] gofer.messaging.adapter.connect:33 - connect: proton+amqps://satellite8.cs.umd.edu:5647, failed: Connection amqps://satellite8.cs.umd.edu:5647 disconnected: Condition('proton.pythonio', 'Connection refused to all addresses') [x33]
== csfw00a (1 distinct, 234 total) ==
Aug 1 10:05:03 csfw00a kernel: bnxt_en 0000:09:00.0 eth3: NIC Link is Down [x234]
== hackerman (6 distinct, 11 total) ==
Aug 1 10:20:04 hackerman gnome-software[2060381]: can't reliably fixup error code 4 in domain g-io-error-quark: Not a directory [x4]
Aug 1 10:20:12 hackerman gnome-software[2060381]: Only 0 apps for recent list, hiding
Aug 1 10:20:28 hackerman gnome-software[2060381]: failed to commit changes to dconf: GDBus.Error:org.gtk.GDBus.UnmappedGError.Quark._g_2dfile_2derror_2dquark.Code2: Failed to create file “/adminhomes/sajith/.config/dconf/user.4D9DT3”: Permission denied
Aug 1 10:20:28 hackerman packagekitd[2776509]: Failed to get cache filename for libreoffice [x2]
Aug 1 10:20:28 hackerman packagekitd[2776509]: Failed to get cache filename for kernel [x2]
Aug 1 10:20:37 hackerman packagekitd[2776509]: failed to parse public key for /etc/pki/rpm-gpg/RPM-GPG-KEY-PQC-redhat-release
== idm00 (1 distinct, 1 total) ==
Aug 1 10:51:15 idm00 named[1455]: client @0x7f3310365af8 10.73.240.42#61022: update '73.10.in-addr.arpa/IN' denied
== idmp0 (3 distinct, 3 total) ==
Aug 1 10:36:01 idmp0 named[5198]: client @0x7f991003a0f8 10.73.240.43#54703: update '73.10.in-addr.arpa/IN' denied
Aug 1 10:38:28 idmp0 named[5198]: client @0x7f9910042b08 10.73.245.14#58463: update '73.10.in-addr.arpa/IN' denied
Aug 1 10:39:51 idmp0 named[5198]: client @0x7f991003a0f8 10.73.245.14#58463: update '73.10.in-addr.arpa/IN' denied
== inbound00.cs.umd.edu (1 distinct, 3 total) ==
Aug 1 10:16:58 inbound00.cs.umd.edu cockpit-ws[1811843]: /usr/share/cockpit/static/login.js/favicon.ico: Failed to open file “/usr/share/cockpit/static/login.js/favicon.ico”: open() failed: Not a directory [x3]
== inbound01.cs.umd.edu (1 distinct, 2 total) ==
Aug 1 10:16:57 inbound01.cs.umd.edu cockpit-ws[4023375]: /usr/share/cockpit/static/login.js/favicon.ico: Failed to open file “/usr/share/cockpit/static/login.js/favicon.ico”: open() failed: Not a directory [x2]
== irb2156 (1 distinct, 1 total) ==
Aug 1 11:00:00 irb2156 (da-udp.*)[300696]: amanda-udp-restart.service: Failed at step EXEC spawning /usr/bin/systemctl restart amanda-udp.*: No such file or directory
== itmon02 (1 distinct, 26 total) ==
Aug 1 10:08:06 itmon02 sshd[1750555]: error: beginning MaxStartups throttling [x26]
== newhonors2 (1 distinct, 24 total) ==
Aug 1 10:13:02 newhonors2 dhcpcd[584598]: dhcpcd is not running [x24]
== outbound00.cs.umd.edu (2 distinct, 10 total) ==
Aug 1 10:09:09 outbound00.cs.umd.edu python3[1776841]: ldapdb [x6]
Aug 1 10:12:07 outbound00.cs.umd.edu cockpit-ws[1777580]: /usr/share/cockpit/static/login.js/favicon.ico: Failed to open file “/usr/share/cockpit/static/login.js/favicon.ico”: open() failed: Not a directory [x4]
== outbound01.cs.umd.edu (2 distinct, 8 total) ==
Aug 1 10:13:06 outbound01.cs.umd.edu python3[4003072]: ldapdb [x6]
Aug 1 10:52:29 outbound01.cs.umd.edu cockpit-ws[4011704]: /usr/share/cockpit/static/login.js/favicon.ico: Failed to open file “/usr/share/cockpit/static/login.js/favicon.ico”: open() failed: Not a directory [x2]
== peach.cs.umd.edu (2 distinct, 2 total) ==
Aug 1 10:12:08 peach.cs.umd.edu setroubleshoot[2043692]: SELinux is preventing /usr/bin/qemu-ga from search access on the directory /var/lib/containers/storage/overlay. For complete SELinux messages run: sealert -l ba415951-a2c6-424e-b17d-305c5300b9f3
Aug 1 10:12:08 peach.cs.umd.edu setroubleshoot[2043692]: SELinux is preventing /usr/bin/qemu-ga from search access on the directory /var/lib/containers/storage/overlay. For complete SELinux messages run: sealert -l 6aeb0956-fcf2-462a-ae4d-439b912c16d0
== quiss (1 distinct, 1 total) ==
Aug 1 11:00:02 quiss (da-udp.*)[97704]: amanda-udp-restart.service: Failed at step EXEC spawning /usr/bin/systemctl restart amanda-udp.*: No such file or directory
== sentry-docker00.cs.umd.edu (42 distinct, 42 total) ==
Aug 1 10:20:02 sentry-docker00.cs.umd.edu systemd-udevd[3833999]: link_config: could not get ethtool features for vethb70b5f5
Aug 1 10:20:02 sentry-docker00.cs.umd.edu systemd-udevd[3833999]: Could not set offload features of vethb70b5f5: No such device
Aug 1 10:20:03 sentry-docker00.cs.umd.edu systemd-udevd[3834027]: Could not generate persistent MAC address for veth3c8d9d2: No such file or directory
Aug 1 10:20:03 sentry-docker00.cs.umd.edu systemd-udevd[3834028]: Could not generate persistent MAC address for vethe65d00b: No such file or directory
Aug 1 10:20:03 sentry-docker00.cs.umd.edu systemd-udevd[3834031]: Could not generate persistent MAC address for vethb2889e8: No such file or directory
Aug 1 10:20:03 sentry-docker00.cs.umd.edu systemd-udevd[3834032]: Could not generate persistent MAC address for veth152818e: No such file or directory
Aug 1 10:20:03 sentry-docker00.cs.umd.edu systemd-udevd[3834054]: Could not generate persistent MAC address for vethaf56b2f: No such file or directory
Aug 1 10:20:03 sentry-docker00.cs.umd.edu systemd-udevd[3834041]: Could not generate persistent MAC address for veth225774d: No such file or directory
Aug 1 10:20:03 sentry-docker00.cs.umd.edu systemd-udevd[3834043]: Could not generate persistent MAC address for vethbfbbd61: No such file or directory
Aug 1 10:20:03 sentry-docker00.cs.umd.edu systemd-udevd[3834049]: Could not generate persistent MAC address for veth4030d0c: No such file or directory
Aug 1 10:23:11 sentry-docker00.cs.umd.edu systemd-udevd[3835537]: Could not generate persistent MAC address for veth83f7b38: No such file or directory
Aug 1 10:23:11 sentry-docker00.cs.umd.edu systemd-udevd[3835538]: Could not generate persistent MAC address for veth0f9ae0d: No such file or directory
Aug 1 10:40:11 sentry-docker00.cs.umd.edu systemd-udevd[3843354]: link_config: could not get ethtool features for veth3c8d9d2
Aug 1 10:40:11 sentry-docker00.cs.umd.edu systemd-udevd[3843354]: Could not set offload features of veth3c8d9d2: No such device
Aug 1 10:40:11 sentry-docker00.cs.umd.edu systemd-udevd[3843430]: link_config: could not get ethtool features for vethaf56b2f
Aug 1 10:40:11 sentry-docker00.cs.umd.edu systemd-udevd[3843430]: Could not set offload features of vethaf56b2f: No such device
Aug 1 10:40:11 sentry-docker00.cs.umd.edu systemd-udevd[3843448]: Could not generate persistent MAC address for vethe071318: No such file or directory
Aug 1 10:40:11 sentry-docker00.cs.umd.edu systemd-udevd[3843449]: Could not generate persistent MAC address for veth4d85c68: No such file or directory
Aug 1 10:40:11 sentry-docker00.cs.umd.edu systemd-udevd[3843467]: Could not generate persistent MAC address for veth04fb033: No such file or directory
Aug 1 10:40:11 sentry-docker00.cs.umd.edu systemd-udevd[3843465]: Could not generate persistent MAC address for veth8c9d966: No such file or directory
Aug 1 10:40:11 sentry-docker00.cs.umd.edu systemd-udevd[3843476]: Could not generate persistent MAC address for vethd03f547: No such file or directory
Aug 1 10:40:11 sentry-docker00.cs.umd.edu systemd-udevd[3843477]: Could not generate persistent MAC address for veth4ecd976: No such file or directory
Aug 1 10:40:11 sentry-docker00.cs.umd.edu systemd-udevd[3843552]: Could not generate persistent MAC address for veth32664da: No such file or directory
Aug 1 10:40:11 sentry-docker00.cs.umd.edu systemd-udevd[3843553]: Could not generate persistent MAC address for veth208ad90: No such file or directory
Aug 1 10:43:19 sentry-docker00.cs.umd.edu systemd-udevd[3844992]: link_config: could not get ethtool features for veth83f7b38
Aug 1 10:43:19 sentry-docker00.cs.umd.edu systemd-udevd[3844992]: Could not set offload features of veth83f7b38: No such device
Aug 1 10:43:19 sentry-docker00.cs.umd.edu systemd-udevd[3845001]: Could not generate persistent MAC address for veth3f161c4: No such file or directory
Aug 1 10:43:19 sentry-docker00.cs.umd.edu systemd-udevd[3845002]: Could not generate persistent MAC address for vethcd34cfc: No such file or directory
Aug 1 11:00:19 sentry-docker00.cs.umd.edu systemd-udevd[3852871]: link_config: could not get ethtool features for veth04fb033
Aug 1 11:00:19 sentry-docker00.cs.umd.edu systemd-udevd[3852871]: Could not set offload features of veth04fb033: No such device
... 12 more distinct messages not shown
== soul (1 distinct, 2 total) ==
Aug 1 10:06:39 soul krb5_child[3004961]: Client 'admin(a)UMD.EDU' not found in Kerberos database [x2]
== strawberry (2 distinct, 8 total) ==
Aug 1 10:09:44 strawberry udisksd[1067]: Error performing housekeeping for drive /org/freedesktop/UDisks2/drives/ST2000DM001_1CH164_W1E8J5KJ: Error updating SMART data: Error sending ATA command CHECK POWER MODE: Unexpected sense data returned:#0120000: 00 00 00 00 00 00 00 00 00 00 00 00 00 00 00 00 ................#0120010: 00 00 00 00 00 00 00 00 00 00 00 00 00 00 00 00 ................#012 (g-io-error-quark, 0) [x6]
Aug 1 10:34:42 strawberry smartd[5314]: Device: /dev/sda [SAT], failed to read SMART Attribute Data [x2]
1
0
Command: /usr/local/sbin/syslog-digest.py
Time : 0.5029s
Status : exited 0
Output :
Syslog digest — 2026-08-01 10:05 EDT
Processed 4,773 lines, filtered 4,039 (84%). 734 unknown (105 distinct) from 19 host(s).
== abuse (1 distinct, 346 total) ==
Aug 1 09:05:06 abuse rsyslogd[21745]: imjournal: open() failed for path: '/var/lib/rsyslog/imjournal.state.tmp': Input/output error [v8.2404.0 try https://www.rsyslog.com/e/2433 ] [x346]
== b0b02.cs.umd.edu (1 distinct, 1 total) ==
Aug 1 09:40:27 b0b02.cs.umd.edu rustdesk[1715038]: cannot open display:
== cmsc436-0101-redis (6 distinct, 9 total) ==
Aug 1 09:28:22 cmsc436-0101-redis krb5_child[636603]: Client 'admin(a)UMD.EDU' not found in Kerberos database [x3]
Aug 1 09:28:24 cmsc436-0101-redis sshd-session[636599]: error: PAM: Authentication failure for admin from 116.99.172.125
Aug 1 09:30:10 cmsc436-0101-redis sshd-session[636765]: error: PAM: Authentication failure for root from 116.110.144.94 [x2]
Aug 1 09:46:15 cmsc436-0101-redis sshd-session[637298]: error: PAM: Authentication failure for root from 116.110.151.49
Aug 1 09:49:45 cmsc436-0101-redis sshd-session[637335]: error: PAM: Authentication failure for admin from 116.110.144.94
Aug 1 10:02:42 cmsc436-0101-redis sshd-session[638164]: error: PAM: Authentication failure for admin from 116.110.151.49
== contest (9 distinct, 42 total) ==
Aug 1 09:05:55 contest goferd[1007]: [ERROR][worker-0] gofer.messaging.adapter.connect:33 - connect: proton+amqps://satellite8.cs.umd.edu:5647, failed: Connection amqps://satellite8.cs.umd.edu:5647 disconnected: Condition('proton.pythonio', 'Connection refused to all addresses') [x34]
Aug 1 09:48:16 contest setroubleshoot[443765]: SELinux is preventing /usr/libexec/platform-python3.6 from create access on the directory libdnf.JdgXxg. For complete SELinux messages run: sealert -l cb6b25c6-4765-4cf2-88a0-9b3b508e94e9
Aug 1 09:48:16 contest setroubleshoot[443765]: SELinux is preventing /usr/bin/gpgconf from add_name access on the directory repodata. For complete SELinux messages run: sealert -l 41cf7b1b-0f34-4609-98f2-b66e7825fef7
Aug 1 09:48:16 contest setroubleshoot[443765]: SELinux is preventing /usr/libexec/platform-python3.6 from create access on the file mirrorlist. For complete SELinux messages run: sealert -l fc20ff92-ea83-4f38-a24b-ddfd737a3141
Aug 1 09:48:16 contest setroubleshoot[443765]: SELinux is preventing /usr/libexec/platform-python3.6 from setattr access on the file repomd.xml. For complete SELinux messages run: sealert -l ac675631-fa35-4e93-adc9-b692b18e53e5
Aug 1 09:48:16 contest setroubleshoot[443765]: SELinux is preventing /usr/libexec/platform-python3.6 from read access on the directory libdnf.JdgXxg. For complete SELinux messages run: sealert -l 45d103b6-0810-4890-a705-990118577ce8
Aug 1 09:48:21 contest setroubleshoot[443765]: SELinux is preventing /usr/libexec/platform-python3.6 from remove_name access on the directory repomd.xml. For complete SELinux messages run: sealert -l 7e499113-2fd7-4f67-bec6-3521efbe3637
Aug 1 09:48:24 contest setroubleshoot[443765]: SELinux is preventing rhsmcertd-worke from unlink access on the file repomd.xml. For complete SELinux messages run: sealert -l 22835727-7fef-4cfb-b3b5-881f66888317
Aug 1 09:48:37 contest setroubleshoot[443815]: SELinux is preventing /usr/libexec/platform-python3.6 from rmdir access on the directory repodata. For complete SELinux messages run: sealert -l 3928930b-a1ed-448d-950b-0665ac2adef8
== csfw00a (1 distinct, 166 total) ==
Aug 1 09:08:46 csfw00a kernel: bnxt_en 0000:09:00.0 eth3: NIC Link is Down [x166]
== hackerman (8 distinct, 13 total) ==
Aug 1 09:19:01 hackerman gnome-software[2060381]: failed to commit changes to dconf: GDBus.Error:org.gtk.GDBus.UnmappedGError.Quark._g_2dfile_2derror_2dquark.Code2: Failed to create file “/adminhomes/sajith/.config/dconf/user.YJ2XS3”: Permission denied
Aug 1 09:20:04 hackerman gnome-software[2060381]: can't reliably fixup error code 4 in domain g-io-error-quark: Not a directory [x4]
Aug 1 09:20:12 hackerman gnome-software[2060381]: Only 0 apps for recent list, hiding
Aug 1 09:20:29 hackerman gnome-software[2060381]: failed to commit changes to dconf: GDBus.Error:org.gtk.GDBus.UnmappedGError.Quark._g_2dfile_2derror_2dquark.Code2: Failed to create file “/adminhomes/sajith/.config/dconf/user.B11YS3”: Permission denied
Aug 1 09:20:29 hackerman packagekitd[2762738]: Failed to get cache filename for libreoffice [x2]
Aug 1 09:20:29 hackerman packagekitd[2762738]: Failed to get cache filename for kernel [x2]
Aug 1 09:20:39 hackerman packagekitd[2762738]: failed to parse public key for /etc/pki/rpm-gpg/RPM-GPG-KEY-PQC-redhat-release
Aug 1 09:32:25 hackerman systemd[1]: insights-client.service: Start request repeated too quickly.
== idm00 (1 distinct, 1 total) ==
Aug 1 09:51:15 idm00 named[1455]: client @0x7f33157d8918 10.73.240.42#64060: update '73.10.in-addr.arpa/IN' denied
== idmp0 (1 distinct, 1 total) ==
Aug 1 09:36:03 idmp0 named[5198]: client @0x7f9910040d98 10.73.240.43#53202: update '73.10.in-addr.arpa/IN' denied
== itmon02 (1 distinct, 31 total) ==
Aug 1 09:07:49 itmon02 sshd[1750555]: error: beginning MaxStartups throttling [x31]
== newhonors2 (1 distinct, 24 total) ==
Aug 1 09:13:03 newhonors2 dhcpcd[582735]: dhcpcd is not running [x24]
== outbound00.cs.umd.edu (1 distinct, 6 total) ==
Aug 1 09:09:08 outbound00.cs.umd.edu python3[1762992]: ldapdb [x6]
== outbound01.cs.umd.edu (1 distinct, 6 total) ==
Aug 1 09:13:06 outbound01.cs.umd.edu python3[3989030]: ldapdb [x6]
== quiss (2 distinct, 2 total) ==
Aug 1 09:06:05 quiss falcon-sensor-bpf[1284]: CrowdStrike(4): Could not retrieve DisableProxy value: c0000225
Aug 1 09:06:05 quiss falcon-sensor-bpf[1284]: CrowdStrike(4): ConnectWithProxy: Unable to get application proxy host from CsConfig: c0000225
== sentry-docker00.cs.umd.edu (40 distinct, 40 total) ==
Aug 1 09:19:37 sentry-docker00.cs.umd.edu systemd-udevd[3805383]: link_config: could not get ethtool features for veth69c907c
Aug 1 09:19:37 sentry-docker00.cs.umd.edu systemd-udevd[3805383]: Could not set offload features of veth69c907c: No such device
Aug 1 09:19:38 sentry-docker00.cs.umd.edu systemd-udevd[3805412]: Could not generate persistent MAC address for vethee3a768: No such file or directory
Aug 1 09:19:38 sentry-docker00.cs.umd.edu systemd-udevd[3805413]: Could not generate persistent MAC address for veth1506d47: No such file or directory
Aug 1 09:19:38 sentry-docker00.cs.umd.edu systemd-udevd[3805416]: Could not generate persistent MAC address for veth54bea7b: No such file or directory
Aug 1 09:19:38 sentry-docker00.cs.umd.edu systemd-udevd[3805417]: Could not generate persistent MAC address for vetha4884a1: No such file or directory
Aug 1 09:19:38 sentry-docker00.cs.umd.edu systemd-udevd[3805440]: Could not generate persistent MAC address for veth8193bc9: No such file or directory
Aug 1 09:19:38 sentry-docker00.cs.umd.edu systemd-udevd[3805441]: Could not generate persistent MAC address for vethc6fcd0b: No such file or directory
Aug 1 09:19:38 sentry-docker00.cs.umd.edu systemd-udevd[3805466]: Could not generate persistent MAC address for vethbb01537: No such file or directory
Aug 1 09:19:38 sentry-docker00.cs.umd.edu systemd-udevd[3805467]: Could not generate persistent MAC address for veth95f356a: No such file or directory
Aug 1 09:22:46 sentry-docker00.cs.umd.edu systemd-udevd[3807236]: link_config: could not get ethtool features for veth23783a0
Aug 1 09:22:46 sentry-docker00.cs.umd.edu systemd-udevd[3807236]: Could not set offload features of veth23783a0: No such device
Aug 1 09:22:46 sentry-docker00.cs.umd.edu systemd-udevd[3807252]: Could not generate persistent MAC address for veth8106772: No such file or directory
Aug 1 09:22:46 sentry-docker00.cs.umd.edu systemd-udevd[3807253]: Could not generate persistent MAC address for vethf2f59cb: No such file or directory
Aug 1 09:39:46 sentry-docker00.cs.umd.edu systemd-udevd[3815109]: link_config: could not get ethtool features for veth8193bc9
Aug 1 09:39:46 sentry-docker00.cs.umd.edu systemd-udevd[3815109]: Could not set offload features of veth8193bc9: No such device
Aug 1 09:39:46 sentry-docker00.cs.umd.edu systemd-udevd[3815138]: Could not generate persistent MAC address for vethe0c4c54: No such file or directory
Aug 1 09:39:46 sentry-docker00.cs.umd.edu systemd-udevd[3815139]: Could not generate persistent MAC address for veth085bde2: No such file or directory
Aug 1 09:39:46 sentry-docker00.cs.umd.edu systemd-udevd[3815142]: Could not generate persistent MAC address for veth74ea97f: No such file or directory
Aug 1 09:39:46 sentry-docker00.cs.umd.edu systemd-udevd[3815143]: Could not generate persistent MAC address for veth58e73b4: No such file or directory
Aug 1 09:39:46 sentry-docker00.cs.umd.edu systemd-udevd[3815142]: Could not generate persistent MAC address for veth47fed89: No such file or directory
Aug 1 09:39:46 sentry-docker00.cs.umd.edu systemd-udevd[3815162]: Could not generate persistent MAC address for veth49b6564: No such file or directory
Aug 1 09:39:46 sentry-docker00.cs.umd.edu systemd-udevd[3815161]: Could not generate persistent MAC address for vethbc2dcd4: No such file or directory
Aug 1 09:39:46 sentry-docker00.cs.umd.edu systemd-udevd[3815157]: Could not generate persistent MAC address for veth1aa65c8: No such file or directory
Aug 1 09:42:54 sentry-docker00.cs.umd.edu systemd-udevd[3816626]: link_config: could not get ethtool features for veth8106772
Aug 1 09:42:54 sentry-docker00.cs.umd.edu systemd-udevd[3816626]: Could not set offload features of veth8106772: No such device
Aug 1 09:42:54 sentry-docker00.cs.umd.edu systemd-udevd[3816642]: Could not generate persistent MAC address for vethe284f71: No such file or directory
Aug 1 09:42:54 sentry-docker00.cs.umd.edu systemd-udevd[3816643]: Could not generate persistent MAC address for vetha4227a0: No such file or directory
Aug 1 09:59:54 sentry-docker00.cs.umd.edu systemd-udevd[3824527]: link_config: could not get ethtool features for vethe0c4c54
Aug 1 09:59:54 sentry-docker00.cs.umd.edu systemd-udevd[3824527]: Could not set offload features of vethe0c4c54: No such device
... 10 more distinct messages not shown
== soul (1 distinct, 3 total) ==
Aug 1 09:29:16 soul krb5_child[3000003]: Client 'admin(a)UMD.EDU' not found in Kerberos database [x3]
== strawberry (2 distinct, 8 total) ==
Aug 1 09:09:44 strawberry udisksd[1067]: Error performing housekeeping for drive /org/freedesktop/UDisks2/drives/ST2000DM001_1CH164_W1E8J5KJ: Error updating SMART data: Error sending ATA command CHECK POWER MODE: Unexpected sense data returned:#0120000: 00 00 00 00 00 00 00 00 00 00 00 00 00 00 00 00 ................#0120010: 00 00 00 00 00 00 00 00 00 00 00 00 00 00 00 00 ................#012 (g-io-error-quark, 0) [x6]
Aug 1 09:34:42 strawberry smartd[5314]: Device: /dev/sda [SAT], failed to read SMART Attribute Data [x2]
== submit26-b9-2 (10 distinct, 14 total) ==
Aug 1 09:12:51 submit26-b9-2 setroubleshoot[766434]: SELinux is preventing /usr/bin/python3.9 from create access on the directory /(null). For complete SELinux messages run: sealert -l d506243c-d61e-48f3-b42a-4592c913deb0 [x2]
Aug 1 09:12:51 submit26-b9-2 setroubleshoot[766434]: SELinux is preventing /usr/bin/python3.9 from add_name access on the directory /(null). For complete SELinux messages run: sealert -l 3b4752ac-1b9a-4af9-a05b-32e4c2eb13ab [x2]
Aug 1 09:12:51 submit26-b9-2 setroubleshoot[766434]: SELinux is preventing /usr/bin/python3.9 from create access on the file /(null). For complete SELinux messages run: sealert -l 29e5adbd-4381-4467-b40d-a2219101e096
Aug 1 09:12:51 submit26-b9-2 setroubleshoot[766434]: SELinux is preventing /usr/bin/python3.9 from open access on the file /tmp/libdnf.ypc4G6/repodata/repomd.xml. For complete SELinux messages run: sealert -l 1b38f2ec-01ce-4343-8059-ba7494ecc5c4
Aug 1 09:12:51 submit26-b9-2 setroubleshoot[766434]: SELinux is preventing /usr/bin/python3.9 from setattr access on the file repomd.xml. For complete SELinux messages run: sealert -l e5f9af40-1f63-4924-b012-27ab2a7b2266
Aug 1 09:12:51 submit26-b9-2 setroubleshoot[766434]: SELinux is preventing /usr/bin/python3.9 from read access on the directory libdnf.ypc4G6. For complete SELinux messages run: sealert -l 5c54db87-54a3-4a7c-97b4-b5c48d6c3543
Aug 1 09:12:51 submit26-b9-2 setroubleshoot[766434]: SELinux is preventing /usr/bin/python3.9 from remove_name access on the directory repomd.xml. For complete SELinux messages run: sealert -l 63cd60e1-1e61-4276-afea-dd8526ffe8b2 [x2]
Aug 1 09:12:51 submit26-b9-2 setroubleshoot[766434]: SELinux is preventing /usr/bin/python3.9 from unlink access on the file repomd.xml. For complete SELinux messages run: sealert -l 81c7e9ec-e023-4c6d-b1ad-c02a242e655e
Aug 1 09:12:51 submit26-b9-2 setroubleshoot[766434]: SELinux is preventing /usr/bin/python3.9 from rmdir access on the directory repodata. For complete SELinux messages run: sealert -l 6ae9a597-e123-4d74-8eec-a8ebe0f5e4d0 [x2]
Aug 1 09:12:51 submit26-b9-2 setroubleshoot[766434]: SELinux is preventing /usr/bin/python3.9 from read access on the directory libdnf.sqWdfX. For complete SELinux messages run: sealert -l 5c54db87-54a3-4a7c-97b4-b5c48d6c3543
== submit26-b9-3 (9 distinct, 9 total) ==
Aug 1 09:20:37 submit26-b9-3 setroubleshoot[752722]: SELinux is preventing /usr/bin/python3.9 from create access on the directory /(null). For complete SELinux messages run: sealert -l 5b912a44-22fd-4560-b201-2a4e289b73f5
Aug 1 09:20:37 submit26-b9-3 setroubleshoot[752722]: SELinux is preventing /usr/bin/python3.9 from add_name access on the directory /(null). For complete SELinux messages run: sealert -l 7f1df1e4-725e-4953-98eb-1079f908f543
Aug 1 09:20:37 submit26-b9-3 setroubleshoot[752722]: SELinux is preventing /usr/bin/python3.9 from create access on the file /(null). For complete SELinux messages run: sealert -l 40b8852a-f77b-44b4-affe-5f11fa33de43
Aug 1 09:20:37 submit26-b9-3 setroubleshoot[752722]: SELinux is preventing /usr/bin/python3.9 from open access on the file /tmp/libdnf.hqJxrf/repodata/repomd.xml. For complete SELinux messages run: sealert -l 45a8019e-f6b5-4baa-92c1-862594b40d46
Aug 1 09:20:37 submit26-b9-3 setroubleshoot[752722]: SELinux is preventing /usr/bin/python3.9 from setattr access on the file repomd.xml. For complete SELinux messages run: sealert -l e9f0bfff-7784-4126-baa4-2bb06da56591
Aug 1 09:20:37 submit26-b9-3 setroubleshoot[752722]: SELinux is preventing /usr/bin/python3.9 from read access on the directory libdnf.hqJxrf. For complete SELinux messages run: sealert -l 0b17cc3d-cdc6-4fe2-a11f-3892e7c41dc7
Aug 1 09:20:37 submit26-b9-3 setroubleshoot[752722]: SELinux is preventing /usr/bin/python3.9 from remove_name access on the directory repomd.xml. For complete SELinux messages run: sealert -l 10e38c64-b65f-4cdd-901e-4375652d9a42
Aug 1 09:20:37 submit26-b9-3 setroubleshoot[752722]: SELinux is preventing /usr/bin/python3.9 from unlink access on the file repomd.xml. For complete SELinux messages run: sealert -l 7fd9cf72-ef38-48e1-b6aa-b571b26a7b22
Aug 1 09:20:37 submit26-b9-3 setroubleshoot[752722]: SELinux is preventing /usr/bin/python3.9 from rmdir access on the directory repodata. For complete SELinux messages run: sealert -l b9b11116-89bd-4a3c-980c-1d422c5dcee4
== submit26-clnb9 (9 distinct, 12 total) ==
Aug 1 09:31:55 submit26-clnb9 setroubleshoot[1630821]: SELinux is preventing /usr/bin/python3.9 from create access on the directory /(null). For complete SELinux messages run: sealert -l 6783ed2b-5ae4-42b5-975a-4bf50eec4658
Aug 1 09:31:56 submit26-clnb9 setroubleshoot[1630821]: SELinux is preventing /usr/bin/python3.9 from add_name access on the directory /(null). For complete SELinux messages run: sealert -l 9e7fa955-cc30-4804-ac8c-e1779e85946c
Aug 1 09:31:56 submit26-clnb9 setroubleshoot[1630821]: SELinux is preventing /usr/bin/python3.9 from create access on the file /(null). For complete SELinux messages run: sealert -l 69bfa6e3-089c-40ff-9563-fd30787d0774 [x2]
Aug 1 09:31:56 submit26-clnb9 setroubleshoot[1630821]: SELinux is preventing /usr/bin/python3.9 from open access on the file /tmp/libdnf.vhQcIc/repodata/repomd.xml. For complete SELinux messages run: sealert -l 001acdb5-31ef-4e52-b10b-90f467a89ddc [x2]
Aug 1 09:31:56 submit26-clnb9 setroubleshoot[1630821]: SELinux is preventing /usr/bin/python3.9 from setattr access on the file repomd.xml. For complete SELinux messages run: sealert -l edacddcf-16ed-4dc3-8d82-7c597d5dee23 [x2]
Aug 1 09:31:56 submit26-clnb9 setroubleshoot[1630821]: SELinux is preventing /usr/bin/python3.9 from read access on the directory libdnf.vhQcIc. For complete SELinux messages run: sealert -l 62b3782e-4730-4488-8178-94dafe9b552c
Aug 1 09:31:56 submit26-clnb9 setroubleshoot[1630821]: SELinux is preventing /usr/bin/python3.9 from remove_name access on the directory repomd.xml. For complete SELinux messages run: sealert -l 81cb3698-78f8-440a-8e3c-e5d1041e6b78
Aug 1 09:31:56 submit26-clnb9 setroubleshoot[1630821]: SELinux is preventing /usr/bin/python3.9 from unlink access on the file repomd.xml. For complete SELinux messages run: sealert -l 792b472a-115c-4799-9805-fc7436f916b9
Aug 1 09:31:56 submit26-clnb9 setroubleshoot[1630821]: SELinux is preventing /usr/bin/python3.9 from rmdir access on the directory repodata. For complete SELinux messages run: sealert -l 15c83a86-837b-41e2-b662-b39cd4e361cb
1
0
Command: /usr/local/sbin/syslog-digest.py
Time : 0.4586s
Status : exited 0
Output :
Syslog digest — 2026-08-01 09:05 EDT
Processed 3,851 lines, filtered 3,292 (85%). 559 unknown (83 distinct) from 23 host(s).
== abuse (1 distinct, 346 total) ==
Aug 1 08:05:06 abuse rsyslogd[21745]: imjournal: open() failed for path: '/var/lib/rsyslog/imjournal.state.tmp': Input/output error [v8.2404.0 try https://www.rsyslog.com/e/2433 ] [x346]
== b0b02.cs.umd.edu (2 distinct, 2 total) ==
Aug 1 08:28:45 b0b02.cs.umd.edu systemd[1]: insights-client.service: Start request repeated too quickly.
Aug 1 08:40:24 b0b02.cs.umd.edu rustdesk[1700002]: cannot open display:
== biggulp.cs.umd.edu (2 distinct, 3 total) ==
Aug 1 08:37:33 biggulp.cs.umd.edu sshd-session[2035677]: error: Protocol major versions differ: 2 vs. 1
Aug 1 08:40:10 biggulp.cs.umd.edu sshd-session[2036189]: error: send_error: write: Connection reset by peer [x2]
== cmsc436-0101-redis (1 distinct, 1 total) ==
Aug 1 08:35:00 cmsc436-0101-redis sshd-session[634793]: error: Protocol major versions differ: 2 vs. 1
== contest (1 distinct, 34 total) ==
Aug 1 08:05:13 contest goferd[1007]: [ERROR][worker-0] gofer.messaging.adapter.connect:33 - connect: proton+amqps://satellite8.cs.umd.edu:5647, failed: Connection amqps://satellite8.cs.umd.edu:5647 disconnected: Condition('proton.pythonio', 'Connection refused to all addresses') [x34]
== csfw00a (1 distinct, 20 total) ==
Aug 1 08:07:29 csfw00a kernel: bnxt_en 0000:09:00.0 eth3: NIC Link is Down [x20]
== emaar (1 distinct, 1 total) ==
Aug 1 08:43:21 emaar puppet-agent[2705709]: (Facter) invalid or malformed lldp data: MalformedDataError: no lldp interface data found
== hackerman (6 distinct, 11 total) ==
Aug 1 08:20:04 hackerman gnome-software[2060381]: can't reliably fixup error code 4 in domain g-io-error-quark: Not a directory [x4]
Aug 1 08:20:12 hackerman gnome-software[2060381]: Only 0 apps for recent list, hiding
Aug 1 08:20:27 hackerman gnome-software[2060381]: failed to commit changes to dconf: GDBus.Error:org.gtk.GDBus.UnmappedGError.Quark._g_2dfile_2derror_2dquark.Code2: Failed to create file “/adminhomes/sajith/.config/dconf/user.SYQWS3”: Permission denied
Aug 1 08:20:28 hackerman packagekitd[2749042]: Failed to get cache filename for libreoffice [x2]
Aug 1 08:20:28 hackerman packagekitd[2749042]: Failed to get cache filename for kernel [x2]
Aug 1 08:20:37 hackerman packagekitd[2749042]: failed to parse public key for /etc/pki/rpm-gpg/RPM-GPG-KEY-PQC-redhat-release
== idm00 (1 distinct, 1 total) ==
Aug 1 08:51:14 idm00 named[1455]: client @0x7f3304129f58 10.73.240.42#53772: update '73.10.in-addr.arpa/IN' denied
== idmp0 (1 distinct, 1 total) ==
Aug 1 08:36:03 idmp0 named[5198]: client @0x7f990c058998 10.73.240.43#63827: update '73.10.in-addr.arpa/IN' denied
== itmon02 (1 distinct, 35 total) ==
Aug 1 08:07:48 itmon02 sshd[1750555]: error: beginning MaxStartups throttling [x35]
== krispykreme.cs.umd.edu (1 distinct, 1 total) ==
Aug 1 09:03:10 krispykreme.cs.umd.edu sshd-session[1943951]: error: send_error: write: Connection reset by peer
== matrix (1 distinct, 1 total) ==
Aug 1 08:36:49 matrix sshd[3451307]: error: Protocol major versions differ: 2 vs. 1
== mcstic (1 distinct, 1 total) ==
Aug 1 08:39:13 mcstic sshd[1960236]: error: Protocol major versions differ: 2 vs. 1
== netman.cs.umd.edu (4 distinct, 4 total) ==
Aug 1 08:29:59 netman.cs.umd.edu setroubleshoot[3636482]: SELinux is preventing /usr/bin/gpg from read access on the file gpg.conf. For complete SELinux messages run: sealert -l 019ad1da-a874-4814-8037-3b3e5f413ad2
Aug 1 08:30:00 netman.cs.umd.edu setroubleshoot[3636482]: SELinux is preventing /usr/bin/gpg from open access on the file /root/.gnupg/gpg.conf. For complete SELinux messages run: sealert -l cb54177e-d44c-46a1-b246-5c0bbb8343be
Aug 1 08:30:12 netman.cs.umd.edu setroubleshoot[3636482]: SELinux is preventing /usr/bin/gpg from getattr access on the file /root/.gnupg/gpg.conf. For complete SELinux messages run: sealert -l fbba2e30-b7ab-491c-9ec6-f553e9ef72af
Aug 1 08:39:17 netman.cs.umd.edu sshd[3638928]: error: Protocol major versions differ: 2 vs. 1
== newhonors2 (1 distinct, 24 total) ==
Aug 1 08:13:03 newhonors2 dhcpcd[580281]: dhcpcd is not running [x24]
== outbound00.cs.umd.edu (2 distinct, 7 total) ==
Aug 1 08:09:09 outbound00.cs.umd.edu python3[1749135]: ldapdb [x6]
Aug 1 08:37:29 outbound00.cs.umd.edu sshd-session[1755639]: error: Protocol major versions differ: 2 vs. 1
== outbound01.cs.umd.edu (2 distinct, 7 total) ==
Aug 1 08:13:06 outbound01.cs.umd.edu python3[3975120]: ldapdb [x6]
Aug 1 08:35:00 outbound01.cs.umd.edu sshd-session[3980324]: error: Protocol major versions differ: 2 vs. 1
== sentry-docker00.cs.umd.edu (40 distinct, 40 total) ==
Aug 1 08:19:12 sentry-docker00.cs.umd.edu systemd-udevd[3775589]: link_config: could not get ethtool features for veth3b26053
Aug 1 08:19:12 sentry-docker00.cs.umd.edu systemd-udevd[3775589]: Could not set offload features of veth3b26053: No such device
Aug 1 08:19:13 sentry-docker00.cs.umd.edu systemd-udevd[3775612]: Could not generate persistent MAC address for veth5ecd721: No such file or directory
Aug 1 08:19:13 sentry-docker00.cs.umd.edu systemd-udevd[3775613]: Could not generate persistent MAC address for veth0701f79: No such file or directory
Aug 1 08:19:13 sentry-docker00.cs.umd.edu systemd-udevd[3775616]: Could not generate persistent MAC address for veth537b071: No such file or directory
Aug 1 08:19:13 sentry-docker00.cs.umd.edu systemd-udevd[3775617]: Could not generate persistent MAC address for veth569a388: No such file or directory
Aug 1 08:19:13 sentry-docker00.cs.umd.edu systemd-udevd[3775620]: Could not generate persistent MAC address for veth440b8d5: No such file or directory
Aug 1 08:19:13 sentry-docker00.cs.umd.edu systemd-udevd[3775622]: Could not generate persistent MAC address for vetha1cf720: No such file or directory
Aug 1 08:19:13 sentry-docker00.cs.umd.edu systemd-udevd[3775622]: Could not generate persistent MAC address for veth597bbfd: No such file or directory
Aug 1 08:19:13 sentry-docker00.cs.umd.edu systemd-udevd[3775620]: Could not generate persistent MAC address for vethef5a8cd: No such file or directory
Aug 1 08:22:21 sentry-docker00.cs.umd.edu systemd-udevd[3777158]: link_config: could not get ethtool features for veth30800d1
Aug 1 08:22:21 sentry-docker00.cs.umd.edu systemd-udevd[3777158]: Could not set offload features of veth30800d1: No such device
Aug 1 08:22:21 sentry-docker00.cs.umd.edu systemd-udevd[3777176]: Could not generate persistent MAC address for vetha152532: No such file or directory
Aug 1 08:22:21 sentry-docker00.cs.umd.edu systemd-udevd[3777177]: Could not generate persistent MAC address for veth45d985f: No such file or directory
Aug 1 08:39:21 sentry-docker00.cs.umd.edu systemd-udevd[3784970]: link_config: could not get ethtool features for veth5ecd721
Aug 1 08:39:21 sentry-docker00.cs.umd.edu systemd-udevd[3784970]: Could not set offload features of veth5ecd721: No such device
Aug 1 08:39:21 sentry-docker00.cs.umd.edu systemd-udevd[3785051]: Could not generate persistent MAC address for veth3d882df: No such file or directory
Aug 1 08:39:21 sentry-docker00.cs.umd.edu systemd-udevd[3785052]: Could not generate persistent MAC address for veth757b3a2: No such file or directory
Aug 1 08:39:21 sentry-docker00.cs.umd.edu systemd-udevd[3785091]: Could not generate persistent MAC address for vethef00a46: No such file or directory
Aug 1 08:39:21 sentry-docker00.cs.umd.edu systemd-udevd[3785092]: Could not generate persistent MAC address for veth9153a8c: No such file or directory
Aug 1 08:39:21 sentry-docker00.cs.umd.edu systemd-udevd[3785092]: Could not generate persistent MAC address for veth358ba31: No such file or directory
Aug 1 08:39:21 sentry-docker00.cs.umd.edu systemd-udevd[3785097]: Could not generate persistent MAC address for vethd286dd6: No such file or directory
Aug 1 08:39:21 sentry-docker00.cs.umd.edu systemd-udevd[3785092]: Could not generate persistent MAC address for vethc2e79ec: No such file or directory
Aug 1 08:39:21 sentry-docker00.cs.umd.edu systemd-udevd[3785099]: Could not generate persistent MAC address for veth1425eea: No such file or directory
Aug 1 08:42:29 sentry-docker00.cs.umd.edu systemd-udevd[3786608]: Could not generate persistent MAC address for veth5fb683c: No such file or directory
Aug 1 08:42:29 sentry-docker00.cs.umd.edu systemd-udevd[3786609]: Could not generate persistent MAC address for veth3ad514e: No such file or directory
Aug 1 08:59:29 sentry-docker00.cs.umd.edu systemd-udevd[3795888]: link_config: could not get ethtool features for vethef00a46
Aug 1 08:59:29 sentry-docker00.cs.umd.edu systemd-udevd[3795888]: Could not set offload features of vethef00a46: No such device
Aug 1 08:59:29 sentry-docker00.cs.umd.edu systemd-udevd[3795955]: Could not generate persistent MAC address for veth86200a9: No such file or directory
Aug 1 08:59:29 sentry-docker00.cs.umd.edu systemd-udevd[3795956]: Could not generate persistent MAC address for veth081b34d: No such file or directory
... 10 more distinct messages not shown
== smokeping-slave (1 distinct, 1 total) ==
Aug 1 08:58:18 smokeping-slave nologin[420361]: Attempted login by UNKNOWN (UID: 65534) on UNKNOWN
== strawberry (2 distinct, 8 total) ==
Aug 1 08:09:44 strawberry udisksd[1067]: Error performing housekeeping for drive /org/freedesktop/UDisks2/drives/ST2000DM001_1CH164_W1E8J5KJ: Error updating SMART data: Error sending ATA command CHECK POWER MODE: Unexpected sense data returned:#0120000: 00 00 00 00 00 00 00 00 00 00 00 00 00 00 00 00 ................#0120010: 00 00 00 00 00 00 00 00 00 00 00 00 00 00 00 00 ................#012 (g-io-error-quark, 0) [x6]
Aug 1 08:34:42 strawberry smartd[5314]: Device: /dev/sda [SAT], failed to read SMART Attribute Data [x2]
== submit26-b9-4 (9 distinct, 9 total) ==
Aug 1 08:15:28 submit26-b9-4 setroubleshoot[770684]: SELinux is preventing /usr/bin/python3.9 from create access on the directory /(null). For complete SELinux messages run: sealert -l a4e66030-8621-4da9-bd27-5988bb1bf8ad
Aug 1 08:15:28 submit26-b9-4 setroubleshoot[770684]: SELinux is preventing /usr/bin/python3.9 from add_name access on the directory /(null). For complete SELinux messages run: sealert -l c055e37d-bbf5-4800-9083-d606f792c8c1
Aug 1 08:15:28 submit26-b9-4 setroubleshoot[770684]: SELinux is preventing /usr/bin/python3.9 from create access on the file /(null). For complete SELinux messages run: sealert -l e5bc3a56-6d6f-4776-954f-ddde1579648f
Aug 1 08:15:28 submit26-b9-4 setroubleshoot[770684]: SELinux is preventing /usr/bin/python3.9 from open access on the file /tmp/libdnf.PegQ32/repodata/repomd.xml. For complete SELinux messages run: sealert -l a8ec5e1b-49f9-4fbc-a8ae-22e800f7abf2
Aug 1 08:15:28 submit26-b9-4 setroubleshoot[770684]: SELinux is preventing /usr/bin/python3.9 from setattr access on the file repomd.xml. For complete SELinux messages run: sealert -l 945db714-d0c0-4402-911e-932978b8b036
Aug 1 08:15:28 submit26-b9-4 setroubleshoot[770684]: SELinux is preventing /usr/bin/python3.9 from read access on the directory libdnf.PegQ32. For complete SELinux messages run: sealert -l 463998a0-fb0d-463c-82b1-471135710a14
Aug 1 08:15:28 submit26-b9-4 setroubleshoot[770684]: SELinux is preventing /usr/bin/python3.9 from remove_name access on the directory repomd.xml. For complete SELinux messages run: sealert -l 473d2e21-15d8-407a-a9ee-2b842607fa00
Aug 1 08:15:28 submit26-b9-4 setroubleshoot[770684]: SELinux is preventing /usr/bin/python3.9 from unlink access on the file repomd.xml. For complete SELinux messages run: sealert -l 80c54d4f-bf4b-4501-addb-1627383587d0
Aug 1 08:15:28 submit26-b9-4 setroubleshoot[770684]: SELinux is preventing /usr/bin/python3.9 from rmdir access on the directory repodata. For complete SELinux messages run: sealert -l c63d3890-151e-49a0-83f0-3dfb69d051e5
== teaching-awards (1 distinct, 1 total) ==
Aug 1 08:35:00 teaching-awards sshd-session[1699918]: error: Protocol major versions differ: 2 vs. 1
1
0
Command: /usr/local/sbin/syslog-digest.py
Time : 0.4619s
Status : exited 0
Output :
Syslog digest — 2026-08-01 08:05 EDT
Processed 3,852 lines, filtered 3,222 (83%). 630 unknown (89 distinct) from 20 host(s).
== abuse (1 distinct, 346 total) ==
Aug 1 07:05:06 abuse rsyslogd[21745]: imjournal: open() failed for path: '/var/lib/rsyslog/imjournal.state.tmp': Input/output error [v8.2404.0 try https://www.rsyslog.com/e/2433 ] [x346]
== b0b02.cs.umd.edu (4 distinct, 5 total) ==
Aug 1 07:28:46 b0b02.cs.umd.edu setroubleshoot[1681488]: SELinux is preventing /usr/bin/python3.9 from getattr access on the file /etc/authselect/nsswitch.conf. For complete SELinux messages run: sealert -l 9a1e2952-3fde-4937-a8ab-f7f59791a458 [x2]
Aug 1 07:28:48 b0b02.cs.umd.edu setroubleshoot[1681488]: SELinux is preventing /usr/bin/python3.9 from read access on the file /etc/authselect/nsswitch.conf. For complete SELinux messages run: sealert -l 97d74423-e027-4cd6-8810-ad80944900b5
Aug 1 07:28:51 b0b02.cs.umd.edu setroubleshoot[1681488]: SELinux is preventing /usr/bin/python3.9 from open access on the file /etc/authselect/nsswitch.conf. For complete SELinux messages run: sealert -l 4f253f6a-62d6-46dd-8eaf-0b4d29df41c6
Aug 1 07:40:20 b0b02.cs.umd.edu rustdesk[1684794]: cannot open display:
== bac102 (6 distinct, 8 total) ==
Aug 1 07:30:15 bac102 systemd-resolved[902]: Using degraded feature set UDP instead of UDP+EDNS0 for DNS server 10.73.244.11. [x2]
Aug 1 07:30:15 bac102 systemd-resolved[902]: Using degraded feature set UDP instead of UDP+EDNS0 for DNS server 10.211.55.1.
Aug 1 07:30:26 bac102 systemd-resolved[902]: Using degraded feature set UDP instead of UDP+EDNS0 for DNS server 10.73.244.10. [x2]
Aug 1 07:30:26 bac102 systemd-resolved[902]: Using degraded feature set TCP instead of UDP for DNS server 10.211.55.1.
Aug 1 07:30:31 bac102 systemd-resolved[902]: Using degraded feature set TCP instead of UDP for DNS server 10.73.244.11.
Aug 1 07:58:52 bac102 systemd-resolved[902]: Using degraded feature set UDP instead of UDP+EDNS0 for DNS server 10.73.244.100.
== contest (1 distinct, 33 total) ==
Aug 1 07:06:18 contest goferd[1007]: [ERROR][worker-0] gofer.messaging.adapter.connect:33 - connect: proton+amqps://satellite8.cs.umd.edu:5647, failed: Connection amqps://satellite8.cs.umd.edu:5647 disconnected: Condition('proton.pythonio', 'Connection refused to all addresses') [x33]
== csfw00a (1 distinct, 20 total) ==
Aug 1 07:04:49 csfw00a kernel: bnxt_en 0000:09:00.0 eth3: NIC Link is Down [x20]
== dojo (2 distinct, 2 total) ==
Aug 1 07:38:09 dojo nologin[804786]: Attempted login by UNKNOWN (UID: 65534) on UNKNOWN
Aug 1 07:38:21 dojo puppet-agent[804787]: The current total number of fact values: 17067 exceeds the fact values limit: 10240
== emaar (1 distinct, 1 total) ==
Aug 1 07:17:18 emaar systemd[1]: insights-client.service: Start request repeated too quickly.
== hackerman (7 distinct, 12 total) ==
Aug 1 07:19:00 hackerman gnome-software[2060381]: failed to commit changes to dconf: GDBus.Error:org.gtk.GDBus.UnmappedGError.Quark._g_2dfile_2derror_2dquark.Code2: Failed to create file “/adminhomes/sajith/.config/dconf/user.MV92S3”: Permission denied
Aug 1 07:20:04 hackerman gnome-software[2060381]: can't reliably fixup error code 4 in domain g-io-error-quark: Not a directory [x4]
Aug 1 07:20:12 hackerman gnome-software[2060381]: Only 0 apps for recent list, hiding
Aug 1 07:20:27 hackerman packagekitd[2735475]: Failed to get cache filename for libreoffice [x2]
Aug 1 07:20:27 hackerman packagekitd[2735475]: Failed to get cache filename for kernel [x2]
Aug 1 07:20:29 hackerman gnome-software[2060381]: failed to commit changes to dconf: GDBus.Error:org.gtk.GDBus.UnmappedGError.Quark._g_2dfile_2derror_2dquark.Code2: Failed to create file “/adminhomes/sajith/.config/dconf/user.R0GAT3”: Permission denied
Aug 1 07:20:37 hackerman packagekitd[2735475]: failed to parse public key for /etc/pki/rpm-gpg/RPM-GPG-KEY-PQC-redhat-release
== hazfs.cs.umd.edu (11 distinct, 66 total) ==
Aug 1 07:50:08 hazfs.cs.umd.edu snmpd[1431]: send response: Failure in sendto [x6]
Aug 1 07:50:08 hazfs.cs.umd.edu snmpd[1431]: -- NET-SNMP-EXTEND-MIB::nsExtendStatus."userweb" [x6]
Aug 1 07:50:08 hazfs.cs.umd.edu snmpd[1431]: -- NET-SNMP-EXTEND-MIB::nsExtendStatus."zfslist" [x6]
Aug 1 07:50:08 hazfs.cs.umd.edu snmpd[1431]: -- NET-SNMP-EXTEND-MIB::nsExtendStatus."userhome" [x6]
Aug 1 07:50:08 hazfs.cs.umd.edu snmpd[1431]: -- NET-SNMP-EXTEND-MIB::nsExtendOutput1Line."userweb" [x6]
Aug 1 07:50:08 hazfs.cs.umd.edu snmpd[1431]: -- NET-SNMP-EXTEND-MIB::nsExtendOutput1Line."zfslist" [x6]
Aug 1 07:50:08 hazfs.cs.umd.edu snmpd[1431]: -- NET-SNMP-EXTEND-MIB::nsExtendOutput1Line."userhome" [x6]
Aug 1 07:50:08 hazfs.cs.umd.edu snmpd[1431]: -- NET-SNMP-EXTEND-MIB::nsExtendOutputFull."userweb" [x6]
Aug 1 07:50:08 hazfs.cs.umd.edu snmpd[1431]: -- NET-SNMP-EXTEND-MIB::nsExtendOutputFull."zfslist" [x6]
Aug 1 07:50:08 hazfs.cs.umd.edu snmpd[1431]: -- NET-SNMP-EXTEND-MIB::nsExtendOutputFull."userhome" [x6]
Aug 1 07:50:08 hazfs.cs.umd.edu snmpd[1431]: -- NET-SNMP-EXTEND-MIB::nsExtendOutNumLines."userweb" [x6]
== idm00 (1 distinct, 1 total) ==
Aug 1 07:51:14 idm00 named[1455]: client @0x7f330423d388 10.73.240.42#60143: update '73.10.in-addr.arpa/IN' denied
== idmp0 (1 distinct, 1 total) ==
Aug 1 07:36:03 idmp0 named[5198]: client @0x7f991c03bb68 10.73.240.43#51650: update '73.10.in-addr.arpa/IN' denied
== irb2156 (3 distinct, 3 total) ==
Aug 1 07:29:28 irb2156 systemd-resolved[3398]: Using degraded feature set UDP instead of UDP+EDNS0 for DNS server 128.8.74.3.
Aug 1 07:29:33 irb2156 systemd-resolved[3398]: Using degraded feature set UDP instead of UDP+EDNS0 for DNS server 128.8.76.3.
Aug 1 07:29:59 irb2156 systemd-resolved[3398]: Using degraded feature set TCP instead of UDP for DNS server 128.8.74.3.
== itmon02 (1 distinct, 44 total) ==
Aug 1 07:08:05 itmon02 sshd[1750555]: error: beginning MaxStartups throttling [x44]
== newhonors2 (1 distinct, 24 total) ==
Aug 1 07:13:03 newhonors2 dhcpcd[578438]: dhcpcd is not running [x24]
== outbound00.cs.umd.edu (1 distinct, 6 total) ==
Aug 1 07:09:09 outbound00.cs.umd.edu python3[1735284]: ldapdb [x6]
== outbound01.cs.umd.edu (1 distinct, 6 total) ==
Aug 1 07:13:06 outbound01.cs.umd.edu python3[3961280]: ldapdb [x6]
== sebatinsky.cs.umd.edu (1 distinct, 1 total) ==
Aug 1 08:03:36 sebatinsky.cs.umd.edu setroubleshoot[792437]: SELinux is preventing /usr/sbin/pdns_server from name_bind access on the udp_socket port 16514. For complete SELinux messages run: sealert -l c40f9216-4e23-4184-838a-6a4f5ec6ccb3
== sentry-docker00.cs.umd.edu (42 distinct, 42 total) ==
Aug 1 07:18:47 sentry-docker00.cs.umd.edu systemd-udevd[3747165]: link_config: could not get ethtool features for veth76d939f
Aug 1 07:18:47 sentry-docker00.cs.umd.edu systemd-udevd[3747165]: Could not set offload features of veth76d939f: No such device
Aug 1 07:18:47 sentry-docker00.cs.umd.edu systemd-udevd[3747241]: link_config: could not get ethtool features for vetha4b4340
Aug 1 07:18:47 sentry-docker00.cs.umd.edu systemd-udevd[3747241]: Could not set offload features of vetha4b4340: No such device
Aug 1 07:18:48 sentry-docker00.cs.umd.edu systemd-udevd[3747263]: Could not generate persistent MAC address for vethecbaca6: No such file or directory
Aug 1 07:18:48 sentry-docker00.cs.umd.edu systemd-udevd[3747264]: Could not generate persistent MAC address for veth011ba18: No such file or directory
Aug 1 07:18:48 sentry-docker00.cs.umd.edu systemd-udevd[3747267]: Could not generate persistent MAC address for veth8a395f3: No such file or directory
Aug 1 07:18:48 sentry-docker00.cs.umd.edu systemd-udevd[3747268]: Could not generate persistent MAC address for veth0a9af1e: No such file or directory
Aug 1 07:18:48 sentry-docker00.cs.umd.edu systemd-udevd[3747291]: Could not generate persistent MAC address for vethcb16ca8: No such file or directory
Aug 1 07:18:48 sentry-docker00.cs.umd.edu systemd-udevd[3747293]: Could not generate persistent MAC address for vethf459ffd: No such file or directory
Aug 1 07:18:48 sentry-docker00.cs.umd.edu systemd-udevd[3747343]: Could not generate persistent MAC address for veth39fe006: No such file or directory
Aug 1 07:18:48 sentry-docker00.cs.umd.edu systemd-udevd[3747346]: Could not generate persistent MAC address for vethd5da593: No such file or directory
Aug 1 07:21:56 sentry-docker00.cs.umd.edu systemd-udevd[3748831]: link_config: could not get ethtool features for veth975fabc
Aug 1 07:21:56 sentry-docker00.cs.umd.edu systemd-udevd[3748831]: Could not set offload features of veth975fabc: No such device
Aug 1 07:21:56 sentry-docker00.cs.umd.edu systemd-udevd[3748847]: Could not generate persistent MAC address for vetha0e070d: No such file or directory
Aug 1 07:21:56 sentry-docker00.cs.umd.edu systemd-udevd[3748848]: Could not generate persistent MAC address for veth6184d15: No such file or directory
Aug 1 07:38:56 sentry-docker00.cs.umd.edu systemd-udevd[3756725]: link_config: could not get ethtool features for vethecbaca6
Aug 1 07:38:56 sentry-docker00.cs.umd.edu systemd-udevd[3756725]: Could not set offload features of vethecbaca6: No such device
Aug 1 07:38:56 sentry-docker00.cs.umd.edu systemd-udevd[3756749]: Could not generate persistent MAC address for veth31e7ede: No such file or directory
Aug 1 07:38:56 sentry-docker00.cs.umd.edu systemd-udevd[3756750]: Could not generate persistent MAC address for vethaa10c39: No such file or directory
Aug 1 07:38:56 sentry-docker00.cs.umd.edu systemd-udevd[3756753]: Could not generate persistent MAC address for veth1ca10de: No such file or directory
Aug 1 07:38:56 sentry-docker00.cs.umd.edu systemd-udevd[3756754]: Could not generate persistent MAC address for veth5c5bf71: No such file or directory
Aug 1 07:38:56 sentry-docker00.cs.umd.edu systemd-udevd[3756750]: Could not generate persistent MAC address for veth03b72d4: No such file or directory
Aug 1 07:38:56 sentry-docker00.cs.umd.edu systemd-udevd[3756769]: Could not generate persistent MAC address for veth6b6c32f: No such file or directory
Aug 1 07:38:56 sentry-docker00.cs.umd.edu systemd-udevd[3756750]: Could not generate persistent MAC address for veth75fde62: No such file or directory
Aug 1 07:38:56 sentry-docker00.cs.umd.edu systemd-udevd[3756769]: Could not generate persistent MAC address for vethbbbc156: No such file or directory
Aug 1 07:42:04 sentry-docker00.cs.umd.edu systemd-udevd[3758283]: Could not generate persistent MAC address for veth287b30a: No such file or directory
Aug 1 07:42:04 sentry-docker00.cs.umd.edu systemd-udevd[3758284]: Could not generate persistent MAC address for veth88bd12e: No such file or directory
Aug 1 07:59:04 sentry-docker00.cs.umd.edu systemd-udevd[3766127]: link_config: could not get ethtool features for veth03b72d4
Aug 1 07:59:04 sentry-docker00.cs.umd.edu systemd-udevd[3766127]: Could not set offload features of veth03b72d4: No such device
... 12 more distinct messages not shown
== strawberry (2 distinct, 8 total) ==
Aug 1 07:09:44 strawberry udisksd[1067]: Error performing housekeeping for drive /org/freedesktop/UDisks2/drives/ST2000DM001_1CH164_W1E8J5KJ: Error updating SMART data: Error sending ATA command CHECK POWER MODE: Unexpected sense data returned:#0120000: 00 00 00 00 00 00 00 00 00 00 00 00 00 00 00 00 ................#0120010: 00 00 00 00 00 00 00 00 00 00 00 00 00 00 00 00 ................#012 (g-io-error-quark, 0) [x6]
Aug 1 07:34:42 strawberry smartd[5314]: Device: /dev/sda [SAT], failed to read SMART Attribute Data [x2]
== submit10-cln25 (1 distinct, 1 total) ==
Aug 1 07:37:01 submit10-cln25 systemd: Failed at step EXEC spawning /usr/local/bin/cronjob: No such file or directory
1
0
Command: /usr/local/sbin/syslog-digest.py
Time : 0.5186s
Status : exited 0
Output :
Syslog digest — 2026-08-01 07:05 EDT
Processed 4,357 lines, filtered 3,486 (80%). 871 unknown (127 distinct) from 20 host(s).
== abadi-computer (2 distinct, 2 total) ==
Aug 1 06:15:00 abadi-computer nologin[546756]: Attempted login by UNKNOWN (UID: 65534) on UNKNOWN
Aug 1 06:15:00 abadi-computer pipewire[546755]: mod.jackdbus-detect: Failed to receive jackdbus reply: org.freedesktop.DBus.Error.ServiceUnknown: The name org.jackaudio.service was not provided by any .service files
== abuse (1 distinct, 346 total) ==
Aug 1 06:05:06 abuse rsyslogd[21745]: imjournal: open() failed for path: '/var/lib/rsyslog/imjournal.state.tmp': Input/output error [v8.2404.0 try https://www.rsyslog.com/e/2433 ] [x346]
== b0b02.cs.umd.edu (4 distinct, 4 total) ==
Aug 1 06:28:42 b0b02.cs.umd.edu setroubleshoot[1665425]: SELinux is preventing /usr/bin/python3.9 from getattr access on the file /etc/authselect/nsswitch.conf. For complete SELinux messages run: sealert -l 9a1e2952-3fde-4937-a8ab-f7f59791a458
Aug 1 06:28:45 b0b02.cs.umd.edu setroubleshoot[1665425]: SELinux is preventing /usr/bin/python3.9 from read access on the file /etc/authselect/nsswitch.conf. For complete SELinux messages run: sealert -l 97d74423-e027-4cd6-8810-ad80944900b5
Aug 1 06:28:48 b0b02.cs.umd.edu setroubleshoot[1665425]: SELinux is preventing /usr/bin/python3.9 from open access on the file /etc/authselect/nsswitch.conf. For complete SELinux messages run: sealert -l 4f253f6a-62d6-46dd-8eaf-0b4d29df41c6
Aug 1 06:40:16 b0b02.cs.umd.edu rustdesk[1668735]: cannot open display:
== contest (1 distinct, 34 total) ==
Aug 1 06:05:36 contest goferd[1007]: [ERROR][worker-0] gofer.messaging.adapter.connect:33 - connect: proton+amqps://satellite8.cs.umd.edu:5647, failed: Connection amqps://satellite8.cs.umd.edu:5647 disconnected: Condition('proton.pythonio', 'Connection refused to all addresses') [x34]
== csfw00a (1 distinct, 198 total) ==
Aug 1 06:13:13 csfw00a kernel: bnxt_en 0000:09:00.0 eth3: NIC Link is Down [x198]
== hackerman (6 distinct, 11 total) ==
Aug 1 06:20:04 hackerman gnome-software[2060381]: can't reliably fixup error code 4 in domain g-io-error-quark: Not a directory [x4]
Aug 1 06:20:13 hackerman gnome-software[2060381]: Only 0 apps for recent list, hiding
Aug 1 06:20:33 hackerman packagekitd[2721848]: Failed to get cache filename for libreoffice [x2]
Aug 1 06:20:33 hackerman packagekitd[2721848]: Failed to get cache filename for kernel [x2]
Aug 1 06:20:37 hackerman gnome-software[2060381]: failed to commit changes to dconf: GDBus.Error:org.gtk.GDBus.UnmappedGError.Quark._g_2dfile_2derror_2dquark.Code2: Failed to create file “/adminhomes/sajith/.config/dconf/user.18DDT3”: Permission denied
Aug 1 06:20:39 hackerman packagekitd[2721848]: failed to parse public key for /etc/pki/rpm-gpg/RPM-GPG-KEY-PQC-redhat-release
== idm00 (1 distinct, 1 total) ==
Aug 1 06:51:14 idm00 named[1455]: client @0x7f33155af458 10.73.240.42#63135: update '73.10.in-addr.arpa/IN' denied
== idmp0 (1 distinct, 1 total) ==
Aug 1 06:36:03 idmp0 named[5198]: client @0x7f99280434c8 10.73.240.43#52380: update '73.10.in-addr.arpa/IN' denied
== inbound00.cs.umd.edu (1 distinct, 1 total) ==
Aug 1 06:06:55 inbound00.cs.umd.edu systemd[1]: Configuration file /usr/lib/systemd/system/authentication_milter.service is marked executable. Please remove executable permission bits. Proceeding anyway.
== inbound01.cs.umd.edu (1 distinct, 1 total) ==
Aug 1 06:17:56 inbound01.cs.umd.edu systemd[1]: Configuration file /usr/lib/systemd/system/authentication_milter.service is marked executable. Please remove executable permission bits. Proceeding anyway.
== itmon02 (5 distinct, 38 total) ==
Aug 1 06:08:11 itmon02 sshd[1834]: error: beginning MaxStartups throttling [x32]
Aug 1 06:54:58 itmon02 systemd-sysv-generator[1750519]: SysV service '/etc/rc.d/init.d/thruk' lacks a native systemd unit file, automatically generating a unit file for compatibility.
Aug 1 06:54:58 itmon02 systemd-sysv-generator[1750519]: Please update package to include a native systemd unit file. [x2]
Aug 1 06:54:58 itmon02 systemd-sysv-generator[1750519]: ! This compatibility logic is deprecated, expect removal soon. ! [x2]
Aug 1 06:54:58 itmon02 systemd-sysv-generator[1750519]: SysV service '/etc/rc.d/init.d/pnp_gearman_worker' lacks a native systemd unit file, automatically generating a unit file for compatibility.
== neodontcare.cs.umd.edu (5 distinct, 7 total) ==
Aug 1 06:13:30 neodontcare.cs.umd.edu gnome-software[7556]: Only 0 apps for recent list, hiding
Aug 1 06:13:34 neodontcare.cs.umd.edu packagekitd[1303480]: Failed to get cache filename for gnu-free-mono-fonts
Aug 1 06:13:34 neodontcare.cs.umd.edu packagekitd[1303480]: Failed to get cache filename for gnu-free-serif-fonts
Aug 1 06:13:34 neodontcare.cs.umd.edu packagekitd[1303480]: Failed to get cache filename for libreoffice [x3]
Aug 1 06:13:38 neodontcare.cs.umd.edu packagekitd[1303480]: failed to parse public key for /etc/pki/rpm-gpg/RPM-GPG-KEY-PQC-redhat-release
== netman.cs.umd.edu (1 distinct, 1 total) ==
Aug 1 06:50:10 netman.cs.umd.edu sshd[3608143]: error: PAM: Authentication failure for root from 49.124.148.206
== newhonors2 (38 distinct, 65 total) ==
Aug 1 06:13:02 newhonors2 dhcpcd[576121]: dhcpcd is not running [x28]
Aug 1 06:48:20 newhonors2 puppet-agent[577382]: Could not update: Execution of '/usr/bin/apt-get -q -y -o DPkg::Options::=--force-confold --force-yes install openvox-agent=8.27.0-1+ubuntu24.04' returned 100: Reading package lists...
Aug 1 06:48:20 newhonors2 puppet-agent[577382]: Building dependency tree...
Aug 1 06:48:20 newhonors2 puppet-agent[577382]: Reading state information...
Aug 1 06:48:20 newhonors2 puppet-agent[577382]: Package openvox-agent is not available, but is referred to by another package.
Aug 1 06:48:20 newhonors2 puppet-agent[577382]: This may mean that the package is missing, has been obsoleted, or
Aug 1 06:48:20 newhonors2 puppet-agent[577382]: is only available from another source
Aug 1 06:48:20 newhonors2 puppet-agent[577382]:
Aug 1 06:48:20 newhonors2 puppet-agent[577382]: W: --force-yes is deprecated, use one of the options starting with --allow instead.
Aug 1 06:48:20 newhonors2 puppet-agent[577382]: E: Version '8.27.0-1+ubuntu24.04' for 'openvox-agent' was not found
Aug 1 06:48:20 newhonors2 puppet-agent[577382]: (/Stage[main]/Puppet::Agent::Install/Package[openvox-agent]/ensure) change from '7.37.2-1+ubuntu24.04' to '8.27.0-1+ubuntu24.04' failed: Could not update: Execution of '/usr/bin/apt-get -q -y -o DPkg::Options::=--force-confold --force-yes install openvox-agent=8.27.0-1+ubuntu24.04' returned 100: Reading package lists...
Aug 1 06:48:20 newhonors2 puppet-agent[577382]: (/Stage[main]/Puppet::Agent::Install/Package[openvox-agent]/ensure) Building dependency tree...
Aug 1 06:48:20 newhonors2 puppet-agent[577382]: (/Stage[main]/Puppet::Agent::Install/Package[openvox-agent]/ensure) Reading state information...
Aug 1 06:48:20 newhonors2 puppet-agent[577382]: (/Stage[main]/Puppet::Agent::Install/Package[openvox-agent]/ensure) Package openvox-agent is not available, but is referred to by another package.
Aug 1 06:48:20 newhonors2 puppet-agent[577382]: (/Stage[main]/Puppet::Agent::Install/Package[openvox-agent]/ensure) This may mean that the package is missing, has been obsoleted, or
Aug 1 06:48:20 newhonors2 puppet-agent[577382]: (/Stage[main]/Puppet::Agent::Install/Package[openvox-agent]/ensure) is only available from another source
Aug 1 06:48:20 newhonors2 puppet-agent[577382]: (/Stage[main]/Puppet::Agent::Install/Package[openvox-agent]/ensure)
Aug 1 06:48:20 newhonors2 puppet-agent[577382]: (/Stage[main]/Puppet::Agent::Install/Package[openvox-agent]/ensure) W: --force-yes is deprecated, use one of the options starting with --allow instead.
Aug 1 06:48:20 newhonors2 puppet-agent[577382]: (/Stage[main]/Puppet::Agent::Install/Package[openvox-agent]/ensure) E: Version '8.27.0-1+ubuntu24.04' for 'openvox-agent' was not found
Aug 1 06:48:44 newhonors2 puppet-agent[577382]: (/Stage[main]/Puppet::Agent::Config/Puppet::Config::Agent[classfile]/Puppet::Config::Entry[agent_classfile]/Concat::Fragment[puppet.conf_agent]/Concat_fragment[puppet.conf_agent]) Skipping because of failed dependencies
Aug 1 06:48:44 newhonors2 puppet-agent[577382]: (/Stage[main]/Puppet::Agent::Config/Puppet::Config::Agent[classfile]/Puppet::Config::Entry[agent_classfile]/Concat::Fragment[puppet.conf_agent_end]/Concat_fragment[puppet.conf_agent_end]) Skipping because of failed dependencies
Aug 1 06:48:44 newhonors2 puppet-agent[577382]: (/Stage[main]/Puppet::Agent::Config/Puppet::Config::Agent[classfile]/Puppet::Config::Entry[agent_classfile]/Concat::Fragment[puppet.conf_agent_classfile]/Concat_fragment[puppet.conf_agent_classfile]) Skipping because of failed dependencies
Aug 1 06:48:44 newhonors2 puppet-agent[577382]: (/Stage[main]/Puppet::Agent::Config/Puppet::Config::Agent[default_schedules]/Puppet::Config::Entry[agent_default_schedules]/Concat::Fragment[puppet.conf_agent_default_schedules]/Concat_fragment[puppet.conf_agent_default_schedules]) Skipping because of failed dependencies
Aug 1 06:48:44 newhonors2 puppet-agent[577382]: (/Stage[main]/Puppet::Agent::Config/Puppet::Config::Agent[report]/Puppet::Config::Entry[agent_report]/Concat::Fragment[puppet.conf_agent_report]/Concat_fragment[puppet.conf_agent_report]) Skipping because of failed dependencies
Aug 1 06:48:44 newhonors2 puppet-agent[577382]: (/Stage[main]/Puppet::Agent::Config/Puppet::Config::Agent[masterport]/Puppet::Config::Entry[agent_masterport]/Concat::Fragment[puppet.conf_agent_masterport]/Concat_fragment[puppet.conf_agent_masterport]) Skipping because of failed dependencies
Aug 1 06:48:44 newhonors2 puppet-agent[577382]: (/Stage[main]/Puppet::Agent::Config/Puppet::Config::Agent[splay]/Puppet::Config::Entry[agent_splay]/Concat::Fragment[puppet.conf_agent_splay]/Concat_fragment[puppet.conf_agent_splay]) Skipping because of failed dependencies
Aug 1 06:48:44 newhonors2 puppet-agent[577382]: (/Stage[main]/Puppet::Agent::Config/Puppet::Config::Agent[splaylimit]/Puppet::Config::Entry[agent_splaylimit]/Concat::Fragment[puppet.conf_agent_splaylimit]/Concat_fragment[puppet.conf_agent_splaylimit]) Skipping because of failed dependencies
Aug 1 06:48:44 newhonors2 puppet-agent[577382]: (/Stage[main]/Puppet::Agent::Config/Puppet::Config::Agent[runinterval]/Puppet::Config::Entry[agent_runinterval]/Concat::Fragment[puppet.conf_agent_runinterval]/Concat_fragment[puppet.conf_agent_runinterval]) Skipping because of failed dependencies
Aug 1 06:48:44 newhonors2 puppet-agent[577382]: (/Stage[main]/Puppet::Agent::Config/Puppet::Config::Agent[noop]/Puppet::Config::Entry[agent_noop]/Concat::Fragment[puppet.conf_agent_noop]/Concat_fragment[puppet.conf_agent_noop]) Skipping because of failed dependencies
Aug 1 06:48:44 newhonors2 puppet-agent[577382]: (/Stage[main]/Puppet::Agent::Config/Puppet::Config::Agent[usecacheonfailure]/Puppet::Config::Entry[agent_usecacheonfailure]/Concat::Fragment[puppet.conf_agent_usecacheonfailure]/Concat_fragment[puppet.conf_agent_usecacheonfailure]) Skipping because of failed dependencies
... 8 more distinct messages not shown
== orchids (3 distinct, 3 total) ==
Aug 1 06:11:31 orchids gnome-software[1516991]: Only 0 apps for recent list, hiding
Aug 1 06:11:38 orchids packagekitd[1069042]: Failed to get cache filename for libreoffice
Aug 1 06:11:40 orchids packagekitd[1069042]: failed to parse public key for /etc/pki/rpm-gpg/RPM-GPG-KEY-PQC-redhat-release
== outbound00.cs.umd.edu (2 distinct, 93 total) ==
Aug 1 06:09:09 outbound00.cs.umd.edu python3[1720662]: ldapdb [x6]
Aug 1 06:21:29 outbound00.cs.umd.edu krb5_child[1723668]: Client 'admin(a)UMD.EDU' not found in Kerberos database [x87]
== outbound01.cs.umd.edu (1 distinct, 6 total) ==
Aug 1 06:13:06 outbound01.cs.umd.edu python3[3947380]: ldapdb [x6]
== sentry-docker00.cs.umd.edu (48 distinct, 48 total) ==
Aug 1 06:18:22 sentry-docker00.cs.umd.edu systemd-udevd[3718765]: link_config: could not get ethtool features for vethdd5d23c
Aug 1 06:18:22 sentry-docker00.cs.umd.edu systemd-udevd[3718765]: Could not set offload features of vethdd5d23c: No such device
Aug 1 06:18:23 sentry-docker00.cs.umd.edu systemd-udevd[3718797]: Could not generate persistent MAC address for vethe62d531: No such file or directory
Aug 1 06:18:23 sentry-docker00.cs.umd.edu systemd-udevd[3718798]: Could not generate persistent MAC address for veth59a0e1e: No such file or directory
Aug 1 06:18:23 sentry-docker00.cs.umd.edu systemd-udevd[3718801]: Could not generate persistent MAC address for veth074bcd9: No such file or directory
Aug 1 06:18:23 sentry-docker00.cs.umd.edu systemd-udevd[3718802]: Could not generate persistent MAC address for veth526d0cd: No such file or directory
Aug 1 06:18:23 sentry-docker00.cs.umd.edu systemd-udevd[3718812]: Could not generate persistent MAC address for veth8e1af27: No such file or directory
Aug 1 06:18:23 sentry-docker00.cs.umd.edu systemd-udevd[3718797]: Could not generate persistent MAC address for veth4a8c384: No such file or directory
Aug 1 06:18:23 sentry-docker00.cs.umd.edu systemd-udevd[3718827]: Could not generate persistent MAC address for vethf9e7b26: No such file or directory
Aug 1 06:18:23 sentry-docker00.cs.umd.edu systemd-udevd[3718829]: Could not generate persistent MAC address for veth7f2c3a7: No such file or directory
Aug 1 06:21:35 sentry-docker00.cs.umd.edu systemd-udevd[3720378]: link_config: could not get ethtool features for veth1e98856
Aug 1 06:21:35 sentry-docker00.cs.umd.edu systemd-udevd[3720378]: Could not set offload features of veth1e98856: No such device
Aug 1 06:21:35 sentry-docker00.cs.umd.edu systemd-udevd[3720399]: Could not generate persistent MAC address for vethc904969: No such file or directory
Aug 1 06:21:35 sentry-docker00.cs.umd.edu systemd-udevd[3720400]: Could not generate persistent MAC address for vetha15ca89: No such file or directory
Aug 1 06:38:31 sentry-docker00.cs.umd.edu systemd-udevd[3728160]: link_config: could not get ethtool features for vethf9e7b26
Aug 1 06:38:31 sentry-docker00.cs.umd.edu systemd-udevd[3728160]: Could not set offload features of vethf9e7b26: No such device
Aug 1 06:38:31 sentry-docker00.cs.umd.edu systemd-udevd[3728236]: link_config: could not get ethtool features for veth074bcd9
Aug 1 06:38:31 sentry-docker00.cs.umd.edu systemd-udevd[3728236]: Could not set offload features of veth074bcd9: No such device
Aug 1 06:38:31 sentry-docker00.cs.umd.edu systemd-udevd[3728257]: Could not generate persistent MAC address for veth8da2e80: No such file or directory
Aug 1 06:38:31 sentry-docker00.cs.umd.edu systemd-udevd[3728258]: Could not generate persistent MAC address for veth7c24abe: No such file or directory
Aug 1 06:38:31 sentry-docker00.cs.umd.edu systemd-udevd[3728276]: Could not generate persistent MAC address for vethcb1c19a: No such file or directory
Aug 1 06:38:31 sentry-docker00.cs.umd.edu systemd-udevd[3728266]: Could not generate persistent MAC address for vethae0a722: No such file or directory
Aug 1 06:38:31 sentry-docker00.cs.umd.edu systemd-udevd[3728287]: Could not generate persistent MAC address for veth3d8bdcc: No such file or directory
Aug 1 06:38:31 sentry-docker00.cs.umd.edu systemd-udevd[3728286]: Could not generate persistent MAC address for veth3e30629: No such file or directory
Aug 1 06:38:31 sentry-docker00.cs.umd.edu systemd-udevd[3728339]: Could not generate persistent MAC address for veth97a3993: No such file or directory
Aug 1 06:38:31 sentry-docker00.cs.umd.edu systemd-udevd[3728345]: Could not generate persistent MAC address for veth3803cfd: No such file or directory
Aug 1 06:38:31 sentry-docker00.cs.umd.edu lldpd[2542515]: unable to bind to raw socket for interface vethcb1c19a: No such device
Aug 1 06:38:31 sentry-docker00.cs.umd.edu lldpd[2542517]: unable to initialize vethcb1c19a
Aug 1 06:38:31 sentry-docker00.cs.umd.edu lldpd[2542515]: unable to bind to raw socket for interface veth3e30629: No such device
Aug 1 06:38:31 sentry-docker00.cs.umd.edu lldpd[2542517]: unable to initialize veth3e30629
... 18 more distinct messages not shown
== strawberry (4 distinct, 10 total) ==
Aug 1 06:09:44 strawberry udisksd[1067]: Error performing housekeeping for drive /org/freedesktop/UDisks2/drives/ST2000DM001_1CH164_W1E8J5KJ: Error updating SMART data: Error sending ATA command CHECK POWER MODE: Unexpected sense data returned:#0120000: 00 00 00 00 00 00 00 00 00 00 00 00 00 00 00 00 ................#0120010: 00 00 00 00 00 00 00 00 00 00 00 00 00 00 00 00 ................#012 (g-io-error-quark, 0) [x6]
Aug 1 06:31:04 strawberry nologin[3301413]: Attempted login by UNKNOWN (UID: 65534) on UNKNOWN
Aug 1 06:31:04 strawberry pipewire[3301412]: mod.jackdbus-detect: Failed to receive jackdbus reply: org.freedesktop.DBus.Error.ServiceUnknown: The name org.jackaudio.service was not provided by any .service files
Aug 1 06:34:42 strawberry smartd[5314]: Device: /dev/sda [SAT], failed to read SMART Attribute Data [x2]
== tlsrpt (1 distinct, 1 total) ==
Aug 1 06:38:03 tlsrpt (httpd)[512170]: httpd.service: Referenced but unset environment variable evaluates to an empty string: OPTIONS
1
0
Command: /usr/local/sbin/syslog-digest.py
Time : 0.4865s
Status : exited 0
Output :
Syslog digest — 2026-08-01 06:05 EDT
Processed 4,093 lines, filtered 3,354 (81%). 739 unknown (103 distinct) from 19 host(s).
== abuse (1 distinct, 346 total) ==
Aug 1 05:05:06 abuse rsyslogd[21745]: imjournal: open() failed for path: '/var/lib/rsyslog/imjournal.state.tmp': Input/output error [v8.2404.0 try https://www.rsyslog.com/e/2433 ] [x346]
== b0b02.cs.umd.edu (4 distinct, 4 total) ==
Aug 1 05:28:37 b0b02.cs.umd.edu setroubleshoot[1650353]: SELinux is preventing /usr/bin/python3.9 from getattr access on the file /etc/authselect/nsswitch.conf. For complete SELinux messages run: sealert -l 9a1e2952-3fde-4937-a8ab-f7f59791a458
Aug 1 05:28:40 b0b02.cs.umd.edu setroubleshoot[1650353]: SELinux is preventing /usr/bin/python3.9 from read access on the file /etc/authselect/nsswitch.conf. For complete SELinux messages run: sealert -l 97d74423-e027-4cd6-8810-ad80944900b5
Aug 1 05:28:43 b0b02.cs.umd.edu setroubleshoot[1650353]: SELinux is preventing /usr/bin/python3.9 from open access on the file /etc/authselect/nsswitch.conf. For complete SELinux messages run: sealert -l 4f253f6a-62d6-46dd-8eaf-0b4d29df41c6
Aug 1 05:40:13 b0b02.cs.umd.edu rustdesk[1653657]: cannot open display:
== contest (9 distinct, 41 total) ==
Aug 1 05:06:41 contest goferd[1007]: [ERROR][worker-0] gofer.messaging.adapter.connect:33 - connect: proton+amqps://satellite8.cs.umd.edu:5647, failed: Connection amqps://satellite8.cs.umd.edu:5647 disconnected: Condition('proton.pythonio', 'Connection refused to all addresses') [x33]
Aug 1 05:48:16 contest setroubleshoot[434531]: SELinux is preventing /usr/libexec/platform-python3.6 from create access on the directory libdnf.FWUgfT. For complete SELinux messages run: sealert -l cb6b25c6-4765-4cf2-88a0-9b3b508e94e9
Aug 1 05:48:16 contest setroubleshoot[434531]: SELinux is preventing /usr/bin/gpgconf from add_name access on the directory repodata. For complete SELinux messages run: sealert -l 41cf7b1b-0f34-4609-98f2-b66e7825fef7
Aug 1 05:48:16 contest setroubleshoot[434531]: SELinux is preventing /usr/libexec/platform-python3.6 from create access on the file mirrorlist. For complete SELinux messages run: sealert -l fc20ff92-ea83-4f38-a24b-ddfd737a3141
Aug 1 05:48:16 contest setroubleshoot[434531]: SELinux is preventing /usr/libexec/platform-python3.6 from setattr access on the file repomd.xml. For complete SELinux messages run: sealert -l ac675631-fa35-4e93-adc9-b692b18e53e5
Aug 1 05:48:16 contest setroubleshoot[434531]: SELinux is preventing /usr/libexec/platform-python3.6 from read access on the directory libdnf.FWUgfT. For complete SELinux messages run: sealert -l 45d103b6-0810-4890-a705-990118577ce8
Aug 1 05:48:21 contest setroubleshoot[434531]: SELinux is preventing /usr/libexec/platform-python3.6 from remove_name access on the directory repomd.xml. For complete SELinux messages run: sealert -l 7e499113-2fd7-4f67-bec6-3521efbe3637
Aug 1 05:48:24 contest setroubleshoot[434531]: SELinux is preventing rhsmcertd-worke from unlink access on the file repomd.xml. For complete SELinux messages run: sealert -l 22835727-7fef-4cfb-b3b5-881f66888317
Aug 1 05:48:37 contest setroubleshoot[434584]: SELinux is preventing /usr/libexec/platform-python3.6 from rmdir access on the directory repodata. For complete SELinux messages run: sealert -l 3928930b-a1ed-448d-950b-0665ac2adef8
== csfw00a (2 distinct, 184 total) ==
Aug 1 05:04:41 csfw00a kernel: bnxt_en 0000:09:00.0 eth3: NIC Link is Down [x180]
Aug 1 05:45:15 csfw00a ospf6d[1477]: [EC 100663307] Could not send entire message [x4]
== grades01.cs.umd.edu (1 distinct, 1 total) ==
Aug 1 05:51:09 grades01.cs.umd.edu puppet-agent[8222]: The directory '/srv/grades' contains 2471 entries, which exceeds the default soft limit 1000 and may cause excessive resource consumption and degraded performance. To remove this warning set a value for `max_files` parameter or consider using an alternate method to manage large directory trees
== hackerman (1 distinct, 1 total) ==
Aug 1 05:19:00 hackerman gnome-software[2060381]: failed to commit changes to dconf: GDBus.Error:org.gtk.GDBus.UnmappedGError.Quark._g_2dfile_2derror_2dquark.Code2: Failed to create file “/adminhomes/sajith/.config/dconf/user.GXV3S3”: Permission denied
== idm00 (1 distinct, 1 total) ==
Aug 1 05:51:14 idm00 named[1455]: client @0x7f33157eace8 10.73.240.42#50120: update '73.10.in-addr.arpa/IN' denied
== idmp0 (1 distinct, 1 total) ==
Aug 1 05:36:02 idmp0 named[5198]: client @0x7f99300523f8 10.73.240.43#58637: update '73.10.in-addr.arpa/IN' denied
== itmon02 (1 distinct, 30 total) ==
Aug 1 05:08:13 itmon02 sshd[1834]: error: beginning MaxStartups throttling [x30]
== newhonors2 (1 distinct, 24 total) ==
Aug 1 05:13:03 newhonors2 dhcpcd[574281]: dhcpcd is not running [x24]
== outbound00.cs.umd.edu (3 distinct, 8 total) ==
Aug 1 05:09:09 outbound00.cs.umd.edu python3[1706156]: ldapdb [x6]
Aug 1 05:10:38 outbound00.cs.umd.edu krb5_child[1706717]: Client 'admin(a)UMD.EDU' not found in Kerberos database
Aug 1 05:33:45 outbound00.cs.umd.edu krb5_child[1712129]: Client 'gitlab(a)UMD.EDU' not found in Kerberos database
== outbound01.cs.umd.edu (2 distinct, 8 total) ==
Aug 1 05:08:15 outbound01.cs.umd.edu python3[3931659]: ldapdb [x7]
Aug 1 05:09:18 outbound01.cs.umd.edu systemd[1]: Configuration file /usr/lib/systemd/system/authentication_milter.service is marked executable. Please remove executable permission bits. Proceeding anyway.
== sentry-docker00.cs.umd.edu (42 distinct, 42 total) ==
Aug 1 05:17:57 sentry-docker00.cs.umd.edu systemd-udevd[3689344]: link_config: could not get ethtool features for veth1dad2ce
Aug 1 05:17:57 sentry-docker00.cs.umd.edu systemd-udevd[3689344]: Could not set offload features of veth1dad2ce: No such device
Aug 1 05:17:58 sentry-docker00.cs.umd.edu systemd-udevd[3689369]: Could not generate persistent MAC address for veth38984a5: No such file or directory
Aug 1 05:17:58 sentry-docker00.cs.umd.edu systemd-udevd[3689370]: Could not generate persistent MAC address for veth95e0522: No such file or directory
Aug 1 05:17:58 sentry-docker00.cs.umd.edu systemd-udevd[3689373]: Could not generate persistent MAC address for vethfc9cddf: No such file or directory
Aug 1 05:17:58 sentry-docker00.cs.umd.edu systemd-udevd[3689374]: Could not generate persistent MAC address for vetha074c08: No such file or directory
Aug 1 05:17:58 sentry-docker00.cs.umd.edu systemd-udevd[3689398]: Could not generate persistent MAC address for veth3993897: No such file or directory
Aug 1 05:17:58 sentry-docker00.cs.umd.edu systemd-udevd[3689397]: Could not generate persistent MAC address for veth31073bc: No such file or directory
Aug 1 05:17:58 sentry-docker00.cs.umd.edu systemd-udevd[3689416]: Could not generate persistent MAC address for veth216da9a: No such file or directory
Aug 1 05:17:58 sentry-docker00.cs.umd.edu systemd-udevd[3689405]: Could not generate persistent MAC address for veth68ee5e9: No such file or directory
Aug 1 05:21:18 sentry-docker00.cs.umd.edu systemd-udevd[3692010]: Could not generate persistent MAC address for veth3c60207: No such file or directory
Aug 1 05:21:18 sentry-docker00.cs.umd.edu systemd-udevd[3692011]: Could not generate persistent MAC address for veth91f9095: No such file or directory
Aug 1 05:38:06 sentry-docker00.cs.umd.edu systemd-udevd[3699028]: link_config: could not get ethtool features for veth38984a5
Aug 1 05:38:06 sentry-docker00.cs.umd.edu systemd-udevd[3699028]: Could not set offload features of veth38984a5: No such device
Aug 1 05:38:06 sentry-docker00.cs.umd.edu systemd-udevd[3699104]: link_config: could not get ethtool features for veth216da9a
Aug 1 05:38:06 sentry-docker00.cs.umd.edu systemd-udevd[3699104]: Could not set offload features of veth216da9a: No such device
Aug 1 05:38:06 sentry-docker00.cs.umd.edu systemd-udevd[3699124]: Could not generate persistent MAC address for vethb8b06f3: No such file or directory
Aug 1 05:38:06 sentry-docker00.cs.umd.edu systemd-udevd[3699125]: Could not generate persistent MAC address for veth1a68060: No such file or directory
Aug 1 05:38:06 sentry-docker00.cs.umd.edu systemd-udevd[3699150]: Could not generate persistent MAC address for veth932a333: No such file or directory
Aug 1 05:38:06 sentry-docker00.cs.umd.edu systemd-udevd[3699151]: Could not generate persistent MAC address for vetha574cdb: No such file or directory
Aug 1 05:38:06 sentry-docker00.cs.umd.edu systemd-udevd[3699176]: Could not generate persistent MAC address for vethb6cfaf8: No such file or directory
Aug 1 05:38:06 sentry-docker00.cs.umd.edu systemd-udevd[3699177]: Could not generate persistent MAC address for vethf9bc14e: No such file or directory
Aug 1 05:38:06 sentry-docker00.cs.umd.edu systemd-udevd[3699225]: Could not generate persistent MAC address for vethd3f888e: No such file or directory
Aug 1 05:38:06 sentry-docker00.cs.umd.edu systemd-udevd[3699229]: Could not generate persistent MAC address for veth541dd7b: No such file or directory
Aug 1 05:41:22 sentry-docker00.cs.umd.edu systemd-udevd[3701509]: link_config: could not get ethtool features for veth3c60207
Aug 1 05:41:22 sentry-docker00.cs.umd.edu systemd-udevd[3701509]: Could not set offload features of veth3c60207: No such device
Aug 1 05:41:22 sentry-docker00.cs.umd.edu systemd-udevd[3701527]: Could not generate persistent MAC address for vethffd333e: No such file or directory
Aug 1 05:41:22 sentry-docker00.cs.umd.edu systemd-udevd[3701528]: Could not generate persistent MAC address for vethda444c0: No such file or directory
Aug 1 05:58:14 sentry-docker00.cs.umd.edu systemd-udevd[3709269]: link_config: could not get ethtool features for vethd3f888e
Aug 1 05:58:14 sentry-docker00.cs.umd.edu systemd-udevd[3709269]: Could not set offload features of vethd3f888e: No such device
... 12 more distinct messages not shown
== strawberry (2 distinct, 8 total) ==
Aug 1 05:09:44 strawberry udisksd[1067]: Error performing housekeeping for drive /org/freedesktop/UDisks2/drives/ST2000DM001_1CH164_W1E8J5KJ: Error updating SMART data: Error sending ATA command CHECK POWER MODE: Unexpected sense data returned:#0120000: 00 00 00 00 00 00 00 00 00 00 00 00 00 00 00 00 ................#0120010: 00 00 00 00 00 00 00 00 00 00 00 00 00 00 00 00 ................#012 (g-io-error-quark, 0) [x6]
Aug 1 05:34:42 strawberry smartd[5314]: Device: /dev/sda [SAT], failed to read SMART Attribute Data [x2]
== submit26-b9-2 (10 distinct, 14 total) ==
Aug 1 05:12:51 submit26-b9-2 setroubleshoot[756701]: SELinux is preventing /usr/bin/python3.9 from create access on the directory /(null). For complete SELinux messages run: sealert -l d506243c-d61e-48f3-b42a-4592c913deb0 [x2]
Aug 1 05:12:51 submit26-b9-2 setroubleshoot[756701]: SELinux is preventing /usr/bin/python3.9 from add_name access on the directory /(null). For complete SELinux messages run: sealert -l 3b4752ac-1b9a-4af9-a05b-32e4c2eb13ab [x2]
Aug 1 05:12:51 submit26-b9-2 setroubleshoot[756701]: SELinux is preventing /usr/bin/python3.9 from create access on the file /(null). For complete SELinux messages run: sealert -l 29e5adbd-4381-4467-b40d-a2219101e096
Aug 1 05:12:51 submit26-b9-2 setroubleshoot[756701]: SELinux is preventing /usr/bin/python3.9 from open access on the file /tmp/libdnf.9SI9Vj/repodata/repomd.xml. For complete SELinux messages run: sealert -l 1b38f2ec-01ce-4343-8059-ba7494ecc5c4
Aug 1 05:12:51 submit26-b9-2 setroubleshoot[756701]: SELinux is preventing /usr/bin/python3.9 from setattr access on the file repomd.xml. For complete SELinux messages run: sealert -l e5f9af40-1f63-4924-b012-27ab2a7b2266
Aug 1 05:12:51 submit26-b9-2 setroubleshoot[756701]: SELinux is preventing /usr/bin/python3.9 from read access on the directory libdnf.9SI9Vj. For complete SELinux messages run: sealert -l 5c54db87-54a3-4a7c-97b4-b5c48d6c3543
Aug 1 05:12:51 submit26-b9-2 setroubleshoot[756701]: SELinux is preventing /usr/bin/python3.9 from remove_name access on the directory repomd.xml. For complete SELinux messages run: sealert -l 63cd60e1-1e61-4276-afea-dd8526ffe8b2 [x2]
Aug 1 05:12:51 submit26-b9-2 setroubleshoot[756701]: SELinux is preventing /usr/bin/python3.9 from unlink access on the file repomd.xml. For complete SELinux messages run: sealert -l 81c7e9ec-e023-4c6d-b1ad-c02a242e655e
Aug 1 05:12:51 submit26-b9-2 setroubleshoot[756701]: SELinux is preventing /usr/bin/python3.9 from rmdir access on the directory repodata. For complete SELinux messages run: sealert -l 6ae9a597-e123-4d74-8eec-a8ebe0f5e4d0 [x2]
Aug 1 05:12:51 submit26-b9-2 setroubleshoot[756701]: SELinux is preventing /usr/bin/python3.9 from read access on the directory libdnf.3Nf1i5. For complete SELinux messages run: sealert -l 5c54db87-54a3-4a7c-97b4-b5c48d6c3543
== submit26-b9-3 (9 distinct, 12 total) ==
Aug 1 05:20:37 submit26-b9-3 setroubleshoot[748649]: SELinux is preventing /usr/bin/python3.9 from create access on the directory /(null). For complete SELinux messages run: sealert -l 5b912a44-22fd-4560-b201-2a4e289b73f5
Aug 1 05:20:37 submit26-b9-3 setroubleshoot[748649]: SELinux is preventing /usr/bin/python3.9 from add_name access on the directory /(null). For complete SELinux messages run: sealert -l 7f1df1e4-725e-4953-98eb-1079f908f543
Aug 1 05:20:37 submit26-b9-3 setroubleshoot[748649]: SELinux is preventing /usr/bin/python3.9 from create access on the file /(null). For complete SELinux messages run: sealert -l 40b8852a-f77b-44b4-affe-5f11fa33de43 [x2]
Aug 1 05:20:37 submit26-b9-3 setroubleshoot[748649]: SELinux is preventing /usr/bin/python3.9 from open access on the file /tmp/libdnf.sOQFVk/repodata/repomd.xml. For complete SELinux messages run: sealert -l 45a8019e-f6b5-4baa-92c1-862594b40d46 [x2]
Aug 1 05:20:37 submit26-b9-3 setroubleshoot[748649]: SELinux is preventing /usr/bin/python3.9 from setattr access on the file repomd.xml. For complete SELinux messages run: sealert -l e9f0bfff-7784-4126-baa4-2bb06da56591 [x2]
Aug 1 05:20:37 submit26-b9-3 setroubleshoot[748649]: SELinux is preventing /usr/bin/python3.9 from read access on the directory libdnf.sOQFVk. For complete SELinux messages run: sealert -l 0b17cc3d-cdc6-4fe2-a11f-3892e7c41dc7
Aug 1 05:20:37 submit26-b9-3 setroubleshoot[748649]: SELinux is preventing /usr/bin/python3.9 from remove_name access on the directory repomd.xml. For complete SELinux messages run: sealert -l 10e38c64-b65f-4cdd-901e-4375652d9a42
Aug 1 05:20:37 submit26-b9-3 setroubleshoot[748649]: SELinux is preventing /usr/bin/python3.9 from unlink access on the file repomd.xml. For complete SELinux messages run: sealert -l 7fd9cf72-ef38-48e1-b6aa-b571b26a7b22
Aug 1 05:20:37 submit26-b9-3 setroubleshoot[748649]: SELinux is preventing /usr/bin/python3.9 from rmdir access on the directory repodata. For complete SELinux messages run: sealert -l b9b11116-89bd-4a3c-980c-1d422c5dcee4
== submit26-clnb9 (9 distinct, 9 total) ==
Aug 1 05:31:55 submit26-clnb9 setroubleshoot[1622692]: SELinux is preventing /usr/bin/python3.9 from create access on the directory /(null). For complete SELinux messages run: sealert -l 6783ed2b-5ae4-42b5-975a-4bf50eec4658
Aug 1 05:31:55 submit26-clnb9 setroubleshoot[1622692]: SELinux is preventing /usr/bin/python3.9 from add_name access on the directory /(null). For complete SELinux messages run: sealert -l 9e7fa955-cc30-4804-ac8c-e1779e85946c
Aug 1 05:31:55 submit26-clnb9 setroubleshoot[1622692]: SELinux is preventing /usr/bin/python3.9 from create access on the file /(null). For complete SELinux messages run: sealert -l 69bfa6e3-089c-40ff-9563-fd30787d0774
Aug 1 05:31:55 submit26-clnb9 setroubleshoot[1622692]: SELinux is preventing /usr/bin/python3.9 from open access on the file /tmp/libdnf.liqlDC/repodata/repomd.xml. For complete SELinux messages run: sealert -l 001acdb5-31ef-4e52-b10b-90f467a89ddc
Aug 1 05:31:55 submit26-clnb9 setroubleshoot[1622692]: SELinux is preventing /usr/bin/python3.9 from setattr access on the file repomd.xml. For complete SELinux messages run: sealert -l edacddcf-16ed-4dc3-8d82-7c597d5dee23
Aug 1 05:31:55 submit26-clnb9 setroubleshoot[1622692]: SELinux is preventing /usr/bin/python3.9 from read access on the directory libdnf.liqlDC. For complete SELinux messages run: sealert -l 62b3782e-4730-4488-8178-94dafe9b552c
Aug 1 05:31:56 submit26-clnb9 setroubleshoot[1622692]: SELinux is preventing /usr/bin/python3.9 from remove_name access on the directory repomd.xml. For complete SELinux messages run: sealert -l 81cb3698-78f8-440a-8e3c-e5d1041e6b78
Aug 1 05:31:56 submit26-clnb9 setroubleshoot[1622692]: SELinux is preventing /usr/bin/python3.9 from unlink access on the file repomd.xml. For complete SELinux messages run: sealert -l 792b472a-115c-4799-9805-fc7436f916b9
Aug 1 05:31:56 submit26-clnb9 setroubleshoot[1622692]: SELinux is preventing /usr/bin/python3.9 from rmdir access on the directory repodata. For complete SELinux messages run: sealert -l 15c83a86-837b-41e2-b662-b39cd4e361cb
== talkhosts9 (1 distinct, 2 total) ==
Aug 1 05:05:30 talkhosts9 setroubleshoot[550235]: SELinux is preventing /usr/bin/lsof from getattr access on the unix_stream_socket unix_stream_socket. For complete SELinux messages run: sealert -l a6df89b3-c497-469c-8232-c4fde0508abf [x2]
== updates00.cs.umd.edu (3 distinct, 3 total) ==
Aug 1 05:18:42 updates00.cs.umd.edu puppet-agent[28383]: Could not retrieve catalog from remote server: Error 500 on SERVER: Server Error: Function lookup() did not find a value for the name 'vault::kerberos' on node updates00.cs.umd.edu
Aug 1 05:18:42 updates00.cs.umd.edu puppet-agent[28383]: Not using cache on failed catalog
Aug 1 05:18:42 updates00.cs.umd.edu puppet-agent[28383]: Could not retrieve catalog; skipping run
1
0
Command: /usr/local/sbin/syslog-digest.py
Time : 0.4814s
Status : exited 0
Output :
Syslog digest — 2026-08-01 05:05 EDT
Processed 4,108 lines, filtered 3,342 (81%). 766 unknown (91 distinct) from 21 host(s).
== abadi-computer (2 distinct, 2 total) ==
Aug 1 04:15:00 abadi-computer nologin[536079]: Attempted login by UNKNOWN (UID: 65534) on UNKNOWN
Aug 1 04:15:00 abadi-computer pipewire[536077]: mod.jackdbus-detect: Failed to receive jackdbus reply: org.freedesktop.DBus.Error.ServiceUnknown: The name org.jackaudio.service was not provided by any .service files
== abuse (1 distinct, 346 total) ==
Aug 1 04:05:06 abuse rsyslogd[21745]: imjournal: open() failed for path: '/var/lib/rsyslog/imjournal.state.tmp': Input/output error [v8.2404.0 try https://www.rsyslog.com/e/2433 ] [x346]
== b0b02.cs.umd.edu (4 distinct, 4 total) ==
Aug 1 04:28:33 b0b02.cs.umd.edu setroubleshoot[1635297]: SELinux is preventing /usr/bin/python3.9 from getattr access on the file /etc/authselect/nsswitch.conf. For complete SELinux messages run: sealert -l 9a1e2952-3fde-4937-a8ab-f7f59791a458
Aug 1 04:28:35 b0b02.cs.umd.edu setroubleshoot[1635297]: SELinux is preventing /usr/bin/python3.9 from read access on the file /etc/authselect/nsswitch.conf. For complete SELinux messages run: sealert -l 97d74423-e027-4cd6-8810-ad80944900b5
Aug 1 04:28:38 b0b02.cs.umd.edu setroubleshoot[1635297]: SELinux is preventing /usr/bin/python3.9 from open access on the file /etc/authselect/nsswitch.conf. For complete SELinux messages run: sealert -l 4f253f6a-62d6-46dd-8eaf-0b4d29df41c6
Aug 1 04:40:09 b0b02.cs.umd.edu rustdesk[1638241]: cannot open display:
== contest (1 distinct, 34 total) ==
Aug 1 04:05:59 contest goferd[1007]: [ERROR][worker-0] gofer.messaging.adapter.connect:33 - connect: proton+amqps://satellite8.cs.umd.edu:5647, failed: Connection amqps://satellite8.cs.umd.edu:5647 disconnected: Condition('proton.pythonio', 'Connection refused to all addresses') [x34]
== csfw00a (1 distinct, 224 total) ==
Aug 1 04:04:54 csfw00a kernel: bnxt_en 0000:09:00.0 eth3: NIC Link is Down [x224]
== dojo (1 distinct, 1 total) ==
Aug 1 04:15:00 dojo nologin[791366]: Attempted login by UNKNOWN (UID: 65534) on UNKNOWN
== forge00 (1 distinct, 1 total) ==
Aug 1 04:09:02 forge00 (httpd)[1339995]: httpd.service: Referenced but unset environment variable evaluates to an empty string: OPTIONS
== idm00 (1 distinct, 1 total) ==
Aug 1 04:51:14 idm00 named[1455]: client @0x7f3310201ff8 10.73.240.42#61247: update '73.10.in-addr.arpa/IN' denied
== idmp0 (1 distinct, 1 total) ==
Aug 1 04:36:02 idmp0 named[5198]: client @0x7f99040313a8 10.73.240.43#50570: update '73.10.in-addr.arpa/IN' denied
== itmon02 (1 distinct, 31 total) ==
Aug 1 04:08:13 itmon02 sshd[1834]: error: beginning MaxStartups throttling [x31]
== matrix (11 distinct, 13 total) ==
Aug 1 04:16:58 matrix systemd[1]: networkd-dispatcher.service: Got notification message from PID 3301215, but reception only permitted for main PID 720
Aug 1 04:16:58 matrix systemd[1]: networkd-dispatcher.service: Got notification message from PID 3301225, but reception only permitted for main PID 720
Aug 1 04:17:05 matrix systemd[1]: networkd-dispatcher.service: Got notification message from PID 3301338, but reception only permitted for main PID 720
Aug 1 04:17:05 matrix networkctl[3301355]: Interface "veth561eb29" not found.
Aug 1 04:17:05 matrix systemd[1]: networkd-dispatcher.service: Got notification message from PID 3301355, but reception only permitted for main PID 720 [x2]
Aug 1 04:17:06 matrix systemd[1]: networkd-dispatcher.service: Got notification message from PID 3301416, but reception only permitted for main PID 720
Aug 1 04:17:06 matrix systemd[1]: networkd-dispatcher.service: Got notification message from PID 3301428, but reception only permitted for main PID 720
Aug 1 04:17:15 matrix systemd[1]: networkd-dispatcher.service: Got notification message from PID 3301532, but reception only permitted for main PID 720
Aug 1 04:17:15 matrix systemd[1]: networkd-dispatcher.service: Got notification message from PID 3301538, but reception only permitted for main PID 720
Aug 1 04:17:15 matrix networkctl[3301549]: Interface "veth5d07beb" not found.
Aug 1 04:17:15 matrix systemd[1]: networkd-dispatcher.service: Got notification message from PID 3301549, but reception only permitted for main PID 720 [x2]
== mcstic (3 distinct, 6 total) ==
Aug 1 04:29:29 mcstic krb5_child[1951573]: Client 'admin(a)UMD.EDU' not found in Kerberos database [x4]
Aug 1 04:29:35 mcstic sshd[1951568]: error: PAM: Authentication failure for admin from 34.77.36.89
Aug 1 04:29:47 mcstic sshd[1951582]: error: Protocol major versions differ: 2 vs. 1
== nagios-worker-admin-avw00.cs.umd.edu (1 distinct, 1 total) ==
Aug 1 04:26:26 nagios-worker-admin-avw00.cs.umd.edu kernel: hrtimer: interrupt took 316151 ns
== netman.cs.umd.edu (3 distinct, 3 total) ==
Aug 1 04:29:58 netman.cs.umd.edu setroubleshoot[3570328]: SELinux is preventing /usr/bin/gpg from read access on the file gpg.conf. For complete SELinux messages run: sealert -l 019ad1da-a874-4814-8037-3b3e5f413ad2
Aug 1 04:29:59 netman.cs.umd.edu setroubleshoot[3570328]: SELinux is preventing /usr/bin/gpg from open access on the file /root/.gnupg/gpg.conf. For complete SELinux messages run: sealert -l cb54177e-d44c-46a1-b246-5c0bbb8343be
Aug 1 04:30:02 netman.cs.umd.edu setroubleshoot[3570328]: SELinux is preventing /usr/bin/gpg from getattr access on the file /root/.gnupg/gpg.conf. For complete SELinux messages run: sealert -l fbba2e30-b7ab-491c-9ec6-f553e9ef72af
== newhonors2 (1 distinct, 24 total) ==
Aug 1 04:13:03 newhonors2 dhcpcd[572401]: dhcpcd is not running [x24]
== outbound00.cs.umd.edu (1 distinct, 6 total) ==
Aug 1 04:09:09 outbound00.cs.umd.edu python3[1692182]: ldapdb [x6]
== outbound01.cs.umd.edu (1 distinct, 6 total) ==
Aug 1 04:13:06 outbound01.cs.umd.edu python3[3918573]: ldapdb [x6]
== sentry-docker00.cs.umd.edu (42 distinct, 42 total) ==
Aug 1 04:17:33 sentry-docker00.cs.umd.edu systemd-udevd[3661041]: link_config: could not get ethtool features for veth333ba1e
Aug 1 04:17:33 sentry-docker00.cs.umd.edu systemd-udevd[3661041]: Could not set offload features of veth333ba1e: No such device
Aug 1 04:17:33 sentry-docker00.cs.umd.edu systemd-udevd[3661070]: Could not generate persistent MAC address for veth5c01a2f: No such file or directory
Aug 1 04:17:33 sentry-docker00.cs.umd.edu systemd-udevd[3661071]: Could not generate persistent MAC address for veth354a01b: No such file or directory
Aug 1 04:17:33 sentry-docker00.cs.umd.edu systemd-udevd[3661074]: Could not generate persistent MAC address for vetha8bc216: No such file or directory
Aug 1 04:17:33 sentry-docker00.cs.umd.edu systemd-udevd[3661075]: Could not generate persistent MAC address for veth103d50a: No such file or directory
Aug 1 04:17:33 sentry-docker00.cs.umd.edu systemd-udevd[3661090]: Could not generate persistent MAC address for veth4e3ce81: No such file or directory
Aug 1 04:17:33 sentry-docker00.cs.umd.edu systemd-udevd[3661083]: Could not generate persistent MAC address for vethf6cbbd0: No such file or directory
Aug 1 04:17:33 sentry-docker00.cs.umd.edu systemd-udevd[3661148]: Could not generate persistent MAC address for veth44835a0: No such file or directory
Aug 1 04:17:33 sentry-docker00.cs.umd.edu systemd-udevd[3661152]: Could not generate persistent MAC address for vethba7b037: No such file or directory
Aug 1 04:20:57 sentry-docker00.cs.umd.edu systemd-udevd[3663707]: link_config: could not get ethtool features for vethaff66ab
Aug 1 04:20:57 sentry-docker00.cs.umd.edu systemd-udevd[3663707]: Could not set offload features of vethaff66ab: No such device
Aug 1 04:20:57 sentry-docker00.cs.umd.edu systemd-udevd[3663725]: Could not generate persistent MAC address for veth07b7204: No such file or directory
Aug 1 04:20:57 sentry-docker00.cs.umd.edu systemd-udevd[3663726]: Could not generate persistent MAC address for veth6f4bcbf: No such file or directory
Aug 1 04:37:41 sentry-docker00.cs.umd.edu systemd-udevd[3670423]: link_config: could not get ethtool features for veth44835a0
Aug 1 04:37:41 sentry-docker00.cs.umd.edu systemd-udevd[3670423]: Could not set offload features of veth44835a0: No such device
Aug 1 04:37:41 sentry-docker00.cs.umd.edu systemd-udevd[3670489]: Could not generate persistent MAC address for veth83a6bcd: No such file or directory
Aug 1 04:37:41 sentry-docker00.cs.umd.edu systemd-udevd[3670490]: Could not generate persistent MAC address for veth41844e5: No such file or directory
Aug 1 04:37:41 sentry-docker00.cs.umd.edu systemd-udevd[3670501]: Could not generate persistent MAC address for vethdbb77da: No such file or directory
Aug 1 04:37:41 sentry-docker00.cs.umd.edu systemd-udevd[3670497]: Could not generate persistent MAC address for veth6871498: No such file or directory
Aug 1 04:37:41 sentry-docker00.cs.umd.edu systemd-udevd[3670514]: Could not generate persistent MAC address for veth940ac23: No such file or directory
Aug 1 04:37:41 sentry-docker00.cs.umd.edu systemd-udevd[3670494]: Could not generate persistent MAC address for veth72f5ff2: No such file or directory
Aug 1 04:37:41 sentry-docker00.cs.umd.edu systemd-udevd[3670497]: Could not generate persistent MAC address for veth014facd: No such file or directory
Aug 1 04:37:41 sentry-docker00.cs.umd.edu systemd-udevd[3670502]: Could not generate persistent MAC address for veth54ad1bb: No such file or directory
Aug 1 04:41:01 sentry-docker00.cs.umd.edu systemd-udevd[3673084]: link_config: could not get ethtool features for veth07b7204
Aug 1 04:41:01 sentry-docker00.cs.umd.edu systemd-udevd[3673084]: Could not set offload features of veth07b7204: No such device
Aug 1 04:41:02 sentry-docker00.cs.umd.edu systemd-udevd[3673101]: Could not generate persistent MAC address for veth968e894: No such file or directory
Aug 1 04:41:02 sentry-docker00.cs.umd.edu systemd-udevd[3673102]: Could not generate persistent MAC address for veth7b73a45: No such file or directory
Aug 1 04:57:49 sentry-docker00.cs.umd.edu systemd-udevd[3679798]: link_config: could not get ethtool features for veth6871498
Aug 1 04:57:49 sentry-docker00.cs.umd.edu systemd-udevd[3679798]: Could not set offload features of veth6871498: No such device
... 12 more distinct messages not shown
== smokeping-slave (1 distinct, 1 total) ==
Aug 1 04:15:31 smokeping-slave nologin[397754]: Attempted login by UNKNOWN (UID: 65534) on UNKNOWN
== strawberry (4 distinct, 10 total) ==
Aug 1 04:09:44 strawberry udisksd[1067]: Error performing housekeeping for drive /org/freedesktop/UDisks2/drives/ST2000DM001_1CH164_W1E8J5KJ: Error updating SMART data: Error sending ATA command CHECK POWER MODE: Unexpected sense data returned:#0120000: 00 00 00 00 00 00 00 00 00 00 00 00 00 00 00 00 ................#0120010: 00 00 00 00 00 00 00 00 00 00 00 00 00 00 00 00 ................#012 (g-io-error-quark, 0) [x6]
Aug 1 04:15:04 strawberry nologin[3293847]: Attempted login by UNKNOWN (UID: 65534) on UNKNOWN
Aug 1 04:15:04 strawberry pipewire[3293846]: mod.jackdbus-detect: Failed to receive jackdbus reply: org.freedesktop.DBus.Error.ServiceUnknown: The name org.jackaudio.service was not provided by any .service files
Aug 1 04:34:42 strawberry smartd[5314]: Device: /dev/sda [SAT], failed to read SMART Attribute Data [x2]
== submit26-b9-4 (9 distinct, 9 total) ==
Aug 1 04:16:12 submit26-b9-4 setroubleshoot[760975]: SELinux is preventing /usr/bin/python3.9 from create access on the directory /(null). For complete SELinux messages run: sealert -l a4e66030-8621-4da9-bd27-5988bb1bf8ad
Aug 1 04:16:12 submit26-b9-4 setroubleshoot[760975]: SELinux is preventing /usr/bin/python3.9 from add_name access on the directory /(null). For complete SELinux messages run: sealert -l c055e37d-bbf5-4800-9083-d606f792c8c1
Aug 1 04:16:12 submit26-b9-4 setroubleshoot[760975]: SELinux is preventing /usr/bin/python3.9 from create access on the file /(null). For complete SELinux messages run: sealert -l e5bc3a56-6d6f-4776-954f-ddde1579648f
Aug 1 04:16:12 submit26-b9-4 setroubleshoot[760975]: SELinux is preventing /usr/bin/python3.9 from open access on the file /tmp/libdnf.WkNPEE/repodata/repomd.xml. For complete SELinux messages run: sealert -l a8ec5e1b-49f9-4fbc-a8ae-22e800f7abf2
Aug 1 04:16:12 submit26-b9-4 setroubleshoot[760975]: SELinux is preventing /usr/bin/python3.9 from setattr access on the file repomd.xml. For complete SELinux messages run: sealert -l 945db714-d0c0-4402-911e-932978b8b036
Aug 1 04:16:12 submit26-b9-4 setroubleshoot[760975]: SELinux is preventing /usr/bin/python3.9 from read access on the directory libdnf.WkNPEE. For complete SELinux messages run: sealert -l 463998a0-fb0d-463c-82b1-471135710a14
Aug 1 04:16:12 submit26-b9-4 setroubleshoot[760975]: SELinux is preventing /usr/bin/python3.9 from remove_name access on the directory repomd.xml. For complete SELinux messages run: sealert -l 473d2e21-15d8-407a-a9ee-2b842607fa00
Aug 1 04:16:12 submit26-b9-4 setroubleshoot[760975]: SELinux is preventing /usr/bin/python3.9 from unlink access on the file repomd.xml. For complete SELinux messages run: sealert -l 80c54d4f-bf4b-4501-addb-1627383587d0
Aug 1 04:16:12 submit26-b9-4 setroubleshoot[760975]: SELinux is preventing /usr/bin/python3.9 from rmdir access on the directory repodata. For complete SELinux messages run: sealert -l c63d3890-151e-49a0-83f0-3dfb69d051e5
1
0
Command: /usr/local/sbin/syslog-digest.py
Time : 0.4768s
Status : exited 0
Output :
Syslog digest — 2026-08-01 04:05 EDT
Processed 4,034 lines, filtered 3,288 (81%). 746 unknown (73 distinct) from 21 host(s).
== abuse (1 distinct, 347 total) ==
Aug 1 03:05:06 abuse rsyslogd[21745]: imjournal: open() failed for path: '/var/lib/rsyslog/imjournal.state.tmp': Input/output error [v8.2404.0 try https://www.rsyslog.com/e/2433 ] [x347]
== b0b02.cs.umd.edu (4 distinct, 5 total) ==
Aug 1 03:28:28 b0b02.cs.umd.edu setroubleshoot[1619910]: SELinux is preventing /usr/bin/python3.9 from getattr access on the file /etc/authselect/nsswitch.conf. For complete SELinux messages run: sealert -l 9a1e2952-3fde-4937-a8ab-f7f59791a458 [x2]
Aug 1 03:28:31 b0b02.cs.umd.edu setroubleshoot[1619910]: SELinux is preventing /usr/bin/python3.9 from read access on the file /etc/authselect/nsswitch.conf. For complete SELinux messages run: sealert -l 97d74423-e027-4cd6-8810-ad80944900b5
Aug 1 03:28:34 b0b02.cs.umd.edu setroubleshoot[1619910]: SELinux is preventing /usr/bin/python3.9 from open access on the file /etc/authselect/nsswitch.conf. For complete SELinux messages run: sealert -l 4f253f6a-62d6-46dd-8eaf-0b4d29df41c6
Aug 1 03:40:06 b0b02.cs.umd.edu rustdesk[1622851]: cannot open display:
== bac102 (4 distinct, 4 total) ==
Aug 1 03:33:43 bac102 systemd-resolved[902]: Using degraded feature set UDP instead of UDP+EDNS0 for DNS server 10.211.55.1.
Aug 1 03:34:14 bac102 systemd-resolved[902]: Using degraded feature set TCP instead of UDP for DNS server 10.211.55.1.
Aug 1 03:34:25 bac102 puppet-agent[185585]: (Facter) invalid or malformed lldp data: MalformedDataError: no lldp interface data found
Aug 1 03:35:01 bac102 systemd-resolved[902]: Using degraded feature set UDP instead of TCP for DNS server 10.211.55.1.
== contest (1 distinct, 34 total) ==
Aug 1 03:05:17 contest goferd[1007]: [ERROR][worker-0] gofer.messaging.adapter.connect:33 - connect: proton+amqps://satellite8.cs.umd.edu:5647, failed: Connection amqps://satellite8.cs.umd.edu:5647 disconnected: Condition('proton.pythonio', 'Connection refused to all addresses') [x34]
== csfw00a (1 distinct, 228 total) ==
Aug 1 03:05:03 csfw00a kernel: bnxt_en 0000:09:00.0 eth3: NIC Link is Down [x228]
== dojo (1 distinct, 1 total) ==
Aug 1 03:09:27 dojo sshd[787279]: error: Protocol major versions differ: 2 vs. 1
== hackerman (1 distinct, 1 total) ==
Aug 1 03:19:01 hackerman gnome-software[2060381]: failed to commit changes to dconf: GDBus.Error:org.gtk.GDBus.UnmappedGError.Quark._g_2dfile_2derror_2dquark.Code2: Failed to create file “/adminhomes/sajith/.config/dconf/user.L8OVS3”: Permission denied
== idm00 (1 distinct, 1 total) ==
Aug 1 03:51:14 idm00 named[1455]: client @0x7f330432bc58 10.73.240.42#53056: update '73.10.in-addr.arpa/IN' denied
== idmp0 (1 distinct, 1 total) ==
Aug 1 03:36:02 idmp0 named[5198]: client @0x7f99000dfeb8 10.73.240.43#55161: update '73.10.in-addr.arpa/IN' denied
== inbound00.cs.umd.edu (2 distinct, 2 total) ==
Aug 1 03:18:02 inbound00.cs.umd.edu krb5_child[1713327]: Client 'admin(a)UMD.EDU' not found in Kerberos database
Aug 1 03:18:19 inbound00.cs.umd.edu sshd-session[1713367]: error: Protocol major versions differ: 2 vs. 1
== itmon02 (2 distinct, 28 total) ==
Aug 1 03:07:48 itmon02 sshd[1834]: error: beginning MaxStartups throttling [x27]
Aug 1 03:15:03 itmon02 (httpd)[1496774]: httpd.service: Referenced but unset environment variable evaluates to an empty string: OPTIONS
== kadath.cs.umd.edu (1 distinct, 1 total) ==
Aug 1 03:47:30 kadath.cs.umd.edu puppet-agent[1127411]: (Facter) invalid or malformed lldp data: MalformedDataError: no lldp interface data found
== neoavion (1 distinct, 1 total) ==
Aug 1 03:34:22 neoavion krb5_child[2809205]: No credentials cache found
== netbox (1 distinct, 1 total) ==
Aug 1 03:08:02 netbox (httpd)[1191141]: httpd.service: Referenced but unset environment variable evaluates to an empty string: OPTIONS
== newhonors2 (1 distinct, 24 total) ==
Aug 1 03:13:03 newhonors2 dhcpcd[570525]: dhcpcd is not running [x24]
== outbound00.cs.umd.edu (2 distinct, 8 total) ==
Aug 1 03:09:09 outbound00.cs.umd.edu python3[1677513]: ldapdb [x7]
Aug 1 03:24:41 outbound00.cs.umd.edu systemd[1]: Configuration file /usr/lib/systemd/system/authentication_milter.service is marked executable. Please remove executable permission bits. Proceeding anyway.
== outbound01.cs.umd.edu (1 distinct, 6 total) ==
Aug 1 03:13:07 outbound01.cs.umd.edu python3[3904690]: ldapdb [x6]
== peach.cs.umd.edu (3 distinct, 3 total) ==
Aug 1 03:36:09 peach.cs.umd.edu systemd[1]: splunk.service: Stopping timed out. Terminating.
Aug 1 03:36:09 peach.cs.umd.edu systemd[1]: splunk.service: Control process exited, code=killed, status=15/TERM
Aug 1 03:36:15 peach.cs.umd.edu setroubleshoot[1988438]: SELinux is preventing systemd from unlink access on the file splunkd.pid. For complete SELinux messages run: sealert -l ad9baf89-a69c-41a4-9dc1-608047e050d5
== sentry-docker00.cs.umd.edu (40 distinct, 40 total) ==
Aug 1 03:17:08 sentry-docker00.cs.umd.edu systemd-udevd[3632504]: link_config: could not get ethtool features for veth3f8ad6b
Aug 1 03:17:08 sentry-docker00.cs.umd.edu systemd-udevd[3632504]: Could not set offload features of veth3f8ad6b: No such device
Aug 1 03:17:08 sentry-docker00.cs.umd.edu systemd-udevd[3632557]: Could not generate persistent MAC address for veth7f71568: No such file or directory
Aug 1 03:17:08 sentry-docker00.cs.umd.edu systemd-udevd[3632558]: Could not generate persistent MAC address for vethbdc9df3: No such file or directory
Aug 1 03:17:08 sentry-docker00.cs.umd.edu systemd-udevd[3632561]: Could not generate persistent MAC address for veth0b1654f: No such file or directory
Aug 1 03:17:08 sentry-docker00.cs.umd.edu systemd-udevd[3632562]: Could not generate persistent MAC address for veth31a1fb2: No such file or directory
Aug 1 03:17:08 sentry-docker00.cs.umd.edu systemd-udevd[3632566]: Could not generate persistent MAC address for vethb84c911: No such file or directory
Aug 1 03:17:08 sentry-docker00.cs.umd.edu systemd-udevd[3632574]: Could not generate persistent MAC address for veth7ab08ee: No such file or directory
Aug 1 03:17:08 sentry-docker00.cs.umd.edu systemd-udevd[3632587]: Could not generate persistent MAC address for vethe7b7652: No such file or directory
Aug 1 03:17:08 sentry-docker00.cs.umd.edu systemd-udevd[3632588]: Could not generate persistent MAC address for veth5de7f2c: No such file or directory
Aug 1 03:20:36 sentry-docker00.cs.umd.edu systemd-udevd[3635250]: link_config: could not get ethtool features for veth72af773
Aug 1 03:20:36 sentry-docker00.cs.umd.edu systemd-udevd[3635250]: Could not set offload features of veth72af773: No such device
Aug 1 03:20:37 sentry-docker00.cs.umd.edu systemd-udevd[3635266]: Could not generate persistent MAC address for vethb0a6a5d: No such file or directory
Aug 1 03:20:37 sentry-docker00.cs.umd.edu systemd-udevd[3635267]: Could not generate persistent MAC address for vethc4ca563: No such file or directory
Aug 1 03:37:16 sentry-docker00.cs.umd.edu systemd-udevd[3641978]: link_config: could not get ethtool features for vethe7b7652
Aug 1 03:37:16 sentry-docker00.cs.umd.edu systemd-udevd[3641978]: Could not set offload features of vethe7b7652: No such device
Aug 1 03:37:16 sentry-docker00.cs.umd.edu systemd-udevd[3642008]: Could not generate persistent MAC address for vethd351c57: No such file or directory
Aug 1 03:37:16 sentry-docker00.cs.umd.edu systemd-udevd[3642009]: Could not generate persistent MAC address for veth1858bc5: No such file or directory
Aug 1 03:37:16 sentry-docker00.cs.umd.edu systemd-udevd[3642012]: Could not generate persistent MAC address for veth4c1a0a2: No such file or directory
Aug 1 03:37:16 sentry-docker00.cs.umd.edu systemd-udevd[3642013]: Could not generate persistent MAC address for veth75f47d1: No such file or directory
Aug 1 03:37:16 sentry-docker00.cs.umd.edu systemd-udevd[3642036]: Could not generate persistent MAC address for veth4958180: No such file or directory
Aug 1 03:37:16 sentry-docker00.cs.umd.edu systemd-udevd[3642037]: Could not generate persistent MAC address for vethd368674: No such file or directory
Aug 1 03:37:16 sentry-docker00.cs.umd.edu systemd-udevd[3642055]: Could not generate persistent MAC address for vethd953fe3: No such file or directory
Aug 1 03:37:16 sentry-docker00.cs.umd.edu systemd-udevd[3642049]: Could not generate persistent MAC address for vethd231cf3: No such file or directory
Aug 1 03:40:45 sentry-docker00.cs.umd.edu systemd-udevd[3644701]: Could not generate persistent MAC address for veth9762d97: No such file or directory
Aug 1 03:40:45 sentry-docker00.cs.umd.edu systemd-udevd[3644702]: Could not generate persistent MAC address for vethad33ddd: No such file or directory
Aug 1 03:57:24 sentry-docker00.cs.umd.edu systemd-udevd[3651365]: link_config: could not get ethtool features for vethd953fe3
Aug 1 03:57:24 sentry-docker00.cs.umd.edu systemd-udevd[3651365]: Could not set offload features of vethd953fe3: No such device
Aug 1 03:57:24 sentry-docker00.cs.umd.edu systemd-udevd[3651447]: Could not generate persistent MAC address for veth333ba1e: No such file or directory
Aug 1 03:57:24 sentry-docker00.cs.umd.edu systemd-udevd[3651448]: Could not generate persistent MAC address for veth67d06a6: No such file or directory
... 10 more distinct messages not shown
== strawberry (2 distinct, 8 total) ==
Aug 1 03:09:44 strawberry udisksd[1067]: Error performing housekeeping for drive /org/freedesktop/UDisks2/drives/ST2000DM001_1CH164_W1E8J5KJ: Error updating SMART data: Error sending ATA command CHECK POWER MODE: Unexpected sense data returned:#0120000: 00 00 00 00 00 00 00 00 00 00 00 00 00 00 00 00 ................#0120010: 00 00 00 00 00 00 00 00 00 00 00 00 00 00 00 00 ................#012 (g-io-error-quark, 0) [x6]
Aug 1 03:34:42 strawberry smartd[5314]: Device: /dev/sda [SAT], failed to read SMART Attribute Data [x2]
== teaching-awards (2 distinct, 2 total) ==
Aug 1 03:39:04 teaching-awards krb5_child[1688582]: Client 'admin(a)UMD.EDU' not found in Kerberos database
Aug 1 03:39:17 teaching-awards sshd-session[1688727]: error: Protocol major versions differ: 2 vs. 1
1
0
Command: /usr/local/sbin/syslog-digest.py
Time : 0.4829s
Status : exited 0
Output :
Syslog digest — 2026-08-01 03:05 EDT
Processed 4,231 lines, filtered 3,492 (82%). 739 unknown (63 distinct) from 14 host(s).
== abuse (1 distinct, 348 total) ==
Aug 1 02:05:06 abuse rsyslogd[21745]: imjournal: open() failed for path: '/var/lib/rsyslog/imjournal.state.tmp': Input/output error [v8.2404.0 try https://www.rsyslog.com/e/2433 ] [x348]
== b0b02.cs.umd.edu (4 distinct, 4 total) ==
Aug 1 02:28:24 b0b02.cs.umd.edu setroubleshoot[1604842]: SELinux is preventing /usr/bin/python3.9 from getattr access on the file /etc/authselect/nsswitch.conf. For complete SELinux messages run: sealert -l 9a1e2952-3fde-4937-a8ab-f7f59791a458
Aug 1 02:28:27 b0b02.cs.umd.edu setroubleshoot[1604842]: SELinux is preventing /usr/bin/python3.9 from read access on the file /etc/authselect/nsswitch.conf. For complete SELinux messages run: sealert -l 97d74423-e027-4cd6-8810-ad80944900b5
Aug 1 02:28:30 b0b02.cs.umd.edu setroubleshoot[1604842]: SELinux is preventing /usr/bin/python3.9 from open access on the file /etc/authselect/nsswitch.conf. For complete SELinux messages run: sealert -l 4f253f6a-62d6-46dd-8eaf-0b4d29df41c6
Aug 1 02:40:02 b0b02.cs.umd.edu rustdesk[1607786]: cannot open display:
== contest (1 distinct, 33 total) ==
Aug 1 02:06:23 contest goferd[1007]: [ERROR][worker-0] gofer.messaging.adapter.connect:33 - connect: proton+amqps://satellite8.cs.umd.edu:5647, failed: Connection amqps://satellite8.cs.umd.edu:5647 disconnected: Condition('proton.pythonio', 'Connection refused to all addresses') [x33]
== csfw00a (1 distinct, 222 total) ==
Aug 1 02:04:44 csfw00a kernel: bnxt_en 0000:09:00.0 eth3: NIC Link is Down [x222]
== idm00 (1 distinct, 1 total) ==
Aug 1 02:51:13 idm00 named[1455]: client @0x7f3310201ff8 10.73.240.42#55132: update '73.10.in-addr.arpa/IN' denied
== idmp0 (1 distinct, 1 total) ==
Aug 1 02:36:02 idmp0 named[5198]: client @0x7f99000dfeb8 10.73.240.43#58112: update '73.10.in-addr.arpa/IN' denied
== itmon02 (1 distinct, 38 total) ==
Aug 1 02:07:57 itmon02 sshd[1834]: error: beginning MaxStartups throttling [x38]
== networkvm01.cs.umd.edu (9 distinct, 9 total) ==
Aug 1 02:06:53 networkvm01.cs.umd.edu setroubleshoot[2576403]: SELinux is preventing /usr/bin/gpg from write access on the directory /(null). For complete SELinux messages run: sealert -l 8ead1354-ae8a-4a17-bb3f-146ebf6c892c
Aug 1 02:06:53 networkvm01.cs.umd.edu setroubleshoot[2576403]: SELinux is preventing /usr/bin/gpg from add_name access on the directory /(null). For complete SELinux messages run: sealert -l f9b51e91-5dbc-455f-88c2-f0746a2f0f4c
Aug 1 02:06:53 networkvm01.cs.umd.edu setroubleshoot[2576403]: SELinux is preventing /usr/bin/gpg from create access on the file /(null). For complete SELinux messages run: sealert -l af0a60e6-c449-4bdd-bfb8-c69b58472884
Aug 1 02:06:53 networkvm01.cs.umd.edu setroubleshoot[2576403]: SELinux is preventing /usr/bin/gpg from link access on the file /(null). For complete SELinux messages run: sealert -l 3df452f6-4d9e-4e38-946b-ea8e1edd356c
Aug 1 02:06:53 networkvm01.cs.umd.edu setroubleshoot[2576403]: SELinux is preventing /usr/bin/gpg from remove_name access on the directory .#lk0x000055e8951b5ed0.networkvm01.cs.umd.edu.2576402x. For complete SELinux messages run: sealert -l fcac71c9-c7c0-45a9-9dc2-a8dcbeccfc75
Aug 1 02:06:53 networkvm01.cs.umd.edu setroubleshoot[2576403]: SELinux is preventing /usr/bin/gpg from unlink access on the file .#lk0x000055e8951b5ed0.networkvm01.cs.umd.edu.2576402x. For complete SELinux messages run: sealert -l a672ebb7-fa69-419c-b1f0-fb386b8b48a6
Aug 1 02:06:53 networkvm01.cs.umd.edu setroubleshoot[2576403]: SELinux is preventing /usr/bin/gpg from write access on the directory /(null). For complete SELinux messages run: sealert -l fec9104e-d27a-4fd4-9872-6b17088c2951
Aug 1 02:06:54 networkvm01.cs.umd.edu setroubleshoot[2576403]: SELinux is preventing /usr/bin/gpg from add_name access on the directory /(null). For complete SELinux messages run: sealert -l 26718b2a-493d-457d-818c-244bd8d4ec9d
Aug 1 02:06:54 networkvm01.cs.umd.edu setroubleshoot[2576403]: SELinux is preventing /usr/bin/gpg from remove_name access on the directory .#lk0x00005632a6401ee0.networkvm01.cs.umd.edu.2576424x. For complete SELinux messages run: sealert -l 80e6efe4-93f3-4219-8132-b2b52db1f517
== newhonors2 (1 distinct, 24 total) ==
Aug 1 02:13:02 newhonors2 dhcpcd[568680]: dhcpcd is not running [x24]
== outbound00.cs.umd.edu (1 distinct, 6 total) ==
Aug 1 02:09:09 outbound00.cs.umd.edu python3[1663515]: ldapdb [x6]
== outbound01.cs.umd.edu (1 distinct, 6 total) ==
Aug 1 02:13:06 outbound01.cs.umd.edu python3[3890850]: ldapdb [x6]
== sentry-docker00.cs.umd.edu (38 distinct, 38 total) ==
Aug 1 02:16:43 sentry-docker00.cs.umd.edu systemd-udevd[3603735]: link_config: could not get ethtool features for veth19e1c78
Aug 1 02:16:43 sentry-docker00.cs.umd.edu systemd-udevd[3603735]: Could not set offload features of veth19e1c78: No such device
Aug 1 02:16:43 sentry-docker00.cs.umd.edu systemd-udevd[3603760]: Could not generate persistent MAC address for veth84ed88a: No such file or directory
Aug 1 02:16:43 sentry-docker00.cs.umd.edu systemd-udevd[3603761]: Could not generate persistent MAC address for veth7472586: No such file or directory
Aug 1 02:16:43 sentry-docker00.cs.umd.edu systemd-udevd[3603764]: Could not generate persistent MAC address for vethfcea607: No such file or directory
Aug 1 02:16:43 sentry-docker00.cs.umd.edu systemd-udevd[3603765]: Could not generate persistent MAC address for vethb00ca2f: No such file or directory
Aug 1 02:16:43 sentry-docker00.cs.umd.edu systemd-udevd[3603769]: Could not generate persistent MAC address for vethed4aac0: No such file or directory
Aug 1 02:16:43 sentry-docker00.cs.umd.edu systemd-udevd[3603776]: Could not generate persistent MAC address for veth28bd15c: No such file or directory
Aug 1 02:16:43 sentry-docker00.cs.umd.edu systemd-udevd[3603790]: Could not generate persistent MAC address for veth36d9d75: No such file or directory
Aug 1 02:16:43 sentry-docker00.cs.umd.edu systemd-udevd[3603791]: Could not generate persistent MAC address for veth4168b92: No such file or directory
Aug 1 02:20:12 sentry-docker00.cs.umd.edu systemd-udevd[3606137]: Could not generate persistent MAC address for veth1bbc52c: No such file or directory
Aug 1 02:20:12 sentry-docker00.cs.umd.edu systemd-udevd[3606138]: Could not generate persistent MAC address for vethb5d6de8: No such file or directory
Aug 1 02:36:51 sentry-docker00.cs.umd.edu systemd-udevd[3613424]: link_config: could not get ethtool features for vethfcea607
Aug 1 02:36:51 sentry-docker00.cs.umd.edu systemd-udevd[3613424]: Could not set offload features of vethfcea607: No such device
Aug 1 02:36:51 sentry-docker00.cs.umd.edu systemd-udevd[3613446]: Could not generate persistent MAC address for veth4ee54ef: No such file or directory
Aug 1 02:36:51 sentry-docker00.cs.umd.edu systemd-udevd[3613447]: Could not generate persistent MAC address for vethab560e7: No such file or directory
Aug 1 02:36:51 sentry-docker00.cs.umd.edu systemd-udevd[3613450]: Could not generate persistent MAC address for vethc2b3652: No such file or directory
Aug 1 02:36:51 sentry-docker00.cs.umd.edu systemd-udevd[3613467]: Could not generate persistent MAC address for veth970e93b: No such file or directory
Aug 1 02:36:51 sentry-docker00.cs.umd.edu systemd-udevd[3613474]: Could not generate persistent MAC address for veth98d8053: No such file or directory
Aug 1 02:36:51 sentry-docker00.cs.umd.edu systemd-udevd[3613475]: Could not generate persistent MAC address for veth13bdfc0: No such file or directory
Aug 1 02:36:51 sentry-docker00.cs.umd.edu systemd-udevd[3613582]: Could not generate persistent MAC address for vethed43e9d: No such file or directory
Aug 1 02:36:51 sentry-docker00.cs.umd.edu systemd-udevd[3613588]: Could not generate persistent MAC address for veth8c05e29: No such file or directory
Aug 1 02:40:20 sentry-docker00.cs.umd.edu systemd-udevd[3615869]: Could not generate persistent MAC address for veth4e8c0fb: No such file or directory
Aug 1 02:40:20 sentry-docker00.cs.umd.edu systemd-udevd[3615870]: Could not generate persistent MAC address for veth41a2ac8: No such file or directory
Aug 1 02:56:59 sentry-docker00.cs.umd.edu systemd-udevd[3623048]: link_config: could not get ethtool features for veth98d8053
Aug 1 02:56:59 sentry-docker00.cs.umd.edu systemd-udevd[3623048]: Could not set offload features of veth98d8053: No such device
Aug 1 02:56:59 sentry-docker00.cs.umd.edu systemd-udevd[3623074]: Could not generate persistent MAC address for veth3f8ad6b: No such file or directory
Aug 1 02:56:59 sentry-docker00.cs.umd.edu systemd-udevd[3623075]: Could not generate persistent MAC address for vetha72a9d4: No such file or directory
Aug 1 02:56:59 sentry-docker00.cs.umd.edu systemd-udevd[3623100]: Could not generate persistent MAC address for vethcf70b4e: No such file or directory
Aug 1 02:56:59 sentry-docker00.cs.umd.edu systemd-udevd[3623101]: Could not generate persistent MAC address for veth8c6af2d: No such file or directory
... 8 more distinct messages not shown
== strawberry (2 distinct, 8 total) ==
Aug 1 02:09:44 strawberry udisksd[1067]: Error performing housekeeping for drive /org/freedesktop/UDisks2/drives/ST2000DM001_1CH164_W1E8J5KJ: Error updating SMART data: Error sending ATA command CHECK POWER MODE: Unexpected sense data returned:#0120000: 00 00 00 00 00 00 00 00 00 00 00 00 00 00 00 00 ................#0120010: 00 00 00 00 00 00 00 00 00 00 00 00 00 00 00 00 ................#012 (g-io-error-quark, 0) [x6]
Aug 1 02:34:42 strawberry smartd[5314]: Device: /dev/sda [SAT], failed to read SMART Attribute Data [x2]
== zebatinsky.cs.umd.edu (1 distinct, 1 total) ==
Aug 1 02:57:17 zebatinsky.cs.umd.edu setroubleshoot[467390]: SELinux is preventing /usr/sbin/pdns_server from name_bind access on the udp_socket port 11111. For complete SELinux messages run: sealert -l 28562ffc-8f62-43f6-a4a9-31dd61e5e0f9
1
0
Command: /usr/local/sbin/syslog-digest.py
Time : 0.5080s
Status : exited 0
Output :
Syslog digest — 2026-08-01 02:05 EDT
Processed 4,110 lines, filtered 3,213 (78%). 897 unknown (117 distinct) from 19 host(s).
== abuse (1 distinct, 345 total) ==
Aug 1 01:05:06 abuse rsyslogd[21745]: imjournal: open() failed for path: '/var/lib/rsyslog/imjournal.state.tmp': Input/output error [v8.2404.0 try https://www.rsyslog.com/e/2433 ] [x345]
== b0b02.cs.umd.edu (1 distinct, 1 total) ==
Aug 1 01:39:59 b0b02.cs.umd.edu rustdesk[1592721]: cannot open display:
== cheezit.cs.umd.edu (11 distinct, 14 total) ==
Aug 1 02:01:26 cheezit.cs.umd.edu setroubleshoot[3982584]: failed to retrieve rpm info for path '/var/log/falconctl.log':
Aug 1 02:01:27 cheezit.cs.umd.edu setroubleshoot[3982584]: SELinux is preventing /opt/CrowdStrike/falconctl18708 from append access on the file /var/log/falconctl.log. For complete SELinux messages run: sealert -l 63f66d53-fcfc-44da-a79e-c789b1ce2ce8 [x2]
Aug 1 02:01:29 cheezit.cs.umd.edu setroubleshoot[3982584]: SELinux is preventing /opt/CrowdStrike/falconctl18708 from write access on the file falconstore. For complete SELinux messages run: sealert -l 386506af-597f-4357-89de-bc382f369a6e
Aug 1 02:01:41 cheezit.cs.umd.edu setroubleshoot[3982951]: failed to retrieve rpm info for path '/var/lib/sss/pipes/nss': [x2]
Aug 1 02:01:42 cheezit.cs.umd.edu setroubleshoot[3982951]: SELinux is preventing /usr/bin/lsof from write access on the sock_file /var/lib/sss/pipes/nss. For complete SELinux messages run: sealert -l f570494d-54d2-4dac-97e2-28395659abf1 [x2]
Aug 1 02:01:42 cheezit.cs.umd.edu setroubleshoot[3982951]: SELinux is preventing /usr/bin/lsof from write access on the sock_file socket. For complete SELinux messages run: sealert -l 9ff2383b-9e1d-44ff-b8ae-af91637450ae
Aug 1 02:02:21 cheezit.cs.umd.edu setroubleshoot[3983397]: SELinux is preventing /usr/bin/python3.9 from read access on the file /etc/selinux/targeted/contexts/files/file_contexts.subs_dist. For complete SELinux messages run: sealert -l 679eb260-cf5d-4783-99f4-ce308edb3295
Aug 1 02:02:21 cheezit.cs.umd.edu setroubleshoot[3983397]: SELinux is preventing /usr/bin/python3.9 from open access on the file /etc/selinux/targeted/contexts/files/file_contexts.subs_dist. For complete SELinux messages run: sealert -l 77caba8a-5cd0-4e18-b188-6e35c461772d
Aug 1 02:02:21 cheezit.cs.umd.edu setroubleshoot[3983397]: SELinux is preventing /usr/bin/python3.9 from read access on the file /etc/selinux/targeted/contexts/files/file_contexts.subs. For complete SELinux messages run: sealert -l d9c6dd0d-0a34-4430-a5ff-e985c55cb064
Aug 1 02:02:21 cheezit.cs.umd.edu setroubleshoot[3983397]: SELinux is preventing /usr/bin/python3.9 from open access on the file /etc/selinux/targeted/contexts/files/file_contexts.subs. For complete SELinux messages run: sealert -l 8edbce57-8212-4ac8-af50-3fe403231eda
Aug 1 02:02:21 cheezit.cs.umd.edu setroubleshoot[3983397]: SELinux is preventing /usr/bin/python3.9 from map access on the file /etc/selinux/targeted/contexts/files/file_contexts.bin. For complete SELinux messages run: sealert -l 4a0cbe3b-6f49-4c7e-95c6-380f7aef806e
== contest (9 distinct, 44 total) ==
Aug 1 01:05:41 contest goferd[1007]: [ERROR][worker-0] gofer.messaging.adapter.connect:33 - connect: proton+amqps://satellite8.cs.umd.edu:5647, failed: Connection amqps://satellite8.cs.umd.edu:5647 disconnected: Condition('proton.pythonio', 'Connection refused to all addresses') [x34]
Aug 1 01:48:16 contest setroubleshoot[425293]: SELinux is preventing /usr/libexec/platform-python3.6 from create access on the directory libdnf.xvB37J. For complete SELinux messages run: sealert -l cb6b25c6-4765-4cf2-88a0-9b3b508e94e9
Aug 1 01:48:16 contest setroubleshoot[425293]: SELinux is preventing /usr/bin/gpgconf from add_name access on the directory repodata. For complete SELinux messages run: sealert -l 41cf7b1b-0f34-4609-98f2-b66e7825fef7 [x2]
Aug 1 01:48:16 contest setroubleshoot[425293]: SELinux is preventing /usr/libexec/platform-python3.6 from create access on the file mirrorlist. For complete SELinux messages run: sealert -l fc20ff92-ea83-4f38-a24b-ddfd737a3141
Aug 1 01:48:16 contest setroubleshoot[425293]: SELinux is preventing /usr/libexec/platform-python3.6 from setattr access on the file repomd.xml. For complete SELinux messages run: sealert -l ac675631-fa35-4e93-adc9-b692b18e53e5
Aug 1 01:48:16 contest setroubleshoot[425293]: SELinux is preventing /usr/libexec/platform-python3.6 from read access on the directory libdnf.xvB37J. For complete SELinux messages run: sealert -l 45d103b6-0810-4890-a705-990118577ce8
Aug 1 01:48:17 contest setroubleshoot[425293]: SELinux is preventing /usr/libexec/platform-python3.6 from remove_name access on the directory repomd.xml. For complete SELinux messages run: sealert -l 7e499113-2fd7-4f67-bec6-3521efbe3637 [x2]
Aug 1 01:48:17 contest setroubleshoot[425293]: SELinux is preventing /usr/libexec/platform-python3.6 from rmdir access on the directory repodata. For complete SELinux messages run: sealert -l 3928930b-a1ed-448d-950b-0665ac2adef8
Aug 1 01:48:17 contest setroubleshoot[425293]: SELinux is preventing /usr/libexec/platform-python3.6 from create access on the directory libdnf.vVS8rZ. For complete SELinux messages run: sealert -l cb6b25c6-4765-4cf2-88a0-9b3b508e94e9
== csfw00a (2 distinct, 258 total) ==
Aug 1 01:05:54 csfw00a kernel: bnxt_en 0000:09:00.0 eth3: NIC Link is Down [x250]
Aug 1 02:03:43 csfw00a ospf6d[1477]: [EC 100663307] Could not send entire message [x8]
== hackerman (1 distinct, 1 total) ==
Aug 1 01:19:01 hackerman gnome-software[2060381]: failed to commit changes to dconf: GDBus.Error:org.gtk.GDBus.UnmappedGError.Quark._g_2dfile_2derror_2dquark.Code2: Failed to create file “/adminhomes/sajith/.config/dconf/user.A3LVS3”: Permission denied
== hazfs.cs.umd.edu (11 distinct, 66 total) ==
Aug 1 01:52:23 hazfs.cs.umd.edu snmpd[1431]: send response: Failure in sendto [x6]
Aug 1 01:52:23 hazfs.cs.umd.edu snmpd[1431]: -- NET-SNMP-EXTEND-MIB::nsExtendStatus."userweb" [x6]
Aug 1 01:52:23 hazfs.cs.umd.edu snmpd[1431]: -- NET-SNMP-EXTEND-MIB::nsExtendStatus."zfslist" [x6]
Aug 1 01:52:23 hazfs.cs.umd.edu snmpd[1431]: -- NET-SNMP-EXTEND-MIB::nsExtendStatus."userhome" [x6]
Aug 1 01:52:23 hazfs.cs.umd.edu snmpd[1431]: -- NET-SNMP-EXTEND-MIB::nsExtendOutput1Line."userweb" [x6]
Aug 1 01:52:23 hazfs.cs.umd.edu snmpd[1431]: -- NET-SNMP-EXTEND-MIB::nsExtendOutput1Line."zfslist" [x6]
Aug 1 01:52:23 hazfs.cs.umd.edu snmpd[1431]: -- NET-SNMP-EXTEND-MIB::nsExtendOutput1Line."userhome" [x6]
Aug 1 01:52:23 hazfs.cs.umd.edu snmpd[1431]: -- NET-SNMP-EXTEND-MIB::nsExtendOutputFull."userweb" [x6]
Aug 1 01:52:23 hazfs.cs.umd.edu snmpd[1431]: -- NET-SNMP-EXTEND-MIB::nsExtendOutputFull."zfslist" [x6]
Aug 1 01:52:23 hazfs.cs.umd.edu snmpd[1431]: -- NET-SNMP-EXTEND-MIB::nsExtendOutputFull."userhome" [x6]
Aug 1 01:52:23 hazfs.cs.umd.edu snmpd[1431]: -- NET-SNMP-EXTEND-MIB::nsExtendOutNumLines."userweb" [x6]
== idm00 (2 distinct, 2 total) ==
Aug 1 01:24:04 idm00 named[1455]: client @0x7f33042401c8 10.73.245.12#57573: update '73.10.in-addr.arpa/IN' denied
Aug 1 01:51:13 idm00 named[1455]: client @0x7f3310023d88 10.73.240.42#54587: update '73.10.in-addr.arpa/IN' denied
== idmp0 (1 distinct, 1 total) ==
Aug 1 01:36:02 idmp0 named[5198]: client @0x7f98e88b27f8 10.73.240.43#58978: update '73.10.in-addr.arpa/IN' denied
== itmon02 (1 distinct, 41 total) ==
Aug 1 01:08:09 itmon02 sshd[1834]: error: beginning MaxStartups throttling [x41]
== newhonors2 (1 distinct, 24 total) ==
Aug 1 01:13:03 newhonors2 dhcpcd[566836]: dhcpcd is not running [x24]
== outbound00.cs.umd.edu (2 distinct, 7 total) ==
Aug 1 01:05:42 outbound00.cs.umd.edu sshd-session[1649134]: error: Protocol major versions differ: 2 vs. 1
Aug 1 01:09:09 outbound00.cs.umd.edu python3[1649672]: ldapdb [x6]
== outbound01.cs.umd.edu (3 distinct, 8 total) ==
Aug 1 01:13:06 outbound01.cs.umd.edu python3[3876794]: ldapdb [x6]
Aug 1 02:04:20 outbound01.cs.umd.edu krb5_child[3889016]: Client 'admin(a)UMD.EDU' not found in Kerberos database
Aug 1 02:04:38 outbound01.cs.umd.edu sshd-session[3889026]: error: Protocol major versions differ: 2 vs. 1
== sentry-docker00.cs.umd.edu (38 distinct, 38 total) ==
Aug 1 01:16:18 sentry-docker00.cs.umd.edu systemd-udevd[3575140]: link_config: could not get ethtool features for vethe09ef8b
Aug 1 01:16:18 sentry-docker00.cs.umd.edu systemd-udevd[3575140]: Could not set offload features of vethe09ef8b: No such device
Aug 1 01:16:18 sentry-docker00.cs.umd.edu systemd-udevd[3575165]: Could not generate persistent MAC address for veth94b3816: No such file or directory
Aug 1 01:16:18 sentry-docker00.cs.umd.edu systemd-udevd[3575166]: Could not generate persistent MAC address for veth7b98c23: No such file or directory
Aug 1 01:16:18 sentry-docker00.cs.umd.edu systemd-udevd[3575169]: Could not generate persistent MAC address for veth160c5de: No such file or directory
Aug 1 01:16:18 sentry-docker00.cs.umd.edu systemd-udevd[3575170]: Could not generate persistent MAC address for vethb652528: No such file or directory
Aug 1 01:16:18 sentry-docker00.cs.umd.edu systemd-udevd[3575190]: Could not generate persistent MAC address for vetha38f4d5: No such file or directory
Aug 1 01:16:18 sentry-docker00.cs.umd.edu systemd-udevd[3575179]: Could not generate persistent MAC address for vethd624a0a: No such file or directory
Aug 1 01:16:18 sentry-docker00.cs.umd.edu systemd-udevd[3575177]: Could not generate persistent MAC address for veth137bb30: No such file or directory
Aug 1 01:16:18 sentry-docker00.cs.umd.edu systemd-udevd[3575190]: Could not generate persistent MAC address for veth59eef9e: No such file or directory
Aug 1 01:19:47 sentry-docker00.cs.umd.edu systemd-udevd[3577552]: Could not generate persistent MAC address for veth2950334: No such file or directory
Aug 1 01:19:47 sentry-docker00.cs.umd.edu systemd-udevd[3577553]: Could not generate persistent MAC address for veth9aef8fd: No such file or directory
Aug 1 01:36:26 sentry-docker00.cs.umd.edu systemd-udevd[3584737]: link_config: could not get ethtool features for veth94b3816
Aug 1 01:36:26 sentry-docker00.cs.umd.edu systemd-udevd[3584737]: Could not set offload features of veth94b3816: No such device
Aug 1 01:36:26 sentry-docker00.cs.umd.edu systemd-udevd[3584764]: Could not generate persistent MAC address for veth691eb50: No such file or directory
Aug 1 01:36:26 sentry-docker00.cs.umd.edu systemd-udevd[3584765]: Could not generate persistent MAC address for veth1e533d3: No such file or directory
Aug 1 01:36:26 sentry-docker00.cs.umd.edu systemd-udevd[3584768]: Could not generate persistent MAC address for veth8991d0c: No such file or directory
Aug 1 01:36:26 sentry-docker00.cs.umd.edu systemd-udevd[3584769]: Could not generate persistent MAC address for veth9e7d2a3: No such file or directory
Aug 1 01:36:26 sentry-docker00.cs.umd.edu systemd-udevd[3584765]: Could not generate persistent MAC address for vethbb0ef60: No such file or directory
Aug 1 01:36:26 sentry-docker00.cs.umd.edu systemd-udevd[3584784]: Could not generate persistent MAC address for veth0648f09: No such file or directory
Aug 1 01:36:26 sentry-docker00.cs.umd.edu systemd-udevd[3584795]: Could not generate persistent MAC address for veth8f681ac: No such file or directory
Aug 1 01:36:26 sentry-docker00.cs.umd.edu systemd-udevd[3584794]: Could not generate persistent MAC address for veth62b7cef: No such file or directory
Aug 1 01:39:55 sentry-docker00.cs.umd.edu systemd-udevd[3587177]: link_config: could not get ethtool features for veth2950334
Aug 1 01:39:55 sentry-docker00.cs.umd.edu systemd-udevd[3587177]: Could not set offload features of veth2950334: No such device
Aug 1 01:39:55 sentry-docker00.cs.umd.edu systemd-udevd[3587194]: Could not generate persistent MAC address for veth197a495: No such file or directory
Aug 1 01:39:55 sentry-docker00.cs.umd.edu systemd-udevd[3587195]: Could not generate persistent MAC address for veth4c6dac1: No such file or directory
Aug 1 01:56:34 sentry-docker00.cs.umd.edu systemd-udevd[3594185]: link_config: could not get ethtool features for vethbb0ef60
Aug 1 01:56:34 sentry-docker00.cs.umd.edu systemd-udevd[3594185]: Could not set offload features of vethbb0ef60: No such device
Aug 1 01:56:35 sentry-docker00.cs.umd.edu systemd-udevd[3594212]: Could not generate persistent MAC address for veth953da88: No such file or directory
Aug 1 01:56:35 sentry-docker00.cs.umd.edu systemd-udevd[3594213]: Could not generate persistent MAC address for veth5782199: No such file or directory
... 8 more distinct messages not shown
== strawberry (2 distinct, 8 total) ==
Aug 1 01:09:44 strawberry udisksd[1067]: Error performing housekeeping for drive /org/freedesktop/UDisks2/drives/ST2000DM001_1CH164_W1E8J5KJ: Error updating SMART data: Error sending ATA command CHECK POWER MODE: Unexpected sense data returned:#0120000: 00 00 00 00 00 00 00 00 00 00 00 00 00 00 00 00 ................#0120010: 00 00 00 00 00 00 00 00 00 00 00 00 00 00 00 00 ................#012 (g-io-error-quark, 0) [x6]
Aug 1 01:34:42 strawberry smartd[5314]: Device: /dev/sda [SAT], failed to read SMART Attribute Data [x2]
== submit26-b9-2 (10 distinct, 10 total) ==
Aug 1 01:08:07 submit26-b9-2 systemd[1]: user(a)1001.service: Main process exited, code=killed, status=9/KILL
Aug 1 01:12:51 submit26-b9-2 setroubleshoot[746882]: SELinux is preventing /usr/bin/python3.9 from create access on the directory /(null). For complete SELinux messages run: sealert -l d506243c-d61e-48f3-b42a-4592c913deb0
Aug 1 01:12:51 submit26-b9-2 setroubleshoot[746882]: SELinux is preventing /usr/bin/python3.9 from add_name access on the directory /(null). For complete SELinux messages run: sealert -l 3b4752ac-1b9a-4af9-a05b-32e4c2eb13ab
Aug 1 01:12:51 submit26-b9-2 setroubleshoot[746882]: SELinux is preventing /usr/bin/python3.9 from create access on the file /(null). For complete SELinux messages run: sealert -l 29e5adbd-4381-4467-b40d-a2219101e096
Aug 1 01:12:51 submit26-b9-2 setroubleshoot[746882]: SELinux is preventing /usr/bin/python3.9 from open access on the file /tmp/libdnf.nPMtQ0/repodata/repomd.xml. For complete SELinux messages run: sealert -l 1b38f2ec-01ce-4343-8059-ba7494ecc5c4
Aug 1 01:12:51 submit26-b9-2 setroubleshoot[746882]: SELinux is preventing /usr/bin/python3.9 from setattr access on the file repomd.xml. For complete SELinux messages run: sealert -l e5f9af40-1f63-4924-b012-27ab2a7b2266
Aug 1 01:12:51 submit26-b9-2 setroubleshoot[746882]: SELinux is preventing /usr/bin/python3.9 from read access on the directory libdnf.nPMtQ0. For complete SELinux messages run: sealert -l 5c54db87-54a3-4a7c-97b4-b5c48d6c3543
Aug 1 01:12:51 submit26-b9-2 setroubleshoot[746882]: SELinux is preventing /usr/bin/python3.9 from remove_name access on the directory repomd.xml. For complete SELinux messages run: sealert -l 63cd60e1-1e61-4276-afea-dd8526ffe8b2
Aug 1 01:12:51 submit26-b9-2 setroubleshoot[746882]: SELinux is preventing /usr/bin/python3.9 from unlink access on the file repomd.xml. For complete SELinux messages run: sealert -l 81c7e9ec-e023-4c6d-b1ad-c02a242e655e
Aug 1 01:12:51 submit26-b9-2 setroubleshoot[746882]: SELinux is preventing /usr/bin/python3.9 from rmdir access on the directory repodata. For complete SELinux messages run: sealert -l 6ae9a597-e123-4d74-8eec-a8ebe0f5e4d0
== submit26-b9-3 (10 distinct, 14 total) ==
Aug 1 01:20:37 submit26-b9-3 setroubleshoot[744460]: SELinux is preventing /usr/bin/python3.9 from create access on the directory /(null). For complete SELinux messages run: sealert -l 5b912a44-22fd-4560-b201-2a4e289b73f5 [x2]
Aug 1 01:20:37 submit26-b9-3 setroubleshoot[744460]: SELinux is preventing /usr/bin/python3.9 from add_name access on the directory /(null). For complete SELinux messages run: sealert -l 7f1df1e4-725e-4953-98eb-1079f908f543 [x2]
Aug 1 01:20:37 submit26-b9-3 setroubleshoot[744460]: SELinux is preventing /usr/bin/python3.9 from create access on the file /(null). For complete SELinux messages run: sealert -l 40b8852a-f77b-44b4-affe-5f11fa33de43
Aug 1 01:20:37 submit26-b9-3 setroubleshoot[744460]: SELinux is preventing /usr/bin/python3.9 from open access on the file /tmp/libdnf.28ywsQ/repodata/repomd.xml. For complete SELinux messages run: sealert -l 45a8019e-f6b5-4baa-92c1-862594b40d46
Aug 1 01:20:37 submit26-b9-3 setroubleshoot[744460]: SELinux is preventing /usr/bin/python3.9 from setattr access on the file repomd.xml. For complete SELinux messages run: sealert -l e9f0bfff-7784-4126-baa4-2bb06da56591
Aug 1 01:20:37 submit26-b9-3 setroubleshoot[744460]: SELinux is preventing /usr/bin/python3.9 from read access on the directory libdnf.28ywsQ. For complete SELinux messages run: sealert -l 0b17cc3d-cdc6-4fe2-a11f-3892e7c41dc7
Aug 1 01:20:37 submit26-b9-3 setroubleshoot[744460]: SELinux is preventing /usr/bin/python3.9 from remove_name access on the directory repomd.xml. For complete SELinux messages run: sealert -l 10e38c64-b65f-4cdd-901e-4375652d9a42 [x2]
Aug 1 01:20:37 submit26-b9-3 setroubleshoot[744460]: SELinux is preventing /usr/bin/python3.9 from unlink access on the file repomd.xml. For complete SELinux messages run: sealert -l 7fd9cf72-ef38-48e1-b6aa-b571b26a7b22
Aug 1 01:20:37 submit26-b9-3 setroubleshoot[744460]: SELinux is preventing /usr/bin/python3.9 from rmdir access on the directory repodata. For complete SELinux messages run: sealert -l b9b11116-89bd-4a3c-980c-1d422c5dcee4 [x2]
Aug 1 01:20:37 submit26-b9-3 setroubleshoot[744460]: SELinux is preventing /usr/bin/python3.9 from read access on the directory libdnf.2gdpkl. For complete SELinux messages run: sealert -l 0b17cc3d-cdc6-4fe2-a11f-3892e7c41dc7
== submit26-clnb9 (10 distinct, 14 total) ==
Aug 1 01:31:55 submit26-clnb9 setroubleshoot[1614407]: SELinux is preventing /usr/bin/python3.9 from create access on the directory /(null). For complete SELinux messages run: sealert -l 6783ed2b-5ae4-42b5-975a-4bf50eec4658 [x2]
Aug 1 01:31:55 submit26-clnb9 setroubleshoot[1614407]: SELinux is preventing /usr/bin/python3.9 from add_name access on the directory /(null). For complete SELinux messages run: sealert -l 9e7fa955-cc30-4804-ac8c-e1779e85946c [x2]
Aug 1 01:31:55 submit26-clnb9 setroubleshoot[1614407]: SELinux is preventing /usr/bin/python3.9 from create access on the file /(null). For complete SELinux messages run: sealert -l 69bfa6e3-089c-40ff-9563-fd30787d0774
Aug 1 01:31:55 submit26-clnb9 setroubleshoot[1614407]: SELinux is preventing /usr/bin/python3.9 from open access on the file /tmp/libdnf.4tQftr/repodata/repomd.xml. For complete SELinux messages run: sealert -l 001acdb5-31ef-4e52-b10b-90f467a89ddc
Aug 1 01:31:55 submit26-clnb9 setroubleshoot[1614407]: SELinux is preventing /usr/bin/python3.9 from setattr access on the file repomd.xml. For complete SELinux messages run: sealert -l edacddcf-16ed-4dc3-8d82-7c597d5dee23
Aug 1 01:31:55 submit26-clnb9 setroubleshoot[1614407]: SELinux is preventing /usr/bin/python3.9 from read access on the directory libdnf.4tQftr. For complete SELinux messages run: sealert -l 62b3782e-4730-4488-8178-94dafe9b552c
Aug 1 01:31:56 submit26-clnb9 setroubleshoot[1614407]: SELinux is preventing /usr/bin/python3.9 from remove_name access on the directory repomd.xml. For complete SELinux messages run: sealert -l 81cb3698-78f8-440a-8e3c-e5d1041e6b78 [x2]
Aug 1 01:31:56 submit26-clnb9 setroubleshoot[1614407]: SELinux is preventing /usr/bin/python3.9 from unlink access on the file repomd.xml. For complete SELinux messages run: sealert -l 792b472a-115c-4799-9805-fc7436f916b9
Aug 1 01:31:56 submit26-clnb9 setroubleshoot[1614407]: SELinux is preventing /usr/bin/python3.9 from rmdir access on the directory repodata. For complete SELinux messages run: sealert -l 15c83a86-837b-41e2-b662-b39cd4e361cb [x2]
Aug 1 01:31:56 submit26-clnb9 setroubleshoot[1614407]: SELinux is preventing /usr/bin/python3.9 from read access on the directory libdnf.4cGZKp. For complete SELinux messages run: sealert -l 62b3782e-4730-4488-8178-94dafe9b552c
== tma-0 (1 distinct, 1 total) ==
Aug 1 01:28:43 tma-0 sshd[2231]: error: PAM: Authentication failure for admin from 25.17.78.34.bc.googleusercontent.com
1
0