Command: /usr/local/sbin/syslog-digest.py
Time : 0.4953s
Status : exited 0
Output :
Syslog digest — 2026-08-03 13:05 EDT
Processed 4,115 lines, filtered 3,327 (80%). 788 unknown (94 distinct) from 23 host(s).
== abuse (1 distinct, 347 total) ==
Aug 3 12:05:06 abuse rsyslogd[21745]: imjournal: open() failed for path: '/var/lib/rsyslog/imjournal.state.tmp': Input/output error [v8.2404.0 try https://www.rsyslog.com/e/2433 ] [x347]
== atif01.cs.umd.edu (5 distinct, 7 total) ==
Aug 3 12:10:37 atif01.cs.umd.edu kernel: net_ratelimit: 8 callbacks suppressed
Aug 3 12:10:37 atif01.cs.umd.edu kernel: nfsd: peername failed (err 107)! [x3]
Aug 3 12:10:38 atif01.cs.umd.edu xinetd[17665]: warning: can't get client address: Connection reset by peer
Aug 3 12:11:46 atif01.cs.umd.edu kernel: net_ratelimit: 13 callbacks suppressed
Aug 3 12:11:51 atif01.cs.umd.edu kernel: net_ratelimit: 1 callbacks suppressed
== b0b02.cs.umd.edu (1 distinct, 1 total) ==
Aug 3 12:43:32 b0b02.cs.umd.edu rustdesk[2489433]: cannot open display:
== bachata (9 distinct, 11 total) ==
Aug 3 12:23:24 bachata setroubleshoot[2395732]: SELinux is preventing /usr/sbin/smbd from read access on the lnk_file ClassRelated. For complete SELinux messages run: sealert -l 8052e635-6f2f-45b1-a983-55d5d837ba65 [x3]
Aug 3 13:02:50 bachata setroubleshoot[2397222]: SELinux is preventing /usr/sbin/smbd from getattr access on the lnk_file /fs/junkfood/nelson/ClassRelated. For complete SELinux messages run: sealert -l fcd56e6d-4082-40d2-8d07-7512890e4b51
Aug 3 13:02:50 bachata setroubleshoot[2397222]: SELinux is preventing /usr/sbin/smbd from getattr access on the file /fs/junkfood/nelson/VirtualDesktop/ClassRelated/cmsc216Summer2026/216_SUMMER_2026. For complete SELinux messages run: sealert -l 278fa2f7-7c6d-4613-8831-0c7902342a33
Aug 3 13:02:50 bachata setroubleshoot[2397222]: SELinux is preventing /usr/sbin/smbd from read access on the file 216_SUMMER_2026. For complete SELinux messages run: sealert -l a2f5acec-ed56-4193-b84b-9c355ad24121
Aug 3 13:02:53 bachata setroubleshoot[2397222]: failed to retrieve rpm info for path '/fs/wwwusers/nelson':
Aug 3 13:02:53 bachata setroubleshoot[2397222]: SELinux is preventing /usr/libexec/samba/samba-dcerpcd from ioctl access on the directory /fs/wwwusers/nelson. For complete SELinux messages run: sealert -l e6152378-fd71-4efe-8359-f1f27dbb4780
Aug 3 13:02:53 bachata setroubleshoot[2397222]: SELinux is preventing /usr/libexec/samba/samba-dcerpcd from read access on the directory /fs/junkfood/nelson/VirtualDesktop/ClassRelated/cmsc216Summer2026/exams/final. For complete SELinux messages run: sealert -l 3c121609-cda8-4152-9925-b75fe7db2d98
Aug 3 13:02:55 bachata setroubleshoot[2397222]: SELinux is preventing /usr/sbin/smbd from open access on the file /fs/junkfood/nelson/VirtualDesktop/ClassRelated/cmsc216Summer2026/exams/final/FinalExam216Summer2026.pdf. For complete SELinux messages run: sealert -l 8c76b021-2297-4487-85d5-4a594e50093c
Aug 3 13:02:55 bachata setroubleshoot[2397222]: SELinux is preventing /usr/sbin/smbd from lock access on the file /fs/junkfood/nelson/VirtualDesktop/ClassRelated/cmsc216Summer2026/exams/final/FinalExam216Summer2026.pdf. For complete SELinux messages run: sealert -l 9436c1bd-99ad-43ff-b349-57e5bcc72374
== cheezit.cs.umd.edu (3 distinct, 3 total) ==
Aug 3 13:04:33 cheezit.cs.umd.edu sshd-session[648984]: pam_access(sshd:auth): access denied for user `admin' from `27.79.6.221'
Aug 3 13:04:33 cheezit.cs.umd.edu krb5_child[648987]: Client 'admin(a)UMD.EDU' not found in Kerberos database
Aug 3 13:04:33 cheezit.cs.umd.edu sshd-session[648981]: error: PAM: System error for admin from 27.79.6.221
== contest (1 distinct, 34 total) ==
Aug 3 12:05:51 contest goferd[1007]: [ERROR][worker-0] gofer.messaging.adapter.connect:33 - connect: proton+amqps://satellite8.cs.umd.edu:5647, failed: Connection amqps://satellite8.cs.umd.edu:5647 disconnected: Condition('proton.pythonio', 'Connection refused to all addresses') [x34]
== csfw00a (1 distinct, 224 total) ==
Aug 3 12:04:32 csfw00a kernel: bnxt_en 0000:09:00.0 eth3: NIC Link is Down [x224]
== hackerman (6 distinct, 11 total) ==
Aug 3 12:20:04 hackerman gnome-software[2060381]: can't reliably fixup error code 4 in domain g-io-error-quark: Not a directory [x4]
Aug 3 12:20:12 hackerman gnome-software[2060381]: Only 0 apps for recent list, hiding
Aug 3 12:20:28 hackerman gnome-software[2060381]: failed to commit changes to dconf: GDBus.Error:org.gtk.GDBus.UnmappedGError.Quark._g_2dfile_2derror_2dquark.Code2: Failed to create file “/adminhomes/sajith/.config/dconf/user.RQ60T3”: Permission denied
Aug 3 12:20:28 hackerman packagekitd[3464459]: Failed to get cache filename for libreoffice [x2]
Aug 3 12:20:28 hackerman packagekitd[3464459]: Failed to get cache filename for kernel [x2]
Aug 3 12:20:38 hackerman packagekitd[3464459]: failed to parse public key for /etc/pki/rpm-gpg/RPM-GPG-KEY-PQC-redhat-release
== idm00 (1 distinct, 1 total) ==
Aug 3 12:51:17 idm00 named[1455]: client @0x7f331587a8b8 10.73.240.42#59285: update '73.10.in-addr.arpa/IN' denied
== idmp0 (1 distinct, 1 total) ==
Aug 3 12:36:00 idmp0 named[5198]: client @0x7f99040313a8 10.73.240.43#60415: update '73.10.in-addr.arpa/IN' denied
== itmon02 (1 distinct, 37 total) ==
Aug 3 12:07:59 itmon02 sshd[1750555]: error: beginning MaxStartups throttling [x37]
== munin (2 distinct, 4 total) ==
Aug 3 12:18:01 munin sudo[1126393]: pam_systemd(sudo:session): Failed to stat() runtime directory '/run/user/0': No such file or directory [x2]
Aug 3 12:18:01 munin sudo[1126393]: pam_systemd(sudo:session): Not setting $XDG_RUNTIME_DIR, as the directory is not in order. [x2]
== neoavion (1 distinct, 1 total) ==
Aug 3 12:38:17 neoavion pipewire[3247355]: mod.jackdbus-detect: Failed to receive jackdbus reply: org.freedesktop.DBus.Error.ServiceUnknown: The name org.jackaudio.service was not provided by any .service files
== netman.cs.umd.edu (4 distinct, 5 total) ==
Aug 3 12:16:15 netman.cs.umd.edu krb5_child[305192]: Client 'admin(a)UMD.EDU' not found in Kerberos database [x2]
Aug 3 12:30:00 netman.cs.umd.edu setroubleshoot[309075]: SELinux is preventing /usr/bin/gpg from read access on the file gpg.conf. For complete SELinux messages run: sealert -l 019ad1da-a874-4814-8037-3b3e5f413ad2
Aug 3 12:30:00 netman.cs.umd.edu setroubleshoot[309075]: SELinux is preventing /usr/bin/gpg from open access on the file /root/.gnupg/gpg.conf. For complete SELinux messages run: sealert -l cb54177e-d44c-46a1-b246-5c0bbb8343be
Aug 3 12:30:06 netman.cs.umd.edu setroubleshoot[309075]: SELinux is preventing /usr/bin/gpg from getattr access on the file /root/.gnupg/gpg.conf. For complete SELinux messages run: sealert -l fbba2e30-b7ab-491c-9ec6-f553e9ef72af
== newhonors2 (1 distinct, 24 total) ==
Aug 3 12:13:03 newhonors2 dhcpcd[679486]: dhcpcd is not running [x24]
== outbound00.cs.umd.edu (1 distinct, 6 total) ==
Aug 3 12:09:09 outbound00.cs.umd.edu python3[2479309]: ldapdb [x6]
== outbound01.cs.umd.edu (1 distinct, 6 total) ==
Aug 3 12:13:06 outbound01.cs.umd.edu python3[512723]: ldapdb [x6]
== sebatinsky.cs.umd.edu (1 distinct, 1 total) ==
Aug 3 12:12:11 sebatinsky.cs.umd.edu setroubleshoot[1268721]: SELinux is preventing /usr/sbin/pdns_server from name_bind access on the udp_socket port 10081. For complete SELinux messages run: sealert -l af222830-ab0f-4bc8-91ab-730551076ae5
== sentry-docker00.cs.umd.edu (38 distinct, 38 total) ==
Aug 3 12:20:42 sentry-docker00.cs.umd.edu systemd-udevd[1059979]: link_config: could not get ethtool features for vethe5b0a15
Aug 3 12:20:42 sentry-docker00.cs.umd.edu systemd-udevd[1059979]: Could not set offload features of vethe5b0a15: No such device
Aug 3 12:20:42 sentry-docker00.cs.umd.edu systemd-udevd[1060008]: Could not generate persistent MAC address for veth8c18452: No such file or directory
Aug 3 12:20:42 sentry-docker00.cs.umd.edu systemd-udevd[1060009]: Could not generate persistent MAC address for vethd6f885a: No such file or directory
Aug 3 12:20:42 sentry-docker00.cs.umd.edu systemd-udevd[1060012]: Could not generate persistent MAC address for vethddbcdae: No such file or directory
Aug 3 12:20:42 sentry-docker00.cs.umd.edu systemd-udevd[1060013]: Could not generate persistent MAC address for vethf6117aa: No such file or directory
Aug 3 12:20:42 sentry-docker00.cs.umd.edu systemd-udevd[1060024]: Could not generate persistent MAC address for veth28a5559: No such file or directory
Aug 3 12:20:42 sentry-docker00.cs.umd.edu systemd-udevd[1060021]: Could not generate persistent MAC address for veth28f8bb1: No such file or directory
Aug 3 12:20:42 sentry-docker00.cs.umd.edu systemd-udevd[1060057]: Could not generate persistent MAC address for veth7b3c938: No such file or directory
Aug 3 12:20:42 sentry-docker00.cs.umd.edu systemd-udevd[1060052]: Could not generate persistent MAC address for veth9b62418: No such file or directory
Aug 3 12:21:27 sentry-docker00.cs.umd.edu systemd-udevd[1060599]: Could not generate persistent MAC address for vethaf6101e: No such file or directory
Aug 3 12:21:27 sentry-docker00.cs.umd.edu systemd-udevd[1060600]: Could not generate persistent MAC address for veth69e0a7c: No such file or directory
Aug 3 12:40:50 sentry-docker00.cs.umd.edu systemd-udevd[1069342]: link_config: could not get ethtool features for veth9b62418
Aug 3 12:40:50 sentry-docker00.cs.umd.edu systemd-udevd[1069342]: Could not set offload features of veth9b62418: No such device
Aug 3 12:40:50 sentry-docker00.cs.umd.edu systemd-udevd[1069418]: link_config: could not set ethtool features for veth28f8bb1
Aug 3 12:40:50 sentry-docker00.cs.umd.edu systemd-udevd[1069418]: Could not set offload features of veth28f8bb1: Operation not permitted
Aug 3 12:40:50 sentry-docker00.cs.umd.edu systemd-udevd[1069435]: Could not generate persistent MAC address for veth1211cb5: No such file or directory
Aug 3 12:40:50 sentry-docker00.cs.umd.edu systemd-udevd[1069436]: Could not generate persistent MAC address for veth4fa1e46: No such file or directory
Aug 3 12:40:50 sentry-docker00.cs.umd.edu systemd-udevd[1069439]: Could not generate persistent MAC address for veth0291047: No such file or directory
Aug 3 12:40:50 sentry-docker00.cs.umd.edu systemd-udevd[1069440]: Could not generate persistent MAC address for vethe500cf2: No such file or directory
Aug 3 12:40:50 sentry-docker00.cs.umd.edu systemd-udevd[1069463]: Could not generate persistent MAC address for veth59aa0da: No such file or directory
Aug 3 12:40:50 sentry-docker00.cs.umd.edu systemd-udevd[1069464]: Could not generate persistent MAC address for vethaa2d8e5: No such file or directory
Aug 3 12:40:50 sentry-docker00.cs.umd.edu systemd-udevd[1069488]: Could not generate persistent MAC address for veth80dece6: No such file or directory
Aug 3 12:40:50 sentry-docker00.cs.umd.edu systemd-udevd[1069473]: Could not generate persistent MAC address for vethe9d085d: No such file or directory
Aug 3 12:41:35 sentry-docker00.cs.umd.edu systemd-udevd[1070049]: Could not generate persistent MAC address for veth55e5603: No such file or directory
Aug 3 12:41:35 sentry-docker00.cs.umd.edu systemd-udevd[1070050]: Could not generate persistent MAC address for veth91e099a: No such file or directory
Aug 3 13:00:58 sentry-docker00.cs.umd.edu systemd-udevd[1078767]: link_config: could not get ethtool features for veth1211cb5
Aug 3 13:00:58 sentry-docker00.cs.umd.edu systemd-udevd[1078767]: Could not set offload features of veth1211cb5: No such device
Aug 3 13:00:59 sentry-docker00.cs.umd.edu systemd-udevd[1078847]: Could not generate persistent MAC address for veth7b2094e: No such file or directory
Aug 3 13:00:59 sentry-docker00.cs.umd.edu systemd-udevd[1078846]: Could not generate persistent MAC address for vetha5e1e20: No such file or directory
... 8 more distinct messages not shown
== soul (1 distinct, 1 total) ==
Aug 3 13:04:33 soul krb5_child[3385750]: Client 'admin(a)UMD.EDU' not found in Kerberos database
== strawberry (2 distinct, 8 total) ==
Aug 3 12:09:44 strawberry udisksd[1067]: Error performing housekeeping for drive /org/freedesktop/UDisks2/drives/ST2000DM001_1CH164_W1E8J5KJ: Error updating SMART data: Error sending ATA command CHECK POWER MODE: Unexpected sense data returned:#0120000: 00 00 00 00 00 00 00 00 00 00 00 00 00 00 00 00 ................#0120010: 00 00 00 00 00 00 00 00 00 00 00 00 00 00 00 00 ................#012 (g-io-error-quark, 0) [x6]
Aug 3 12:34:42 strawberry smartd[5314]: Device: /dev/sda [SAT], failed to read SMART Attribute Data [x2]
== submit26-b9-4 (11 distinct, 15 total) ==
Aug 3 12:15:29 submit26-b9-4 setroubleshoot[954047]: SELinux is preventing /usr/bin/python3.9 from create access on the directory /(null). For complete SELinux messages run: sealert -l a4e66030-8621-4da9-bd27-5988bb1bf8ad [x2]
Aug 3 12:15:29 submit26-b9-4 setroubleshoot[954047]: SELinux is preventing /usr/bin/python3.9 from add_name access on the directory /(null). For complete SELinux messages run: sealert -l c055e37d-bbf5-4800-9083-d606f792c8c1 [x2]
Aug 3 12:15:29 submit26-b9-4 setroubleshoot[954047]: SELinux is preventing /usr/bin/python3.9 from create access on the file /(null). For complete SELinux messages run: sealert -l e5bc3a56-6d6f-4776-954f-ddde1579648f
Aug 3 12:15:29 submit26-b9-4 setroubleshoot[954047]: SELinux is preventing /usr/bin/python3.9 from open access on the file /tmp/libdnf.yHHR6b/repodata/repomd.xml. For complete SELinux messages run: sealert -l a8ec5e1b-49f9-4fbc-a8ae-22e800f7abf2
Aug 3 12:15:29 submit26-b9-4 setroubleshoot[954047]: SELinux is preventing /usr/bin/python3.9 from setattr access on the file repomd.xml. For complete SELinux messages run: sealert -l 945db714-d0c0-4402-911e-932978b8b036
Aug 3 12:15:29 submit26-b9-4 setroubleshoot[954047]: SELinux is preventing /usr/bin/python3.9 from read access on the directory libdnf.yHHR6b. For complete SELinux messages run: sealert -l 463998a0-fb0d-463c-82b1-471135710a14
Aug 3 12:15:29 submit26-b9-4 setroubleshoot[954047]: SELinux is preventing /usr/bin/python3.9 from remove_name access on the directory repomd.xml. For complete SELinux messages run: sealert -l 473d2e21-15d8-407a-a9ee-2b842607fa00 [x2]
Aug 3 12:15:29 submit26-b9-4 setroubleshoot[954047]: SELinux is preventing /usr/bin/python3.9 from unlink access on the file repomd.xml. For complete SELinux messages run: sealert -l 80c54d4f-bf4b-4501-addb-1627383587d0
Aug 3 12:15:29 submit26-b9-4 setroubleshoot[954047]: SELinux is preventing /usr/bin/python3.9 from rmdir access on the directory repodata. For complete SELinux messages run: sealert -l c63d3890-151e-49a0-83f0-3dfb69d051e5 [x2]
Aug 3 12:15:29 submit26-b9-4 setroubleshoot[954047]: SELinux is preventing /usr/bin/python3.9 from read access on the directory libdnf.9URVdx. For complete SELinux messages run: sealert -l 463998a0-fb0d-463c-82b1-471135710a14
Aug 3 13:01:32 submit26-b9-4 systemd[1]: user(a)1001.service: Main process exited, code=killed, status=9/KILL
== teaching-awards (1 distinct, 2 total) ==
Aug 3 12:30:39 teaching-awards krb5_child[1816010]: Client 'admin(a)UMD.EDU' not found in Kerberos database [x2]
1
0
Command: /usr/local/sbin/syslog-digest.py
Time : 0.5312s
Status : exited 0
Output :
Syslog digest — 2026-08-03 12:05 EDT
Processed 5,798 lines, filtered 5,006 (86%). 792 unknown (114 distinct) from 18 host(s).
== abuse (1 distinct, 346 total) ==
Aug 3 11:05:06 abuse rsyslogd[21745]: imjournal: open() failed for path: '/var/lib/rsyslog/imjournal.state.tmp': Input/output error [v8.2404.0 try https://www.rsyslog.com/e/2433 ] [x346]
== atif01.cs.umd.edu (2 distinct, 4 total) ==
Aug 3 11:36:09 atif01.cs.umd.edu kernel: net_ratelimit: 1 callbacks suppressed
Aug 3 11:37:16 atif01.cs.umd.edu kernel: net_ratelimit: 9 callbacks suppressed [x3]
== b0b02.cs.umd.edu (1 distinct, 1 total) ==
Aug 3 11:43:28 b0b02.cs.umd.edu rustdesk[2474234]: cannot open display:
== bachata (23 distinct, 26 total) ==
Aug 3 11:39:00 bachata setroubleshoot[2393863]: failed to retrieve rpm info for path '/fs/www/class/summer2026/cmsc216/piazza.shtml':
Aug 3 11:39:01 bachata setroubleshoot[2393863]: SELinux is preventing /usr/sbin/smbd from getattr access on the file /fs/www/class/summer2026/cmsc216/piazza.shtml. For complete SELinux messages run: sealert -l 278fa2f7-7c6d-4613-8831-0c7902342a33
Aug 3 11:39:01 bachata setroubleshoot[2393863]: SELinux is preventing /usr/sbin/smbd from read access on the file piazza.shtml. For complete SELinux messages run: sealert -l a2f5acec-ed56-4193-b84b-9c355ad24121
Aug 3 11:39:03 bachata setroubleshoot[2393863]: failed to retrieve rpm info for path '/fs/www/class/summer2026/cmsc216/prot/.htaccess':
Aug 3 11:39:03 bachata setroubleshoot[2393863]: SELinux is preventing /usr/sbin/smbd from getattr access on the file /fs/www/class/summer2026/cmsc216/prot/.htaccess. For complete SELinux messages run: sealert -l 278fa2f7-7c6d-4613-8831-0c7902342a33
Aug 3 11:39:04 bachata setroubleshoot[2393863]: SELinux is preventing /usr/sbin/smbd from read access on the file .htaccess. For complete SELinux messages run: sealert -l a2f5acec-ed56-4193-b84b-9c355ad24121
Aug 3 11:39:06 bachata setroubleshoot[2393863]: SELinux is preventing /usr/sbin/smbd from getattr access on the lnk_file /fs/junkfood/nelson/ClassRelated. For complete SELinux messages run: sealert -l fcd56e6d-4082-40d2-8d07-7512890e4b51 [x2]
Aug 3 11:39:07 bachata setroubleshoot[2393863]: SELinux is preventing /usr/sbin/smbd from read access on the lnk_file ClassRelated. For complete SELinux messages run: sealert -l 8052e635-6f2f-45b1-a983-55d5d837ba65 [x3]
Aug 3 11:39:30 bachata setroubleshoot[2394130]: failed to retrieve rpm info for path '/fs/www/class/summer2026/cmsc216/prot/quizzes_exams/final/index.shtml':
Aug 3 11:39:31 bachata setroubleshoot[2394130]: SELinux is preventing /usr/sbin/smbd from getattr access on the file /fs/www/class/summer2026/cmsc216/prot/quizzes_exams/final/index.shtml. For complete SELinux messages run: sealert -l 278fa2f7-7c6d-4613-8831-0c7902342a33
Aug 3 11:39:31 bachata setroubleshoot[2394130]: SELinux is preventing /usr/sbin/smbd from read access on the file index.shtml. For complete SELinux messages run: sealert -l a2f5acec-ed56-4193-b84b-9c355ad24121
Aug 3 11:39:46 bachata setroubleshoot[2394130]: SELinux is preventing /usr/sbin/smbd from name_bind access on the udp_socket port 866. For complete SELinux messages run: sealert -l 8f7247f1-69a5-4a62-a4f0-88a324bfd75c
Aug 3 11:39:46 bachata setroubleshoot[2394130]: SELinux is preventing /usr/sbin/smbd from open access on the file /fs/junkfood/nelson/VirtualDesktop/ClassRelated/cmsc216Summer2026/exams/exam3/ExamThreeCMSC216Summer2026Key.pdf. For complete SELinux messages run: sealert -l 8c76b021-2297-4487-85d5-4a594e50093c
Aug 3 11:39:46 bachata setroubleshoot[2394130]: SELinux is preventing /usr/sbin/smbd from write access on the directory /fs/www/class/(null). For complete SELinux messages run: sealert -l 2eb8aca4-3542-458a-ba12-c410a98dfbba
Aug 3 11:39:46 bachata setroubleshoot[2394130]: SELinux is preventing /usr/sbin/smbd from add_name access on the directory /fs/www/class/(null). For complete SELinux messages run: sealert -l 655dab10-bb1a-4409-bed5-1fa4cfbaac79
Aug 3 11:39:46 bachata setroubleshoot[2394130]: SELinux is preventing /usr/sbin/smbd from create access on the file /fs/www/class/(null). For complete SELinux messages run: sealert -l f15b4b59-4558-463e-8763-5c4dd3529b67
Aug 3 11:39:46 bachata setroubleshoot[2394130]: failed to retrieve rpm info for path '/fs/www/class/summer2026/cmsc216/prot/quizzes_exams/exam3/ExamThreeCMSC216Summer2026Key.pdf':
Aug 3 11:39:46 bachata setroubleshoot[2394130]: SELinux is preventing /usr/sbin/smbd from write access on the file /fs/www/class/summer2026/cmsc216/prot/quizzes_exams/exam3/ExamThreeCMSC216Summer2026Key.pdf. For complete SELinux messages run: sealert -l b65b78cc-eac8-4ad4-8e05-6760b51a5f9d
Aug 3 11:39:46 bachata setroubleshoot[2394130]: SELinux is preventing /usr/sbin/smbd from setattr access on the file ExamThreeCMSC216Summer2026Key.pdf. For complete SELinux messages run: sealert -l 2156271f-4021-4cff-92dd-85a8a157bdf3
Aug 3 11:39:46 bachata setroubleshoot[2394130]: SELinux is preventing /usr/sbin/smbd from lock access on the file /fs/junkfood/nelson/VirtualDesktop/ClassRelated/cmsc216Summer2026/exams/exam3/ExamThreeCMSC216Summer2026Key.pdf. For complete SELinux messages run: sealert -l 9436c1bd-99ad-43ff-b349-57e5bcc72374
Aug 3 11:39:46 bachata setroubleshoot[2394130]: failed to retrieve rpm info for path '/fs/wwwusers/nelson':
Aug 3 11:39:46 bachata setroubleshoot[2394130]: SELinux is preventing /usr/libexec/samba/samba-dcerpcd from ioctl access on the directory /fs/wwwusers/nelson. For complete SELinux messages run: sealert -l e6152378-fd71-4efe-8359-f1f27dbb4780
Aug 3 11:39:46 bachata setroubleshoot[2394130]: SELinux is preventing /usr/libexec/samba/samba-dcerpcd from read access on the directory /fs/junkfood/nelson/VirtualDesktop/ClassRelated/cmsc216Summer2026/exams/exam3. For complete SELinux messages run: sealert -l 3c121609-cda8-4152-9925-b75fe7db2d98
== contest (1 distinct, 34 total) ==
Aug 3 11:05:09 contest goferd[1007]: [ERROR][worker-0] gofer.messaging.adapter.connect:33 - connect: proton+amqps://satellite8.cs.umd.edu:5647, failed: Connection amqps://satellite8.cs.umd.edu:5647 disconnected: Condition('proton.pythonio', 'Connection refused to all addresses') [x34]
== csfw00a (2 distinct, 212 total) ==
Aug 3 11:04:51 csfw00a kernel: bnxt_en 0000:09:00.0 eth3: NIC Link is Down [x204]
Aug 3 11:54:51 csfw00a ospf6d[1477]: [EC 100663307] Could not send entire message [x8]
== hackerman (7 distinct, 12 total) ==
Aug 3 11:19:02 hackerman gnome-software[2060381]: failed to commit changes to dconf: GDBus.Error:org.gtk.GDBus.UnmappedGError.Quark._g_2dfile_2derror_2dquark.Code2: Failed to create file “/adminhomes/sajith/.config/dconf/user.0KXJT3”: Permission denied
Aug 3 11:20:04 hackerman gnome-software[2060381]: can't reliably fixup error code 4 in domain g-io-error-quark: Not a directory [x4]
Aug 3 11:20:12 hackerman gnome-software[2060381]: Only 0 apps for recent list, hiding
Aug 3 11:20:27 hackerman packagekitd[3450818]: Failed to get cache filename for libreoffice [x2]
Aug 3 11:20:27 hackerman packagekitd[3450818]: Failed to get cache filename for kernel [x2]
Aug 3 11:20:30 hackerman gnome-software[2060381]: failed to commit changes to dconf: GDBus.Error:org.gtk.GDBus.UnmappedGError.Quark._g_2dfile_2derror_2dquark.Code2: Failed to create file “/adminhomes/sajith/.config/dconf/user.55DIT3”: Permission denied
Aug 3 11:20:39 hackerman packagekitd[3450818]: failed to parse public key for /etc/pki/rpm-gpg/RPM-GPG-KEY-PQC-redhat-release
== idm00 (1 distinct, 1 total) ==
Aug 3 11:51:16 idm00 named[1455]: client @0x7f33048c7d98 10.73.240.42#51244: update '73.10.in-addr.arpa/IN' denied
== idmp0 (1 distinct, 1 total) ==
Aug 3 11:36:00 idmp0 named[5198]: client @0x7f9904040418 10.73.240.43#60072: update '73.10.in-addr.arpa/IN' denied
== itmon02 (1 distinct, 37 total) ==
Aug 3 11:08:05 itmon02 sshd[1750555]: error: beginning MaxStartups throttling [x37]
== netman.cs.umd.edu (24 distinct, 24 total) ==
Aug 3 11:05:18 netman.cs.umd.edu sshd[285205]: error: maximum authentication attempts exceeded for root from 211.200.98.61 port 65357 ssh2 [preauth]
Aug 3 11:05:39 netman.cs.umd.edu sshd[285223]: error: maximum authentication attempts exceeded for root from 211.200.98.61 port 55834 ssh2 [preauth]
Aug 3 11:06:00 netman.cs.umd.edu sshd[285741]: error: maximum authentication attempts exceeded for root from 211.200.98.61 port 62986 ssh2 [preauth]
Aug 3 11:06:21 netman.cs.umd.edu sshd[286001]: error: maximum authentication attempts exceeded for root from 211.200.98.61 port 53895 ssh2 [preauth]
Aug 3 11:06:42 netman.cs.umd.edu sshd[286306]: error: maximum authentication attempts exceeded for root from 211.200.98.61 port 61431 ssh2 [preauth]
Aug 3 11:07:06 netman.cs.umd.edu sshd[286454]: error: maximum authentication attempts exceeded for root from 211.200.98.61 port 52177 ssh2 [preauth]
Aug 3 11:07:27 netman.cs.umd.edu sshd[286480]: error: maximum authentication attempts exceeded for root from 211.200.98.61 port 60591 ssh2 [preauth]
Aug 3 11:07:48 netman.cs.umd.edu sshd[286511]: error: maximum authentication attempts exceeded for root from 211.200.98.61 port 51358 ssh2 [preauth]
Aug 3 11:08:09 netman.cs.umd.edu sshd[286556]: error: maximum authentication attempts exceeded for root from 211.200.98.61 port 58920 ssh2 [preauth]
Aug 3 11:08:30 netman.cs.umd.edu sshd[286583]: error: maximum authentication attempts exceeded for root from 211.200.98.61 port 50002 ssh2 [preauth]
Aug 3 11:08:51 netman.cs.umd.edu sshd[286617]: error: maximum authentication attempts exceeded for root from 211.200.98.61 port 57313 ssh2 [preauth]
Aug 3 11:09:12 netman.cs.umd.edu sshd[286662]: error: maximum authentication attempts exceeded for root from 211.200.98.61 port 64697 ssh2 [preauth]
Aug 3 11:09:33 netman.cs.umd.edu sshd[286675]: error: maximum authentication attempts exceeded for root from 211.200.98.61 port 55459 ssh2 [preauth]
Aug 3 11:09:54 netman.cs.umd.edu sshd[286705]: error: maximum authentication attempts exceeded for root from 211.200.98.61 port 62479 ssh2 [preauth]
Aug 3 11:10:15 netman.cs.umd.edu sshd[286749]: error: maximum authentication attempts exceeded for root from 211.200.98.61 port 53232 ssh2 [preauth]
Aug 3 11:10:36 netman.cs.umd.edu sshd[286766]: error: maximum authentication attempts exceeded for root from 211.200.98.61 port 60165 ssh2 [preauth]
Aug 3 11:10:57 netman.cs.umd.edu sshd[287261]: error: maximum authentication attempts exceeded for root from 211.200.98.61 port 50544 ssh2 [preauth]
Aug 3 11:11:18 netman.cs.umd.edu sshd[287534]: error: maximum authentication attempts exceeded for root from 211.200.98.61 port 57525 ssh2 [preauth]
Aug 3 11:11:39 netman.cs.umd.edu sshd[287547]: error: maximum authentication attempts exceeded for root from 211.200.98.61 port 64580 ssh2 [preauth]
Aug 3 11:12:00 netman.cs.umd.edu sshd[287609]: error: maximum authentication attempts exceeded for root from 211.200.98.61 port 55456 ssh2 [preauth]
Aug 3 11:12:21 netman.cs.umd.edu sshd[287621]: error: maximum authentication attempts exceeded for root from 211.200.98.61 port 62817 ssh2 [preauth]
Aug 3 11:12:42 netman.cs.umd.edu sshd[287652]: error: maximum authentication attempts exceeded for root from 211.200.98.61 port 54076 ssh2 [preauth]
Aug 3 11:13:03 netman.cs.umd.edu sshd[287700]: error: maximum authentication attempts exceeded for root from 211.200.98.61 port 61538 ssh2 [preauth]
Aug 3 11:13:24 netman.cs.umd.edu sshd[287711]: error: maximum authentication attempts exceeded for root from 211.200.98.61 port 52581 ssh2 [preauth]
== newhonors.cs.umd.edu (1 distinct, 1 total) ==
Aug 3 11:14:23 newhonors.cs.umd.edu systemd-tmpfiles: [/usr/lib/tmpfiles.d/var.conf:14] Duplicate line for path "/var/log", ignoring.
== newhonors2 (1 distinct, 24 total) ==
Aug 3 11:13:03 newhonors2 dhcpcd[677659]: dhcpcd is not running [x24]
== outbound00.cs.umd.edu (1 distinct, 6 total) ==
Aug 3 11:09:09 outbound00.cs.umd.edu python3[2464376]: ldapdb [x6]
== outbound01.cs.umd.edu (2 distinct, 11 total) ==
Aug 3 11:13:06 outbound01.cs.umd.edu python3[496821]: ldapdb [x6]
Aug 3 11:24:34 outbound01.cs.umd.edu cockpit-ws[499089]: /usr/share/cockpit/static/login.js/favicon.ico: Failed to open file “/usr/share/cockpit/static/login.js/favicon.ico”: open() failed: Not a directory [x5]
== sentry-docker00.cs.umd.edu (42 distinct, 42 total) ==
Aug 3 11:20:17 sentry-docker00.cs.umd.edu systemd-udevd[1031300]: link_config: could not get ethtool features for veth520f802
Aug 3 11:20:17 sentry-docker00.cs.umd.edu systemd-udevd[1031300]: Could not set offload features of veth520f802: No such device
Aug 3 11:20:17 sentry-docker00.cs.umd.edu systemd-udevd[1031341]: Could not generate persistent MAC address for vethf1996a8: No such file or directory
Aug 3 11:20:17 sentry-docker00.cs.umd.edu systemd-udevd[1031342]: Could not generate persistent MAC address for veth104e5f6: No such file or directory
Aug 3 11:20:17 sentry-docker00.cs.umd.edu systemd-udevd[1031345]: Could not generate persistent MAC address for veth05da5d7: No such file or directory
Aug 3 11:20:17 sentry-docker00.cs.umd.edu systemd-udevd[1031346]: Could not generate persistent MAC address for vethad95753: No such file or directory
Aug 3 11:20:17 sentry-docker00.cs.umd.edu systemd-udevd[1031364]: Could not generate persistent MAC address for vethd6845f9: No such file or directory
Aug 3 11:20:17 sentry-docker00.cs.umd.edu systemd-udevd[1031350]: Could not generate persistent MAC address for vethd4afa61: No such file or directory
Aug 3 11:20:17 sentry-docker00.cs.umd.edu systemd-udevd[1031358]: Could not generate persistent MAC address for veth87f44da: No such file or directory
Aug 3 11:20:17 sentry-docker00.cs.umd.edu systemd-udevd[1031352]: Could not generate persistent MAC address for vetha2429ae: No such file or directory
Aug 3 11:21:10 sentry-docker00.cs.umd.edu systemd-udevd[1032193]: link_config: could not get ethtool features for vetheea9cee
Aug 3 11:21:10 sentry-docker00.cs.umd.edu systemd-udevd[1032193]: Could not set offload features of vetheea9cee: No such device
Aug 3 11:21:10 sentry-docker00.cs.umd.edu systemd-udevd[1032211]: Could not generate persistent MAC address for vethe3ccc41: No such file or directory
Aug 3 11:21:10 sentry-docker00.cs.umd.edu systemd-udevd[1032212]: Could not generate persistent MAC address for veth912c8e6: No such file or directory
Aug 3 11:40:25 sentry-docker00.cs.umd.edu systemd-udevd[1040798]: link_config: could not get ethtool features for vethd4afa61
Aug 3 11:40:25 sentry-docker00.cs.umd.edu systemd-udevd[1040798]: Could not set offload features of vethd4afa61: No such device
Aug 3 11:40:25 sentry-docker00.cs.umd.edu systemd-udevd[1040799]: link_config: could not get ethtool features for vetha2429ae
Aug 3 11:40:25 sentry-docker00.cs.umd.edu systemd-udevd[1040799]: Could not set offload features of vetha2429ae: No such device
Aug 3 11:40:26 sentry-docker00.cs.umd.edu systemd-udevd[1040826]: Could not generate persistent MAC address for veth6307a21: No such file or directory
Aug 3 11:40:26 sentry-docker00.cs.umd.edu systemd-udevd[1040827]: Could not generate persistent MAC address for veth310bfff: No such file or directory
Aug 3 11:40:26 sentry-docker00.cs.umd.edu systemd-udevd[1040830]: Could not generate persistent MAC address for veth28e575d: No such file or directory
Aug 3 11:40:26 sentry-docker00.cs.umd.edu systemd-udevd[1040831]: Could not generate persistent MAC address for veth7eaf0fd: No such file or directory
Aug 3 11:40:26 sentry-docker00.cs.umd.edu systemd-udevd[1040856]: Could not generate persistent MAC address for veth4f186c8: No such file or directory
Aug 3 11:40:26 sentry-docker00.cs.umd.edu systemd-udevd[1040855]: Could not generate persistent MAC address for veth8423ef2: No such file or directory
Aug 3 11:40:26 sentry-docker00.cs.umd.edu systemd-udevd[1040874]: Could not generate persistent MAC address for veth0d5caa5: No such file or directory
Aug 3 11:40:26 sentry-docker00.cs.umd.edu systemd-udevd[1040866]: Could not generate persistent MAC address for veth08535d5: No such file or directory
Aug 3 11:41:18 sentry-docker00.cs.umd.edu systemd-udevd[1041703]: link_config: could not get ethtool features for vethe3ccc41
Aug 3 11:41:18 sentry-docker00.cs.umd.edu systemd-udevd[1041703]: Could not set offload features of vethe3ccc41: No such device
Aug 3 11:41:19 sentry-docker00.cs.umd.edu systemd-udevd[1041719]: Could not generate persistent MAC address for veth2989957: No such file or directory
Aug 3 11:41:19 sentry-docker00.cs.umd.edu systemd-udevd[1041720]: Could not generate persistent MAC address for vethcd0a14f: No such file or directory
... 12 more distinct messages not shown
== strawberry (2 distinct, 8 total) ==
Aug 3 11:09:44 strawberry udisksd[1067]: Error performing housekeeping for drive /org/freedesktop/UDisks2/drives/ST2000DM001_1CH164_W1E8J5KJ: Error updating SMART data: Error sending ATA command CHECK POWER MODE: Unexpected sense data returned:#0120000: 00 00 00 00 00 00 00 00 00 00 00 00 00 00 00 00 ................#0120010: 00 00 00 00 00 00 00 00 00 00 00 00 00 00 00 00 ................#012 (g-io-error-quark, 0) [x6]
Aug 3 11:34:42 strawberry smartd[5314]: Device: /dev/sda [SAT], failed to read SMART Attribute Data [x2]
== talkhosts9 (1 distinct, 2 total) ==
Aug 3 11:07:20 talkhosts9 setroubleshoot[1024627]: SELinux is preventing /usr/bin/lsof from getattr access on the unix_stream_socket unix_stream_socket. For complete SELinux messages run: sealert -l a6df89b3-c497-469c-8232-c4fde0508abf [x2]
1
0
Command: /usr/local/sbin/syslog-digest.py
Time : 0.5425s
Status : exited 0
Output :
Syslog digest — 2026-08-03 11:05 EDT
Processed 5,226 lines, filtered 4,341 (83%). 885 unknown (155 distinct) from 24 host(s).
== abuse (1 distinct, 346 total) ==
Aug 3 10:05:06 abuse rsyslogd[21745]: imjournal: open() failed for path: '/var/lib/rsyslog/imjournal.state.tmp': Input/output error [v8.2404.0 try https://www.rsyslog.com/e/2433 ] [x346]
== atif01.cs.umd.edu (45 distinct, 88 total) ==
Aug 3 10:26:21 atif01.cs.umd.edu sshd[15300]: error: maximum authentication attempts exceeded for root from 211.200.98.61 port 60011 ssh2 [preauth]
Aug 3 10:26:21 atif01.cs.umd.edu sshd[15300]: PAM service(sshd) ignoring max retries; 6 > 3 [x44]
Aug 3 10:26:38 atif01.cs.umd.edu sshd[15316]: error: maximum authentication attempts exceeded for root from 211.200.98.61 port 49271 ssh2 [preauth]
Aug 3 10:26:54 atif01.cs.umd.edu sshd[15326]: error: maximum authentication attempts exceeded for root from 211.200.98.61 port 54897 ssh2 [preauth]
Aug 3 10:27:12 atif01.cs.umd.edu sshd[15334]: error: maximum authentication attempts exceeded for root from 211.200.98.61 port 60531 ssh2 [preauth]
Aug 3 10:27:28 atif01.cs.umd.edu sshd[15344]: error: maximum authentication attempts exceeded for root from 211.200.98.61 port 49859 ssh2 [preauth]
Aug 3 10:27:44 atif01.cs.umd.edu sshd[15362]: error: maximum authentication attempts exceeded for root from 211.200.98.61 port 55281 ssh2 [preauth]
Aug 3 10:27:59 atif01.cs.umd.edu sshd[15378]: error: maximum authentication attempts exceeded for root from 211.200.98.61 port 61061 ssh2 [preauth]
Aug 3 10:28:14 atif01.cs.umd.edu sshd[15388]: error: maximum authentication attempts exceeded for root from 211.200.98.61 port 49753 ssh2 [preauth]
Aug 3 10:28:29 atif01.cs.umd.edu sshd[15400]: error: maximum authentication attempts exceeded for root from 211.200.98.61 port 55034 ssh2 [preauth]
Aug 3 10:28:44 atif01.cs.umd.edu sshd[15416]: error: maximum authentication attempts exceeded for root from 211.200.98.61 port 60208 ssh2 [preauth]
Aug 3 10:28:59 atif01.cs.umd.edu sshd[15426]: error: maximum authentication attempts exceeded for root from 211.200.98.61 port 65319 ssh2 [preauth]
Aug 3 10:29:14 atif01.cs.umd.edu sshd[15434]: error: maximum authentication attempts exceeded for root from 211.200.98.61 port 54555 ssh2 [preauth]
Aug 3 10:29:29 atif01.cs.umd.edu sshd[15444]: error: maximum authentication attempts exceeded for root from 211.200.98.61 port 59965 ssh2 [preauth]
Aug 3 10:29:44 atif01.cs.umd.edu sshd[15460]: error: maximum authentication attempts exceeded for root from 211.200.98.61 port 65251 ssh2 [preauth]
Aug 3 10:30:00 atif01.cs.umd.edu sshd[15470]: error: maximum authentication attempts exceeded for root from 211.200.98.61 port 54129 ssh2 [preauth]
Aug 3 10:30:15 atif01.cs.umd.edu sshd[15480]: error: maximum authentication attempts exceeded for root from 211.200.98.61 port 59632 ssh2 [preauth]
Aug 3 10:30:31 atif01.cs.umd.edu sshd[15511]: error: maximum authentication attempts exceeded for root from 211.200.98.61 port 65083 ssh2 [preauth]
Aug 3 10:30:47 atif01.cs.umd.edu sshd[15529]: error: maximum authentication attempts exceeded for root from 211.200.98.61 port 54093 ssh2 [preauth]
Aug 3 10:31:02 atif01.cs.umd.edu sshd[15537]: error: maximum authentication attempts exceeded for root from 211.200.98.61 port 59568 ssh2 [preauth]
Aug 3 10:31:18 atif01.cs.umd.edu sshd[15547]: error: maximum authentication attempts exceeded for root from 211.200.98.61 port 64608 ssh2 [preauth]
Aug 3 10:31:34 atif01.cs.umd.edu sshd[15557]: error: maximum authentication attempts exceeded for root from 211.200.98.61 port 53685 ssh2 [preauth]
Aug 3 10:31:51 atif01.cs.umd.edu sshd[15574]: error: maximum authentication attempts exceeded for root from 211.200.98.61 port 59198 ssh2 [preauth]
Aug 3 10:32:08 atif01.cs.umd.edu sshd[15584]: error: maximum authentication attempts exceeded for root from 211.200.98.61 port 64816 ssh2 [preauth]
Aug 3 10:32:25 atif01.cs.umd.edu sshd[15594]: error: maximum authentication attempts exceeded for root from 211.200.98.61 port 54281 ssh2 [preauth]
Aug 3 10:32:41 atif01.cs.umd.edu sshd[15610]: error: maximum authentication attempts exceeded for root from 211.200.98.61 port 59759 ssh2 [preauth]
Aug 3 10:32:57 atif01.cs.umd.edu sshd[15628]: error: maximum authentication attempts exceeded for root from 211.200.98.61 port 65073 ssh2 [preauth]
Aug 3 10:33:14 atif01.cs.umd.edu sshd[15643]: error: maximum authentication attempts exceeded for root from 211.200.98.61 port 54042 ssh2 [preauth]
Aug 3 10:33:29 atif01.cs.umd.edu sshd[15654]: error: maximum authentication attempts exceeded for root from 211.200.98.61 port 59676 ssh2 [preauth]
Aug 3 10:33:46 atif01.cs.umd.edu sshd[15672]: error: maximum authentication attempts exceeded for root from 211.200.98.61 port 65130 ssh2 [preauth]
... 15 more distinct messages not shown
== b0b02.cs.umd.edu (1 distinct, 1 total) ==
Aug 3 10:43:24 b0b02.cs.umd.edu rustdesk[2459140]: cannot open display:
== biggulp.cs.umd.edu (1 distinct, 1 total) ==
Aug 3 10:18:02 biggulp.cs.umd.edu sshd-session[2585626]: pam_access(sshd:auth): access denied for user `asriniv1' from `108.40.120.8'
== cheezit.cs.umd.edu (1 distinct, 1 total) ==
Aug 3 10:07:28 cheezit.cs.umd.edu sshd-session[604534]: error: send_error: write: Connection reset by peer
== contest (1 distinct, 33 total) ==
Aug 3 10:06:14 contest goferd[1007]: [ERROR][worker-0] gofer.messaging.adapter.connect:33 - connect: proton+amqps://satellite8.cs.umd.edu:5647, failed: Connection amqps://satellite8.cs.umd.edu:5647 disconnected: Condition('proton.pythonio', 'Connection refused to all addresses') [x33]
== csfw00a (1 distinct, 212 total) ==
Aug 3 10:04:42 csfw00a kernel: bnxt_en 0000:09:00.0 eth3: NIC Link is Down [x212]
== cskayako (2 distinct, 2 total) ==
Aug 3 10:59:48 cskayako setroubleshoot[1926898]: failed to retrieve rpm info for path '/var/www/html/__swift/logs/log.cache_03_Aug_2026_fde990a3cf.txt':
Aug 3 10:59:49 cskayako setroubleshoot[1926898]: SELinux is preventing /usr/sbin/sendmail.postfix from append access on the file /var/www/html/__swift/logs/log.cache_03_Aug_2026_fde990a3cf.txt. For complete SELinux messages run: sealert -l c566b62c-2773-4bf0-808b-10f832f1eafb
== hackerman (6 distinct, 11 total) ==
Aug 3 10:20:04 hackerman gnome-software[2060381]: can't reliably fixup error code 4 in domain g-io-error-quark: Not a directory [x4]
Aug 3 10:20:14 hackerman gnome-software[2060381]: Only 0 apps for recent list, hiding
Aug 3 10:20:31 hackerman gnome-software[2060381]: failed to commit changes to dconf: GDBus.Error:org.gtk.GDBus.UnmappedGError.Quark._g_2dfile_2derror_2dquark.Code2: Failed to create file “/adminhomes/sajith/.config/dconf/user.W6YOT3”: Permission denied
Aug 3 10:20:31 hackerman packagekitd[3437461]: Failed to get cache filename for libreoffice [x2]
Aug 3 10:20:31 hackerman packagekitd[3437461]: Failed to get cache filename for kernel [x2]
Aug 3 10:20:42 hackerman packagekitd[3437461]: failed to parse public key for /etc/pki/rpm-gpg/RPM-GPG-KEY-PQC-redhat-release
== idm00 (1 distinct, 1 total) ==
Aug 3 10:51:16 idm00 named[1455]: client @0x7f330424fbc8 10.73.240.42#55317: update '73.10.in-addr.arpa/IN' denied
== idmp0 (2 distinct, 3 total) ==
Aug 3 10:36:00 idmp0 named[5198]: client @0x7f98f4021ea8 10.73.240.43#57371: update '73.10.in-addr.arpa/IN' denied
Aug 3 10:38:27 idmp0 named[5198]: client @0x7f9910009828 10.73.245.14#58463: update '73.10.in-addr.arpa/IN' denied [x2]
== inbound00.cs.umd.edu (1 distinct, 5 total) ==
Aug 3 10:31:32 inbound00.cs.umd.edu cockpit-ws[2493341]: /usr/share/cockpit/static/login.js/favicon.ico: Failed to open file “/usr/share/cockpit/static/login.js/favicon.ico”: open() failed: Not a directory [x5]
== inbound01.cs.umd.edu (1 distinct, 5 total) ==
Aug 3 10:31:26 inbound01.cs.umd.edu cockpit-ws[508714]: /usr/share/cockpit/static/login.js/favicon.ico: Failed to open file “/usr/share/cockpit/static/login.js/favicon.ico”: open() failed: Not a directory [x5]
== irb2156 (1 distinct, 1 total) ==
Aug 3 11:00:00 irb2156 (da-udp.*)[575505]: amanda-udp-restart.service: Failed at step EXEC spawning /usr/bin/systemctl restart amanda-udp.*: No such file or directory
== itmon02 (1 distinct, 44 total) ==
Aug 3 10:07:48 itmon02 sshd[1750555]: error: beginning MaxStartups throttling [x44]
== krispykreme.cs.umd.edu (1 distinct, 1 total) ==
Aug 3 10:07:11 krispykreme.cs.umd.edu sshd-session[2771260]: error: send_error: write: Connection reset by peer
== netman.cs.umd.edu (26 distinct, 26 total) ==
Aug 3 10:56:17 netman.cs.umd.edu sshd[282680]: error: maximum authentication attempts exceeded for root from 211.200.98.61 port 65219 ssh2 [preauth]
Aug 3 10:56:38 netman.cs.umd.edu sshd[282941]: error: maximum authentication attempts exceeded for root from 211.200.98.61 port 55567 ssh2 [preauth]
Aug 3 10:56:59 netman.cs.umd.edu sshd[283081]: error: maximum authentication attempts exceeded for root from 211.200.98.61 port 62687 ssh2 [preauth]
Aug 3 10:57:20 netman.cs.umd.edu sshd[283155]: error: maximum authentication attempts exceeded for root from 211.200.98.61 port 53028 ssh2 [preauth]
Aug 3 10:57:41 netman.cs.umd.edu sshd[283168]: error: maximum authentication attempts exceeded for root from 211.200.98.61 port 59962 ssh2 [preauth]
Aug 3 10:58:02 netman.cs.umd.edu sshd[283231]: error: maximum authentication attempts exceeded for root from 211.200.98.61 port 50359 ssh2 [preauth]
Aug 3 10:58:23 netman.cs.umd.edu sshd[283350]: error: maximum authentication attempts exceeded for root from 211.200.98.61 port 56951 ssh2 [preauth]
Aug 3 10:58:44 netman.cs.umd.edu sshd[283487]: error: maximum authentication attempts exceeded for root from 211.200.98.61 port 63854 ssh2 [preauth]
Aug 3 10:59:03 netman.cs.umd.edu sshd[283532]: error: maximum authentication attempts exceeded for root from 211.200.98.61 port 54376 ssh2 [preauth]
Aug 3 10:59:24 netman.cs.umd.edu sshd[283544]: error: maximum authentication attempts exceeded for root from 211.200.98.61 port 60979 ssh2 [preauth]
Aug 3 10:59:46 netman.cs.umd.edu sshd[283575]: error: maximum authentication attempts exceeded for root from 211.200.98.61 port 51392 ssh2 [preauth]
Aug 3 11:00:07 netman.cs.umd.edu sshd[283619]: error: maximum authentication attempts exceeded for root from 211.200.98.61 port 58620 ssh2 [preauth]
Aug 3 11:00:27 netman.cs.umd.edu sshd[284049]: error: maximum authentication attempts exceeded for root from 211.200.98.61 port 49673 ssh2 [preauth]
Aug 3 11:00:47 netman.cs.umd.edu sshd[284506]: error: maximum authentication attempts exceeded for root from 211.200.98.61 port 56946 ssh2 [preauth]
Aug 3 11:01:08 netman.cs.umd.edu sshd[284827]: error: maximum authentication attempts exceeded for root from 211.200.98.61 port 63987 ssh2 [preauth]
Aug 3 11:01:29 netman.cs.umd.edu sshd[284849]: error: maximum authentication attempts exceeded for root from 211.200.98.61 port 55175 ssh2 [preauth]
Aug 3 11:01:50 netman.cs.umd.edu sshd[284880]: error: maximum authentication attempts exceeded for root from 211.200.98.61 port 62585 ssh2 [preauth]
Aug 3 11:02:11 netman.cs.umd.edu sshd[284924]: error: maximum authentication attempts exceeded for root from 211.200.98.61 port 53779 ssh2 [preauth]
Aug 3 11:02:32 netman.cs.umd.edu sshd[284936]: error: maximum authentication attempts exceeded for root from 211.200.98.61 port 61080 ssh2 [preauth]
Aug 3 11:02:53 netman.cs.umd.edu sshd[284970]: error: maximum authentication attempts exceeded for root from 211.200.98.61 port 51584 ssh2 [preauth]
Aug 3 11:03:14 netman.cs.umd.edu sshd[285015]: error: maximum authentication attempts exceeded for root from 211.200.98.61 port 58652 ssh2 [preauth]
Aug 3 11:03:35 netman.cs.umd.edu sshd[285043]: error: maximum authentication attempts exceeded for root from 211.200.98.61 port 65267 ssh2 [preauth]
Aug 3 11:03:56 netman.cs.umd.edu sshd[285074]: error: maximum authentication attempts exceeded for root from 211.200.98.61 port 55727 ssh2 [preauth]
Aug 3 11:04:17 netman.cs.umd.edu sshd[285119]: error: maximum authentication attempts exceeded for root from 211.200.98.61 port 62299 ssh2 [preauth]
Aug 3 11:04:36 netman.cs.umd.edu sshd[285133]: error: maximum authentication attempts exceeded for root from 211.200.98.61 port 52578 ssh2 [preauth]
Aug 3 11:04:57 netman.cs.umd.edu sshd[285161]: error: maximum authentication attempts exceeded for root from 211.200.98.61 port 58268 ssh2 [preauth]
== newhonors2 (1 distinct, 24 total) ==
Aug 3 10:13:02 newhonors2 dhcpcd[675817]: dhcpcd is not running [x24]
== nightingale (14 distinct, 14 total) ==
Aug 3 10:05:09 nightingale packagekitd[1646763]: failed to parse public key for /etc/pki/rpm-gpg/RPM-GPG-KEY-PQC-redhat-release
Aug 3 10:05:09 nightingale gnome-software[1646801]: failed to install runtime/org.freedesktop.Platform.GL.default/x86_64/22.08 (non fatal): Flatpak system operation Deploy not allowed for user
Aug 3 10:05:14 nightingale gnome-software[1646801]: failed to install runtime/org.freedesktop.Platform.GL.default/x86_64/22.08-extra (non fatal): Flatpak system operation Deploy not allowed for user
Aug 3 10:05:29 nightingale gnome-software[1646801]: failed to install runtime/org.freedesktop.Platform.GL.default/x86_64/25.08 (non fatal): Flatpak system operation Deploy not allowed for user
Aug 3 10:05:45 nightingale gnome-software[1646801]: failed to install runtime/org.freedesktop.Platform.GL.default/x86_64/25.08-extra (non fatal): Flatpak system operation Deploy not allowed for user
Aug 3 10:05:53 nightingale gnome-software[1646801]: failed to install runtime/org.freedesktop.Platform.Locale/x86_64/22.08 (non fatal): Flatpak system operation Deploy not allowed for user
Aug 3 10:05:53 nightingale gnome-software[1646801]: failed to install runtime/org.freedesktop.Platform.Locale/x86_64/25.08 (non fatal): Flatpak system operation Deploy not allowed for user
Aug 3 10:05:55 nightingale gnome-software[1646801]: failed to install runtime/org.freedesktop.Platform.VAAPI.Intel/x86_64/22.08 (non fatal): Flatpak system operation Deploy not allowed for user
Aug 3 10:05:56 nightingale gnome-software[1646801]: failed to install runtime/org.freedesktop.Platform.VAAPI.Intel/x86_64/25.08 (non fatal): Flatpak system operation Deploy not allowed for user
Aug 3 10:05:57 nightingale gnome-software[1646801]: failed to install runtime/org.freedesktop.Platform.codecs-extra/x86_64/25.08-extra (non fatal): Flatpak system operation Deploy not allowed for user
Aug 3 10:06:32 nightingale gnome-software[1646801]: failed to install runtime/org.freedesktop.Platform.openh264/x86_64/2.2.0 (non fatal): Flatpak system operation Deploy not allowed for user
Aug 3 10:06:32 nightingale gnome-software[1646801]: State change on system/flatpak/flathub/org.freedesktop.Platform/22.08 (Freedesktop Platform) from installing to removing is not OK
Aug 3 10:06:33 nightingale gnome-software[1646801]: State change on system/flatpak/flathub/im.riot.Riot/stable (Element) from updatable-live to installed is not OK
Aug 3 10:06:33 nightingale gnome-software[1646801]: State change on system/flatpak/flathub/org.freedesktop.Platform/22.08 (Freedesktop Platform) from updatable-live to installed is not OK
== outbound00.cs.umd.edu (2 distinct, 10 total) ==
Aug 3 10:09:09 outbound00.cs.umd.edu python3[2449788]: ldapdb [x6]
Aug 3 10:26:29 outbound00.cs.umd.edu cockpit-ws[2454254]: /usr/share/cockpit/static/login.js/favicon.ico: Failed to open file “/usr/share/cockpit/static/login.js/favicon.ico”: open() failed: Not a directory [x4]
== outbound01.cs.umd.edu (2 distinct, 7 total) ==
Aug 3 10:13:06 outbound01.cs.umd.edu python3[482748]: ldapdb [x6]
Aug 3 10:26:34 outbound01.cs.umd.edu cockpit-ws[486231]: /usr/share/cockpit/static/login.js/favicon.ico: Failed to open file “/usr/share/cockpit/static/login.js/favicon.ico”: open() failed: Not a directory
== quiss (1 distinct, 1 total) ==
Aug 3 11:00:18 quiss (da-udp.*)[304912]: amanda-udp-restart.service: Failed at step EXEC spawning /usr/bin/systemctl restart amanda-udp.*: No such file or directory
== sentry-docker00.cs.umd.edu (40 distinct, 40 total) ==
Aug 3 10:19:52 sentry-docker00.cs.umd.edu systemd-udevd[1002798]: link_config: could not get ethtool features for veth69848c7
Aug 3 10:19:52 sentry-docker00.cs.umd.edu systemd-udevd[1002798]: Could not set offload features of veth69848c7: No such device
Aug 3 10:19:52 sentry-docker00.cs.umd.edu systemd-udevd[1002893]: Could not generate persistent MAC address for vethd24a1cd: No such file or directory
Aug 3 10:19:52 sentry-docker00.cs.umd.edu systemd-udevd[1002894]: Could not generate persistent MAC address for veth8a71adb: No such file or directory
Aug 3 10:19:52 sentry-docker00.cs.umd.edu systemd-udevd[1002919]: Could not generate persistent MAC address for vethc314964: No such file or directory
Aug 3 10:19:52 sentry-docker00.cs.umd.edu systemd-udevd[1002920]: Could not generate persistent MAC address for vethddc42ed: No such file or directory
Aug 3 10:19:52 sentry-docker00.cs.umd.edu systemd-udevd[1002938]: Could not generate persistent MAC address for vethce17073: No such file or directory
Aug 3 10:19:52 sentry-docker00.cs.umd.edu systemd-udevd[1002923]: Could not generate persistent MAC address for vethd296ce7: No such file or directory
Aug 3 10:19:52 sentry-docker00.cs.umd.edu systemd-udevd[1002960]: Could not generate persistent MAC address for vethfc68792: No such file or directory
Aug 3 10:19:52 sentry-docker00.cs.umd.edu systemd-udevd[1002964]: Could not generate persistent MAC address for vethf465fe0: No such file or directory
Aug 3 10:20:57 sentry-docker00.cs.umd.edu systemd-udevd[1003879]: link_config: could not get ethtool features for vethfe7d8d3
Aug 3 10:20:57 sentry-docker00.cs.umd.edu systemd-udevd[1003879]: Could not set offload features of vethfe7d8d3: No such device
Aug 3 10:20:58 sentry-docker00.cs.umd.edu systemd-udevd[1003895]: Could not generate persistent MAC address for veth901009f: No such file or directory
Aug 3 10:20:58 sentry-docker00.cs.umd.edu systemd-udevd[1003896]: Could not generate persistent MAC address for vethe90a01d: No such file or directory
Aug 3 10:40:00 sentry-docker00.cs.umd.edu systemd-udevd[1012270]: link_config: could not get ethtool features for vethce17073
Aug 3 10:40:00 sentry-docker00.cs.umd.edu systemd-udevd[1012270]: Could not set offload features of vethce17073: No such device
Aug 3 10:40:00 sentry-docker00.cs.umd.edu systemd-udevd[1012329]: Could not generate persistent MAC address for vethc901297: No such file or directory
Aug 3 10:40:00 sentry-docker00.cs.umd.edu systemd-udevd[1012330]: Could not generate persistent MAC address for vethb803217: No such file or directory
Aug 3 10:40:00 sentry-docker00.cs.umd.edu systemd-udevd[1012355]: Could not generate persistent MAC address for vethba6f030: No such file or directory
Aug 3 10:40:00 sentry-docker00.cs.umd.edu systemd-udevd[1012356]: Could not generate persistent MAC address for veth6cbdb85: No such file or directory
Aug 3 10:40:00 sentry-docker00.cs.umd.edu systemd-udevd[1012406]: Could not generate persistent MAC address for veth3f14d62: No such file or directory
Aug 3 10:40:00 sentry-docker00.cs.umd.edu systemd-udevd[1012407]: Could not generate persistent MAC address for vetha784467: No such file or directory
Aug 3 10:40:01 sentry-docker00.cs.umd.edu systemd-udevd[1012470]: Could not generate persistent MAC address for veth8298bb0: No such file or directory
Aug 3 10:40:01 sentry-docker00.cs.umd.edu systemd-udevd[1012471]: Could not generate persistent MAC address for veth7015049: No such file or directory
Aug 3 10:41:02 sentry-docker00.cs.umd.edu systemd-udevd[1013337]: Could not generate persistent MAC address for vethc12b0ef: No such file or directory
Aug 3 10:41:02 sentry-docker00.cs.umd.edu systemd-udevd[1013338]: Could not generate persistent MAC address for vethf55f8d7: No such file or directory
Aug 3 11:00:09 sentry-docker00.cs.umd.edu systemd-udevd[1021765]: link_config: could not get ethtool features for vethc901297
Aug 3 11:00:09 sentry-docker00.cs.umd.edu systemd-udevd[1021765]: Could not set offload features of vethc901297: No such device
Aug 3 11:00:09 sentry-docker00.cs.umd.edu systemd-udevd[1021811]: Could not generate persistent MAC address for veth4fe372f: No such file or directory
Aug 3 11:00:09 sentry-docker00.cs.umd.edu systemd-udevd[1021812]: Could not generate persistent MAC address for veth0d87924: No such file or directory
... 10 more distinct messages not shown
== strawberry (2 distinct, 8 total) ==
Aug 3 10:09:44 strawberry udisksd[1067]: Error performing housekeeping for drive /org/freedesktop/UDisks2/drives/ST2000DM001_1CH164_W1E8J5KJ: Error updating SMART data: Error sending ATA command CHECK POWER MODE: Unexpected sense data returned:#0120000: 00 00 00 00 00 00 00 00 00 00 00 00 00 00 00 00 ................#0120010: 00 00 00 00 00 00 00 00 00 00 00 00 00 00 00 00 ................#012 (g-io-error-quark, 0) [x6]
Aug 3 10:34:42 strawberry smartd[5314]: Device: /dev/sda [SAT], failed to read SMART Attribute Data [x2]
1
0
Command: /usr/local/sbin/syslog-digest.py
Time : 0.5217s
Status : exited 0
Output :
Syslog digest — 2026-08-03 10:05 EDT
Processed 4,411 lines, filtered 3,529 (80%). 882 unknown (182 distinct) from 22 host(s).
== abuse (1 distinct, 347 total) ==
Aug 3 09:05:06 abuse rsyslogd[21745]: imjournal: open() failed for path: '/var/lib/rsyslog/imjournal.state.tmp': Input/output error [v8.2404.0 try https://www.rsyslog.com/e/2433 ] [x347]
== b0b02.cs.umd.edu (2 distinct, 2 total) ==
Aug 3 09:43:20 b0b02.cs.umd.edu rustdesk[2444108]: cannot open display:
Aug 3 09:47:47 b0b02.cs.umd.edu systemd[1]: insights-client.service: Start request repeated too quickly.
== bachata (4 distinct, 4 total) ==
Aug 3 09:12:11 bachata setroubleshoot[2388427]: SELinux is preventing /usr/sbin/smbd from read access on the lnk_file ClassRelated. For complete SELinux messages run: sealert -l 8052e635-6f2f-45b1-a983-55d5d837ba65
Aug 3 09:12:11 bachata setroubleshoot[2388427]: SELinux is preventing /usr/sbin/smbd from getattr access on the file /fs/junkfood/nelson/.history.16381003. For complete SELinux messages run: sealert -l 278fa2f7-7c6d-4613-8831-0c7902342a33
Aug 3 09:12:11 bachata setroubleshoot[2388427]: SELinux is preventing /usr/sbin/smbd from read access on the file .history.16381003. For complete SELinux messages run: sealert -l a2f5acec-ed56-4193-b84b-9c355ad24121
Aug 3 09:12:11 bachata setroubleshoot[2388427]: SELinux is preventing /usr/sbin/smbd from getattr access on the lnk_file /fs/junkfood/nelson/ClassRelated. For complete SELinux messages run: sealert -l fcd56e6d-4082-40d2-8d07-7512890e4b51
== borealis (8 distinct, 14 total) ==
Aug 3 09:51:48 borealis gnome-software[917207]: Only 0 apps for recent list, hiding
Aug 3 09:51:52 borealis gsd-color[917084]: failed to connect to device: Failed to connect to missing device /org/freedesktop/ColorManager/devices/xrandr_Dell_Inc__DELL_U2412M_7WFG152E149L_gdm_42
Aug 3 09:51:52 borealis gsd-color[917084]: failed to connect to device: Failed to connect to missing device /org/freedesktop/ColorManager/devices/xrandr_Dell_Inc__DELL_U2412M_4V35D7133HNU_gdm_42
Aug 3 09:52:06 borealis packagekitd[1620418]: Failed to get cache filename for chromium
Aug 3 09:52:08 borealis packagekitd[1620418]: Failed to get cache filename for kernel-devel-matched [x3]
Aug 3 09:52:08 borealis packagekitd[1620418]: Failed to get cache filename for libreoffice [x3]
Aug 3 09:52:08 borealis packagekitd[1620418]: Failed to get cache filename for kernel [x3]
Aug 3 09:52:12 borealis packagekitd[1620418]: failed to parse public key for /etc/pki/rpm-gpg/RPM-GPG-KEY-PQC-redhat-release
== contest (10 distinct, 44 total) ==
Aug 3 09:05:32 contest goferd[1007]: [ERROR][worker-0] gofer.messaging.adapter.connect:33 - connect: proton+amqps://satellite8.cs.umd.edu:5647, failed: Connection amqps://satellite8.cs.umd.edu:5647 disconnected: Condition('proton.pythonio', 'Connection refused to all addresses') [x34]
Aug 3 09:48:17 contest setroubleshoot[554676]: SELinux is preventing /usr/libexec/platform-python3.6 from create access on the directory libdnf.l1tjmD. For complete SELinux messages run: sealert -l cb6b25c6-4765-4cf2-88a0-9b3b508e94e9
Aug 3 09:48:17 contest setroubleshoot[554676]: SELinux is preventing /usr/bin/gpgconf from add_name access on the directory repodata. For complete SELinux messages run: sealert -l 41cf7b1b-0f34-4609-98f2-b66e7825fef7
Aug 3 09:48:17 contest setroubleshoot[554676]: SELinux is preventing /usr/libexec/platform-python3.6 from create access on the file mirrorlist. For complete SELinux messages run: sealert -l fc20ff92-ea83-4f38-a24b-ddfd737a3141
Aug 3 09:48:17 contest setroubleshoot[554676]: SELinux is preventing /usr/libexec/platform-python3.6 from setattr access on the file repomd.xml. For complete SELinux messages run: sealert -l ac675631-fa35-4e93-adc9-b692b18e53e5
Aug 3 09:48:17 contest setroubleshoot[554676]: SELinux is preventing /usr/bin/gpgconf from add_name access on the directory repomd.xml.asc. For complete SELinux messages run: sealert -l 41cf7b1b-0f34-4609-98f2-b66e7825fef7
Aug 3 09:48:18 contest setroubleshoot[554676]: SELinux is preventing /usr/libexec/platform-python3.6 from read access on the directory libdnf.l1tjmD. For complete SELinux messages run: sealert -l 45d103b6-0810-4890-a705-990118577ce8
Aug 3 09:48:18 contest setroubleshoot[554676]: SELinux is preventing /usr/libexec/platform-python3.6 from remove_name access on the directory repomd.xml. For complete SELinux messages run: sealert -l 7e499113-2fd7-4f67-bec6-3521efbe3637 [x2]
Aug 3 09:48:18 contest setroubleshoot[554676]: SELinux is preventing /usr/libexec/platform-python3.6 from rmdir access on the directory repodata. For complete SELinux messages run: sealert -l 3928930b-a1ed-448d-950b-0665ac2adef8
Aug 3 09:48:19 contest setroubleshoot[554676]: SELinux is preventing /usr/libexec/platform-python3.6 from create access on the directory libdnf.8oO4mp. For complete SELinux messages run: sealert -l cb6b25c6-4765-4cf2-88a0-9b3b508e94e9
== csfw00a (1 distinct, 198 total) ==
Aug 3 09:04:27 csfw00a kernel: bnxt_en 0000:09:00.0 eth3: NIC Link is Down [x198]
== cskayako (2 distinct, 4 total) ==
Aug 3 09:27:14 cskayako setroubleshoot[1917404]: failed to retrieve rpm info for path '/var/www/html/__swift/logs/log.cache_03_Aug_2026_fde990a3cf.txt': [x2]
Aug 3 09:27:15 cskayako setroubleshoot[1917404]: SELinux is preventing /usr/sbin/sendmail.postfix from append access on the file /var/www/html/__swift/logs/log.cache_03_Aug_2026_fde990a3cf.txt. For complete SELinux messages run: sealert -l c566b62c-2773-4bf0-808b-10f832f1eafb [x2]
== emaar (1 distinct, 1 total) ==
Aug 3 09:47:16 emaar systemd[1]: insights-client.service: Start request repeated too quickly.
== hackerman (7 distinct, 12 total) ==
Aug 3 09:19:01 hackerman gnome-software[2060381]: failed to commit changes to dconf: GDBus.Error:org.gtk.GDBus.UnmappedGError.Quark._g_2dfile_2derror_2dquark.Code2: Failed to create file “/adminhomes/sajith/.config/dconf/user.T6JZT3”: Permission denied
Aug 3 09:20:04 hackerman gnome-software[2060381]: can't reliably fixup error code 4 in domain g-io-error-quark: Not a directory [x4]
Aug 3 09:20:12 hackerman gnome-software[2060381]: Only 0 apps for recent list, hiding
Aug 3 09:20:28 hackerman gnome-software[2060381]: failed to commit changes to dconf: GDBus.Error:org.gtk.GDBus.UnmappedGError.Quark._g_2dfile_2derror_2dquark.Code2: Failed to create file “/adminhomes/sajith/.config/dconf/user.7UWUT3”: Permission denied
Aug 3 09:20:29 hackerman packagekitd[3423780]: Failed to get cache filename for libreoffice [x2]
Aug 3 09:20:29 hackerman packagekitd[3423780]: Failed to get cache filename for kernel [x2]
Aug 3 09:20:38 hackerman packagekitd[3423780]: failed to parse public key for /etc/pki/rpm-gpg/RPM-GPG-KEY-PQC-redhat-release
== idm00 (1 distinct, 1 total) ==
Aug 3 09:51:16 idm00 named[1455]: client @0x7f3304d076b8 10.73.240.42#54322: update '73.10.in-addr.arpa/IN' denied
== idmp0 (1 distinct, 1 total) ==
Aug 3 09:36:03 idmp0 named[5198]: client @0x7f990c0123e8 10.73.240.43#57184: update '73.10.in-addr.arpa/IN' denied
== itmon02 (1 distinct, 50 total) ==
Aug 3 09:07:48 itmon02 sshd[1750555]: error: beginning MaxStartups throttling [x50]
== munin (2 distinct, 4 total) ==
Aug 3 09:37:52 munin sudo[1069969]: pam_systemd(sudo:session): Failed to stat() runtime directory '/run/user/0': No such file or directory [x2]
Aug 3 09:37:52 munin sudo[1069969]: pam_systemd(sudo:session): Not setting $XDG_RUNTIME_DIR, as the directory is not in order. [x2]
== newhonors2 (1 distinct, 24 total) ==
Aug 3 09:13:03 newhonors2 dhcpcd[673918]: dhcpcd is not running [x24]
== nightingale (63 distinct, 80 total) ==
Aug 3 10:02:54 nightingale krb5_child[1646404]: Preauthentication failed
Aug 3 10:03:21 nightingale goa-identity-se[1646749]: GoaKerberosIdentityManager: Using polling for change notification for credential cache type 'KCM'
Aug 3 10:03:22 nightingale vmware-user.desktop[1646878]: vmware-user: could not open /proc/fs/vmblock/dev
Aug 3 10:03:22 nightingale gsd-usb-protect[1646852]: Failed to fetch USBGuard parameters: GDBus.Error:org.freedesktop.DBus.Error.ServiceUnknown: The name is not activatable
Aug 3 10:03:24 nightingale gsd-rfkill[1202642]: Error releasing name org.gnome.SettingsDaemon.Rfkill: The connection is closed
Aug 3 10:03:24 nightingale gsd-screensaver[1202659]: Error releasing name org.freedesktop.ScreenSaver: The connection is closed
Aug 3 10:03:24 nightingale gsd-smartcard[1202654]: Error releasing name org.gnome.SettingsDaemon.Smartcard: The connection is closed
Aug 3 10:03:24 nightingale gsd-sound[1202664]: Error releasing name org.gnome.SettingsDaemon.Sound: The connection is closed
Aug 3 10:03:24 nightingale gsd-a11y-settin[1202670]: Error releasing name org.gnome.SettingsDaemon.A11ySettings: The connection is closed
Aug 3 10:03:24 nightingale gsd-datetime[1202656]: Error releasing name org.gnome.SettingsDaemon.Datetime: The connection is closed
Aug 3 10:03:24 nightingale gsd-housekeepin[1202671]: Error releasing name org.gnome.SettingsDaemon.Housekeeping: The connection is closed
Aug 3 10:03:25 nightingale gsd-color[1646782]: failed to connect to device: Failed to connect to missing device /org/freedesktop/ColorManager/devices/xrandr_Acer_Technologies_B246WL_T1ZAA0012420_gdm_42
Aug 3 10:03:32 nightingale PanGPUI[1646831]: QObject::connect: No such slot PanGPUIWebDialog::onReload()
Aug 3 10:03:32 nightingale PanGPUI[1646831]: Setting a QCompleter on non-editable QComboBox is not allowed.
Aug 3 10:03:33 nightingale PanGPUI[1646831]: QLayout: Attempting to add QLayout "" to ConnectionsTab "", which already has a layout [x5]
Aug 3 10:03:33 nightingale PanGPUI[1646831]: QLayout: Attempting to add QLayout "" to TroubleShootingTab "", which already has a layout
Aug 3 10:03:33 nightingale PanGPUI[1646831]: QLayout: Attempting to add QLayout "" to PanGPUIFedMandateDialog "", which already has a layout
Aug 3 10:03:33 nightingale PanGPUI[1646831]: QLayout: Attempting to add QLayout "" to PanGPUIPreferredGwDialog "", which already has a layout
Aug 3 10:03:33 nightingale PanGPUI[1646831]: QLayout: Attempting to add QLayout "" to PanGPUICertSelectDialog "", which already has a layout
Aug 3 10:03:40 nightingale gnome-software[1646801]: Kind change on net.launchpad.Gnuclad from console-application to desktop-application is not OK
Aug 3 10:03:42 nightingale gnome-software[1646801]: Kind change on io.github.sil_car.SqueezeVid from console-application to desktop-application is not OK
Aug 3 10:03:44 nightingale gnome-software[1646801]: Kind change on net.mkiol.SpeechNote.Addon.amd from addon to runtime is not OK
Aug 3 10:03:44 nightingale gnome-software[1646801]: Kind change on net.mkiol.SpeechNote.Addon.nvidia from addon to runtime is not OK
Aug 3 10:03:44 nightingale gnome-software[1646801]: Kind change on org.videolan.VLC.Plugin.pause_click from addon to runtime is not OK
Aug 3 10:03:46 nightingale gnome-software[1646801]: Kind change on org.nuspell.Nuspell from console-application to desktop-application is not OK
Aug 3 10:03:47 nightingale gnome-software[1646801]: Kind change on com.github.ilai_deutel.kibi from console-application to desktop-application is not OK
Aug 3 10:03:48 nightingale gnome-software[1646801]: Kind change on dev.paullee.scraterpreter.Scrape from console-application to desktop-application is not OK
Aug 3 10:03:48 nightingale gnome-software[1646801]: Kind change on dev.paullee.scraterpreter.Scrapec from console-application to desktop-application is not OK
Aug 3 10:03:48 nightingale gnome-software[1646801]: Kind change on fr.inria.corese.CoreseCommand from console-application to desktop-application is not OK
Aug 3 10:03:49 nightingale gnome-software[1646801]: Kind change on io.github.coccinelle.coccinelle from console-application to desktop-application is not OK
... 33 more distinct messages not shown
== outbound00.cs.umd.edu (1 distinct, 6 total) ==
Aug 3 09:09:09 outbound00.cs.umd.edu python3[2435977]: ldapdb [x6]
== outbound01.cs.umd.edu (1 distinct, 6 total) ==
Aug 3 09:13:06 outbound01.cs.umd.edu python3[468780]: ldapdb [x6]
== sentry-docker00.cs.umd.edu (44 distinct, 44 total) ==
Aug 3 09:19:27 sentry-docker00.cs.umd.edu systemd-udevd[974284]: link_config: could not get ethtool features for veth18cdaea
Aug 3 09:19:27 sentry-docker00.cs.umd.edu systemd-udevd[974284]: Could not set offload features of veth18cdaea: No such device
Aug 3 09:19:27 sentry-docker00.cs.umd.edu systemd-udevd[974309]: Could not generate persistent MAC address for veth16e1493: No such file or directory
Aug 3 09:19:27 sentry-docker00.cs.umd.edu systemd-udevd[974310]: Could not generate persistent MAC address for veth2e3d4d0: No such file or directory
Aug 3 09:19:27 sentry-docker00.cs.umd.edu systemd-udevd[974313]: Could not generate persistent MAC address for vetha219f80: No such file or directory
Aug 3 09:19:27 sentry-docker00.cs.umd.edu systemd-udevd[974314]: Could not generate persistent MAC address for veth8870bc0: No such file or directory
Aug 3 09:19:27 sentry-docker00.cs.umd.edu systemd-udevd[974309]: Could not generate persistent MAC address for veth84218d5: No such file or directory
Aug 3 09:19:27 sentry-docker00.cs.umd.edu systemd-udevd[974330]: Could not generate persistent MAC address for veth6619ac0: No such file or directory
Aug 3 09:19:27 sentry-docker00.cs.umd.edu systemd-udevd[974339]: Could not generate persistent MAC address for vethfe2ab67: No such file or directory
Aug 3 09:19:27 sentry-docker00.cs.umd.edu systemd-udevd[974340]: Could not generate persistent MAC address for vethaa901cf: No such file or directory
Aug 3 09:20:37 sentry-docker00.cs.umd.edu systemd-udevd[975301]: link_config: could not get ethtool features for veth3f15f91
Aug 3 09:20:37 sentry-docker00.cs.umd.edu systemd-udevd[975301]: Could not set offload features of veth3f15f91: No such device
Aug 3 09:20:37 sentry-docker00.cs.umd.edu systemd-udevd[975320]: Could not generate persistent MAC address for veth40c7b48: No such file or directory
Aug 3 09:20:37 sentry-docker00.cs.umd.edu systemd-udevd[975321]: Could not generate persistent MAC address for veth182e2c8: No such file or directory
Aug 3 09:39:35 sentry-docker00.cs.umd.edu systemd-udevd[983950]: link_config: could not get ethtool features for veth84218d5
Aug 3 09:39:35 sentry-docker00.cs.umd.edu systemd-udevd[983950]: Could not set offload features of veth84218d5: No such device
Aug 3 09:39:35 sentry-docker00.cs.umd.edu systemd-udevd[983992]: link_config: could not get ethtool features for vethfe2ab67
Aug 3 09:39:35 sentry-docker00.cs.umd.edu systemd-udevd[983992]: Could not set offload features of vethfe2ab67: No such device
Aug 3 09:39:35 sentry-docker00.cs.umd.edu systemd-udevd[984029]: Could not generate persistent MAC address for vethe504ec0: No such file or directory
Aug 3 09:39:35 sentry-docker00.cs.umd.edu systemd-udevd[984030]: Could not generate persistent MAC address for vethddce40c: No such file or directory
Aug 3 09:39:36 sentry-docker00.cs.umd.edu systemd-udevd[984055]: Could not generate persistent MAC address for vethc4d98d8: No such file or directory
Aug 3 09:39:36 sentry-docker00.cs.umd.edu systemd-udevd[984056]: Could not generate persistent MAC address for veth7cb8449: No such file or directory
Aug 3 09:39:36 sentry-docker00.cs.umd.edu systemd-udevd[984063]: Could not generate persistent MAC address for veth54cb5c7: No such file or directory
Aug 3 09:39:36 sentry-docker00.cs.umd.edu systemd-udevd[984063]: Could not generate persistent MAC address for veth41c73e1: No such file or directory
Aug 3 09:39:36 sentry-docker00.cs.umd.edu systemd-udevd[984090]: Could not generate persistent MAC address for vetha6fe53a: No such file or directory
Aug 3 09:39:36 sentry-docker00.cs.umd.edu systemd-udevd[984055]: Could not generate persistent MAC address for veth352012e: No such file or directory
Aug 3 09:40:45 sentry-docker00.cs.umd.edu systemd-udevd[985055]: link_config: could not get ethtool features for veth40c7b48
Aug 3 09:40:45 sentry-docker00.cs.umd.edu systemd-udevd[985055]: Could not set offload features of veth40c7b48: No such device
Aug 3 09:40:45 sentry-docker00.cs.umd.edu systemd-udevd[985071]: Could not generate persistent MAC address for veth5202f48: No such file or directory
Aug 3 09:40:45 sentry-docker00.cs.umd.edu systemd-udevd[985072]: Could not generate persistent MAC address for vethe27956f: No such file or directory
... 14 more distinct messages not shown
== strawberry (3 distinct, 9 total) ==
Aug 3 09:09:44 strawberry udisksd[1067]: Error performing housekeeping for drive /org/freedesktop/UDisks2/drives/ST2000DM001_1CH164_W1E8J5KJ: Error updating SMART data: Error sending ATA command CHECK POWER MODE: Unexpected sense data returned:#0120000: 00 00 00 00 00 00 00 00 00 00 00 00 00 00 00 00 ................#0120010: 00 00 00 00 00 00 00 00 00 00 00 00 00 00 00 00 ................#012 (g-io-error-quark, 0) [x6]
Aug 3 09:34:42 strawberry smartd[5314]: Device: /dev/sda [SAT], failed to read SMART Attribute Data [x2]
Aug 3 10:04:42 strawberry smartd[5314]: Device: /dev/sda [SAT], not capable of Offline or Self-Testing.
== submit26-b9-2 (9 distinct, 9 total) ==
Aug 3 09:12:52 submit26-b9-2 setroubleshoot[939396]: SELinux is preventing /usr/bin/python3.9 from create access on the directory /(null). For complete SELinux messages run: sealert -l d506243c-d61e-48f3-b42a-4592c913deb0
Aug 3 09:12:52 submit26-b9-2 setroubleshoot[939396]: SELinux is preventing /usr/bin/python3.9 from add_name access on the directory /(null). For complete SELinux messages run: sealert -l 3b4752ac-1b9a-4af9-a05b-32e4c2eb13ab
Aug 3 09:12:52 submit26-b9-2 setroubleshoot[939396]: SELinux is preventing /usr/bin/python3.9 from create access on the file /(null). For complete SELinux messages run: sealert -l 29e5adbd-4381-4467-b40d-a2219101e096
Aug 3 09:12:52 submit26-b9-2 setroubleshoot[939396]: SELinux is preventing /usr/bin/python3.9 from open access on the file /tmp/libdnf.2vCnix/repodata/repomd.xml. For complete SELinux messages run: sealert -l 1b38f2ec-01ce-4343-8059-ba7494ecc5c4
Aug 3 09:12:52 submit26-b9-2 setroubleshoot[939396]: SELinux is preventing /usr/bin/python3.9 from setattr access on the file repomd.xml. For complete SELinux messages run: sealert -l e5f9af40-1f63-4924-b012-27ab2a7b2266
Aug 3 09:12:52 submit26-b9-2 setroubleshoot[939396]: SELinux is preventing /usr/bin/python3.9 from read access on the directory libdnf.2vCnix. For complete SELinux messages run: sealert -l 5c54db87-54a3-4a7c-97b4-b5c48d6c3543
Aug 3 09:12:52 submit26-b9-2 setroubleshoot[939396]: SELinux is preventing /usr/bin/python3.9 from remove_name access on the directory repomd.xml. For complete SELinux messages run: sealert -l 63cd60e1-1e61-4276-afea-dd8526ffe8b2
Aug 3 09:12:52 submit26-b9-2 setroubleshoot[939396]: SELinux is preventing /usr/bin/python3.9 from unlink access on the file repomd.xml. For complete SELinux messages run: sealert -l 81c7e9ec-e023-4c6d-b1ad-c02a242e655e
Aug 3 09:12:52 submit26-b9-2 setroubleshoot[939396]: SELinux is preventing /usr/bin/python3.9 from rmdir access on the directory repodata. For complete SELinux messages run: sealert -l 6ae9a597-e123-4d74-8eec-a8ebe0f5e4d0
== submit26-b9-3 (9 distinct, 9 total) ==
Aug 3 09:20:38 submit26-b9-3 setroubleshoot[802006]: SELinux is preventing /usr/bin/python3.9 from create access on the directory /(null). For complete SELinux messages run: sealert -l 5b912a44-22fd-4560-b201-2a4e289b73f5
Aug 3 09:20:38 submit26-b9-3 setroubleshoot[802006]: SELinux is preventing /usr/bin/python3.9 from add_name access on the directory /(null). For complete SELinux messages run: sealert -l 7f1df1e4-725e-4953-98eb-1079f908f543
Aug 3 09:20:38 submit26-b9-3 setroubleshoot[802006]: SELinux is preventing /usr/bin/python3.9 from create access on the file /(null). For complete SELinux messages run: sealert -l 40b8852a-f77b-44b4-affe-5f11fa33de43
Aug 3 09:20:38 submit26-b9-3 setroubleshoot[802006]: SELinux is preventing /usr/bin/python3.9 from open access on the file /tmp/libdnf.YKupL2/repodata/repomd.xml. For complete SELinux messages run: sealert -l 45a8019e-f6b5-4baa-92c1-862594b40d46
Aug 3 09:20:38 submit26-b9-3 setroubleshoot[802006]: SELinux is preventing /usr/bin/python3.9 from setattr access on the file repomd.xml. For complete SELinux messages run: sealert -l e9f0bfff-7784-4126-baa4-2bb06da56591
Aug 3 09:20:38 submit26-b9-3 setroubleshoot[802006]: SELinux is preventing /usr/bin/python3.9 from read access on the directory libdnf.YKupL2. For complete SELinux messages run: sealert -l 0b17cc3d-cdc6-4fe2-a11f-3892e7c41dc7
Aug 3 09:20:38 submit26-b9-3 setroubleshoot[802006]: SELinux is preventing /usr/bin/python3.9 from remove_name access on the directory repomd.xml. For complete SELinux messages run: sealert -l 10e38c64-b65f-4cdd-901e-4375652d9a42
Aug 3 09:20:38 submit26-b9-3 setroubleshoot[802006]: SELinux is preventing /usr/bin/python3.9 from unlink access on the file repomd.xml. For complete SELinux messages run: sealert -l 7fd9cf72-ef38-48e1-b6aa-b571b26a7b22
Aug 3 09:20:38 submit26-b9-3 setroubleshoot[802006]: SELinux is preventing /usr/bin/python3.9 from rmdir access on the directory repodata. For complete SELinux messages run: sealert -l b9b11116-89bd-4a3c-980c-1d422c5dcee4
== submit26-clnb9 (10 distinct, 13 total) ==
Aug 3 09:31:57 submit26-clnb9 setroubleshoot[1728880]: SELinux is preventing /usr/bin/python3.9 from create access on the directory /(null). For complete SELinux messages run: sealert -l 6783ed2b-5ae4-42b5-975a-4bf50eec4658
Aug 3 09:31:57 submit26-clnb9 setroubleshoot[1728880]: SELinux is preventing /usr/bin/python3.9 from add_name access on the directory /(null). For complete SELinux messages run: sealert -l 9e7fa955-cc30-4804-ac8c-e1779e85946c
Aug 3 09:31:57 submit26-clnb9 setroubleshoot[1728880]: SELinux is preventing /usr/bin/python3.9 from create access on the file /(null). For complete SELinux messages run: sealert -l 69bfa6e3-089c-40ff-9563-fd30787d0774 [x2]
Aug 3 09:31:57 submit26-clnb9 setroubleshoot[1728880]: SELinux is preventing /usr/bin/python3.9 from open access on the file /tmp/libdnf.WFr1zM/repodata/repomd.xml. For complete SELinux messages run: sealert -l 001acdb5-31ef-4e52-b10b-90f467a89ddc
Aug 3 09:31:57 submit26-clnb9 setroubleshoot[1728880]: SELinux is preventing /usr/bin/python3.9 from setattr access on the file repomd.xml. For complete SELinux messages run: sealert -l edacddcf-16ed-4dc3-8d82-7c597d5dee23 [x2]
Aug 3 09:31:57 submit26-clnb9 setroubleshoot[1728880]: SELinux is preventing /usr/bin/python3.9 from read access on the directory libdnf.WFr1zM. For complete SELinux messages run: sealert -l 62b3782e-4730-4488-8178-94dafe9b552c
Aug 3 09:31:57 submit26-clnb9 setroubleshoot[1728880]: SELinux is preventing /usr/bin/python3.9 from remove_name access on the directory repomd.xml. For complete SELinux messages run: sealert -l 81cb3698-78f8-440a-8e3c-e5d1041e6b78
Aug 3 09:31:57 submit26-clnb9 setroubleshoot[1728880]: SELinux is preventing /usr/bin/python3.9 from unlink access on the file repomd.xml. For complete SELinux messages run: sealert -l 792b472a-115c-4799-9805-fc7436f916b9 [x2]
Aug 3 09:31:57 submit26-clnb9 setroubleshoot[1728880]: SELinux is preventing /usr/bin/python3.9 from rmdir access on the directory repodata. For complete SELinux messages run: sealert -l 15c83a86-837b-41e2-b662-b39cd4e361cb
Aug 3 09:31:57 submit26-clnb9 setroubleshoot[1728880]: SELinux is preventing /usr/bin/python3.9 from open access on the file /tmp/libdnf.QPXZvS/repodata/repomd.xml. For complete SELinux messages run: sealert -l 001acdb5-31ef-4e52-b10b-90f467a89ddc
1
0
Command: /usr/local/sbin/syslog-digest.py
Time : 0.5260s
Status : exited 0
Output :
Syslog digest — 2026-08-03 09:05 EDT
Processed 5,146 lines, filtered 4,340 (84%). 806 unknown (106 distinct) from 23 host(s).
== abadi-computer (1 distinct, 1 total) ==
Aug 3 09:00:36 abadi-computer kernel: kauditd_printk_skb: 6 callbacks suppressed
== abuse (1 distinct, 346 total) ==
Aug 3 08:05:06 abuse rsyslogd[21745]: imjournal: open() failed for path: '/var/lib/rsyslog/imjournal.state.tmp': Input/output error [v8.2404.0 try https://www.rsyslog.com/e/2433 ] [x346]
== b0b02.cs.umd.edu (4 distinct, 5 total) ==
Aug 3 08:43:16 b0b02.cs.umd.edu rustdesk[2429031]: cannot open display:
Aug 3 08:47:48 b0b02.cs.umd.edu setroubleshoot[2429896]: SELinux is preventing /usr/bin/python3.9 from getattr access on the file /etc/authselect/nsswitch.conf. For complete SELinux messages run: sealert -l 9a1e2952-3fde-4937-a8ab-f7f59791a458 [x2]
Aug 3 08:47:51 b0b02.cs.umd.edu setroubleshoot[2429896]: SELinux is preventing /usr/bin/python3.9 from read access on the file /etc/authselect/nsswitch.conf. For complete SELinux messages run: sealert -l 97d74423-e027-4cd6-8810-ad80944900b5
Aug 3 08:47:53 b0b02.cs.umd.edu setroubleshoot[2429896]: SELinux is preventing /usr/bin/python3.9 from open access on the file /etc/authselect/nsswitch.conf. For complete SELinux messages run: sealert -l 4f253f6a-62d6-46dd-8eaf-0b4d29df41c6
== bachata (13 distinct, 33 total) ==
Aug 3 08:32:19 bachata setroubleshoot[2386759]: SELinux is preventing /usr/sbin/smbd from getattr access on the lnk_file /fs/junkfood/nelson/ClassRelated. For complete SELinux messages run: sealert -l fcd56e6d-4082-40d2-8d07-7512890e4b51 [x4]
Aug 3 08:32:19 bachata setroubleshoot[2386759]: SELinux is preventing /usr/sbin/smbd from read access on the lnk_file ClassRelated. For complete SELinux messages run: sealert -l 8052e635-6f2f-45b1-a983-55d5d837ba65 [x4]
Aug 3 08:32:19 bachata setroubleshoot[2386759]: SELinux is preventing /usr/sbin/smbd from getattr access on the file /fs/junkfood/nelson/VirtualDesktop/ClassRelated/cmsc216Summer2026/216_SUMMER_2026. For complete SELinux messages run: sealert -l 278fa2f7-7c6d-4613-8831-0c7902342a33 [x2]
Aug 3 08:32:19 bachata setroubleshoot[2386759]: SELinux is preventing /usr/sbin/smbd from read access on the file 216_SUMMER_2026. For complete SELinux messages run: sealert -l a2f5acec-ed56-4193-b84b-9c355ad24121 [x2]
Aug 3 08:35:05 bachata setroubleshoot[2386835]: SELinux is preventing /usr/sbin/smbd from open access on the file /fs/junkfood/nelson/VirtualDesktop/ClassRelated/cmsc216Summer2026/exams/final/FinalExam216Summer2026.pdf. For complete SELinux messages run: sealert -l 8c76b021-2297-4487-85d5-4a594e50093c [x3]
Aug 3 08:35:05 bachata setroubleshoot[2386835]: failed to retrieve rpm info for path '/fs/wwwusers/nelson': [x3]
Aug 3 08:35:05 bachata setroubleshoot[2386835]: SELinux is preventing /usr/libexec/samba/samba-dcerpcd from ioctl access on the directory /fs/wwwusers/nelson. For complete SELinux messages run: sealert -l e6152378-fd71-4efe-8359-f1f27dbb4780 [x3]
Aug 3 08:35:05 bachata setroubleshoot[2386835]: SELinux is preventing /usr/libexec/samba/samba-dcerpcd from read access on the directory /fs/junkfood/nelson/VirtualDesktop/ClassRelated/cmsc216Summer2026/exams/final. For complete SELinux messages run: sealert -l 3c121609-cda8-4152-9925-b75fe7db2d98 [x3]
Aug 3 08:35:06 bachata setroubleshoot[2386835]: SELinux is preventing /usr/sbin/smbd from lock access on the file /fs/junkfood/nelson/VirtualDesktop/ClassRelated/cmsc216Summer2026/exams/final/FinalExam216Summer2026.pdf. For complete SELinux messages run: sealert -l 9436c1bd-99ad-43ff-b349-57e5bcc72374 [x3]
Aug 3 08:37:09 bachata setroubleshoot[2386892]: SELinux is preventing /usr/sbin/smbd from getattr access on the file /fs/junkfood/nelson/.history.16381003. For complete SELinux messages run: sealert -l 278fa2f7-7c6d-4613-8831-0c7902342a33 [x2]
Aug 3 08:37:10 bachata setroubleshoot[2386892]: SELinux is preventing /usr/sbin/smbd from read access on the file .history.16381003. For complete SELinux messages run: sealert -l a2f5acec-ed56-4193-b84b-9c355ad24121 [x2]
Aug 3 08:40:09 bachata setroubleshoot[2387217]: SELinux is preventing /usr/sbin/smbd from getattr access on the file /fs/junkfood/nelson/VirtualDesktop/ClassRelated/cmsc216Summer2026/exams/final/FinalExam216Summer2026.pdf. For complete SELinux messages run: sealert -l 278fa2f7-7c6d-4613-8831-0c7902342a33
Aug 3 08:40:10 bachata setroubleshoot[2387217]: SELinux is preventing /usr/sbin/smbd from read access on the file FinalExam216Summer2026.pdf. For complete SELinux messages run: sealert -l a2f5acec-ed56-4193-b84b-9c355ad24121
== cheezit.cs.umd.edu (6 distinct, 12 total) ==
Aug 3 08:47:13 cheezit.cs.umd.edu sshd-session[584399]: error: kex_protocol_error: type 20 seq 2 [preauth] [x2]
Aug 3 08:47:13 cheezit.cs.umd.edu sshd-session[584399]: error: kex_protocol_error: type 30 seq 3 [preauth] [x2]
Aug 3 08:47:14 cheezit.cs.umd.edu sshd-session[584399]: error: kex_protocol_error: type 20 seq 4 [preauth] [x2]
Aug 3 08:47:14 cheezit.cs.umd.edu sshd-session[584399]: error: kex_protocol_error: type 30 seq 5 [preauth] [x2]
Aug 3 08:47:16 cheezit.cs.umd.edu sshd-session[584399]: error: kex_protocol_error: type 20 seq 6 [preauth] [x2]
Aug 3 08:47:16 cheezit.cs.umd.edu sshd-session[584399]: error: kex_protocol_error: type 30 seq 7 [preauth] [x2]
== contest (1 distinct, 33 total) ==
Aug 3 08:06:38 contest goferd[1007]: [ERROR][worker-0] gofer.messaging.adapter.connect:33 - connect: proton+amqps://satellite8.cs.umd.edu:5647, failed: Connection amqps://satellite8.cs.umd.edu:5647 disconnected: Condition('proton.pythonio', 'Connection refused to all addresses') [x33]
== csfw00a (1 distinct, 206 total) ==
Aug 3 08:04:39 csfw00a kernel: bnxt_en 0000:09:00.0 eth3: NIC Link is Down [x206]
== dojo (1 distinct, 1 total) ==
Aug 3 08:31:00 dojo kernel: kauditd_printk_skb: 1 callbacks suppressed
== emaar (1 distinct, 1 total) ==
Aug 3 08:43:28 emaar puppet-agent[3510925]: (Facter) invalid or malformed lldp data: MalformedDataError: no lldp interface data found
== hackerman (6 distinct, 11 total) ==
Aug 3 08:20:04 hackerman gnome-software[2060381]: can't reliably fixup error code 4 in domain g-io-error-quark: Not a directory [x4]
Aug 3 08:20:12 hackerman gnome-software[2060381]: Only 0 apps for recent list, hiding
Aug 3 08:20:28 hackerman gnome-software[2060381]: failed to commit changes to dconf: GDBus.Error:org.gtk.GDBus.UnmappedGError.Quark._g_2dfile_2derror_2dquark.Code2: Failed to create file “/adminhomes/sajith/.config/dconf/user.CHJQT3”: Permission denied
Aug 3 08:20:29 hackerman packagekitd[3410097]: Failed to get cache filename for libreoffice [x2]
Aug 3 08:20:29 hackerman packagekitd[3410097]: Failed to get cache filename for kernel [x2]
Aug 3 08:20:38 hackerman packagekitd[3410097]: failed to parse public key for /etc/pki/rpm-gpg/RPM-GPG-KEY-PQC-redhat-release
== idm00 (1 distinct, 1 total) ==
Aug 3 08:51:16 idm00 named[1455]: client @0x7f330c44bf28 10.73.240.42#54324: update '73.10.in-addr.arpa/IN' denied
== idmp0 (1 distinct, 1 total) ==
Aug 3 08:36:03 idmp0 named[5198]: client @0x7f99000dfeb8 10.73.240.43#54996: update '73.10.in-addr.arpa/IN' denied
== itmon02 (1 distinct, 39 total) ==
Aug 3 08:08:05 itmon02 sshd[1750555]: error: beginning MaxStartups throttling [x39]
== krispykreme.cs.umd.edu (6 distinct, 12 total) ==
Aug 3 08:47:11 krispykreme.cs.umd.edu sshd-session[2748859]: error: kex_protocol_error: type 20 seq 2 [preauth] [x2]
Aug 3 08:47:11 krispykreme.cs.umd.edu sshd-session[2748859]: error: kex_protocol_error: type 30 seq 3 [preauth] [x2]
Aug 3 08:47:13 krispykreme.cs.umd.edu sshd-session[2748859]: error: kex_protocol_error: type 20 seq 4 [preauth] [x2]
Aug 3 08:47:13 krispykreme.cs.umd.edu sshd-session[2748859]: error: kex_protocol_error: type 30 seq 5 [preauth] [x2]
Aug 3 08:47:15 krispykreme.cs.umd.edu sshd-session[2748859]: error: kex_protocol_error: type 20 seq 6 [preauth] [x2]
Aug 3 08:47:15 krispykreme.cs.umd.edu sshd-session[2748859]: error: kex_protocol_error: type 30 seq 7 [preauth] [x2]
== netman.cs.umd.edu (3 distinct, 3 total) ==
Aug 3 08:30:00 netman.cs.umd.edu setroubleshoot[242502]: SELinux is preventing /usr/bin/gpg from read access on the file gpg.conf. For complete SELinux messages run: sealert -l 019ad1da-a874-4814-8037-3b3e5f413ad2
Aug 3 08:30:01 netman.cs.umd.edu setroubleshoot[242502]: SELinux is preventing /usr/bin/gpg from open access on the file /root/.gnupg/gpg.conf. For complete SELinux messages run: sealert -l cb54177e-d44c-46a1-b246-5c0bbb8343be
Aug 3 08:30:13 netman.cs.umd.edu setroubleshoot[242502]: SELinux is preventing /usr/bin/gpg from getattr access on the file /root/.gnupg/gpg.conf. For complete SELinux messages run: sealert -l fbba2e30-b7ab-491c-9ec6-f553e9ef72af
== newhonors2 (1 distinct, 24 total) ==
Aug 3 08:13:03 newhonors2 dhcpcd[672076]: dhcpcd is not running [x24]
== outbound00.cs.umd.edu (1 distinct, 6 total) ==
Aug 3 08:09:09 outbound00.cs.umd.edu python3[2422160]: ldapdb [x6]
== outbound01.cs.umd.edu (1 distinct, 6 total) ==
Aug 3 08:13:06 outbound01.cs.umd.edu python3[454970]: ldapdb [x6]
== sebatinsky.cs.umd.edu (1 distinct, 1 total) ==
Aug 3 08:27:52 sebatinsky.cs.umd.edu kernel: hpet1: lost 2 rtc interrupts
== sentry-docker00.cs.umd.edu (42 distinct, 42 total) ==
Aug 3 08:19:02 sentry-docker00.cs.umd.edu systemd-udevd[944439]: link_config: could not set ethtool features for vethee1da17
Aug 3 08:19:02 sentry-docker00.cs.umd.edu systemd-udevd[944439]: Could not set offload features of vethee1da17: Operation not permitted
Aug 3 08:19:02 sentry-docker00.cs.umd.edu systemd-udevd[944459]: Could not generate persistent MAC address for veth43be298: No such file or directory
Aug 3 08:19:02 sentry-docker00.cs.umd.edu systemd-udevd[944460]: Could not generate persistent MAC address for veth4f11998: No such file or directory
Aug 3 08:19:02 sentry-docker00.cs.umd.edu systemd-udevd[944478]: Could not generate persistent MAC address for veth851d1c9: No such file or directory
Aug 3 08:19:02 sentry-docker00.cs.umd.edu systemd-udevd[944474]: Could not generate persistent MAC address for veth8d77da2: No such file or directory
Aug 3 08:19:02 sentry-docker00.cs.umd.edu systemd-udevd[944487]: Could not generate persistent MAC address for veth8fb55ba: No such file or directory
Aug 3 08:19:02 sentry-docker00.cs.umd.edu systemd-udevd[944488]: Could not generate persistent MAC address for veth4ac76ec: No such file or directory
Aug 3 08:19:02 sentry-docker00.cs.umd.edu systemd-udevd[944549]: Could not generate persistent MAC address for veth07f50a8: No such file or directory
Aug 3 08:19:02 sentry-docker00.cs.umd.edu systemd-udevd[944559]: Could not generate persistent MAC address for vethd934d78: No such file or directory
Aug 3 08:20:16 sentry-docker00.cs.umd.edu systemd-udevd[945481]: link_config: could not get ethtool features for vetha332353
Aug 3 08:20:16 sentry-docker00.cs.umd.edu systemd-udevd[945481]: Could not set offload features of vetha332353: No such device
Aug 3 08:20:16 sentry-docker00.cs.umd.edu systemd-udevd[945499]: Could not generate persistent MAC address for veth2e56812: No such file or directory
Aug 3 08:20:16 sentry-docker00.cs.umd.edu systemd-udevd[945500]: Could not generate persistent MAC address for vethe03887b: No such file or directory
Aug 3 08:39:10 sentry-docker00.cs.umd.edu systemd-udevd[953877]: link_config: could not get ethtool features for veth43be298
Aug 3 08:39:10 sentry-docker00.cs.umd.edu systemd-udevd[953877]: Could not set offload features of veth43be298: No such device
Aug 3 08:39:11 sentry-docker00.cs.umd.edu systemd-udevd[953900]: Could not generate persistent MAC address for veth39661fb: No such file or directory
Aug 3 08:39:11 sentry-docker00.cs.umd.edu systemd-udevd[953901]: Could not generate persistent MAC address for vethdad563b: No such file or directory
Aug 3 08:39:11 sentry-docker00.cs.umd.edu systemd-udevd[953926]: Could not generate persistent MAC address for veth53f99e9: No such file or directory
Aug 3 08:39:11 sentry-docker00.cs.umd.edu systemd-udevd[953927]: Could not generate persistent MAC address for veth8da50b9: No such file or directory
Aug 3 08:39:11 sentry-docker00.cs.umd.edu systemd-udevd[953952]: Could not generate persistent MAC address for vethfba2580: No such file or directory
Aug 3 08:39:11 sentry-docker00.cs.umd.edu systemd-udevd[953953]: Could not generate persistent MAC address for vethe63312e: No such file or directory
Aug 3 08:39:11 sentry-docker00.cs.umd.edu systemd-udevd[953971]: Could not generate persistent MAC address for veth8f3d8ae: No such file or directory
Aug 3 08:39:11 sentry-docker00.cs.umd.edu systemd-udevd[953976]: Could not generate persistent MAC address for veth2b23f74: No such file or directory
Aug 3 08:40:20 sentry-docker00.cs.umd.edu systemd-udevd[954828]: Could not generate persistent MAC address for vethb423faa: No such file or directory
Aug 3 08:40:20 sentry-docker00.cs.umd.edu systemd-udevd[954829]: Could not generate persistent MAC address for vethd34a136: No such file or directory
Aug 3 08:59:19 sentry-docker00.cs.umd.edu systemd-udevd[964748]: link_config: could not get ethtool features for vethfba2580
Aug 3 08:59:19 sentry-docker00.cs.umd.edu systemd-udevd[964748]: Could not set offload features of vethfba2580: No such device
Aug 3 08:59:19 sentry-docker00.cs.umd.edu systemd-udevd[964859]: link_config: could not get ethtool features for veth53f99e9
Aug 3 08:59:19 sentry-docker00.cs.umd.edu systemd-udevd[964859]: Could not set offload features of veth53f99e9: No such device
... 12 more distinct messages not shown
== smokeping-slave (1 distinct, 1 total) ==
Aug 3 08:58:18 smokeping-slave nologin[650557]: Attempted login by UNKNOWN (UID: 65534) on UNKNOWN
== strawberry (2 distinct, 8 total) ==
Aug 3 08:09:44 strawberry udisksd[1067]: Error performing housekeeping for drive /org/freedesktop/UDisks2/drives/ST2000DM001_1CH164_W1E8J5KJ: Error updating SMART data: Error sending ATA command CHECK POWER MODE: Unexpected sense data returned:#0120000: 00 00 00 00 00 00 00 00 00 00 00 00 00 00 00 00 ................#0120010: 00 00 00 00 00 00 00 00 00 00 00 00 00 00 00 00 ................#012 (g-io-error-quark, 0) [x6]
Aug 3 08:34:42 strawberry smartd[5314]: Device: /dev/sda [SAT], failed to read SMART Attribute Data [x2]
== submit26-b9-4 (10 distinct, 13 total) ==
Aug 3 08:15:28 submit26-b9-4 setroubleshoot[944314]: SELinux is preventing /usr/bin/python3.9 from create access on the directory /(null). For complete SELinux messages run: sealert -l a4e66030-8621-4da9-bd27-5988bb1bf8ad
Aug 3 08:15:28 submit26-b9-4 setroubleshoot[944314]: SELinux is preventing /usr/bin/python3.9 from add_name access on the directory /(null). For complete SELinux messages run: sealert -l c055e37d-bbf5-4800-9083-d606f792c8c1
Aug 3 08:15:28 submit26-b9-4 setroubleshoot[944314]: SELinux is preventing /usr/bin/python3.9 from create access on the file /(null). For complete SELinux messages run: sealert -l e5bc3a56-6d6f-4776-954f-ddde1579648f [x2]
Aug 3 08:15:28 submit26-b9-4 setroubleshoot[944314]: SELinux is preventing /usr/bin/python3.9 from open access on the file /tmp/libdnf.jRgDlg/repodata/repomd.xml. For complete SELinux messages run: sealert -l a8ec5e1b-49f9-4fbc-a8ae-22e800f7abf2
Aug 3 08:15:28 submit26-b9-4 setroubleshoot[944314]: SELinux is preventing /usr/bin/python3.9 from setattr access on the file repomd.xml. For complete SELinux messages run: sealert -l 945db714-d0c0-4402-911e-932978b8b036 [x2]
Aug 3 08:15:29 submit26-b9-4 setroubleshoot[944314]: SELinux is preventing /usr/bin/python3.9 from read access on the directory libdnf.jRgDlg. For complete SELinux messages run: sealert -l 463998a0-fb0d-463c-82b1-471135710a14
Aug 3 08:15:29 submit26-b9-4 setroubleshoot[944314]: SELinux is preventing /usr/bin/python3.9 from remove_name access on the directory repomd.xml. For complete SELinux messages run: sealert -l 473d2e21-15d8-407a-a9ee-2b842607fa00
Aug 3 08:15:29 submit26-b9-4 setroubleshoot[944314]: SELinux is preventing /usr/bin/python3.9 from unlink access on the file repomd.xml. For complete SELinux messages run: sealert -l 80c54d4f-bf4b-4501-addb-1627383587d0 [x2]
Aug 3 08:15:29 submit26-b9-4 setroubleshoot[944314]: SELinux is preventing /usr/bin/python3.9 from rmdir access on the directory repodata. For complete SELinux messages run: sealert -l c63d3890-151e-49a0-83f0-3dfb69d051e5
Aug 3 08:15:29 submit26-b9-4 setroubleshoot[944314]: SELinux is preventing /usr/bin/python3.9 from open access on the file /tmp/libdnf.2b8ohX/repodata/repomd.xml. For complete SELinux messages run: sealert -l a8ec5e1b-49f9-4fbc-a8ae-22e800f7abf2
1
0
Command: /usr/local/sbin/syslog-digest.py
Time : 0.4981s
Status : exited 0
Output :
Syslog digest — 2026-08-03 08:05 EDT
Processed 4,526 lines, filtered 3,702 (81%). 824 unknown (95 distinct) from 23 host(s).
== abadi-computer (1 distinct, 1 total) ==
Aug 3 07:55:02 abadi-computer kernel: kauditd_printk_skb: 9 callbacks suppressed
== abuse (1 distinct, 346 total) ==
Aug 3 07:05:06 abuse rsyslogd[21745]: imjournal: open() failed for path: '/var/lib/rsyslog/imjournal.state.tmp': Input/output error [v8.2404.0 try https://www.rsyslog.com/e/2433 ] [x346]
== b0b02.cs.umd.edu (4 distinct, 5 total) ==
Aug 3 07:43:12 b0b02.cs.umd.edu rustdesk[2413791]: cannot open display:
Aug 3 07:47:43 b0b02.cs.umd.edu setroubleshoot[2414655]: SELinux is preventing /usr/bin/python3.9 from getattr access on the file /etc/authselect/nsswitch.conf. For complete SELinux messages run: sealert -l 9a1e2952-3fde-4937-a8ab-f7f59791a458 [x2]
Aug 3 07:47:46 b0b02.cs.umd.edu setroubleshoot[2414655]: SELinux is preventing /usr/bin/python3.9 from read access on the file /etc/authselect/nsswitch.conf. For complete SELinux messages run: sealert -l 97d74423-e027-4cd6-8810-ad80944900b5
Aug 3 07:47:49 b0b02.cs.umd.edu setroubleshoot[2414655]: SELinux is preventing /usr/bin/python3.9 from open access on the file /etc/authselect/nsswitch.conf. For complete SELinux messages run: sealert -l 4f253f6a-62d6-46dd-8eaf-0b4d29df41c6
== bachata (15 distinct, 16 total) ==
Aug 3 07:32:41 bachata setroubleshoot[2384440]: SELinux is preventing /usr/sbin/smbd from read access on the lnk_file www. For complete SELinux messages run: sealert -l 8052e635-6f2f-45b1-a983-55d5d837ba65 [x2]
Aug 3 07:32:42 bachata setroubleshoot[2384440]: SELinux is preventing /usr/sbin/smbd from getattr access on the file /fs/junkfood/nelson/.history.16381003. For complete SELinux messages run: sealert -l 278fa2f7-7c6d-4613-8831-0c7902342a33
Aug 3 07:32:42 bachata setroubleshoot[2384440]: SELinux is preventing /usr/sbin/smbd from read access on the file .history.16381003. For complete SELinux messages run: sealert -l a2f5acec-ed56-4193-b84b-9c355ad24121
Aug 3 07:32:42 bachata setroubleshoot[2384440]: SELinux is preventing /usr/sbin/smbd from getattr access on the lnk_file /fs/junkfood/nelson/ClassRelated. For complete SELinux messages run: sealert -l fcd56e6d-4082-40d2-8d07-7512890e4b51
Aug 3 07:32:42 bachata setroubleshoot[2384440]: SELinux is preventing /usr/sbin/smbd from read access on the lnk_file ClassRelated. For complete SELinux messages run: sealert -l 8052e635-6f2f-45b1-a983-55d5d837ba65
Aug 3 07:43:04 bachata smbd[2384418]: [2026/08/03 07:43:04.307581, 0] ../../source3/smbd/smb2_service.c:117(chdir_current_service)
Aug 3 07:43:04 bachata smbd[2384418]: chdir_current_service: vfs_ChDir(/fs/junkfood/nelson) failed: Permission denied. Current token: uid=20608, gid=20608, 20 groups: 20608 319050000 25274 319000009 25057 30872 25195 30043 25038 15228 31006 15294 15206 15248 25025 30742 25200 319100011 30871 30736
Aug 3 07:43:04 bachata smbd[2384418]: [2026/08/03 07:43:04.307918, 0] ../../source3/smbd/smbXsrv_tcon.c:914(smbXsrv_tcon_disconnect)
Aug 3 07:43:04 bachata smbd[2384418]: smbXsrv_tcon_disconnect: disconnect(0xf8533bd9, 'nelson'): chdir_current_service() failed: NT_STATUS_INTERNAL_ERROR
Aug 3 07:43:04 bachata smbd[2384418]: [2026/08/03 07:43:04.308018, 0] ../../source3/smbd/smbXsrv_tcon.c:1028(smbXsrv_tcon_disconnect_all)
Aug 3 07:43:04 bachata smbd[2384418]: smbXsrv_tcon_disconnect_all: count[3] errors[1] first[NT_STATUS_INTERNAL_ERROR]
Aug 3 07:43:04 bachata smbd[2384418]: [2026/08/03 07:43:04.308049, 0] ../../source3/smbd/smbXsrv_session.c:1900(smbXsrv_session_logoff)
Aug 3 07:43:04 bachata smbd[2384418]: smbXsrv_session_logoff: smbXsrv_session_logoff(0xa8d5ad61): smb2srv_tcon_disconnect_all() failed: NT_STATUS_INTERNAL_ERROR
Aug 3 07:43:04 bachata smbd[2384418]: [2026/08/03 07:43:04.308098, 0] ../../source3/smbd/smbXsrv_session.c:428(smbXsrv_session_close_shutdown_done)
Aug 3 07:43:04 bachata smbd[2384418]: smbXsrv_session_close_shutdown_done: smbXsrv_session_logoff(2832575841) failed: NT_STATUS_INTERNAL_ERROR
== cheezit.cs.umd.edu (1 distinct, 1 total) ==
Aug 3 08:03:39 cheezit.cs.umd.edu sshd[1653]: error: beginning MaxStartups throttling
== contest (1 distinct, 34 total) ==
Aug 3 07:05:56 contest goferd[1007]: [ERROR][worker-0] gofer.messaging.adapter.connect:33 - connect: proton+amqps://satellite8.cs.umd.edu:5647, failed: Connection amqps://satellite8.cs.umd.edu:5647 disconnected: Condition('proton.pythonio', 'Connection refused to all addresses') [x34]
== csfw00a (1 distinct, 222 total) ==
Aug 3 07:05:58 csfw00a kernel: bnxt_en 0000:09:00.0 eth3: NIC Link is Down [x222]
== dojo (2 distinct, 2 total) ==
Aug 3 07:38:20 dojo nologin[980394]: Attempted login by UNKNOWN (UID: 65534) on UNKNOWN
Aug 3 07:38:32 dojo puppet-agent[980395]: The current total number of fact values: 17067 exceeds the fact values limit: 10240
== hackerman (8 distinct, 13 total) ==
Aug 3 07:15:13 hackerman systemd[1]: insights-client.service: Start request repeated too quickly.
Aug 3 07:19:01 hackerman gnome-software[2060381]: failed to commit changes to dconf: GDBus.Error:org.gtk.GDBus.UnmappedGError.Quark._g_2dfile_2derror_2dquark.Code2: Failed to create file “/adminhomes/sajith/.config/dconf/user.YM6YT3”: Permission denied
Aug 3 07:20:04 hackerman gnome-software[2060381]: can't reliably fixup error code 4 in domain g-io-error-quark: Not a directory [x4]
Aug 3 07:20:12 hackerman gnome-software[2060381]: Only 0 apps for recent list, hiding
Aug 3 07:20:28 hackerman gnome-software[2060381]: failed to commit changes to dconf: GDBus.Error:org.gtk.GDBus.UnmappedGError.Quark._g_2dfile_2derror_2dquark.Code2: Failed to create file “/adminhomes/sajith/.config/dconf/user.GOPHT3”: Permission denied
Aug 3 07:20:28 hackerman packagekitd[3396519]: Failed to get cache filename for libreoffice [x2]
Aug 3 07:20:28 hackerman packagekitd[3396519]: Failed to get cache filename for kernel [x2]
Aug 3 07:20:38 hackerman packagekitd[3396519]: failed to parse public key for /etc/pki/rpm-gpg/RPM-GPG-KEY-PQC-redhat-release
== hazfs.cs.umd.edu (11 distinct, 66 total) ==
Aug 3 07:55:01 hazfs.cs.umd.edu snmpd[1431]: send response: Failure in sendto [x6]
Aug 3 07:55:01 hazfs.cs.umd.edu snmpd[1431]: -- NET-SNMP-EXTEND-MIB::nsExtendStatus."userweb" [x6]
Aug 3 07:55:01 hazfs.cs.umd.edu snmpd[1431]: -- NET-SNMP-EXTEND-MIB::nsExtendStatus."zfslist" [x6]
Aug 3 07:55:01 hazfs.cs.umd.edu snmpd[1431]: -- NET-SNMP-EXTEND-MIB::nsExtendStatus."userhome" [x6]
Aug 3 07:55:01 hazfs.cs.umd.edu snmpd[1431]: -- NET-SNMP-EXTEND-MIB::nsExtendOutput1Line."userweb" [x6]
Aug 3 07:55:01 hazfs.cs.umd.edu snmpd[1431]: -- NET-SNMP-EXTEND-MIB::nsExtendOutput1Line."zfslist" [x6]
Aug 3 07:55:01 hazfs.cs.umd.edu snmpd[1431]: -- NET-SNMP-EXTEND-MIB::nsExtendOutput1Line."userhome" [x6]
Aug 3 07:55:01 hazfs.cs.umd.edu snmpd[1431]: -- NET-SNMP-EXTEND-MIB::nsExtendOutputFull."userweb" [x6]
Aug 3 07:55:01 hazfs.cs.umd.edu snmpd[1431]: -- NET-SNMP-EXTEND-MIB::nsExtendOutputFull."zfslist" [x6]
Aug 3 07:55:01 hazfs.cs.umd.edu snmpd[1431]: -- NET-SNMP-EXTEND-MIB::nsExtendOutputFull."userhome" [x6]
Aug 3 07:55:01 hazfs.cs.umd.edu snmpd[1431]: -- NET-SNMP-EXTEND-MIB::nsExtendOutNumLines."userweb" [x6]
== idm00 (1 distinct, 1 total) ==
Aug 3 07:51:16 idm00 named[1455]: client @0x7f330c3b74e8 10.73.240.42#49352: update '73.10.in-addr.arpa/IN' denied
== idmp0 (1 distinct, 1 total) ==
Aug 3 07:36:02 idmp0 named[5198]: client @0x7f990801f168 10.73.240.43#65100: update '73.10.in-addr.arpa/IN' denied
== irb2156 (3 distinct, 3 total) ==
Aug 3 07:29:28 irb2156 systemd-resolved[3398]: Using degraded feature set UDP instead of UDP+EDNS0 for DNS server 128.8.74.3.
Aug 3 07:29:33 irb2156 systemd-resolved[3398]: Using degraded feature set UDP instead of UDP+EDNS0 for DNS server 128.8.76.3.
Aug 3 07:29:59 irb2156 systemd-resolved[3398]: Using degraded feature set TCP instead of UDP for DNS server 128.8.74.3.
== itmon02 (1 distinct, 29 total) ==
Aug 3 07:07:48 itmon02 sshd[1750555]: error: beginning MaxStartups throttling [x29]
== newhonors2 (1 distinct, 24 total) ==
Aug 3 07:13:03 newhonors2 dhcpcd[670232]: dhcpcd is not running [x24]
== outbound00.cs.umd.edu (1 distinct, 6 total) ==
Aug 3 07:09:09 outbound00.cs.umd.edu python3[2408383]: ldapdb [x6]
== outbound01.cs.umd.edu (1 distinct, 6 total) ==
Aug 3 07:13:06 outbound01.cs.umd.edu python3[441094]: ldapdb [x6]
== peach.cs.umd.edu (2 distinct, 2 total) ==
Aug 3 07:22:11 peach.cs.umd.edu setroubleshoot[703369]: SELinux is preventing /usr/bin/qemu-ga from search access on the directory /var/lib/containers/storage/overlay. For complete SELinux messages run: sealert -l 007f2494-1b82-4ff6-bd59-5f449ab9de99
Aug 3 07:22:11 peach.cs.umd.edu setroubleshoot[703369]: SELinux is preventing /usr/bin/qemu-ga from search access on the directory /var/lib/containers/storage/overlay. For complete SELinux messages run: sealert -l a801d9aa-5cee-4f5c-b9a9-bd22e572596b
== sentry-docker00.cs.umd.edu (34 distinct, 34 total) ==
Aug 3 07:18:38 sentry-docker00.cs.umd.edu systemd-udevd[916047]: Could not generate persistent MAC address for vethe0438f5: No such file or directory
Aug 3 07:18:38 sentry-docker00.cs.umd.edu systemd-udevd[916048]: Could not generate persistent MAC address for veth83b47b5: No such file or directory
Aug 3 07:18:38 sentry-docker00.cs.umd.edu systemd-udevd[916051]: Could not generate persistent MAC address for veth36a5112: No such file or directory
Aug 3 07:18:38 sentry-docker00.cs.umd.edu systemd-udevd[916052]: Could not generate persistent MAC address for veth3072b1d: No such file or directory
Aug 3 07:18:38 sentry-docker00.cs.umd.edu systemd-udevd[916075]: Could not generate persistent MAC address for vethff85f44: No such file or directory
Aug 3 07:18:38 sentry-docker00.cs.umd.edu systemd-udevd[916076]: Could not generate persistent MAC address for veth06785b3: No such file or directory
Aug 3 07:18:38 sentry-docker00.cs.umd.edu systemd-udevd[916091]: Could not generate persistent MAC address for vethafc5d27: No such file or directory
Aug 3 07:18:38 sentry-docker00.cs.umd.edu systemd-udevd[916076]: Could not generate persistent MAC address for veth8fda49a: No such file or directory
Aug 3 07:19:51 sentry-docker00.cs.umd.edu systemd-udevd[916812]: Could not generate persistent MAC address for veth4db4906: No such file or directory
Aug 3 07:19:51 sentry-docker00.cs.umd.edu systemd-udevd[916813]: Could not generate persistent MAC address for vethf329e99: No such file or directory
Aug 3 07:38:46 sentry-docker00.cs.umd.edu systemd-udevd[925515]: link_config: could not get ethtool features for veth36a5112
Aug 3 07:38:46 sentry-docker00.cs.umd.edu systemd-udevd[925515]: Could not set offload features of veth36a5112: No such device
Aug 3 07:38:46 sentry-docker00.cs.umd.edu systemd-udevd[925539]: Could not generate persistent MAC address for veth0085bbc: No such file or directory
Aug 3 07:38:46 sentry-docker00.cs.umd.edu systemd-udevd[925540]: Could not generate persistent MAC address for vethf6c527d: No such file or directory
Aug 3 07:38:46 sentry-docker00.cs.umd.edu systemd-udevd[925543]: Could not generate persistent MAC address for veth8eff2e3: No such file or directory
Aug 3 07:38:46 sentry-docker00.cs.umd.edu systemd-udevd[925544]: Could not generate persistent MAC address for veth3406864: No such file or directory
Aug 3 07:38:46 sentry-docker00.cs.umd.edu systemd-udevd[925557]: Could not generate persistent MAC address for vetha2f10e4: No such file or directory
Aug 3 07:38:46 sentry-docker00.cs.umd.edu systemd-udevd[925556]: Could not generate persistent MAC address for veth76741b6: No such file or directory
Aug 3 07:38:46 sentry-docker00.cs.umd.edu systemd-udevd[925563]: Could not generate persistent MAC address for vetheba3607: No such file or directory
Aug 3 07:38:46 sentry-docker00.cs.umd.edu systemd-udevd[925560]: Could not generate persistent MAC address for veth74e24e0: No such file or directory
Aug 3 07:40:00 sentry-docker00.cs.umd.edu systemd-udevd[926259]: Could not generate persistent MAC address for veth7a0f05f: No such file or directory
Aug 3 07:40:00 sentry-docker00.cs.umd.edu systemd-udevd[926260]: Could not generate persistent MAC address for vetha0b5afc: No such file or directory
Aug 3 07:58:54 sentry-docker00.cs.umd.edu systemd-udevd[934970]: link_config: could not get ethtool features for veth74e24e0
Aug 3 07:58:54 sentry-docker00.cs.umd.edu systemd-udevd[934970]: Could not set offload features of veth74e24e0: No such device
Aug 3 07:58:54 sentry-docker00.cs.umd.edu systemd-udevd[934996]: Could not generate persistent MAC address for veth579dc92: No such file or directory
Aug 3 07:58:54 sentry-docker00.cs.umd.edu systemd-udevd[934997]: Could not generate persistent MAC address for veth57314e0: No such file or directory
Aug 3 07:58:54 sentry-docker00.cs.umd.edu systemd-udevd[935000]: Could not generate persistent MAC address for vethee1da17: No such file or directory
Aug 3 07:58:54 sentry-docker00.cs.umd.edu systemd-udevd[935001]: Could not generate persistent MAC address for vethdd402a9: No such file or directory
Aug 3 07:58:54 sentry-docker00.cs.umd.edu systemd-udevd[935005]: Could not generate persistent MAC address for veth7905707: No such file or directory
Aug 3 07:58:54 sentry-docker00.cs.umd.edu systemd-udevd[935010]: Could not generate persistent MAC address for veth3e5f5f7: No such file or directory
... 4 more distinct messages not shown
== strawberry (2 distinct, 8 total) ==
Aug 3 07:09:44 strawberry udisksd[1067]: Error performing housekeeping for drive /org/freedesktop/UDisks2/drives/ST2000DM001_1CH164_W1E8J5KJ: Error updating SMART data: Error sending ATA command CHECK POWER MODE: Unexpected sense data returned:#0120000: 00 00 00 00 00 00 00 00 00 00 00 00 00 00 00 00 ................#0120010: 00 00 00 00 00 00 00 00 00 00 00 00 00 00 00 00 ................#012 (g-io-error-quark, 0) [x6]
Aug 3 07:34:42 strawberry smartd[5314]: Device: /dev/sda [SAT], failed to read SMART Attribute Data [x2]
== submit10-cln25 (1 distinct, 1 total) ==
Aug 3 07:37:00 submit10-cln25 systemd: Failed at step EXEC spawning /usr/local/bin/cronjob: No such file or directory
== submit26-b9-2 (1 distinct, 1 total) ==
Aug 3 07:10:05 submit26-b9-2 systemd[1]: user(a)1001.service: Main process exited, code=killed, status=9/KILL
== submit26-b9-4 (1 distinct, 2 total) ==
Aug 3 07:08:06 submit26-b9-4 systemd[1]: user(a)1001.service: Main process exited, code=killed, status=9/KILL [x2]
1
0
Command: /usr/local/sbin/syslog-digest.py
Time : 0.5177s
Status : exited 0
Output :
Syslog digest — 2026-08-03 07:05 EDT
Processed 4,541 lines, filtered 3,682 (81%). 859 unknown (115 distinct) from 22 host(s).
== abadi-computer (2 distinct, 2 total) ==
Aug 3 06:15:00 abadi-computer nologin[798872]: Attempted login by UNKNOWN (UID: 65534) on UNKNOWN
Aug 3 06:15:00 abadi-computer pipewire[798870]: mod.jackdbus-detect: Failed to receive jackdbus reply: org.freedesktop.DBus.Error.ServiceUnknown: The name org.jackaudio.service was not provided by any .service files
== abuse (1 distinct, 348 total) ==
Aug 3 06:05:06 abuse rsyslogd[21745]: imjournal: open() failed for path: '/var/lib/rsyslog/imjournal.state.tmp': Input/output error [v8.2404.0 try https://www.rsyslog.com/e/2433 ] [x348]
== b0b02.cs.umd.edu (4 distinct, 5 total) ==
Aug 3 06:43:08 b0b02.cs.umd.edu rustdesk[2397696]: cannot open display:
Aug 3 06:47:39 b0b02.cs.umd.edu setroubleshoot[2398559]: SELinux is preventing /usr/bin/python3.9 from getattr access on the file /etc/authselect/nsswitch.conf. For complete SELinux messages run: sealert -l 9a1e2952-3fde-4937-a8ab-f7f59791a458 [x2]
Aug 3 06:47:42 b0b02.cs.umd.edu setroubleshoot[2398559]: SELinux is preventing /usr/bin/python3.9 from read access on the file /etc/authselect/nsswitch.conf. For complete SELinux messages run: sealert -l 97d74423-e027-4cd6-8810-ad80944900b5
Aug 3 06:47:45 b0b02.cs.umd.edu setroubleshoot[2398559]: SELinux is preventing /usr/bin/python3.9 from open access on the file /etc/authselect/nsswitch.conf. For complete SELinux messages run: sealert -l 4f253f6a-62d6-46dd-8eaf-0b4d29df41c6
== contest (1 distinct, 34 total) ==
Aug 3 06:05:14 contest goferd[1007]: [ERROR][worker-0] gofer.messaging.adapter.connect:33 - connect: proton+amqps://satellite8.cs.umd.edu:5647, failed: Connection amqps://satellite8.cs.umd.edu:5647 disconnected: Condition('proton.pythonio', 'Connection refused to all addresses') [x34]
== csfw00a (1 distinct, 274 total) ==
Aug 3 06:05:01 csfw00a kernel: bnxt_en 0000:09:00.0 eth3: NIC Link is Down [x274]
== hackerman (6 distinct, 11 total) ==
Aug 3 06:20:04 hackerman gnome-software[2060381]: can't reliably fixup error code 4 in domain g-io-error-quark: Not a directory [x4]
Aug 3 06:20:12 hackerman gnome-software[2060381]: Only 0 apps for recent list, hiding
Aug 3 06:20:38 hackerman packagekitd[3382858]: Failed to get cache filename for libreoffice [x2]
Aug 3 06:20:38 hackerman packagekitd[3382858]: Failed to get cache filename for kernel [x2]
Aug 3 06:20:40 hackerman gnome-software[2060381]: failed to commit changes to dconf: GDBus.Error:org.gtk.GDBus.UnmappedGError.Quark._g_2dfile_2derror_2dquark.Code2: Failed to create file “/adminhomes/sajith/.config/dconf/user.G8XQT3”: Permission denied
Aug 3 06:20:44 hackerman packagekitd[3382858]: failed to parse public key for /etc/pki/rpm-gpg/RPM-GPG-KEY-PQC-redhat-release
== idm00 (1 distinct, 1 total) ==
Aug 3 06:51:16 idm00 named[1455]: client @0x7f3304b3d148 10.73.240.42#53500: update '73.10.in-addr.arpa/IN' denied
== idmp0 (1 distinct, 1 total) ==
Aug 3 06:36:02 idmp0 named[5198]: client @0x7f992003f1c8 10.73.240.43#59938: update '73.10.in-addr.arpa/IN' denied
== inbound00.cs.umd.edu (1 distinct, 1 total) ==
Aug 3 06:06:56 inbound00.cs.umd.edu systemd[1]: Configuration file /usr/lib/systemd/system/authentication_milter.service is marked executable. Please remove executable permission bits. Proceeding anyway.
== inbound01.cs.umd.edu (1 distinct, 1 total) ==
Aug 3 06:18:04 inbound01.cs.umd.edu systemd[1]: Configuration file /usr/lib/systemd/system/authentication_milter.service is marked executable. Please remove executable permission bits. Proceeding anyway.
== itmon02 (1 distinct, 30 total) ==
Aug 3 06:07:56 itmon02 sshd[1750555]: error: beginning MaxStartups throttling [x30]
== mcstic (1 distinct, 1 total) ==
Aug 3 06:07:55 mcstic sshd[2048894]: fatal: userauth_pubkey: parse publickey packet: incomplete message [preauth]
== neodontcare.cs.umd.edu (5 distinct, 6 total) ==
Aug 3 06:13:30 neodontcare.cs.umd.edu gnome-software[7556]: Only 0 apps for recent list, hiding
Aug 3 06:13:34 neodontcare.cs.umd.edu packagekitd[1883157]: Failed to get cache filename for gnu-free-mono-fonts
Aug 3 06:13:34 neodontcare.cs.umd.edu packagekitd[1883157]: Failed to get cache filename for gnu-free-serif-fonts
Aug 3 06:13:34 neodontcare.cs.umd.edu packagekitd[1883157]: Failed to get cache filename for libreoffice [x2]
Aug 3 06:13:38 neodontcare.cs.umd.edu packagekitd[1883157]: failed to parse public key for /etc/pki/rpm-gpg/RPM-GPG-KEY-PQC-redhat-release
== newhonors2 (38 distinct, 65 total) ==
Aug 3 06:13:02 newhonors2 dhcpcd[667899]: dhcpcd is not running [x28]
Aug 3 06:48:17 newhonors2 puppet-agent[669178]: Could not update: Execution of '/usr/bin/apt-get -q -y -o DPkg::Options::=--force-confold --force-yes install openvox-agent=8.27.0-1+ubuntu24.04' returned 100: Reading package lists...
Aug 3 06:48:17 newhonors2 puppet-agent[669178]: Building dependency tree...
Aug 3 06:48:17 newhonors2 puppet-agent[669178]: Reading state information...
Aug 3 06:48:17 newhonors2 puppet-agent[669178]: Package openvox-agent is not available, but is referred to by another package.
Aug 3 06:48:17 newhonors2 puppet-agent[669178]: This may mean that the package is missing, has been obsoleted, or
Aug 3 06:48:17 newhonors2 puppet-agent[669178]: is only available from another source
Aug 3 06:48:17 newhonors2 puppet-agent[669178]:
Aug 3 06:48:17 newhonors2 puppet-agent[669178]: W: --force-yes is deprecated, use one of the options starting with --allow instead.
Aug 3 06:48:17 newhonors2 puppet-agent[669178]: E: Version '8.27.0-1+ubuntu24.04' for 'openvox-agent' was not found
Aug 3 06:48:17 newhonors2 puppet-agent[669178]: (/Stage[main]/Puppet::Agent::Install/Package[openvox-agent]/ensure) change from '7.37.2-1+ubuntu24.04' to '8.27.0-1+ubuntu24.04' failed: Could not update: Execution of '/usr/bin/apt-get -q -y -o DPkg::Options::=--force-confold --force-yes install openvox-agent=8.27.0-1+ubuntu24.04' returned 100: Reading package lists...
Aug 3 06:48:17 newhonors2 puppet-agent[669178]: (/Stage[main]/Puppet::Agent::Install/Package[openvox-agent]/ensure) Building dependency tree...
Aug 3 06:48:17 newhonors2 puppet-agent[669178]: (/Stage[main]/Puppet::Agent::Install/Package[openvox-agent]/ensure) Reading state information...
Aug 3 06:48:17 newhonors2 puppet-agent[669178]: (/Stage[main]/Puppet::Agent::Install/Package[openvox-agent]/ensure) Package openvox-agent is not available, but is referred to by another package.
Aug 3 06:48:17 newhonors2 puppet-agent[669178]: (/Stage[main]/Puppet::Agent::Install/Package[openvox-agent]/ensure) This may mean that the package is missing, has been obsoleted, or
Aug 3 06:48:17 newhonors2 puppet-agent[669178]: (/Stage[main]/Puppet::Agent::Install/Package[openvox-agent]/ensure) is only available from another source
Aug 3 06:48:17 newhonors2 puppet-agent[669178]: (/Stage[main]/Puppet::Agent::Install/Package[openvox-agent]/ensure)
Aug 3 06:48:17 newhonors2 puppet-agent[669178]: (/Stage[main]/Puppet::Agent::Install/Package[openvox-agent]/ensure) W: --force-yes is deprecated, use one of the options starting with --allow instead.
Aug 3 06:48:17 newhonors2 puppet-agent[669178]: (/Stage[main]/Puppet::Agent::Install/Package[openvox-agent]/ensure) E: Version '8.27.0-1+ubuntu24.04' for 'openvox-agent' was not found
Aug 3 06:48:41 newhonors2 puppet-agent[669178]: (/Stage[main]/Puppet::Agent::Config/Puppet::Config::Agent[classfile]/Puppet::Config::Entry[agent_classfile]/Concat::Fragment[puppet.conf_agent]/Concat_fragment[puppet.conf_agent]) Skipping because of failed dependencies
Aug 3 06:48:41 newhonors2 puppet-agent[669178]: (/Stage[main]/Puppet::Agent::Config/Puppet::Config::Agent[classfile]/Puppet::Config::Entry[agent_classfile]/Concat::Fragment[puppet.conf_agent_end]/Concat_fragment[puppet.conf_agent_end]) Skipping because of failed dependencies
Aug 3 06:48:41 newhonors2 puppet-agent[669178]: (/Stage[main]/Puppet::Agent::Config/Puppet::Config::Agent[classfile]/Puppet::Config::Entry[agent_classfile]/Concat::Fragment[puppet.conf_agent_classfile]/Concat_fragment[puppet.conf_agent_classfile]) Skipping because of failed dependencies
Aug 3 06:48:41 newhonors2 puppet-agent[669178]: (/Stage[main]/Puppet::Agent::Config/Puppet::Config::Agent[default_schedules]/Puppet::Config::Entry[agent_default_schedules]/Concat::Fragment[puppet.conf_agent_default_schedules]/Concat_fragment[puppet.conf_agent_default_schedules]) Skipping because of failed dependencies
Aug 3 06:48:41 newhonors2 puppet-agent[669178]: (/Stage[main]/Puppet::Agent::Config/Puppet::Config::Agent[report]/Puppet::Config::Entry[agent_report]/Concat::Fragment[puppet.conf_agent_report]/Concat_fragment[puppet.conf_agent_report]) Skipping because of failed dependencies
Aug 3 06:48:41 newhonors2 puppet-agent[669178]: (/Stage[main]/Puppet::Agent::Config/Puppet::Config::Agent[masterport]/Puppet::Config::Entry[agent_masterport]/Concat::Fragment[puppet.conf_agent_masterport]/Concat_fragment[puppet.conf_agent_masterport]) Skipping because of failed dependencies
Aug 3 06:48:41 newhonors2 puppet-agent[669178]: (/Stage[main]/Puppet::Agent::Config/Puppet::Config::Agent[splay]/Puppet::Config::Entry[agent_splay]/Concat::Fragment[puppet.conf_agent_splay]/Concat_fragment[puppet.conf_agent_splay]) Skipping because of failed dependencies
Aug 3 06:48:41 newhonors2 puppet-agent[669178]: (/Stage[main]/Puppet::Agent::Config/Puppet::Config::Agent[splaylimit]/Puppet::Config::Entry[agent_splaylimit]/Concat::Fragment[puppet.conf_agent_splaylimit]/Concat_fragment[puppet.conf_agent_splaylimit]) Skipping because of failed dependencies
Aug 3 06:48:41 newhonors2 puppet-agent[669178]: (/Stage[main]/Puppet::Agent::Config/Puppet::Config::Agent[runinterval]/Puppet::Config::Entry[agent_runinterval]/Concat::Fragment[puppet.conf_agent_runinterval]/Concat_fragment[puppet.conf_agent_runinterval]) Skipping because of failed dependencies
Aug 3 06:48:41 newhonors2 puppet-agent[669178]: (/Stage[main]/Puppet::Agent::Config/Puppet::Config::Agent[noop]/Puppet::Config::Entry[agent_noop]/Concat::Fragment[puppet.conf_agent_noop]/Concat_fragment[puppet.conf_agent_noop]) Skipping because of failed dependencies
Aug 3 06:48:41 newhonors2 puppet-agent[669178]: (/Stage[main]/Puppet::Agent::Config/Puppet::Config::Agent[usecacheonfailure]/Puppet::Config::Entry[agent_usecacheonfailure]/Concat::Fragment[puppet.conf_agent_usecacheonfailure]/Concat_fragment[puppet.conf_agent_usecacheonfailure]) Skipping because of failed dependencies
... 8 more distinct messages not shown
== orchids (4 distinct, 4 total) ==
Aug 3 06:11:31 orchids gnome-software[1516991]: Only 0 apps for recent list, hiding
Aug 3 06:11:31 orchids packagekitd[2261438]: LRO_METALINKURL processing failed: Curl error (42): Operation was aborted by an application callback for https://mirrors.fedoraproject.org/metalink?repo=epel-9&arch=x86_64 [Callback aborted]
Aug 3 06:11:34 orchids packagekitd[2261438]: Failed to get cache filename for libreoffice
Aug 3 06:11:36 orchids packagekitd[2261438]: failed to parse public key for /etc/pki/rpm-gpg/RPM-GPG-KEY-PQC-redhat-release
== outbound00.cs.umd.edu (1 distinct, 6 total) ==
Aug 3 06:09:10 outbound00.cs.umd.edu python3[2394418]: ldapdb [x6]
== outbound01.cs.umd.edu (1 distinct, 6 total) ==
Aug 3 06:13:06 outbound01.cs.umd.edu python3[427270]: ldapdb [x6]
== sentry-docker00.cs.umd.edu (38 distinct, 38 total) ==
Aug 3 06:18:12 sentry-docker00.cs.umd.edu systemd-udevd[887600]: link_config: could not get ethtool features for vethe2eb460
Aug 3 06:18:12 sentry-docker00.cs.umd.edu systemd-udevd[887600]: Could not set offload features of vethe2eb460: No such device
Aug 3 06:18:13 sentry-docker00.cs.umd.edu systemd-udevd[887630]: Could not generate persistent MAC address for veth85c490c: No such file or directory
Aug 3 06:18:13 sentry-docker00.cs.umd.edu systemd-udevd[887631]: Could not generate persistent MAC address for vethb73d944: No such file or directory
Aug 3 06:18:13 sentry-docker00.cs.umd.edu systemd-udevd[887634]: Could not generate persistent MAC address for vethdd03823: No such file or directory
Aug 3 06:18:13 sentry-docker00.cs.umd.edu systemd-udevd[887635]: Could not generate persistent MAC address for veth0dfa138: No such file or directory
Aug 3 06:18:13 sentry-docker00.cs.umd.edu systemd-udevd[887653]: Could not generate persistent MAC address for vethb47c74f: No such file or directory
Aug 3 06:18:13 sentry-docker00.cs.umd.edu systemd-udevd[887642]: Could not generate persistent MAC address for veth1ed07df: No such file or directory
Aug 3 06:18:13 sentry-docker00.cs.umd.edu systemd-udevd[887660]: Could not generate persistent MAC address for veth786caa3: No such file or directory
Aug 3 06:18:13 sentry-docker00.cs.umd.edu systemd-udevd[887661]: Could not generate persistent MAC address for veth12a09c5: No such file or directory
Aug 3 06:19:30 sentry-docker00.cs.umd.edu systemd-udevd[888466]: Could not generate persistent MAC address for veth1cf8750: No such file or directory
Aug 3 06:19:30 sentry-docker00.cs.umd.edu systemd-udevd[888467]: Could not generate persistent MAC address for vethc7e8834: No such file or directory
Aug 3 06:38:20 sentry-docker00.cs.umd.edu systemd-udevd[897048]: link_config: could not get ethtool features for veth85c490c
Aug 3 06:38:20 sentry-docker00.cs.umd.edu systemd-udevd[897048]: Could not set offload features of veth85c490c: No such device
Aug 3 06:38:21 sentry-docker00.cs.umd.edu systemd-udevd[897095]: Could not generate persistent MAC address for vetha57e113: No such file or directory
Aug 3 06:38:21 sentry-docker00.cs.umd.edu systemd-udevd[897096]: Could not generate persistent MAC address for vethbd99207: No such file or directory
Aug 3 06:38:21 sentry-docker00.cs.umd.edu systemd-udevd[897099]: Could not generate persistent MAC address for veth00ac7c7: No such file or directory
Aug 3 06:38:21 sentry-docker00.cs.umd.edu systemd-udevd[897100]: Could not generate persistent MAC address for vethdc0a147: No such file or directory
Aug 3 06:38:21 sentry-docker00.cs.umd.edu systemd-udevd[897123]: Could not generate persistent MAC address for vethb74ed42: No such file or directory
Aug 3 06:38:21 sentry-docker00.cs.umd.edu systemd-udevd[897124]: Could not generate persistent MAC address for vethc203de5: No such file or directory
Aug 3 06:38:21 sentry-docker00.cs.umd.edu systemd-udevd[897127]: Could not generate persistent MAC address for veth0263b32: No such file or directory
Aug 3 06:38:21 sentry-docker00.cs.umd.edu systemd-udevd[897131]: Could not generate persistent MAC address for vethdf56eed: No such file or directory
Aug 3 06:39:39 sentry-docker00.cs.umd.edu systemd-udevd[897882]: Could not generate persistent MAC address for vethaf56c23: No such file or directory
Aug 3 06:39:39 sentry-docker00.cs.umd.edu systemd-udevd[897883]: Could not generate persistent MAC address for veth7760dfc: No such file or directory
Aug 3 06:58:29 sentry-docker00.cs.umd.edu systemd-udevd[906505]: link_config: could not get ethtool features for veth0263b32
Aug 3 06:58:29 sentry-docker00.cs.umd.edu systemd-udevd[906505]: Could not set offload features of veth0263b32: No such device
Aug 3 06:58:29 sentry-docker00.cs.umd.edu systemd-udevd[906584]: link_config: could not get ethtool features for veth00ac7c7
Aug 3 06:58:29 sentry-docker00.cs.umd.edu systemd-udevd[906584]: Could not set offload features of veth00ac7c7: No such device
Aug 3 06:58:29 sentry-docker00.cs.umd.edu systemd-udevd[906604]: Could not generate persistent MAC address for veth01310eb: No such file or directory
Aug 3 06:58:29 sentry-docker00.cs.umd.edu systemd-udevd[906605]: Could not generate persistent MAC address for veth4da11dc: No such file or directory
... 8 more distinct messages not shown
== strawberry (4 distinct, 10 total) ==
Aug 3 06:09:44 strawberry udisksd[1067]: Error performing housekeeping for drive /org/freedesktop/UDisks2/drives/ST2000DM001_1CH164_W1E8J5KJ: Error updating SMART data: Error sending ATA command CHECK POWER MODE: Unexpected sense data returned:#0120000: 00 00 00 00 00 00 00 00 00 00 00 00 00 00 00 00 ................#0120010: 00 00 00 00 00 00 00 00 00 00 00 00 00 00 00 00 ................#012 (g-io-error-quark, 0) [x6]
Aug 3 06:31:04 strawberry nologin[3460034]: Attempted login by UNKNOWN (UID: 65534) on UNKNOWN
Aug 3 06:31:04 strawberry pipewire[3460032]: mod.jackdbus-detect: Failed to receive jackdbus reply: org.freedesktop.DBus.Error.ServiceUnknown: The name org.jackaudio.service was not provided by any .service files
Aug 3 06:34:42 strawberry smartd[5314]: Device: /dev/sda [SAT], failed to read SMART Attribute Data [x2]
== submit26-b9-2 (1 distinct, 7 total) ==
Aug 3 06:17:45 submit26-b9-2 systemd[1]: user(a)1001.service: Main process exited, code=killed, status=9/KILL [x7]
== submit26-b9-4 (1 distinct, 7 total) ==
Aug 3 06:06:00 submit26-b9-4 systemd[1]: user(a)1001.service: Main process exited, code=killed, status=9/KILL [x7]
== tlsrpt (1 distinct, 1 total) ==
Aug 3 06:38:02 tlsrpt (httpd)[607755]: httpd.service: Referenced but unset environment variable evaluates to an empty string: OPTIONS
1
0
Command: /usr/local/sbin/syslog-digest.py
Time : 0.4996s
Status : exited 0
Output :
Syslog digest — 2026-08-03 06:05 EDT
Processed 4,204 lines, filtered 3,402 (80%). 802 unknown (104 distinct) from 22 host(s).
== abuse (1 distinct, 345 total) ==
Aug 3 05:05:06 abuse rsyslogd[21745]: imjournal: open() failed for path: '/var/lib/rsyslog/imjournal.state.tmp': Input/output error [v8.2404.0 try https://www.rsyslog.com/e/2433 ] [x345]
== b0b02.cs.umd.edu (4 distinct, 4 total) ==
Aug 3 05:43:06 b0b02.cs.umd.edu rustdesk[2382630]: cannot open display:
Aug 3 05:47:34 b0b02.cs.umd.edu setroubleshoot[2383488]: SELinux is preventing /usr/bin/python3.9 from getattr access on the file /etc/authselect/nsswitch.conf. For complete SELinux messages run: sealert -l 9a1e2952-3fde-4937-a8ab-f7f59791a458
Aug 3 05:47:37 b0b02.cs.umd.edu setroubleshoot[2383488]: SELinux is preventing /usr/bin/python3.9 from read access on the file /etc/authselect/nsswitch.conf. For complete SELinux messages run: sealert -l 97d74423-e027-4cd6-8810-ad80944900b5
Aug 3 05:47:40 b0b02.cs.umd.edu setroubleshoot[2383488]: SELinux is preventing /usr/bin/python3.9 from open access on the file /etc/authselect/nsswitch.conf. For complete SELinux messages run: sealert -l 4f253f6a-62d6-46dd-8eaf-0b4d29df41c6
== contest (10 distinct, 43 total) ==
Aug 3 05:06:19 contest goferd[1007]: [ERROR][worker-0] gofer.messaging.adapter.connect:33 - connect: proton+amqps://satellite8.cs.umd.edu:5647, failed: Connection amqps://satellite8.cs.umd.edu:5647 disconnected: Condition('proton.pythonio', 'Connection refused to all addresses') [x33]
Aug 3 05:48:17 contest setroubleshoot[545436]: SELinux is preventing /usr/libexec/platform-python3.6 from create access on the directory libdnf.T1eyox. For complete SELinux messages run: sealert -l cb6b25c6-4765-4cf2-88a0-9b3b508e94e9
Aug 3 05:48:17 contest setroubleshoot[545436]: SELinux is preventing /usr/bin/gpgconf from add_name access on the directory repodata. For complete SELinux messages run: sealert -l 41cf7b1b-0f34-4609-98f2-b66e7825fef7
Aug 3 05:48:17 contest setroubleshoot[545436]: SELinux is preventing /usr/libexec/platform-python3.6 from create access on the file mirrorlist. For complete SELinux messages run: sealert -l fc20ff92-ea83-4f38-a24b-ddfd737a3141
Aug 3 05:48:17 contest setroubleshoot[545436]: SELinux is preventing /usr/libexec/platform-python3.6 from setattr access on the file repomd.xml. For complete SELinux messages run: sealert -l ac675631-fa35-4e93-adc9-b692b18e53e5
Aug 3 05:48:17 contest setroubleshoot[545436]: SELinux is preventing /usr/libexec/platform-python3.6 from setattr access on the file repomd.xml.asc. For complete SELinux messages run: sealert -l ac675631-fa35-4e93-adc9-b692b18e53e5
Aug 3 05:48:17 contest setroubleshoot[545436]: SELinux is preventing /usr/libexec/platform-python3.6 from read access on the directory libdnf.T1eyox. For complete SELinux messages run: sealert -l 45d103b6-0810-4890-a705-990118577ce8
Aug 3 05:48:17 contest setroubleshoot[545436]: SELinux is preventing /usr/libexec/platform-python3.6 from remove_name access on the directory repomd.xml. For complete SELinux messages run: sealert -l 7e499113-2fd7-4f67-bec6-3521efbe3637 [x2]
Aug 3 05:48:18 contest setroubleshoot[545436]: SELinux is preventing /usr/libexec/platform-python3.6 from rmdir access on the directory repodata. For complete SELinux messages run: sealert -l 3928930b-a1ed-448d-950b-0665ac2adef8
Aug 3 05:48:19 contest setroubleshoot[545436]: SELinux is preventing /usr/libexec/platform-python3.6 from create access on the file repomd.xml. For complete SELinux messages run: sealert -l fc20ff92-ea83-4f38-a24b-ddfd737a3141
== csfw00a (2 distinct, 240 total) ==
Aug 3 05:04:51 csfw00a kernel: bnxt_en 0000:09:00.0 eth3: NIC Link is Down [x236]
Aug 3 05:49:56 csfw00a ospf6d[1477]: [EC 100663307] Could not send entire message [x4]
== grades01.cs.umd.edu (1 distinct, 1 total) ==
Aug 3 05:49:02 grades01.cs.umd.edu puppet-agent[4036]: The directory '/srv/grades' contains 2471 entries, which exceeds the default soft limit 1000 and may cause excessive resource consumption and degraded performance. To remove this warning set a value for `max_files` parameter or consider using an alternate method to manage large directory trees
== hackerman (1 distinct, 1 total) ==
Aug 3 05:19:01 hackerman gnome-software[2060381]: failed to commit changes to dconf: GDBus.Error:org.gtk.GDBus.UnmappedGError.Quark._g_2dfile_2derror_2dquark.Code2: Failed to create file “/adminhomes/sajith/.config/dconf/user.LPC0T3”: Permission denied
== idm00 (1 distinct, 1 total) ==
Aug 3 05:51:15 idm00 named[1455]: client @0x7f3304251938 10.73.240.42#51218: update '73.10.in-addr.arpa/IN' denied
== idmp0 (1 distinct, 1 total) ==
Aug 3 05:36:02 idmp0 named[5198]: client @0x7f9920001598 10.73.240.43#61013: update '73.10.in-addr.arpa/IN' denied
== itmon02 (1 distinct, 32 total) ==
Aug 3 05:07:55 itmon02 sshd[1750555]: error: beginning MaxStartups throttling [x32]
== newhonors2 (1 distinct, 24 total) ==
Aug 3 05:13:03 newhonors2 dhcpcd[666059]: dhcpcd is not running [x24]
== outbound00.cs.umd.edu (1 distinct, 6 total) ==
Aug 3 05:09:09 outbound00.cs.umd.edu python3[2380623]: ldapdb [x6]
== outbound01.cs.umd.edu (2 distinct, 8 total) ==
Aug 3 05:08:18 outbound01.cs.umd.edu python3[411622]: ldapdb [x7]
Aug 3 05:09:19 outbound01.cs.umd.edu systemd[1]: Configuration file /usr/lib/systemd/system/authentication_milter.service is marked executable. Please remove executable permission bits. Proceeding anyway.
== sentry-docker00.cs.umd.edu (40 distinct, 40 total) ==
Aug 3 05:17:47 sentry-docker00.cs.umd.edu systemd-udevd[858019]: link_config: could not get ethtool features for vethf384c91
Aug 3 05:17:47 sentry-docker00.cs.umd.edu systemd-udevd[858019]: Could not set offload features of vethf384c91: No such device
Aug 3 05:17:48 sentry-docker00.cs.umd.edu systemd-udevd[858109]: Could not generate persistent MAC address for veth73a7cd4: No such file or directory
Aug 3 05:17:48 sentry-docker00.cs.umd.edu systemd-udevd[858110]: Could not generate persistent MAC address for veth805bfcf: No such file or directory
Aug 3 05:17:48 sentry-docker00.cs.umd.edu systemd-udevd[858113]: Could not generate persistent MAC address for vethe03d9cc: No such file or directory
Aug 3 05:17:48 sentry-docker00.cs.umd.edu systemd-udevd[858114]: Could not generate persistent MAC address for veth75abecd: No such file or directory
Aug 3 05:17:48 sentry-docker00.cs.umd.edu systemd-udevd[858134]: Could not generate persistent MAC address for vethd2a8806: No such file or directory
Aug 3 05:17:48 sentry-docker00.cs.umd.edu systemd-udevd[858128]: Could not generate persistent MAC address for veth45b0550: No such file or directory
Aug 3 05:17:48 sentry-docker00.cs.umd.edu systemd-udevd[858191]: Could not generate persistent MAC address for vethe88aade: No such file or directory
Aug 3 05:17:48 sentry-docker00.cs.umd.edu systemd-udevd[858189]: Could not generate persistent MAC address for vethb01b56b: No such file or directory
Aug 3 05:19:05 sentry-docker00.cs.umd.edu systemd-udevd[859918]: Could not generate persistent MAC address for veth4c0328c: No such file or directory
Aug 3 05:19:05 sentry-docker00.cs.umd.edu systemd-udevd[859919]: Could not generate persistent MAC address for veth0b6edfb: No such file or directory
Aug 3 05:37:56 sentry-docker00.cs.umd.edu systemd-udevd[867726]: link_config: could not get ethtool features for vethb01b56b
Aug 3 05:37:56 sentry-docker00.cs.umd.edu systemd-udevd[867726]: Could not set offload features of vethb01b56b: No such device
Aug 3 05:37:56 sentry-docker00.cs.umd.edu systemd-udevd[867745]: Could not generate persistent MAC address for vethec1b813: No such file or directory
Aug 3 05:37:56 sentry-docker00.cs.umd.edu systemd-udevd[867746]: Could not generate persistent MAC address for veth7a25015: No such file or directory
Aug 3 05:37:56 sentry-docker00.cs.umd.edu systemd-udevd[867749]: Could not generate persistent MAC address for veth0354c94: No such file or directory
Aug 3 05:37:56 sentry-docker00.cs.umd.edu systemd-udevd[867750]: Could not generate persistent MAC address for vethc199390: No such file or directory
Aug 3 05:37:56 sentry-docker00.cs.umd.edu systemd-udevd[867759]: Could not generate persistent MAC address for vethe9de4db: No such file or directory
Aug 3 05:37:56 sentry-docker00.cs.umd.edu systemd-udevd[867758]: Could not generate persistent MAC address for veth011cdda: No such file or directory
Aug 3 05:37:56 sentry-docker00.cs.umd.edu systemd-udevd[867758]: Could not generate persistent MAC address for veth67d7e90: No such file or directory
Aug 3 05:37:56 sentry-docker00.cs.umd.edu systemd-udevd[867759]: Could not generate persistent MAC address for veth94a7710: No such file or directory
Aug 3 05:39:13 sentry-docker00.cs.umd.edu systemd-udevd[869511]: link_config: could not get ethtool features for veth4c0328c
Aug 3 05:39:13 sentry-docker00.cs.umd.edu systemd-udevd[869511]: Could not set offload features of veth4c0328c: No such device
Aug 3 05:39:14 sentry-docker00.cs.umd.edu systemd-udevd[869529]: Could not generate persistent MAC address for veth9059161: No such file or directory
Aug 3 05:39:14 sentry-docker00.cs.umd.edu systemd-udevd[869530]: Could not generate persistent MAC address for veth01a03bc: No such file or directory
Aug 3 05:58:04 sentry-docker00.cs.umd.edu systemd-udevd[877179]: link_config: could not get ethtool features for veth0354c94
Aug 3 05:58:04 sentry-docker00.cs.umd.edu systemd-udevd[877179]: Could not set offload features of veth0354c94: No such device
Aug 3 05:58:05 sentry-docker00.cs.umd.edu systemd-udevd[877207]: Could not generate persistent MAC address for vethb7b6bd0: No such file or directory
Aug 3 05:58:05 sentry-docker00.cs.umd.edu systemd-udevd[877208]: Could not generate persistent MAC address for veth9eb6760: No such file or directory
... 10 more distinct messages not shown
== soul (1 distinct, 1 total) ==
Aug 3 05:30:15 soul sshd-session[3328362]: fatal: userauth_pubkey: parse publickey packet: incomplete message [preauth]
== strawberry (2 distinct, 8 total) ==
Aug 3 05:09:44 strawberry udisksd[1067]: Error performing housekeeping for drive /org/freedesktop/UDisks2/drives/ST2000DM001_1CH164_W1E8J5KJ: Error updating SMART data: Error sending ATA command CHECK POWER MODE: Unexpected sense data returned:#0120000: 00 00 00 00 00 00 00 00 00 00 00 00 00 00 00 00 ................#0120010: 00 00 00 00 00 00 00 00 00 00 00 00 00 00 00 00 ................#012 (g-io-error-quark, 0) [x6]
Aug 3 05:34:42 strawberry smartd[5314]: Device: /dev/sda [SAT], failed to read SMART Attribute Data [x2]
== submit26-b9-2 (11 distinct, 14 total) ==
Aug 3 05:12:52 submit26-b9-2 setroubleshoot[926303]: SELinux is preventing /usr/bin/python3.9 from create access on the directory /(null). For complete SELinux messages run: sealert -l d506243c-d61e-48f3-b42a-4592c913deb0
Aug 3 05:12:52 submit26-b9-2 setroubleshoot[926303]: SELinux is preventing /usr/bin/python3.9 from add_name access on the directory /(null). For complete SELinux messages run: sealert -l 3b4752ac-1b9a-4af9-a05b-32e4c2eb13ab
Aug 3 05:12:52 submit26-b9-2 setroubleshoot[926303]: SELinux is preventing /usr/bin/python3.9 from create access on the file /(null). For complete SELinux messages run: sealert -l 29e5adbd-4381-4467-b40d-a2219101e096 [x2]
Aug 3 05:12:52 submit26-b9-2 setroubleshoot[926303]: SELinux is preventing /usr/bin/python3.9 from open access on the file /tmp/libdnf.UgfAci/repodata/repomd.xml. For complete SELinux messages run: sealert -l 1b38f2ec-01ce-4343-8059-ba7494ecc5c4
Aug 3 05:12:52 submit26-b9-2 setroubleshoot[926303]: SELinux is preventing /usr/bin/python3.9 from setattr access on the file repomd.xml. For complete SELinux messages run: sealert -l e5f9af40-1f63-4924-b012-27ab2a7b2266 [x2]
Aug 3 05:12:52 submit26-b9-2 setroubleshoot[926303]: SELinux is preventing /usr/bin/python3.9 from read access on the directory libdnf.UgfAci. For complete SELinux messages run: sealert -l 5c54db87-54a3-4a7c-97b4-b5c48d6c3543
Aug 3 05:12:52 submit26-b9-2 setroubleshoot[926303]: SELinux is preventing /usr/bin/python3.9 from remove_name access on the directory repomd.xml. For complete SELinux messages run: sealert -l 63cd60e1-1e61-4276-afea-dd8526ffe8b2
Aug 3 05:12:52 submit26-b9-2 setroubleshoot[926303]: SELinux is preventing /usr/bin/python3.9 from unlink access on the file repomd.xml. For complete SELinux messages run: sealert -l 81c7e9ec-e023-4c6d-b1ad-c02a242e655e [x2]
Aug 3 05:12:52 submit26-b9-2 setroubleshoot[926303]: SELinux is preventing /usr/bin/python3.9 from rmdir access on the directory repodata. For complete SELinux messages run: sealert -l 6ae9a597-e123-4d74-8eec-a8ebe0f5e4d0
Aug 3 05:12:52 submit26-b9-2 setroubleshoot[926303]: SELinux is preventing /usr/bin/python3.9 from open access on the file /tmp/libdnf.P8AuCh/repodata/repomd.xml. For complete SELinux messages run: sealert -l 1b38f2ec-01ce-4343-8059-ba7494ecc5c4
Aug 3 05:58:07 submit26-b9-2 systemd[1]: user(a)1001.service: Main process exited, code=killed, status=9/KILL
== submit26-b9-3 (9 distinct, 9 total) ==
Aug 3 05:20:38 submit26-b9-3 setroubleshoot[797902]: SELinux is preventing /usr/bin/python3.9 from create access on the directory /(null). For complete SELinux messages run: sealert -l 5b912a44-22fd-4560-b201-2a4e289b73f5
Aug 3 05:20:38 submit26-b9-3 setroubleshoot[797902]: SELinux is preventing /usr/bin/python3.9 from add_name access on the directory /(null). For complete SELinux messages run: sealert -l 7f1df1e4-725e-4953-98eb-1079f908f543
Aug 3 05:20:38 submit26-b9-3 setroubleshoot[797902]: SELinux is preventing /usr/bin/python3.9 from create access on the file /(null). For complete SELinux messages run: sealert -l 40b8852a-f77b-44b4-affe-5f11fa33de43
Aug 3 05:20:38 submit26-b9-3 setroubleshoot[797902]: SELinux is preventing /usr/bin/python3.9 from open access on the file /tmp/libdnf.EX46Du/repodata/repomd.xml. For complete SELinux messages run: sealert -l 45a8019e-f6b5-4baa-92c1-862594b40d46
Aug 3 05:20:38 submit26-b9-3 setroubleshoot[797902]: SELinux is preventing /usr/bin/python3.9 from setattr access on the file repomd.xml. For complete SELinux messages run: sealert -l e9f0bfff-7784-4126-baa4-2bb06da56591
Aug 3 05:20:38 submit26-b9-3 setroubleshoot[797902]: SELinux is preventing /usr/bin/python3.9 from read access on the directory libdnf.EX46Du. For complete SELinux messages run: sealert -l 0b17cc3d-cdc6-4fe2-a11f-3892e7c41dc7
Aug 3 05:20:38 submit26-b9-3 setroubleshoot[797902]: SELinux is preventing /usr/bin/python3.9 from remove_name access on the directory repomd.xml. For complete SELinux messages run: sealert -l 10e38c64-b65f-4cdd-901e-4375652d9a42
Aug 3 05:20:38 submit26-b9-3 setroubleshoot[797902]: SELinux is preventing /usr/bin/python3.9 from unlink access on the file repomd.xml. For complete SELinux messages run: sealert -l 7fd9cf72-ef38-48e1-b6aa-b571b26a7b22
Aug 3 05:20:38 submit26-b9-3 setroubleshoot[797902]: SELinux is preventing /usr/bin/python3.9 from rmdir access on the directory repodata. For complete SELinux messages run: sealert -l b9b11116-89bd-4a3c-980c-1d422c5dcee4
== submit26-b9-4 (1 distinct, 6 total) ==
Aug 3 05:13:05 submit26-b9-4 systemd[1]: user(a)1001.service: Main process exited, code=killed, status=9/KILL [x6]
== submit26-clnb9 (9 distinct, 12 total) ==
Aug 3 05:31:57 submit26-clnb9 setroubleshoot[1720708]: SELinux is preventing /usr/bin/python3.9 from create access on the directory /(null). For complete SELinux messages run: sealert -l 6783ed2b-5ae4-42b5-975a-4bf50eec4658
Aug 3 05:31:57 submit26-clnb9 setroubleshoot[1720708]: SELinux is preventing /usr/bin/python3.9 from add_name access on the directory /(null). For complete SELinux messages run: sealert -l 9e7fa955-cc30-4804-ac8c-e1779e85946c
Aug 3 05:31:57 submit26-clnb9 setroubleshoot[1720708]: SELinux is preventing /usr/bin/python3.9 from create access on the file /(null). For complete SELinux messages run: sealert -l 69bfa6e3-089c-40ff-9563-fd30787d0774 [x2]
Aug 3 05:31:57 submit26-clnb9 setroubleshoot[1720708]: SELinux is preventing /usr/bin/python3.9 from open access on the file /tmp/libdnf.N8gh5J/repodata/repomd.xml. For complete SELinux messages run: sealert -l 001acdb5-31ef-4e52-b10b-90f467a89ddc [x2]
Aug 3 05:31:57 submit26-clnb9 setroubleshoot[1720708]: SELinux is preventing /usr/bin/python3.9 from setattr access on the file repomd.xml. For complete SELinux messages run: sealert -l edacddcf-16ed-4dc3-8d82-7c597d5dee23 [x2]
Aug 3 05:31:57 submit26-clnb9 setroubleshoot[1720708]: SELinux is preventing /usr/bin/python3.9 from read access on the directory libdnf.N8gh5J. For complete SELinux messages run: sealert -l 62b3782e-4730-4488-8178-94dafe9b552c
Aug 3 05:31:57 submit26-clnb9 setroubleshoot[1720708]: SELinux is preventing /usr/bin/python3.9 from remove_name access on the directory repomd.xml. For complete SELinux messages run: sealert -l 81cb3698-78f8-440a-8e3c-e5d1041e6b78
Aug 3 05:31:57 submit26-clnb9 setroubleshoot[1720708]: SELinux is preventing /usr/bin/python3.9 from unlink access on the file repomd.xml. For complete SELinux messages run: sealert -l 792b472a-115c-4799-9805-fc7436f916b9
Aug 3 05:31:57 submit26-clnb9 setroubleshoot[1720708]: SELinux is preventing /usr/bin/python3.9 from rmdir access on the directory repodata. For complete SELinux messages run: sealert -l 15c83a86-837b-41e2-b662-b39cd4e361cb
== talkhosts9 (1 distinct, 2 total) ==
Aug 3 05:07:07 talkhosts9 setroubleshoot[973002]: SELinux is preventing /usr/bin/lsof from getattr access on the unix_stream_socket unix_stream_socket. For complete SELinux messages run: sealert -l a6df89b3-c497-469c-8232-c4fde0508abf [x2]
== teaching-awards (1 distinct, 1 total) ==
Aug 3 05:50:12 teaching-awards krb5_child[1800593]: Preauthentication failed
== updates00.cs.umd.edu (3 distinct, 3 total) ==
Aug 3 05:18:41 updates00.cs.umd.edu puppet-agent[10956]: Could not retrieve catalog from remote server: Error 500 on SERVER: Server Error: Function lookup() did not find a value for the name 'vault::kerberos' on node updates00.cs.umd.edu
Aug 3 05:18:41 updates00.cs.umd.edu puppet-agent[10956]: Not using cache on failed catalog
Aug 3 05:18:41 updates00.cs.umd.edu puppet-agent[10956]: Could not retrieve catalog; skipping run
1
0
Command: /usr/local/sbin/syslog-digest.py
Time : 0.4880s
Status : exited 0
Output :
Syslog digest — 2026-08-03 05:05 EDT
Processed 4,107 lines, filtered 3,328 (81%). 779 unknown (94 distinct) from 22 host(s).
== abadi-computer (2 distinct, 2 total) ==
Aug 3 04:15:00 abadi-computer nologin[788154]: Attempted login by UNKNOWN (UID: 65534) on UNKNOWN
Aug 3 04:15:00 abadi-computer pipewire[788153]: mod.jackdbus-detect: Failed to receive jackdbus reply: org.freedesktop.DBus.Error.ServiceUnknown: The name org.jackaudio.service was not provided by any .service files
== abuse (1 distinct, 347 total) ==
Aug 3 04:05:06 abuse rsyslogd[21745]: imjournal: open() failed for path: '/var/lib/rsyslog/imjournal.state.tmp': Input/output error [v8.2404.0 try https://www.rsyslog.com/e/2433 ] [x347]
== b0b02.cs.umd.edu (4 distinct, 4 total) ==
Aug 3 04:43:02 b0b02.cs.umd.edu rustdesk[2367541]: cannot open display:
Aug 3 04:47:30 b0b02.cs.umd.edu setroubleshoot[2368407]: SELinux is preventing /usr/bin/python3.9 from getattr access on the file /etc/authselect/nsswitch.conf. For complete SELinux messages run: sealert -l 9a1e2952-3fde-4937-a8ab-f7f59791a458
Aug 3 04:47:32 b0b02.cs.umd.edu setroubleshoot[2368407]: SELinux is preventing /usr/bin/python3.9 from read access on the file /etc/authselect/nsswitch.conf. For complete SELinux messages run: sealert -l 97d74423-e027-4cd6-8810-ad80944900b5
Aug 3 04:47:35 b0b02.cs.umd.edu setroubleshoot[2368407]: SELinux is preventing /usr/bin/python3.9 from open access on the file /etc/authselect/nsswitch.conf. For complete SELinux messages run: sealert -l 4f253f6a-62d6-46dd-8eaf-0b4d29df41c6
== contest (1 distinct, 34 total) ==
Aug 3 04:05:37 contest goferd[1007]: [ERROR][worker-0] gofer.messaging.adapter.connect:33 - connect: proton+amqps://satellite8.cs.umd.edu:5647, failed: Connection amqps://satellite8.cs.umd.edu:5647 disconnected: Condition('proton.pythonio', 'Connection refused to all addresses') [x34]
== csfw00a (1 distinct, 218 total) ==
Aug 3 04:04:48 csfw00a kernel: bnxt_en 0000:09:00.0 eth3: NIC Link is Down [x218]
== dojo (1 distinct, 1 total) ==
Aug 3 04:15:10 dojo nologin[967471]: Attempted login by UNKNOWN (UID: 65534) on UNKNOWN
== forge00 (1 distinct, 1 total) ==
Aug 3 04:09:02 forge00 (httpd)[1613922]: httpd.service: Referenced but unset environment variable evaluates to an empty string: OPTIONS
== idm00 (1 distinct, 1 total) ==
Aug 3 04:51:15 idm00 named[1455]: client @0x7f3310552688 10.73.240.42#64153: update '73.10.in-addr.arpa/IN' denied
== idmp0 (1 distinct, 1 total) ==
Aug 3 04:36:01 idmp0 named[5198]: client @0x7f992407d618 10.73.240.43#54495: update '73.10.in-addr.arpa/IN' denied
== itmon02 (1 distinct, 40 total) ==
Aug 3 04:07:59 itmon02 sshd[1750555]: error: beginning MaxStartups throttling [x40]
== matrix (11 distinct, 13 total) ==
Aug 3 04:53:59 matrix systemd[1]: networkd-dispatcher.service: Got notification message from PID 789135, but reception only permitted for main PID 720
Aug 3 04:53:59 matrix systemd[1]: networkd-dispatcher.service: Got notification message from PID 789144, but reception only permitted for main PID 720
Aug 3 04:54:07 matrix systemd[1]: networkd-dispatcher.service: Got notification message from PID 789237, but reception only permitted for main PID 720
Aug 3 04:54:07 matrix systemd[1]: networkd-dispatcher.service: Got notification message from PID 789243, but reception only permitted for main PID 720
Aug 3 04:54:07 matrix networkctl[789257]: Interface "vethedc7728" not found.
Aug 3 04:54:07 matrix systemd[1]: networkd-dispatcher.service: Got notification message from PID 789257, but reception only permitted for main PID 720 [x2]
Aug 3 04:54:08 matrix systemd[1]: networkd-dispatcher.service: Got notification message from PID 789314, but reception only permitted for main PID 720
Aug 3 04:54:08 matrix systemd[1]: networkd-dispatcher.service: Got notification message from PID 789326, but reception only permitted for main PID 720
Aug 3 04:54:17 matrix systemd[1]: networkd-dispatcher.service: Got notification message from PID 789457, but reception only permitted for main PID 720
Aug 3 04:54:17 matrix networkctl[789469]: Interface "veth4258f27" not found.
Aug 3 04:54:17 matrix systemd[1]: networkd-dispatcher.service: Got notification message from PID 789469, but reception only permitted for main PID 720 [x2]
== munin (2 distinct, 4 total) ==
Aug 3 04:28:02 munin sudo[959292]: pam_systemd(sudo:session): Failed to stat() runtime directory '/run/user/0': No such file or directory [x2]
Aug 3 04:28:02 munin sudo[959292]: pam_systemd(sudo:session): Not setting $XDG_RUNTIME_DIR, as the directory is not in order. [x2]
== netman.cs.umd.edu (3 distinct, 3 total) ==
Aug 3 04:30:00 netman.cs.umd.edu setroubleshoot[176461]: SELinux is preventing /usr/bin/gpg from read access on the file gpg.conf. For complete SELinux messages run: sealert -l 019ad1da-a874-4814-8037-3b3e5f413ad2
Aug 3 04:30:01 netman.cs.umd.edu setroubleshoot[176461]: SELinux is preventing /usr/bin/gpg from open access on the file /root/.gnupg/gpg.conf. For complete SELinux messages run: sealert -l cb54177e-d44c-46a1-b246-5c0bbb8343be
Aug 3 04:30:08 netman.cs.umd.edu setroubleshoot[176461]: SELinux is preventing /usr/bin/gpg from getattr access on the file /root/.gnupg/gpg.conf. For complete SELinux messages run: sealert -l fbba2e30-b7ab-491c-9ec6-f553e9ef72af
== newhonors2 (1 distinct, 24 total) ==
Aug 3 04:13:03 newhonors2 dhcpcd[664196]: dhcpcd is not running [x24]
== outbound00.cs.umd.edu (1 distinct, 6 total) ==
Aug 3 04:09:09 outbound00.cs.umd.edu python3[2366723]: ldapdb [x6]
== outbound01.cs.umd.edu (1 distinct, 6 total) ==
Aug 3 04:13:06 outbound01.cs.umd.edu python3[398575]: ldapdb [x6]
== peach.cs.umd.edu (2 distinct, 2 total) ==
Aug 3 04:52:08 peach.cs.umd.edu setroubleshoot[696175]: SELinux is preventing /usr/bin/qemu-ga from search access on the directory /var/lib/containers/storage/overlay. For complete SELinux messages run: sealert -l 007f2494-1b82-4ff6-bd59-5f449ab9de99
Aug 3 04:52:08 peach.cs.umd.edu setroubleshoot[696175]: SELinux is preventing /usr/bin/qemu-ga from search access on the directory /var/lib/containers/storage/overlay. For complete SELinux messages run: sealert -l a801d9aa-5cee-4f5c-b9a9-bd22e572596b
== sentry-docker00.cs.umd.edu (42 distinct, 42 total) ==
Aug 3 04:17:22 sentry-docker00.cs.umd.edu systemd-udevd[829697]: link_config: could not get ethtool features for veth4354b2d
Aug 3 04:17:22 sentry-docker00.cs.umd.edu systemd-udevd[829697]: Could not set offload features of veth4354b2d: No such device
Aug 3 04:17:24 sentry-docker00.cs.umd.edu systemd-udevd[829735]: Could not generate persistent MAC address for veth6e03461: No such file or directory
Aug 3 04:17:24 sentry-docker00.cs.umd.edu systemd-udevd[829736]: Could not generate persistent MAC address for vethaabf4eb: No such file or directory
Aug 3 04:17:24 sentry-docker00.cs.umd.edu systemd-udevd[829740]: Could not generate persistent MAC address for vethe201042: No such file or directory
Aug 3 04:17:24 sentry-docker00.cs.umd.edu systemd-udevd[829739]: Could not generate persistent MAC address for veth43f2fcd: No such file or directory
Aug 3 04:17:24 sentry-docker00.cs.umd.edu systemd-udevd[829756]: Could not generate persistent MAC address for vethdc68836: No such file or directory
Aug 3 04:17:24 sentry-docker00.cs.umd.edu systemd-udevd[829761]: Could not generate persistent MAC address for veth6e0552a: No such file or directory
Aug 3 04:17:24 sentry-docker00.cs.umd.edu systemd-udevd[829765]: Could not generate persistent MAC address for veth89fd46f: No such file or directory
Aug 3 04:17:24 sentry-docker00.cs.umd.edu systemd-udevd[829766]: Could not generate persistent MAC address for veth9c1bbc3: No such file or directory
Aug 3 04:18:40 sentry-docker00.cs.umd.edu systemd-udevd[831542]: link_config: could not get ethtool features for vethbff2086
Aug 3 04:18:40 sentry-docker00.cs.umd.edu systemd-udevd[831542]: Could not set offload features of vethbff2086: No such device
Aug 3 04:18:40 sentry-docker00.cs.umd.edu systemd-udevd[831574]: Could not generate persistent MAC address for veth978aac9: No such file or directory
Aug 3 04:18:40 sentry-docker00.cs.umd.edu systemd-udevd[831575]: Could not generate persistent MAC address for veth11183cf: No such file or directory
Aug 3 04:37:31 sentry-docker00.cs.umd.edu systemd-udevd[839119]: link_config: could not get ethtool features for veth89fd46f
Aug 3 04:37:31 sentry-docker00.cs.umd.edu systemd-udevd[839119]: Could not set offload features of veth89fd46f: No such device
Aug 3 04:37:31 sentry-docker00.cs.umd.edu systemd-udevd[839181]: Could not generate persistent MAC address for vetha5a02d8: No such file or directory
Aug 3 04:37:31 sentry-docker00.cs.umd.edu systemd-udevd[839182]: Could not generate persistent MAC address for vethcf38fa0: No such file or directory
Aug 3 04:37:31 sentry-docker00.cs.umd.edu systemd-udevd[839185]: Could not generate persistent MAC address for veth274fd83: No such file or directory
Aug 3 04:37:31 sentry-docker00.cs.umd.edu systemd-udevd[839186]: Could not generate persistent MAC address for veth01377f9: No such file or directory
Aug 3 04:37:31 sentry-docker00.cs.umd.edu systemd-udevd[839209]: Could not generate persistent MAC address for veth530c2f1: No such file or directory
Aug 3 04:37:31 sentry-docker00.cs.umd.edu systemd-udevd[839210]: Could not generate persistent MAC address for veth6c54b33: No such file or directory
Aug 3 04:37:31 sentry-docker00.cs.umd.edu systemd-udevd[839228]: Could not generate persistent MAC address for veth20c911a: No such file or directory
Aug 3 04:37:31 sentry-docker00.cs.umd.edu systemd-udevd[839210]: Could not generate persistent MAC address for vethf127b6e: No such file or directory
Aug 3 04:38:49 sentry-docker00.cs.umd.edu systemd-udevd[841005]: Could not generate persistent MAC address for veth480ad69: No such file or directory
Aug 3 04:38:49 sentry-docker00.cs.umd.edu systemd-udevd[841006]: Could not generate persistent MAC address for veth5f10a50: No such file or directory
Aug 3 04:57:39 sentry-docker00.cs.umd.edu systemd-udevd[848582]: link_config: could not get ethtool features for veth20c911a
Aug 3 04:57:39 sentry-docker00.cs.umd.edu systemd-udevd[848582]: Could not set offload features of veth20c911a: No such device
Aug 3 04:57:39 sentry-docker00.cs.umd.edu systemd-udevd[848583]: link_config: could not get ethtool features for vetha5a02d8
Aug 3 04:57:39 sentry-docker00.cs.umd.edu systemd-udevd[848583]: Could not set offload features of vetha5a02d8: No such device
... 12 more distinct messages not shown
== smokeping-slave (1 distinct, 1 total) ==
Aug 3 04:15:31 smokeping-slave nologin[627822]: Attempted login by UNKNOWN (UID: 65534) on UNKNOWN
== strawberry (4 distinct, 10 total) ==
Aug 3 04:09:44 strawberry udisksd[1067]: Error performing housekeeping for drive /org/freedesktop/UDisks2/drives/ST2000DM001_1CH164_W1E8J5KJ: Error updating SMART data: Error sending ATA command CHECK POWER MODE: Unexpected sense data returned:#0120000: 00 00 00 00 00 00 00 00 00 00 00 00 00 00 00 00 ................#0120010: 00 00 00 00 00 00 00 00 00 00 00 00 00 00 00 00 ................#012 (g-io-error-quark, 0) [x6]
Aug 3 04:15:04 strawberry nologin[3453213]: Attempted login by UNKNOWN (UID: 65534) on UNKNOWN
Aug 3 04:15:04 strawberry pipewire[3453212]: mod.jackdbus-detect: Failed to receive jackdbus reply: org.freedesktop.DBus.Error.ServiceUnknown: The name org.jackaudio.service was not provided by any .service files
Aug 3 04:34:42 strawberry smartd[5314]: Device: /dev/sda [SAT], failed to read SMART Attribute Data [x2]
== submit26-b9-2 (1 distinct, 2 total) ==
Aug 3 04:05:18 submit26-b9-2 systemd[1]: user(a)1001.service: Main process exited, code=killed, status=9/KILL [x2]
== submit26-b9-4 (11 distinct, 17 total) ==
Aug 3 04:16:12 submit26-b9-4 setroubleshoot[928084]: SELinux is preventing /usr/bin/python3.9 from create access on the directory /(null). For complete SELinux messages run: sealert -l a4e66030-8621-4da9-bd27-5988bb1bf8ad [x2]
Aug 3 04:16:12 submit26-b9-4 setroubleshoot[928084]: SELinux is preventing /usr/bin/python3.9 from add_name access on the directory /(null). For complete SELinux messages run: sealert -l c055e37d-bbf5-4800-9083-d606f792c8c1 [x2]
Aug 3 04:16:12 submit26-b9-4 setroubleshoot[928084]: SELinux is preventing /usr/bin/python3.9 from create access on the file /(null). For complete SELinux messages run: sealert -l e5bc3a56-6d6f-4776-954f-ddde1579648f
Aug 3 04:16:12 submit26-b9-4 setroubleshoot[928084]: SELinux is preventing /usr/bin/python3.9 from open access on the file /tmp/libdnf.3w4m7b/repodata/repomd.xml. For complete SELinux messages run: sealert -l a8ec5e1b-49f9-4fbc-a8ae-22e800f7abf2
Aug 3 04:16:12 submit26-b9-4 setroubleshoot[928084]: SELinux is preventing /usr/bin/python3.9 from setattr access on the file repomd.xml. For complete SELinux messages run: sealert -l 945db714-d0c0-4402-911e-932978b8b036
Aug 3 04:16:12 submit26-b9-4 setroubleshoot[928084]: SELinux is preventing /usr/bin/python3.9 from read access on the directory libdnf.3w4m7b. For complete SELinux messages run: sealert -l 463998a0-fb0d-463c-82b1-471135710a14
Aug 3 04:16:12 submit26-b9-4 setroubleshoot[928084]: SELinux is preventing /usr/bin/python3.9 from remove_name access on the directory repomd.xml. For complete SELinux messages run: sealert -l 473d2e21-15d8-407a-a9ee-2b842607fa00 [x2]
Aug 3 04:16:12 submit26-b9-4 setroubleshoot[928084]: SELinux is preventing /usr/bin/python3.9 from unlink access on the file repomd.xml. For complete SELinux messages run: sealert -l 80c54d4f-bf4b-4501-addb-1627383587d0
Aug 3 04:16:12 submit26-b9-4 setroubleshoot[928084]: SELinux is preventing /usr/bin/python3.9 from rmdir access on the directory repodata. For complete SELinux messages run: sealert -l c63d3890-151e-49a0-83f0-3dfb69d051e5 [x2]
Aug 3 04:16:12 submit26-b9-4 setroubleshoot[928084]: SELinux is preventing /usr/bin/python3.9 from read access on the directory libdnf.hWqpuf. For complete SELinux messages run: sealert -l 463998a0-fb0d-463c-82b1-471135710a14
Aug 3 04:42:50 submit26-b9-4 systemd[1]: user(a)1001.service: Main process exited, code=killed, status=9/KILL [x3]
1
0
Command: /usr/local/sbin/syslog-digest.py
Time : 0.4814s
Status : exited 0
Output :
Syslog digest — 2026-08-03 04:05 EDT
Processed 4,139 lines, filtered 3,368 (81%). 771 unknown (64 distinct) from 20 host(s).
== abuse (1 distinct, 346 total) ==
Aug 3 03:05:06 abuse rsyslogd[21745]: imjournal: open() failed for path: '/var/lib/rsyslog/imjournal.state.tmp': Input/output error [v8.2404.0 try https://www.rsyslog.com/e/2433 ] [x346]
== b0b02.cs.umd.edu (4 distinct, 5 total) ==
Aug 3 03:42:58 b0b02.cs.umd.edu rustdesk[2352194]: cannot open display:
Aug 3 03:47:25 b0b02.cs.umd.edu setroubleshoot[2353054]: SELinux is preventing /usr/bin/python3.9 from getattr access on the file /etc/authselect/nsswitch.conf. For complete SELinux messages run: sealert -l 9a1e2952-3fde-4937-a8ab-f7f59791a458 [x2]
Aug 3 03:47:28 b0b02.cs.umd.edu setroubleshoot[2353054]: SELinux is preventing /usr/bin/python3.9 from read access on the file /etc/authselect/nsswitch.conf. For complete SELinux messages run: sealert -l 97d74423-e027-4cd6-8810-ad80944900b5
Aug 3 03:47:31 b0b02.cs.umd.edu setroubleshoot[2353054]: SELinux is preventing /usr/bin/python3.9 from open access on the file /etc/authselect/nsswitch.conf. For complete SELinux messages run: sealert -l 4f253f6a-62d6-46dd-8eaf-0b4d29df41c6
== contest (1 distinct, 33 total) ==
Aug 3 03:06:42 contest goferd[1007]: [ERROR][worker-0] gofer.messaging.adapter.connect:33 - connect: proton+amqps://satellite8.cs.umd.edu:5647, failed: Connection amqps://satellite8.cs.umd.edu:5647 disconnected: Condition('proton.pythonio', 'Connection refused to all addresses') [x33]
== csfw00a (1 distinct, 250 total) ==
Aug 3 03:04:37 csfw00a kernel: bnxt_en 0000:09:00.0 eth3: NIC Link is Down [x250]
== frabjous (2 distinct, 2 total) ==
Aug 3 03:24:43 frabjous krb5_child[2820835]: Client 'admin(a)UMD.EDU' not found in Kerberos database
Aug 3 03:24:45 frabjous sshd-session[2820831]: error: PAM: Authentication failure for admin from 35.240.20.252
== hackerman (1 distinct, 1 total) ==
Aug 3 03:19:01 hackerman gnome-software[2060381]: failed to commit changes to dconf: GDBus.Error:org.gtk.GDBus.UnmappedGError.Quark._g_2dfile_2derror_2dquark.Code2: Failed to create file “/adminhomes/sajith/.config/dconf/user.NWLGT3”: Permission denied
== idm00 (1 distinct, 1 total) ==
Aug 3 03:51:15 idm00 named[1455]: client @0x7f330c0095e8 10.73.240.42#52794: update '73.10.in-addr.arpa/IN' denied
== idmp0 (1 distinct, 1 total) ==
Aug 3 03:36:01 idmp0 named[5198]: client @0x7f9910009828 10.73.240.43#57097: update '73.10.in-addr.arpa/IN' denied
== itmon02 (2 distinct, 33 total) ==
Aug 3 03:07:52 itmon02 sshd[1750555]: error: beginning MaxStartups throttling [x32]
Aug 3 03:15:03 itmon02 (httpd)[614287]: httpd.service: Referenced but unset environment variable evaluates to an empty string: OPTIONS
== kadath.cs.umd.edu (1 distinct, 1 total) ==
Aug 3 03:47:31 kadath.cs.umd.edu puppet-agent[1604908]: (Facter) invalid or malformed lldp data: MalformedDataError: no lldp interface data found
== neoavion (1 distinct, 1 total) ==
Aug 3 03:34:22 neoavion krb5_child[3177607]: No credentials cache found
== netbox (1 distinct, 1 total) ==
Aug 3 03:08:02 netbox (httpd)[1468642]: httpd.service: Referenced but unset environment variable evaluates to an empty string: OPTIONS
== newhonors2 (1 distinct, 24 total) ==
Aug 3 03:13:03 newhonors2 dhcpcd[662370]: dhcpcd is not running [x24]
== outbound00.cs.umd.edu (2 distinct, 8 total) ==
Aug 3 03:09:09 outbound00.cs.umd.edu python3[2352100]: ldapdb [x7]
Aug 3 03:24:25 outbound00.cs.umd.edu systemd[1]: Configuration file /usr/lib/systemd/system/authentication_milter.service is marked executable. Please remove executable permission bits. Proceeding anyway.
== outbound01.cs.umd.edu (1 distinct, 6 total) ==
Aug 3 03:13:07 outbound01.cs.umd.edu python3[384723]: ldapdb [x6]
== sentry-docker00.cs.umd.edu (38 distinct, 38 total) ==
Aug 3 03:16:57 sentry-docker00.cs.umd.edu systemd-udevd[801305]: link_config: could not get ethtool features for vethe49b80f
Aug 3 03:16:57 sentry-docker00.cs.umd.edu systemd-udevd[801305]: Could not set offload features of vethe49b80f: No such device
Aug 3 03:16:58 sentry-docker00.cs.umd.edu systemd-udevd[801332]: Could not generate persistent MAC address for veth1b3ddd9: No such file or directory
Aug 3 03:16:58 sentry-docker00.cs.umd.edu systemd-udevd[801333]: Could not generate persistent MAC address for vethbd0614d: No such file or directory
Aug 3 03:16:58 sentry-docker00.cs.umd.edu systemd-udevd[801336]: Could not generate persistent MAC address for veth03a2ba6: No such file or directory
Aug 3 03:16:58 sentry-docker00.cs.umd.edu systemd-udevd[801346]: Could not generate persistent MAC address for vethe7595c3: No such file or directory
Aug 3 03:16:58 sentry-docker00.cs.umd.edu systemd-udevd[801358]: Could not generate persistent MAC address for vethd9ce233: No such file or directory
Aug 3 03:16:58 sentry-docker00.cs.umd.edu systemd-udevd[801350]: Could not generate persistent MAC address for vetha37d8f9: No such file or directory
Aug 3 03:16:58 sentry-docker00.cs.umd.edu systemd-udevd[801350]: Could not generate persistent MAC address for vethb9aa039: No such file or directory
Aug 3 03:16:58 sentry-docker00.cs.umd.edu systemd-udevd[801354]: Could not generate persistent MAC address for veth3852930: No such file or directory
Aug 3 03:18:15 sentry-docker00.cs.umd.edu systemd-udevd[803056]: link_config: could not get ethtool features for veth56f1a5a
Aug 3 03:18:15 sentry-docker00.cs.umd.edu systemd-udevd[803056]: Could not set offload features of veth56f1a5a: No such device
Aug 3 03:18:16 sentry-docker00.cs.umd.edu systemd-udevd[803090]: Could not generate persistent MAC address for vethfd54b7d: No such file or directory
Aug 3 03:18:16 sentry-docker00.cs.umd.edu systemd-udevd[803089]: Could not generate persistent MAC address for vethd12306c: No such file or directory
Aug 3 03:37:06 sentry-docker00.cs.umd.edu systemd-udevd[810754]: Could not generate persistent MAC address for vethe6265c6: No such file or directory
Aug 3 03:37:06 sentry-docker00.cs.umd.edu systemd-udevd[810755]: Could not generate persistent MAC address for vetha2dec5a: No such file or directory
Aug 3 03:37:06 sentry-docker00.cs.umd.edu systemd-udevd[810758]: Could not generate persistent MAC address for vethf683cd1: No such file or directory
Aug 3 03:37:06 sentry-docker00.cs.umd.edu systemd-udevd[810754]: Could not generate persistent MAC address for veth12d8c5f: No such file or directory
Aug 3 03:37:06 sentry-docker00.cs.umd.edu systemd-udevd[810772]: Could not generate persistent MAC address for veth1b92b78: No such file or directory
Aug 3 03:37:06 sentry-docker00.cs.umd.edu systemd-udevd[810778]: Could not generate persistent MAC address for veth525f658: No such file or directory
Aug 3 03:37:06 sentry-docker00.cs.umd.edu systemd-udevd[810755]: Could not generate persistent MAC address for veth2fc6849: No such file or directory
Aug 3 03:37:06 sentry-docker00.cs.umd.edu systemd-udevd[810769]: Could not generate persistent MAC address for veth91c8c85: No such file or directory
Aug 3 03:38:23 sentry-docker00.cs.umd.edu systemd-udevd[812482]: link_config: could not get ethtool features for vethd12306c
Aug 3 03:38:23 sentry-docker00.cs.umd.edu systemd-udevd[812482]: Could not set offload features of vethd12306c: No such device
Aug 3 03:38:24 sentry-docker00.cs.umd.edu systemd-udevd[812498]: Could not generate persistent MAC address for veth2c0fd63: No such file or directory
Aug 3 03:38:24 sentry-docker00.cs.umd.edu systemd-udevd[812499]: Could not generate persistent MAC address for veth45093fa: No such file or directory
Aug 3 03:57:14 sentry-docker00.cs.umd.edu systemd-udevd[820131]: link_config: could not get ethtool features for veth2fc6849
Aug 3 03:57:14 sentry-docker00.cs.umd.edu systemd-udevd[820131]: Could not set offload features of veth2fc6849: No such device
Aug 3 03:57:14 sentry-docker00.cs.umd.edu systemd-udevd[820161]: Could not generate persistent MAC address for veth4365e0d: No such file or directory
Aug 3 03:57:14 sentry-docker00.cs.umd.edu systemd-udevd[820162]: Could not generate persistent MAC address for vethadbd741: No such file or directory
... 8 more distinct messages not shown
== strawberry (2 distinct, 8 total) ==
Aug 3 03:09:44 strawberry udisksd[1067]: Error performing housekeeping for drive /org/freedesktop/UDisks2/drives/ST2000DM001_1CH164_W1E8J5KJ: Error updating SMART data: Error sending ATA command CHECK POWER MODE: Unexpected sense data returned:#0120000: 00 00 00 00 00 00 00 00 00 00 00 00 00 00 00 00 ................#0120010: 00 00 00 00 00 00 00 00 00 00 00 00 00 00 00 00 ................#012 (g-io-error-quark, 0) [x6]
Aug 3 03:34:42 strawberry smartd[5314]: Device: /dev/sda [SAT], failed to read SMART Attribute Data [x2]
== submit26-b9-2 (1 distinct, 2 total) ==
Aug 3 03:55:06 submit26-b9-2 systemd[1]: user(a)1001.service: Main process exited, code=killed, status=9/KILL [x2]
== submit26-b9-4 (1 distinct, 9 total) ==
Aug 3 03:13:05 submit26-b9-4 systemd[1]: user(a)1001.service: Main process exited, code=killed, status=9/KILL [x9]
== zfs00.cs.umd.edu (1 distinct, 1 total) ==
Aug 3 03:28:01 zfs00.cs.umd.edu kernel: kauditd_printk_skb: 9 callbacks suppressed
1
0