Command: /usr/local/sbin/syslog-digest.py
Time : 0.5061s
Status : exited 0
Output :
Syslog digest — 2026-08-04 09:05 EDT
Processed 4,257 lines, filtered 3,373 (79%). 884 unknown (129 distinct) from 28 host(s).
== abadi-computer (4 distinct, 5 total) ==
Aug 4 08:48:25 abadi-computer kernel: kauditd_printk_skb: 13 callbacks suppressed
Aug 4 08:48:26 abadi-computer krb5_child[942086]: Preauthentication failed [x2]
Aug 4 08:48:29 abadi-computer sshd[942066]: error: PAM: Authentication failure for poojan from 10.206.33.124
Aug 4 09:00:36 abadi-computer kernel: kauditd_printk_skb: 4 callbacks suppressed
== abuse (1 distinct, 346 total) ==
Aug 4 08:05:06 abuse rsyslogd[21745]: imjournal: open() failed for path: '/var/lib/rsyslog/imjournal.state.tmp': Input/output error [v8.2404.0 try https://www.rsyslog.com/e/2433 ] [x346]
== amoeba (3 distinct, 3 total) ==
Aug 4 08:05:36 amoeba sshd-session[1453856]: error: Received disconnect from 128.8.236.70 port 45068:3: com.jcraft.jsch.JSchException: Auth fail for methods 'publickey,gssapi-keyex,gssapi-with-mic,password' [preauth]
Aug 4 08:05:36 amoeba sshd-session[1453860]: error: Received disconnect from 128.8.236.70 port 45098:3: com.jcraft.jsch.JSchException: Auth fail for methods 'publickey,gssapi-keyex,gssapi-with-mic,password' [preauth]
Aug 4 08:05:38 amoeba sshd-session[1453863]: error: Received disconnect from 128.8.236.70 port 45100:3: com.jcraft.jsch.JSchException: Auth fail for methods 'publickey,gssapi-keyex,gssapi-with-mic,password' [preauth]
== b0b02.cs.umd.edu (2 distinct, 2 total) ==
Aug 4 08:39:07 b0b02.cs.umd.edu systemd[1]: insights-client.service: Start request repeated too quickly.
Aug 4 08:44:48 b0b02.cs.umd.edu rustdesk[2793918]: cannot open display:
== biggulp.cs.umd.edu (8 distinct, 8 total) ==
Aug 4 08:15:16 biggulp.cs.umd.edu sshd-session[2826808]: pam_access(sshd:auth): access denied for user `root' from `45.154.244.193'
Aug 4 08:15:17 biggulp.cs.umd.edu sshd-session[2826806]: error: PAM: Authentication failure for root from 45.154.244.193
Aug 4 08:20:01 biggulp.cs.umd.edu sshd-session[2827471]: error: kex_protocol_error: type 20 seq 2 [preauth]
Aug 4 08:20:01 biggulp.cs.umd.edu sshd-session[2827471]: error: kex_protocol_error: type 30 seq 3 [preauth]
Aug 4 08:20:02 biggulp.cs.umd.edu sshd-session[2827471]: error: kex_protocol_error: type 20 seq 4 [preauth]
Aug 4 08:20:02 biggulp.cs.umd.edu sshd-session[2827471]: error: kex_protocol_error: type 30 seq 5 [preauth]
Aug 4 08:20:04 biggulp.cs.umd.edu sshd-session[2827471]: error: kex_protocol_error: type 20 seq 6 [preauth]
Aug 4 08:20:04 biggulp.cs.umd.edu sshd-session[2827471]: error: kex_protocol_error: type 30 seq 7 [preauth]
== cheezit.cs.umd.edu (6 distinct, 6 total) ==
Aug 4 08:09:10 cheezit.cs.umd.edu sshd-session[927348]: error: kex_protocol_error: type 20 seq 2 [preauth]
Aug 4 08:09:10 cheezit.cs.umd.edu sshd-session[927348]: error: kex_protocol_error: type 30 seq 3 [preauth]
Aug 4 08:09:11 cheezit.cs.umd.edu sshd-session[927348]: error: kex_protocol_error: type 20 seq 4 [preauth]
Aug 4 08:09:11 cheezit.cs.umd.edu sshd-session[927348]: error: kex_protocol_error: type 30 seq 5 [preauth]
Aug 4 08:09:13 cheezit.cs.umd.edu sshd-session[927348]: error: kex_protocol_error: type 20 seq 6 [preauth]
Aug 4 08:09:13 cheezit.cs.umd.edu sshd-session[927348]: error: kex_protocol_error: type 30 seq 7 [preauth]
== contest (1 distinct, 34 total) ==
Aug 4 08:05:33 contest goferd[1007]: [ERROR][worker-0] gofer.messaging.adapter.connect:33 - connect: proton+amqps://satellite8.cs.umd.edu:5647, failed: Connection amqps://satellite8.cs.umd.edu:5647 disconnected: Condition('proton.pythonio', 'Connection refused to all addresses') [x34]
== csfw00a (2 distinct, 268 total) ==
Aug 4 08:05:25 csfw00a kernel: bnxt_en 0000:09:00.0 eth3: NIC Link is Down [x264]
Aug 4 08:23:18 csfw00a ospf6d[1477]: [EC 100663307] Could not send entire message [x4]
== emaar (2 distinct, 2 total) ==
Aug 4 08:31:32 emaar systemd[1]: insights-client.service: Start request repeated too quickly.
Aug 4 08:43:28 emaar puppet-agent[3916828]: (Facter) invalid or malformed lldp data: MalformedDataError: no lldp interface data found
== galahad.cs.umd.edu (1 distinct, 1 total) ==
Aug 4 08:05:31 galahad.cs.umd.edu sshd-session[2195660]: error: Received disconnect from 128.8.236.70 port 46380:3: com.jcraft.jsch.JSchException: Auth fail for methods 'publickey,gssapi-keyex,gssapi-with-mic,password,keyboard-interactive' [preauth]
== hackerman (6 distinct, 11 total) ==
Aug 4 08:20:04 hackerman gnome-software[2060381]: can't reliably fixup error code 4 in domain g-io-error-quark: Not a directory [x4]
Aug 4 08:20:12 hackerman gnome-software[2060381]: Only 0 apps for recent list, hiding
Aug 4 08:20:29 hackerman gnome-software[2060381]: failed to commit changes to dconf: GDBus.Error:org.gtk.GDBus.UnmappedGError.Quark._g_2dfile_2derror_2dquark.Code2: Failed to create file “/adminhomes/sajith/.config/dconf/user.N92KT3”: Permission denied
Aug 4 08:20:29 hackerman packagekitd[3744395]: Failed to get cache filename for libreoffice [x2]
Aug 4 08:20:29 hackerman packagekitd[3744395]: Failed to get cache filename for kernel [x2]
Aug 4 08:20:39 hackerman packagekitd[3744395]: failed to parse public key for /etc/pki/rpm-gpg/RPM-GPG-KEY-PQC-redhat-release
== idm00 (1 distinct, 1 total) ==
Aug 4 08:51:17 idm00 named[1455]: client @0x7f3315b04908 10.73.240.42#64107: update '73.10.in-addr.arpa/IN' denied
== idmp0 (1 distinct, 1 total) ==
Aug 4 08:36:03 idmp0 named[5198]: client @0x7f9904001258 10.73.240.43#64898: update '73.10.in-addr.arpa/IN' denied
== irb2156 (1 distinct, 1 total) ==
Aug 4 08:36:12 irb2156 sshd-session[718242]: error: Certificate does not contain an authorized principal
== itmon02 (1 distinct, 47 total) ==
Aug 4 08:08:00 itmon02 sshd[1750555]: error: beginning MaxStartups throttling [x47]
== krispykreme.cs.umd.edu (6 distinct, 6 total) ==
Aug 4 08:15:27 krispykreme.cs.umd.edu sshd-session[3143460]: error: kex_protocol_error: type 20 seq 2 [preauth]
Aug 4 08:15:27 krispykreme.cs.umd.edu sshd-session[3143460]: error: kex_protocol_error: type 30 seq 3 [preauth]
Aug 4 08:15:28 krispykreme.cs.umd.edu sshd-session[3143460]: error: kex_protocol_error: type 20 seq 4 [preauth]
Aug 4 08:15:28 krispykreme.cs.umd.edu sshd-session[3143460]: error: kex_protocol_error: type 30 seq 5 [preauth]
Aug 4 08:15:30 krispykreme.cs.umd.edu sshd-session[3143460]: error: kex_protocol_error: type 20 seq 6 [preauth]
Aug 4 08:15:30 krispykreme.cs.umd.edu sshd-session[3143460]: error: kex_protocol_error: type 30 seq 7 [preauth]
== neoavion (20 distinct, 25 total) ==
Aug 4 08:05:44 neoavion sshd[3397388]: error: Received disconnect from 128.8.236.70 port 51168:3: com.jcraft.jsch.JSchException: Auth fail for methods 'publickey,gssapi-keyex,gssapi-with-mic,password,keyboard-interactive' [preauth]
Aug 4 08:05:47 neoavion sshd[3397391]: error: Received disconnect from 128.8.236.70 port 51196:3: com.jcraft.jsch.JSchException: Auth fail for methods 'publickey,gssapi-keyex,gssapi-with-mic,password,keyboard-interactive' [preauth]
Aug 4 08:05:49 neoavion sshd[3397397]: error: Received disconnect from 128.8.236.70 port 51224:3: com.jcraft.jsch.JSchException: Auth fail for methods 'publickey,gssapi-keyex,gssapi-with-mic,password,keyboard-interactive' [preauth]
Aug 4 08:05:51 neoavion sshd[3397400]: error: Received disconnect from 128.8.236.70 port 51262:3: com.jcraft.jsch.JSchException: Auth fail for methods 'publickey,gssapi-keyex,gssapi-with-mic,password,keyboard-interactive' [preauth]
Aug 4 08:05:51 neoavion sshd[3397403]: error: Received disconnect from 128.8.236.70 port 51282:3: com.jcraft.jsch.JSchException: Auth fail for methods 'publickey,gssapi-keyex,gssapi-with-mic,password,keyboard-interactive' [preauth]
Aug 4 08:05:56 neoavion sshd[3397406]: error: Received disconnect from 128.8.236.70 port 51286:3: com.jcraft.jsch.JSchException: Auth fail for methods 'publickey,gssapi-keyex,gssapi-with-mic,password,keyboard-interactive' [preauth]
Aug 4 08:06:00 neoavion sshd[3397409]: error: Received disconnect from 128.8.236.70 port 51352:3: com.jcraft.jsch.JSchException: Auth fail for methods 'publickey,gssapi-keyex,gssapi-with-mic,password,keyboard-interactive' [preauth]
Aug 4 08:06:02 neoavion sshd[3397412]: error: Received disconnect from 128.8.236.70 port 51414:3: com.jcraft.jsch.JSchException: Auth fail for methods 'publickey,gssapi-keyex,gssapi-with-mic,password,keyboard-interactive' [preauth]
Aug 4 08:06:05 neoavion sshd[3397415]: error: Received disconnect from 128.8.236.70 port 51446:3: com.jcraft.jsch.JSchException: Auth fail for methods 'publickey,gssapi-keyex,gssapi-with-mic,password,keyboard-interactive' [preauth]
Aug 4 08:06:06 neoavion krb5_child[3397420]: Client 'admin(a)UMD.EDU' not found in Kerberos database [x6]
Aug 4 08:06:10 neoavion sshd[3397418]: error: Received disconnect from 128.8.236.70 port 51496:3: com.jcraft.jsch.JSchException: Auth fail for methods 'publickey,gssapi-keyex,gssapi-with-mic,password,keyboard-interactive' [preauth]
Aug 4 08:06:12 neoavion sshd[3397425]: error: Received disconnect from 128.8.236.70 port 51562:3: com.jcraft.jsch.JSchException: Auth fail for methods 'publickey,gssapi-keyex,gssapi-with-mic,password,keyboard-interactive' [preauth]
Aug 4 08:06:14 neoavion sshd[3397428]: error: Received disconnect from 128.8.236.70 port 51582:3: com.jcraft.jsch.JSchException: Auth fail for methods 'publickey,gssapi-keyex,gssapi-with-mic,password,keyboard-interactive' [preauth]
Aug 4 08:06:18 neoavion sshd[3397431]: error: Received disconnect from 128.8.236.70 port 51608:3: com.jcraft.jsch.JSchException: Auth fail for methods 'publickey,gssapi-keyex,gssapi-with-mic,password,keyboard-interactive' [preauth]
Aug 4 08:06:22 neoavion sshd[3397448]: error: Received disconnect from 128.8.236.70 port 51682:3: com.jcraft.jsch.JSchException: Auth fail for methods 'publickey,gssapi-keyex,gssapi-with-mic,password,keyboard-interactive' [preauth]
Aug 4 08:06:24 neoavion sshd[3397451]: error: Received disconnect from 128.8.236.70 port 51730:3: com.jcraft.jsch.JSchException: Auth fail for methods 'publickey,gssapi-keyex,gssapi-with-mic,password,keyboard-interactive' [preauth]
Aug 4 08:06:26 neoavion sshd[3397455]: error: Received disconnect from 128.8.236.70 port 51770:3: com.jcraft.jsch.JSchException: Auth fail for methods 'publickey,gssapi-keyex,gssapi-with-mic,password,keyboard-interactive' [preauth]
Aug 4 08:06:31 neoavion sshd[3397458]: error: Received disconnect from 128.8.236.70 port 51794:3: com.jcraft.jsch.JSchException: Auth fail for methods 'publickey,gssapi-keyex,gssapi-with-mic,password,keyboard-interactive' [preauth]
Aug 4 08:06:35 neoavion sshd[3397462]: error: Received disconnect from 128.8.236.70 port 51816:3: com.jcraft.jsch.JSchException: Auth fail for methods 'publickey,gssapi-keyex,gssapi-with-mic,password,keyboard-interactive' [preauth]
Aug 4 08:06:35 neoavion sshd[3397465]: error: Received disconnect from 128.8.236.70 port 51828:3: com.jcraft.jsch.JSchException: Auth fail for methods 'publickey,gssapi-keyex,gssapi-with-mic,password,keyboard-interactive' [preauth]
== neodontcare.cs.umd.edu (3 distinct, 3 total) ==
Aug 4 08:05:57 neodontcare.cs.umd.edu sshd-session[2205831]: error: Received disconnect from 128.8.236.70 port 47898:3: com.jcraft.jsch.JSchException: Auth fail for methods 'publickey,gssapi-keyex,gssapi-with-mic,password' [preauth]
Aug 4 08:05:57 neodontcare.cs.umd.edu sshd-session[2205851]: error: Received disconnect from 128.8.236.70 port 47958:3: com.jcraft.jsch.JSchException: Auth fail for methods 'publickey,gssapi-keyex,gssapi-with-mic,password' [preauth]
Aug 4 08:05:59 neodontcare.cs.umd.edu sshd-session[2205854]: error: Received disconnect from 128.8.236.70 port 47962:3: com.jcraft.jsch.JSchException: Auth fail for methods 'publickey,gssapi-keyex,gssapi-with-mic,password' [preauth]
== netman.cs.umd.edu (5 distinct, 8 total) ==
Aug 4 08:28:33 netman.cs.umd.edu sshd[642572]: error: PAM: Authentication failure for root from 106.89.60.76
Aug 4 08:30:00 netman.cs.umd.edu setroubleshoot[642854]: SELinux is preventing /usr/bin/gpg from read access on the file gpg.conf. For complete SELinux messages run: sealert -l 019ad1da-a874-4814-8037-3b3e5f413ad2 [x2]
Aug 4 08:30:00 netman.cs.umd.edu setroubleshoot[642854]: SELinux is preventing /usr/bin/gpg from open access on the file /root/.gnupg/gpg.conf. For complete SELinux messages run: sealert -l cb54177e-d44c-46a1-b246-5c0bbb8343be [x2]
Aug 4 08:30:01 netman.cs.umd.edu setroubleshoot[642854]: SELinux is preventing /usr/bin/gpg from getattr access on the file /root/.gnupg/gpg.conf. For complete SELinux messages run: sealert -l fbba2e30-b7ab-491c-9ec6-f553e9ef72af [x2]
Aug 4 08:43:17 netman.cs.umd.edu sshd[646253]: fatal: userauth_pubkey: parse request failed: incomplete message [preauth]
== newhonors2 (1 distinct, 24 total) ==
Aug 4 08:13:02 newhonors2 dhcpcd[717814]: dhcpcd is not running [x24]
== outbound00.cs.umd.edu (1 distinct, 6 total) ==
Aug 4 08:09:09 outbound00.cs.umd.edu python3[2761599]: ldapdb [x6]
== outbound01.cs.umd.edu (1 distinct, 6 total) ==
Aug 4 08:13:06 outbound01.cs.umd.edu python3[795093]: ldapdb [x6]
== peach.cs.umd.edu (4 distinct, 4 total) ==
Aug 4 08:17:02 peach.cs.umd.edu sshd-session[776767]: error: Received disconnect from 128.8.236.70 port 42772:3: com.jcraft.jsch.JSchException: Auth fail for methods 'publickey,gssapi-keyex,gssapi-with-mic,password' [preauth]
Aug 4 08:17:02 peach.cs.umd.edu sshd-session[776779]: error: Received disconnect from 128.8.236.70 port 42790:3: com.jcraft.jsch.JSchException: Auth fail for methods 'publickey,gssapi-keyex,gssapi-with-mic,password' [preauth]
Aug 4 08:17:04 peach.cs.umd.edu sshd-session[776782]: error: Received disconnect from 128.8.236.70 port 42792:3: com.jcraft.jsch.JSchException: Auth fail for methods 'publickey,gssapi-keyex,gssapi-with-mic,password' [preauth]
Aug 4 08:18:57 peach.cs.umd.edu sshd-session[776799]: error: Received disconnect from 128.8.236.70 port 43264:3: com.jcraft.jsch.JSchException: Auth fail for methods 'publickey,gssapi-keyex,gssapi-with-mic,password' [preauth]
== sentry-docker00.cs.umd.edu (34 distinct, 34 total) ==
Aug 4 08:08:53 sentry-docker00.cs.umd.edu systemd-udevd[1619327]: link_config: could not get ethtool features for vetha869ed9
Aug 4 08:08:53 sentry-docker00.cs.umd.edu systemd-udevd[1619327]: Could not set offload features of vetha869ed9: No such device
Aug 4 08:08:53 sentry-docker00.cs.umd.edu systemd-udevd[1619384]: Could not generate persistent MAC address for veth1d9a9c1: No such file or directory
Aug 4 08:08:53 sentry-docker00.cs.umd.edu systemd-udevd[1619385]: Could not generate persistent MAC address for veth2debf26: No such file or directory
Aug 4 08:08:53 sentry-docker00.cs.umd.edu systemd-udevd[1619388]: Could not generate persistent MAC address for veth413536d: No such file or directory
Aug 4 08:08:53 sentry-docker00.cs.umd.edu systemd-udevd[1619384]: Could not generate persistent MAC address for vethe7f8249: No such file or directory
Aug 4 08:08:53 sentry-docker00.cs.umd.edu systemd-udevd[1619407]: Could not generate persistent MAC address for vethb3489ff: No such file or directory
Aug 4 08:08:53 sentry-docker00.cs.umd.edu systemd-udevd[1619406]: Could not generate persistent MAC address for veth3142b05: No such file or directory
Aug 4 08:08:53 sentry-docker00.cs.umd.edu systemd-udevd[1619407]: Could not generate persistent MAC address for veth1865603: No such file or directory
Aug 4 08:08:53 sentry-docker00.cs.umd.edu systemd-udevd[1619405]: Could not generate persistent MAC address for vethee4a931: No such file or directory
Aug 4 08:08:53 sentry-docker00.cs.umd.edu systemd-udevd[1619418]: Could not generate persistent MAC address for vetha1786ee: No such file or directory
Aug 4 08:08:53 sentry-docker00.cs.umd.edu systemd-udevd[1619419]: Could not generate persistent MAC address for vethd6191b2: No such file or directory
Aug 4 08:29:01 sentry-docker00.cs.umd.edu systemd-udevd[1628810]: Could not generate persistent MAC address for vethf3849c9: No such file or directory
Aug 4 08:29:01 sentry-docker00.cs.umd.edu systemd-udevd[1628809]: Could not generate persistent MAC address for veth2c92f21: No such file or directory
Aug 4 08:29:01 sentry-docker00.cs.umd.edu systemd-udevd[1628813]: Could not generate persistent MAC address for vethd298774: No such file or directory
Aug 4 08:29:01 sentry-docker00.cs.umd.edu systemd-udevd[1628814]: Could not generate persistent MAC address for veth4466282: No such file or directory
Aug 4 08:29:01 sentry-docker00.cs.umd.edu systemd-udevd[1628837]: Could not generate persistent MAC address for vethefa18e1: No such file or directory
Aug 4 08:29:01 sentry-docker00.cs.umd.edu systemd-udevd[1628838]: Could not generate persistent MAC address for veth26c5e86: No such file or directory
Aug 4 08:29:01 sentry-docker00.cs.umd.edu systemd-udevd[1628857]: Could not generate persistent MAC address for veth6358089: No such file or directory
Aug 4 08:29:01 sentry-docker00.cs.umd.edu systemd-udevd[1628868]: Could not generate persistent MAC address for veth1387e61: No such file or directory
Aug 4 08:29:01 sentry-docker00.cs.umd.edu systemd-udevd[1628856]: Could not generate persistent MAC address for veth5cd4ca2: No such file or directory
Aug 4 08:29:01 sentry-docker00.cs.umd.edu systemd-udevd[1628863]: Could not generate persistent MAC address for vethdd7114d: No such file or directory
Aug 4 08:49:09 sentry-docker00.cs.umd.edu systemd-udevd[1638157]: link_config: could not get ethtool features for veth6358089
Aug 4 08:49:09 sentry-docker00.cs.umd.edu systemd-udevd[1638157]: Could not set offload features of veth6358089: No such device
Aug 4 08:49:10 sentry-docker00.cs.umd.edu systemd-udevd[1638193]: Could not generate persistent MAC address for vethab4c2d3: No such file or directory
Aug 4 08:49:10 sentry-docker00.cs.umd.edu systemd-udevd[1638192]: Could not generate persistent MAC address for vethfdbca89: No such file or directory
Aug 4 08:49:10 sentry-docker00.cs.umd.edu systemd-udevd[1638199]: Could not generate persistent MAC address for vetha5d911b: No such file or directory
Aug 4 08:49:10 sentry-docker00.cs.umd.edu systemd-udevd[1638196]: Could not generate persistent MAC address for veth33dc570: No such file or directory
Aug 4 08:49:10 sentry-docker00.cs.umd.edu systemd-udevd[1638202]: Could not generate persistent MAC address for veth0af80ee: No such file or directory
Aug 4 08:49:10 sentry-docker00.cs.umd.edu systemd-udevd[1638217]: Could not generate persistent MAC address for vethb0b4cf3: No such file or directory
... 4 more distinct messages not shown
== smokeping-slave (1 distinct, 1 total) ==
Aug 4 08:58:18 smokeping-slave nologin[765649]: Attempted login by UNKNOWN (UID: 65534) on UNKNOWN
== strawberry (2 distinct, 8 total) ==
Aug 4 08:09:44 strawberry udisksd[1067]: Error performing housekeeping for drive /org/freedesktop/UDisks2/drives/ST2000DM001_1CH164_W1E8J5KJ: Error updating SMART data: Error sending ATA command CHECK POWER MODE: Unexpected sense data returned:#0120000: 00 00 00 00 00 00 00 00 00 00 00 00 00 00 00 00 ................#0120010: 00 00 00 00 00 00 00 00 00 00 00 00 00 00 00 00 ................#012 (g-io-error-quark, 0) [x6]
Aug 4 08:34:42 strawberry smartd[5314]: Device: /dev/sda [SAT], failed to read SMART Attribute Data [x2]
== submit26-b9-2 (1 distinct, 4 total) ==
Aug 4 08:35:05 submit26-b9-2 systemd[1]: user(a)1001.service: Main process exited, code=killed, status=9/KILL [x4]
== submit26-b9-4 (10 distinct, 19 total) ==
Aug 4 08:15:29 submit26-b9-4 setroubleshoot[1011570]: SELinux is preventing /usr/bin/python3.9 from create access on the directory /(null). For complete SELinux messages run: sealert -l a4e66030-8621-4da9-bd27-5988bb1bf8ad
Aug 4 08:15:29 submit26-b9-4 setroubleshoot[1011570]: SELinux is preventing /usr/bin/python3.9 from add_name access on the directory /(null). For complete SELinux messages run: sealert -l c055e37d-bbf5-4800-9083-d606f792c8c1
Aug 4 08:15:29 submit26-b9-4 setroubleshoot[1011570]: SELinux is preventing /usr/bin/python3.9 from create access on the file /(null). For complete SELinux messages run: sealert -l e5bc3a56-6d6f-4776-954f-ddde1579648f [x2]
Aug 4 08:15:29 submit26-b9-4 setroubleshoot[1011570]: SELinux is preventing /usr/bin/python3.9 from open access on the file /tmp/libdnf.RFfhYU/repodata/repomd.xml. For complete SELinux messages run: sealert -l a8ec5e1b-49f9-4fbc-a8ae-22e800f7abf2 [x2]
Aug 4 08:15:29 submit26-b9-4 setroubleshoot[1011570]: SELinux is preventing /usr/bin/python3.9 from setattr access on the file repomd.xml. For complete SELinux messages run: sealert -l 945db714-d0c0-4402-911e-932978b8b036 [x2]
Aug 4 08:15:29 submit26-b9-4 setroubleshoot[1011570]: SELinux is preventing /usr/bin/python3.9 from read access on the directory libdnf.RFfhYU. For complete SELinux messages run: sealert -l 463998a0-fb0d-463c-82b1-471135710a14
Aug 4 08:15:29 submit26-b9-4 setroubleshoot[1011570]: SELinux is preventing /usr/bin/python3.9 from remove_name access on the directory repomd.xml. For complete SELinux messages run: sealert -l 473d2e21-15d8-407a-a9ee-2b842607fa00
Aug 4 08:15:29 submit26-b9-4 setroubleshoot[1011570]: SELinux is preventing /usr/bin/python3.9 from unlink access on the file repomd.xml. For complete SELinux messages run: sealert -l 80c54d4f-bf4b-4501-addb-1627383587d0
Aug 4 08:15:29 submit26-b9-4 setroubleshoot[1011570]: SELinux is preventing /usr/bin/python3.9 from rmdir access on the directory repodata. For complete SELinux messages run: sealert -l c63d3890-151e-49a0-83f0-3dfb69d051e5
Aug 4 08:31:49 submit26-b9-4 systemd[1]: user(a)1001.service: Main process exited, code=killed, status=9/KILL [x7]
1
0
Command: /usr/local/sbin/syslog-digest.py
Time : 0.5779s
Status : exited 0
Output :
Syslog digest — 2026-08-04 08:05 EDT
Processed 5,815 lines, filtered 4,827 (83%). 988 unknown (209 distinct) from 31 host(s).
== abadi-computer (20 distinct, 25 total) ==
Aug 4 07:23:56 abadi-computer sshd[934277]: error: Received disconnect from 128.8.236.70 port 52730:3: com.jcraft.jsch.JSchException: Auth fail for methods 'publickey,gssapi-keyex,gssapi-with-mic,password,keyboard-interactive' [preauth]
Aug 4 07:24:00 abadi-computer sshd[934280]: error: Received disconnect from 128.8.236.70 port 52744:3: com.jcraft.jsch.JSchException: Auth fail for methods 'publickey,gssapi-keyex,gssapi-with-mic,password,keyboard-interactive' [preauth]
Aug 4 07:24:03 abadi-computer sshd[934287]: error: Received disconnect from 128.8.236.70 port 52756:3: com.jcraft.jsch.JSchException: Auth fail for methods 'publickey,gssapi-keyex,gssapi-with-mic,password,keyboard-interactive' [preauth]
Aug 4 07:24:06 abadi-computer sshd[934552]: error: Received disconnect from 128.8.236.70 port 52764:3: com.jcraft.jsch.JSchException: Auth fail for methods 'publickey,gssapi-keyex,gssapi-with-mic,password,keyboard-interactive' [preauth]
Aug 4 07:24:06 abadi-computer sshd[934563]: error: Received disconnect from 128.8.236.70 port 52776:3: com.jcraft.jsch.JSchException: Auth fail for methods 'publickey,gssapi-keyex,gssapi-with-mic,password,keyboard-interactive' [preauth]
Aug 4 07:24:09 abadi-computer sshd[934566]: error: Received disconnect from 128.8.236.70 port 52782:3: com.jcraft.jsch.JSchException: Auth fail for methods 'publickey,gssapi-keyex,gssapi-with-mic,password,keyboard-interactive' [preauth]
Aug 4 07:24:11 abadi-computer sshd[934653]: error: Received disconnect from 128.8.236.70 port 52788:3: com.jcraft.jsch.JSchException: Auth fail for methods 'publickey,gssapi-keyex,gssapi-with-mic,password,keyboard-interactive' [preauth]
Aug 4 07:24:14 abadi-computer sshd[934836]: error: Received disconnect from 128.8.236.70 port 52796:3: com.jcraft.jsch.JSchException: Auth fail for methods 'publickey,gssapi-keyex,gssapi-with-mic,password,keyboard-interactive' [preauth]
Aug 4 07:24:18 abadi-computer sshd[934840]: error: Received disconnect from 128.8.236.70 port 52808:3: com.jcraft.jsch.JSchException: Auth fail for methods 'publickey,gssapi-keyex,gssapi-with-mic,password,keyboard-interactive' [preauth]
Aug 4 07:24:18 abadi-computer krb5_child[934845]: Client 'admin(a)UMD.EDU' not found in Kerberos database [x6]
Aug 4 07:24:22 abadi-computer sshd[934843]: error: Received disconnect from 128.8.236.70 port 52828:3: com.jcraft.jsch.JSchException: Auth fail for methods 'publickey,gssapi-keyex,gssapi-with-mic,password,keyboard-interactive' [preauth]
Aug 4 07:24:26 abadi-computer sshd[934852]: error: Received disconnect from 128.8.236.70 port 52838:3: com.jcraft.jsch.JSchException: Auth fail for methods 'publickey,gssapi-keyex,gssapi-with-mic,password,keyboard-interactive' [preauth]
Aug 4 07:24:29 abadi-computer sshd[934871]: error: Received disconnect from 128.8.236.70 port 52856:3: com.jcraft.jsch.JSchException: Auth fail for methods 'publickey,gssapi-keyex,gssapi-with-mic,password,keyboard-interactive' [preauth]
Aug 4 07:24:32 abadi-computer sshd[934875]: error: Received disconnect from 128.8.236.70 port 52874:3: com.jcraft.jsch.JSchException: Auth fail for methods 'publickey,gssapi-keyex,gssapi-with-mic,password,keyboard-interactive' [preauth]
Aug 4 07:24:35 abadi-computer sshd[934878]: error: Received disconnect from 128.8.236.70 port 52894:3: com.jcraft.jsch.JSchException: Auth fail for methods 'publickey,gssapi-keyex,gssapi-with-mic,password,keyboard-interactive' [preauth]
Aug 4 07:24:37 abadi-computer sshd[934882]: error: Received disconnect from 128.8.236.70 port 52906:3: com.jcraft.jsch.JSchException: Auth fail for methods 'publickey,gssapi-keyex,gssapi-with-mic,password,keyboard-interactive' [preauth]
Aug 4 07:24:40 abadi-computer sshd[934886]: error: Received disconnect from 128.8.236.70 port 52918:3: com.jcraft.jsch.JSchException: Auth fail for methods 'publickey,gssapi-keyex,gssapi-with-mic,password,keyboard-interactive' [preauth]
Aug 4 07:24:42 abadi-computer sshd[934891]: error: Received disconnect from 128.8.236.70 port 52938:3: com.jcraft.jsch.JSchException: Auth fail for methods 'publickey,gssapi-keyex,gssapi-with-mic,password,keyboard-interactive' [preauth]
Aug 4 07:24:46 abadi-computer sshd[934895]: error: Received disconnect from 128.8.236.70 port 52944:3: com.jcraft.jsch.JSchException: Auth fail for methods 'publickey,gssapi-keyex,gssapi-with-mic,password,keyboard-interactive' [preauth]
Aug 4 07:24:46 abadi-computer sshd[934900]: error: Received disconnect from 128.8.236.70 port 52964:3: com.jcraft.jsch.JSchException: Auth fail for methods 'publickey,gssapi-keyex,gssapi-with-mic,password,keyboard-interactive' [preauth]
== abuse (1 distinct, 346 total) ==
Aug 4 07:05:06 abuse rsyslogd[21745]: imjournal: open() failed for path: '/var/lib/rsyslog/imjournal.state.tmp': Input/output error [v8.2404.0 try https://www.rsyslog.com/e/2433 ] [x346]
== atif01.cs.umd.edu (5 distinct, 6 total) ==
Aug 4 07:09:42 atif01.cs.umd.edu kernel: net_ratelimit: 11 callbacks suppressed
Aug 4 07:20:00 atif01.cs.umd.edu kernel: net_ratelimit: 32 callbacks suppressed
Aug 4 07:20:01 atif01.cs.umd.edu kernel: nfsd: peername failed (err 107)!
Aug 4 07:20:03 atif01.cs.umd.edu xinetd[37931]: warning: can't get client address: Connection reset by peer [x2]
Aug 4 07:37:22 atif01.cs.umd.edu kernel: net_ratelimit: 20 callbacks suppressed
== b0b02.cs.umd.edu (13 distinct, 13 total) ==
Aug 4 07:29:51 b0b02.cs.umd.edu csregistry[5224]: 2026/08/04 11:29:51 http: TLS handshake error from 128.8.236.70:44122: tls: client offered an unsupported, maximum protocol version of 300
Aug 4 07:29:51 b0b02.cs.umd.edu csregistry[5224]: 2026/08/04 11:29:51 http: TLS handshake error from 128.8.236.70:44128: tls: no cipher suite supported by both client and server
Aug 4 07:29:51 b0b02.cs.umd.edu csregistry[5224]: 2026/08/04 11:29:51 http: TLS handshake error from 128.8.236.70:44134: tls: no cipher suite supported by both client and server
Aug 4 07:29:51 b0b02.cs.umd.edu csregistry[5224]: 2026/08/04 11:29:51 http: TLS handshake error from 128.8.236.70:44144: tls: no cipher suite supported by both client and server
Aug 4 07:29:51 b0b02.cs.umd.edu csregistry[5224]: 2026/08/04 11:29:51 http: TLS handshake error from 128.8.236.70:44146: tls: no cipher suite supported by both client and server
Aug 4 07:29:51 b0b02.cs.umd.edu csregistry[5224]: 2026/08/04 11:29:51 http: TLS handshake error from 128.8.236.70:44148: tls: unsupported SSLv2 handshake received
Aug 4 07:29:52 b0b02.cs.umd.edu csregistry[5224]: time="2026-08-04T11:29:52.39793854Z" level=info msg="response completed" go.version=go1.11.2 http.request.host=10.227.108.237 http.request.id=51f12b68-76f7-4976-adba-206eac39042a http.request.method=GET http.request.remoteaddr="128.8.236.70:44240" http.request.uri="/vpn/../vpns/cfg/smb.conf" http.request.useragent= http.response.duration="64.022µs" http.response.status=301 http.response.written=0
Aug 4 07:29:53 b0b02.cs.umd.edu csregistry[5224]: time="2026-08-04T11:29:53.068926692Z" level=info msg="response completed" go.version=go1.11.2 http.request.host=10.227.108.237 http.request.id=09713f7e-876c-4b50-ad86-c92c46115e32 http.request.method=GET http.request.remoteaddr="128.8.236.70:44356" http.request.uri="/dana-na/../dana/html5acc/guacamole/../../../../../../etc/passwd?/dana/html5acc/guacamole/" http.request.useragent= http.response.duration="67.646µs" http.response.status=301 http.response.written=0
Aug 4 07:30:08 b0b02.cs.umd.edu csregistry[5224]: time="2026-08-04T11:30:08.673281985Z" level=info msg="response completed" go.version=go1.11.2 http.request.host=10.227.108.237 http.request.id=b450806b-7de4-4b93-8fcb-3ff100dddbe7 http.request.method=GET http.request.referer="HTTPS://10.227.108.237:443/info.html" http.request.remoteaddr="128.8.236.70:44610" http.request.uri="/images/..%2finfo.html" http.request.useragent= http.response.duration="31.167µs" http.response.status=301 http.response.written=0
Aug 4 07:39:08 b0b02.cs.umd.edu setroubleshoot[2777233]: SELinux is preventing /usr/bin/python3.9 from getattr access on the file /etc/authselect/nsswitch.conf. For complete SELinux messages run: sealert -l 9a1e2952-3fde-4937-a8ab-f7f59791a458
Aug 4 07:39:11 b0b02.cs.umd.edu setroubleshoot[2777233]: SELinux is preventing /usr/bin/python3.9 from read access on the file /etc/authselect/nsswitch.conf. For complete SELinux messages run: sealert -l 97d74423-e027-4cd6-8810-ad80944900b5
Aug 4 07:39:14 b0b02.cs.umd.edu setroubleshoot[2777233]: SELinux is preventing /usr/bin/python3.9 from open access on the file /etc/authselect/nsswitch.conf. For complete SELinux messages run: sealert -l 4f253f6a-62d6-46dd-8eaf-0b4d29df41c6
Aug 4 07:44:44 b0b02.cs.umd.edu rustdesk[2778640]: cannot open display:
== cheezit.cs.umd.edu (6 distinct, 6 total) ==
Aug 4 07:11:36 cheezit.cs.umd.edu sshd-session[913652]: error: kex_protocol_error: type 20 seq 2 [preauth]
Aug 4 07:11:36 cheezit.cs.umd.edu sshd-session[913652]: error: kex_protocol_error: type 30 seq 3 [preauth]
Aug 4 07:11:37 cheezit.cs.umd.edu sshd-session[913652]: error: kex_protocol_error: type 20 seq 4 [preauth]
Aug 4 07:11:37 cheezit.cs.umd.edu sshd-session[913652]: error: kex_protocol_error: type 30 seq 5 [preauth]
Aug 4 07:11:39 cheezit.cs.umd.edu sshd-session[913652]: error: kex_protocol_error: type 20 seq 6 [preauth]
Aug 4 07:11:39 cheezit.cs.umd.edu sshd-session[913652]: error: kex_protocol_error: type 30 seq 7 [preauth]
== contest (1 distinct, 33 total) ==
Aug 4 07:06:38 contest goferd[1007]: [ERROR][worker-0] gofer.messaging.adapter.connect:33 - connect: proton+amqps://satellite8.cs.umd.edu:5647, failed: Connection amqps://satellite8.cs.umd.edu:5647 disconnected: Condition('proton.pythonio', 'Connection refused to all addresses') [x33]
== csfw00a (1 distinct, 250 total) ==
Aug 4 07:05:53 csfw00a kernel: bnxt_en 0000:09:00.0 eth3: NIC Link is Down [x250]
== dojo (5 distinct, 6 total) ==
Aug 4 07:19:26 dojo sshd[1069435]: error: PAM: Authentication failure for root from 128.8.236.70 [x2]
Aug 4 07:19:27 dojo sshd[1069435]: error: Received disconnect from 128.8.236.70 port 60406:3: com.jcraft.jsch.JSchException: Auth fail for methods 'publickey,keyboard-interactive' [preauth]
Aug 4 07:19:30 dojo sshd[1069439]: error: Received disconnect from 128.8.236.70 port 60414:3: com.jcraft.jsch.JSchException: Auth fail for methods 'publickey,keyboard-interactive' [preauth]
Aug 4 07:38:24 dojo nologin[1070713]: Attempted login by UNKNOWN (UID: 65534) on UNKNOWN
Aug 4 07:38:33 dojo puppet-agent[1070714]: The current total number of fact values: 17067 exceeds the fact values limit: 10240
== frabjous (3 distinct, 4 total) ==
Aug 4 07:15:46 frabjous sshd-session[3011711]: error: PAM: Authentication failure for root from 128.8.236.70 [x2]
Aug 4 07:15:46 frabjous sshd-session[3011711]: error: Received disconnect from 128.8.236.70 port 54118:3: com.jcraft.jsch.JSchException: Auth fail for methods 'publickey,gssapi-with-mic,keyboard-interactive' [preauth]
Aug 4 07:15:48 frabjous sshd-session[3011768]: error: Received disconnect from 128.8.236.70 port 54128:3: com.jcraft.jsch.JSchException: Auth fail for methods 'publickey,gssapi-with-mic,keyboard-interactive' [preauth]
== galahad.cs.umd.edu (4 distinct, 4 total) ==
Aug 4 08:04:51 galahad.cs.umd.edu sshd-session[2195257]: error: Received disconnect from 128.8.236.70 port 45906:3: com.jcraft.jsch.JSchException: Auth fail for methods 'publickey,gssapi-keyex,gssapi-with-mic,password,keyboard-interactive' [preauth]
Aug 4 08:04:51 galahad.cs.umd.edu sshd-session[2195260]: error: Could not get shadow information for NOUSER
Aug 4 08:04:51 galahad.cs.umd.edu sshd-session[2195260]: error: Received disconnect from 128.8.236.70 port 45908:3: com.jcraft.jsch.JSchException: Auth fail for methods 'publickey,gssapi-keyex,gssapi-with-mic,password,keyboard-interactive' [preauth]
Aug 4 08:04:51 galahad.cs.umd.edu sshd-session[2195263]: error: Received disconnect from 128.8.236.70 port 45910:3: com.jcraft.jsch.JSchException: Auth fail for methods 'publickey,gssapi-keyex,gssapi-with-mic,password,keyboard-interactive' [preauth]
== hackerman (8 distinct, 13 total) ==
Aug 4 07:19:01 hackerman gnome-software[2060381]: failed to commit changes to dconf: GDBus.Error:org.gtk.GDBus.UnmappedGError.Quark._g_2dfile_2derror_2dquark.Code2: Failed to create file “/adminhomes/sajith/.config/dconf/user.DE4XT3”: Permission denied
Aug 4 07:20:04 hackerman gnome-software[2060381]: can't reliably fixup error code 4 in domain g-io-error-quark: Not a directory [x4]
Aug 4 07:20:13 hackerman gnome-software[2060381]: Only 0 apps for recent list, hiding
Aug 4 07:20:29 hackerman gnome-software[2060381]: failed to commit changes to dconf: GDBus.Error:org.gtk.GDBus.UnmappedGError.Quark._g_2dfile_2derror_2dquark.Code2: Failed to create file “/adminhomes/sajith/.config/dconf/user.C0A2T3”: Permission denied
Aug 4 07:20:29 hackerman packagekitd[3730430]: Failed to get cache filename for libreoffice [x2]
Aug 4 07:20:29 hackerman packagekitd[3730430]: Failed to get cache filename for kernel [x2]
Aug 4 07:20:38 hackerman packagekitd[3730430]: failed to parse public key for /etc/pki/rpm-gpg/RPM-GPG-KEY-PQC-redhat-release
Aug 4 07:55:59 hackerman systemd[1]: insights-client.service: Start request repeated too quickly.
== hazfs.cs.umd.edu (11 distinct, 66 total) ==
Aug 4 07:46:19 hazfs.cs.umd.edu snmpd[1431]: send response: Failure in sendto [x6]
Aug 4 07:46:19 hazfs.cs.umd.edu snmpd[1431]: -- NET-SNMP-EXTEND-MIB::nsExtendStatus."userweb" [x6]
Aug 4 07:46:19 hazfs.cs.umd.edu snmpd[1431]: -- NET-SNMP-EXTEND-MIB::nsExtendStatus."zfslist" [x6]
Aug 4 07:46:19 hazfs.cs.umd.edu snmpd[1431]: -- NET-SNMP-EXTEND-MIB::nsExtendStatus."userhome" [x6]
Aug 4 07:46:19 hazfs.cs.umd.edu snmpd[1431]: -- NET-SNMP-EXTEND-MIB::nsExtendOutput1Line."userweb" [x6]
Aug 4 07:46:19 hazfs.cs.umd.edu snmpd[1431]: -- NET-SNMP-EXTEND-MIB::nsExtendOutput1Line."zfslist" [x6]
Aug 4 07:46:19 hazfs.cs.umd.edu snmpd[1431]: -- NET-SNMP-EXTEND-MIB::nsExtendOutput1Line."userhome" [x6]
Aug 4 07:46:19 hazfs.cs.umd.edu snmpd[1431]: -- NET-SNMP-EXTEND-MIB::nsExtendOutputFull."userweb" [x6]
Aug 4 07:46:19 hazfs.cs.umd.edu snmpd[1431]: -- NET-SNMP-EXTEND-MIB::nsExtendOutputFull."zfslist" [x6]
Aug 4 07:46:19 hazfs.cs.umd.edu snmpd[1431]: -- NET-SNMP-EXTEND-MIB::nsExtendOutputFull."userhome" [x6]
Aug 4 07:46:19 hazfs.cs.umd.edu snmpd[1431]: -- NET-SNMP-EXTEND-MIB::nsExtendOutNumLines."userweb" [x6]
== idm00 (1 distinct, 1 total) ==
Aug 4 07:51:17 idm00 named[1455]: client @0x7f33154dca68 10.73.240.42#53526: update '73.10.in-addr.arpa/IN' denied
== idmp0 (1 distinct, 1 total) ==
Aug 4 07:36:02 idmp0 named[5198]: client @0x7f992c0184a8 10.73.240.43#55743: update '73.10.in-addr.arpa/IN' denied
== inbound00.cs.umd.edu (5 distinct, 5 total) ==
Aug 4 07:13:00 inbound00.cs.umd.edu sshd-session[2789176]: error: Received disconnect from 128.8.236.70 port 43938:3: com.jcraft.jsch.JSchException: Auth fail for methods 'publickey,gssapi-keyex,gssapi-with-mic,password' [preauth]
Aug 4 07:13:03 inbound00.cs.umd.edu sshd-session[2789180]: error: Received disconnect from 128.8.236.70 port 43955:3: com.jcraft.jsch.JSchException: Auth fail for methods 'publickey,gssapi-keyex,gssapi-with-mic,password' [preauth]
Aug 4 07:13:07 inbound00.cs.umd.edu sshd-session[2789189]: error: Received disconnect from 128.8.236.70 port 44088:3: com.jcraft.jsch.JSchException: Auth fail for methods 'publickey,gssapi-keyex,gssapi-with-mic,password' [preauth]
Aug 4 07:13:10 inbound00.cs.umd.edu sshd-session[2789193]: error: Received disconnect from 128.8.236.70 port 44376:3: com.jcraft.jsch.JSchException: Auth fail for methods 'publickey,gssapi-keyex,gssapi-with-mic,password' [preauth]
Aug 4 07:13:10 inbound00.cs.umd.edu sshd-session[2789198]: error: Received disconnect from 128.8.236.70 port 44628:3: com.jcraft.jsch.JSchException: Auth fail for methods 'publickey,gssapi-keyex,gssapi-with-mic,password' [preauth]
== inbound01.cs.umd.edu (5 distinct, 5 total) ==
Aug 4 07:13:05 inbound01.cs.umd.edu sshd-session[803035]: error: Received disconnect from 128.8.236.70 port 53514:3: com.jcraft.jsch.JSchException: Auth fail for methods 'publickey,gssapi-keyex,gssapi-with-mic,password' [preauth]
Aug 4 07:13:09 inbound01.cs.umd.edu sshd-session[803039]: error: Received disconnect from 128.8.236.70 port 53862:3: com.jcraft.jsch.JSchException: Auth fail for methods 'publickey,gssapi-keyex,gssapi-with-mic,password' [preauth]
Aug 4 07:13:12 inbound01.cs.umd.edu sshd-session[803042]: error: Received disconnect from 128.8.236.70 port 54054:3: com.jcraft.jsch.JSchException: Auth fail for methods 'publickey,gssapi-keyex,gssapi-with-mic,password' [preauth]
Aug 4 07:13:15 inbound01.cs.umd.edu sshd-session[803051]: error: Received disconnect from 128.8.236.70 port 54284:3: com.jcraft.jsch.JSchException: Auth fail for methods 'publickey,gssapi-keyex,gssapi-with-mic,password' [preauth]
Aug 4 07:13:15 inbound01.cs.umd.edu sshd-session[803070]: error: Received disconnect from 128.8.236.70 port 54641:3: com.jcraft.jsch.JSchException: Auth fail for methods 'publickey,gssapi-keyex,gssapi-with-mic,password' [preauth]
== irb2156 (1 distinct, 1 total) ==
Aug 4 07:29:07 irb2156 systemd-resolved[3398]: Using degraded feature set TCP instead of UDP for DNS server 128.8.76.3.
== itmon02 (1 distinct, 32 total) ==
Aug 4 07:07:54 itmon02 sshd[1750555]: error: beginning MaxStartups throttling [x32]
== kadath.cs.umd.edu (3 distinct, 3 total) ==
Aug 4 07:24:48 kadath.cs.umd.edu sshd-session[1880572]: error: Received disconnect from 128.8.236.70 port 56882:3: com.jcraft.jsch.JSchException: Auth fail for methods 'publickey,gssapi-keyex,gssapi-with-mic,password' [preauth]
Aug 4 07:24:48 kadath.cs.umd.edu sshd-session[1880576]: error: Received disconnect from 128.8.236.70 port 56894:3: com.jcraft.jsch.JSchException: Auth fail for methods 'publickey,gssapi-keyex,gssapi-with-mic,password' [preauth]
Aug 4 07:24:51 kadath.cs.umd.edu sshd-session[1880579]: error: Received disconnect from 128.8.236.70 port 56896:3: com.jcraft.jsch.JSchException: Auth fail for methods 'publickey,gssapi-keyex,gssapi-with-mic,password' [preauth]
== netman.cs.umd.edu (1 distinct, 1 total) ==
Aug 4 07:27:17 netman.cs.umd.edu sshd[625815]: error: PAM: Authentication failure for root from 82.208.65.46
== newhonors2 (1 distinct, 24 total) ==
Aug 4 07:13:03 newhonors2 dhcpcd[715969]: dhcpcd is not running [x24]
== outbound00.cs.umd.edu (1 distinct, 6 total) ==
Aug 4 07:09:09 outbound00.cs.umd.edu python3[2746659]: ldapdb [x6]
== outbound01.cs.umd.edu (1 distinct, 6 total) ==
Aug 4 07:13:06 outbound01.cs.umd.edu python3[780713]: ldapdb [x6]
== sentry-docker00.cs.umd.edu (40 distinct, 40 total) ==
Aug 4 07:08:28 sentry-docker00.cs.umd.edu systemd-udevd[1590934]: link_config: could not get ethtool features for vethad7b6ac
Aug 4 07:08:28 sentry-docker00.cs.umd.edu systemd-udevd[1590934]: Could not set offload features of vethad7b6ac: No such device
Aug 4 07:08:28 sentry-docker00.cs.umd.edu systemd-udevd[1591032]: link_config: could not get ethtool features for vethb33fc65
Aug 4 07:08:28 sentry-docker00.cs.umd.edu systemd-udevd[1591032]: Could not set offload features of vethb33fc65: No such device
Aug 4 07:08:28 sentry-docker00.cs.umd.edu systemd-udevd[1591056]: Could not generate persistent MAC address for veth8a2d1c0: No such file or directory
Aug 4 07:08:28 sentry-docker00.cs.umd.edu systemd-udevd[1591057]: Could not generate persistent MAC address for vethd4d870d: No such file or directory
Aug 4 07:08:28 sentry-docker00.cs.umd.edu systemd-udevd[1591075]: Could not generate persistent MAC address for vethe42ae08: No such file or directory
Aug 4 07:08:28 sentry-docker00.cs.umd.edu systemd-udevd[1591082]: Could not generate persistent MAC address for veth1af4246: No such file or directory
Aug 4 07:08:28 sentry-docker00.cs.umd.edu systemd-udevd[1591085]: Could not generate persistent MAC address for vethc2e9472: No such file or directory
Aug 4 07:08:28 sentry-docker00.cs.umd.edu systemd-udevd[1591084]: Could not generate persistent MAC address for veth488c695: No such file or directory
Aug 4 07:08:28 sentry-docker00.cs.umd.edu systemd-udevd[1591115]: Could not generate persistent MAC address for veth5abbfd5: No such file or directory
Aug 4 07:08:28 sentry-docker00.cs.umd.edu systemd-udevd[1591091]: Could not generate persistent MAC address for veth9cb6043: No such file or directory
Aug 4 07:08:28 sentry-docker00.cs.umd.edu systemd-udevd[1591148]: Could not generate persistent MAC address for vethec52282: No such file or directory
Aug 4 07:08:28 sentry-docker00.cs.umd.edu systemd-udevd[1591149]: Could not generate persistent MAC address for vetha21a889: No such file or directory
Aug 4 07:28:36 sentry-docker00.cs.umd.edu systemd-udevd[1600489]: link_config: could not get ethtool features for vethe42ae08
Aug 4 07:28:36 sentry-docker00.cs.umd.edu systemd-udevd[1600489]: Could not set offload features of vethe42ae08: No such device
Aug 4 07:28:36 sentry-docker00.cs.umd.edu systemd-udevd[1600501]: link_config: could not get ethtool features for veth5abbfd5
Aug 4 07:28:36 sentry-docker00.cs.umd.edu systemd-udevd[1600501]: Could not set offload features of veth5abbfd5: No such device
Aug 4 07:28:36 sentry-docker00.cs.umd.edu systemd-udevd[1600535]: Could not generate persistent MAC address for vethb5b8e49: No such file or directory
Aug 4 07:28:36 sentry-docker00.cs.umd.edu systemd-udevd[1600536]: Could not generate persistent MAC address for veth115fbfd: No such file or directory
Aug 4 07:28:36 sentry-docker00.cs.umd.edu systemd-udevd[1600539]: Could not generate persistent MAC address for veth6f1ff03: No such file or directory
Aug 4 07:28:36 sentry-docker00.cs.umd.edu systemd-udevd[1600540]: Could not generate persistent MAC address for veth550cccd: No such file or directory
Aug 4 07:28:36 sentry-docker00.cs.umd.edu systemd-udevd[1600545]: Could not generate persistent MAC address for veth32b7311: No such file or directory
Aug 4 07:28:36 sentry-docker00.cs.umd.edu systemd-udevd[1600548]: Could not generate persistent MAC address for vethb485ba5: No such file or directory
Aug 4 07:28:36 sentry-docker00.cs.umd.edu systemd-udevd[1600565]: Could not generate persistent MAC address for vethfdce093: No such file or directory
Aug 4 07:28:36 sentry-docker00.cs.umd.edu systemd-udevd[1600566]: Could not generate persistent MAC address for vethbb26a52: No such file or directory
Aug 4 07:28:36 sentry-docker00.cs.umd.edu systemd-udevd[1600589]: Could not generate persistent MAC address for veth56b8aab: No such file or directory
Aug 4 07:28:36 sentry-docker00.cs.umd.edu systemd-udevd[1600596]: Could not generate persistent MAC address for veth039aa0b: No such file or directory
Aug 4 07:48:45 sentry-docker00.cs.umd.edu systemd-udevd[1609888]: link_config: could not get ethtool features for vethb485ba5
Aug 4 07:48:45 sentry-docker00.cs.umd.edu systemd-udevd[1609888]: Could not set offload features of vethb485ba5: No such device
... 10 more distinct messages not shown
== strawberry (22 distinct, 33 total) ==
Aug 4 07:09:44 strawberry udisksd[1067]: Error performing housekeeping for drive /org/freedesktop/UDisks2/drives/ST2000DM001_1CH164_W1E8J5KJ: Error updating SMART data: Error sending ATA command CHECK POWER MODE: Unexpected sense data returned:#0120000: 00 00 00 00 00 00 00 00 00 00 00 00 00 00 00 00 ................#0120010: 00 00 00 00 00 00 00 00 00 00 00 00 00 00 00 00 ................#012 (g-io-error-quark, 0) [x6]
Aug 4 07:26:09 strawberry sshd[3526763]: error: Received disconnect from 128.8.236.70 port 34550:3: com.jcraft.jsch.JSchException: Auth fail for methods 'publickey,gssapi-keyex,gssapi-with-mic,password,keyboard-interactive' [preauth]
Aug 4 07:26:12 strawberry sshd[3526766]: error: Received disconnect from 128.8.236.70 port 34564:3: com.jcraft.jsch.JSchException: Auth fail for methods 'publickey,gssapi-keyex,gssapi-with-mic,password,keyboard-interactive' [preauth]
Aug 4 07:26:15 strawberry sshd[3526773]: error: Received disconnect from 128.8.236.70 port 34572:3: com.jcraft.jsch.JSchException: Auth fail for methods 'publickey,gssapi-keyex,gssapi-with-mic,password,keyboard-interactive' [preauth]
Aug 4 07:26:19 strawberry sshd[3526776]: error: Received disconnect from 128.8.236.70 port 34586:3: com.jcraft.jsch.JSchException: Auth fail for methods 'publickey,gssapi-keyex,gssapi-with-mic,password,keyboard-interactive' [preauth]
Aug 4 07:26:19 strawberry sshd[3526779]: error: Received disconnect from 128.8.236.70 port 34594:3: com.jcraft.jsch.JSchException: Auth fail for methods 'publickey,gssapi-keyex,gssapi-with-mic,password,keyboard-interactive' [preauth]
Aug 4 07:26:22 strawberry sshd[3526782]: error: Received disconnect from 128.8.236.70 port 34596:3: com.jcraft.jsch.JSchException: Auth fail for methods 'publickey,gssapi-keyex,gssapi-with-mic,password,keyboard-interactive' [preauth]
Aug 4 07:26:26 strawberry sshd[3526785]: error: Received disconnect from 128.8.236.70 port 34606:3: com.jcraft.jsch.JSchException: Auth fail for methods 'publickey,gssapi-keyex,gssapi-with-mic,password,keyboard-interactive' [preauth]
Aug 4 07:26:29 strawberry sshd[3526788]: error: Received disconnect from 128.8.236.70 port 34624:3: com.jcraft.jsch.JSchException: Auth fail for methods 'publickey,gssapi-keyex,gssapi-with-mic,password,keyboard-interactive' [preauth]
Aug 4 07:26:33 strawberry sshd[3526791]: error: Received disconnect from 128.8.236.70 port 34636:3: com.jcraft.jsch.JSchException: Auth fail for methods 'publickey,gssapi-keyex,gssapi-with-mic,password,keyboard-interactive' [preauth]
Aug 4 07:26:34 strawberry krb5_child[3526796]: Client 'admin(a)UMD.EDU' not found in Kerberos database [x6]
Aug 4 07:26:38 strawberry sshd[3526794]: error: Received disconnect from 128.8.236.70 port 34658:3: com.jcraft.jsch.JSchException: Auth fail for methods 'publickey,gssapi-keyex,gssapi-with-mic,password,keyboard-interactive' [preauth]
Aug 4 07:26:40 strawberry sshd[3526803]: error: Received disconnect from 128.8.236.70 port 34674:3: com.jcraft.jsch.JSchException: Auth fail for methods 'publickey,gssapi-keyex,gssapi-with-mic,password,keyboard-interactive' [preauth]
Aug 4 07:26:43 strawberry sshd[3526807]: error: Received disconnect from 128.8.236.70 port 34700:3: com.jcraft.jsch.JSchException: Auth fail for methods 'publickey,gssapi-keyex,gssapi-with-mic,password,keyboard-interactive' [preauth]
Aug 4 07:26:46 strawberry sshd[3526810]: error: Received disconnect from 128.8.236.70 port 34716:3: com.jcraft.jsch.JSchException: Auth fail for methods 'publickey,gssapi-keyex,gssapi-with-mic,password,keyboard-interactive' [preauth]
Aug 4 07:26:48 strawberry sshd[3526813]: error: Received disconnect from 128.8.236.70 port 34728:3: com.jcraft.jsch.JSchException: Auth fail for methods 'publickey,gssapi-keyex,gssapi-with-mic,password,keyboard-interactive' [preauth]
Aug 4 07:26:51 strawberry sshd[3526816]: error: Received disconnect from 128.8.236.70 port 34732:3: com.jcraft.jsch.JSchException: Auth fail for methods 'publickey,gssapi-keyex,gssapi-with-mic,password,keyboard-interactive' [preauth]
Aug 4 07:26:54 strawberry sshd[3526820]: error: Received disconnect from 128.8.236.70 port 34742:3: com.jcraft.jsch.JSchException: Auth fail for methods 'publickey,gssapi-keyex,gssapi-with-mic,password,keyboard-interactive' [preauth]
Aug 4 07:26:56 strawberry sshd[3526823]: error: Received disconnect from 128.8.236.70 port 34756:3: com.jcraft.jsch.JSchException: Auth fail for methods 'publickey,gssapi-keyex,gssapi-with-mic,password,keyboard-interactive' [preauth]
Aug 4 07:27:00 strawberry sshd[3526828]: error: Received disconnect from 128.8.236.70 port 34766:3: com.jcraft.jsch.JSchException: Auth fail for methods 'publickey,gssapi-keyex,gssapi-with-mic,password,keyboard-interactive' [preauth]
Aug 4 07:27:01 strawberry sshd[3526831]: error: Received disconnect from 128.8.236.70 port 34776:3: com.jcraft.jsch.JSchException: verify: false [preauth]
Aug 4 07:34:42 strawberry smartd[5314]: Device: /dev/sda [SAT], failed to read SMART Attribute Data [x2]
== stuckeys (4 distinct, 4 total) ==
Aug 4 07:24:20 stuckeys sshd-session[1926933]: error: Received disconnect from 128.8.236.70 port 54892:3: com.jcraft.jsch.JSchException: Auth fail for methods 'publickey,gssapi-keyex,gssapi-with-mic,password' [preauth]
Aug 4 07:24:23 stuckeys sshd-session[1926937]: error: Received disconnect from 128.8.236.70 port 54906:3: com.jcraft.jsch.JSchException: Auth fail for methods 'publickey,gssapi-keyex,gssapi-with-mic,password' [preauth]
Aug 4 07:24:27 stuckeys sshd-session[1926941]: error: Received disconnect from 128.8.236.70 port 54918:3: com.jcraft.jsch.JSchException: Auth fail for methods 'publickey,gssapi-keyex,gssapi-with-mic,password' [preauth]
Aug 4 07:24:30 stuckeys sshd-session[1926945]: error: Received disconnect from 128.8.236.70 port 54936:3: com.jcraft.jsch.JSchException: Auth fail for methods 'publickey,gssapi-keyex,gssapi-with-mic,password' [preauth]
== submit10-cln25 (1 distinct, 1 total) ==
Aug 4 07:37:00 submit10-cln25 systemd: Failed at step EXEC spawning /usr/local/bin/cronjob: No such file or directory
== whiffle.cs.umd.edu (1 distinct, 1 total) ==
Aug 4 07:09:03 whiffle.cs.umd.edu kernel: libceph: osd34 10.73.235.202:6842 socket closed (con state CONNECTING)
== wraith (20 distinct, 25 total) ==
Aug 4 07:22:09 wraith sshd[1161270]: error: Received disconnect from 128.8.236.70 port 44814:3: com.jcraft.jsch.JSchException: Auth fail for methods 'publickey,gssapi-keyex,gssapi-with-mic,password,keyboard-interactive' [preauth]
Aug 4 07:22:09 wraith sshd[1161273]: error: Received disconnect from 128.8.236.70 port 44822:3: com.jcraft.jsch.JSchException: Auth fail for methods 'publickey,gssapi-keyex,gssapi-with-mic,password,keyboard-interactive' [preauth]
Aug 4 07:22:12 wraith sshd[1161280]: error: Received disconnect from 128.8.236.70 port 44824:3: com.jcraft.jsch.JSchException: Auth fail for methods 'publickey,gssapi-keyex,gssapi-with-mic,password,keyboard-interactive' [preauth]
Aug 4 07:22:14 wraith sshd[1161283]: error: Received disconnect from 128.8.236.70 port 44830:3: com.jcraft.jsch.JSchException: Auth fail for methods 'publickey,gssapi-keyex,gssapi-with-mic,password,keyboard-interactive' [preauth]
Aug 4 07:22:14 wraith sshd[1161286]: error: Received disconnect from 128.8.236.70 port 44836:3: com.jcraft.jsch.JSchException: Auth fail for methods 'publickey,gssapi-keyex,gssapi-with-mic,password,keyboard-interactive' [preauth]
Aug 4 07:22:19 wraith sshd[1161289]: error: Received disconnect from 128.8.236.70 port 44838:3: com.jcraft.jsch.JSchException: Auth fail for methods 'publickey,gssapi-keyex,gssapi-with-mic,password,keyboard-interactive' [preauth]
Aug 4 07:22:19 wraith sshd[1161306]: error: Received disconnect from 128.8.236.70 port 44844:3: com.jcraft.jsch.JSchException: Auth fail for methods 'publickey,gssapi-keyex,gssapi-with-mic,password,keyboard-interactive' [preauth]
Aug 4 07:22:22 wraith sshd[1161309]: error: Received disconnect from 128.8.236.70 port 44850:3: com.jcraft.jsch.JSchException: Auth fail for methods 'publickey,gssapi-keyex,gssapi-with-mic,password,keyboard-interactive' [preauth]
Aug 4 07:22:22 wraith sshd[1161312]: error: Received disconnect from 128.8.236.70 port 44852:3: com.jcraft.jsch.JSchException: Auth fail for methods 'publickey,gssapi-keyex,gssapi-with-mic,password,keyboard-interactive' [preauth]
Aug 4 07:22:22 wraith krb5_child[1161321]: Client 'admin(a)UMD.EDU' not found in Kerberos database [x6]
Aug 4 07:22:22 wraith sshd[1161315]: error: Received disconnect from 128.8.236.70 port 44854:3: com.jcraft.jsch.JSchException: Auth fail for methods 'publickey,gssapi-keyex,gssapi-with-mic,password,keyboard-interactive' [preauth]
Aug 4 07:22:23 wraith sshd[1161323]: error: Received disconnect from 128.8.236.70 port 44860:3: com.jcraft.jsch.JSchException: Auth fail for methods 'publickey,gssapi-keyex,gssapi-with-mic,password,keyboard-interactive' [preauth]
Aug 4 07:22:25 wraith sshd[1161326]: error: Received disconnect from 128.8.236.70 port 44862:3: com.jcraft.jsch.JSchException: Auth fail for methods 'publickey,gssapi-keyex,gssapi-with-mic,password,keyboard-interactive' [preauth]
Aug 4 07:22:25 wraith sshd[1161330]: error: Received disconnect from 128.8.236.70 port 44872:3: com.jcraft.jsch.JSchException: Auth fail for methods 'publickey,gssapi-keyex,gssapi-with-mic,password,keyboard-interactive' [preauth]
Aug 4 07:22:25 wraith sshd[1161333]: error: Received disconnect from 128.8.236.70 port 44876:3: com.jcraft.jsch.JSchException: Auth fail for methods 'publickey,gssapi-keyex,gssapi-with-mic,password,keyboard-interactive' [preauth]
Aug 4 07:22:26 wraith sshd[1161336]: error: Received disconnect from 128.8.236.70 port 44878:3: com.jcraft.jsch.JSchException: Auth fail for methods 'publickey,gssapi-keyex,gssapi-with-mic,password,keyboard-interactive' [preauth]
Aug 4 07:22:28 wraith sshd[1161341]: error: Received disconnect from 128.8.236.70 port 44880:3: com.jcraft.jsch.JSchException: Auth fail for methods 'publickey,gssapi-keyex,gssapi-with-mic,password,keyboard-interactive' [preauth]
Aug 4 07:22:28 wraith sshd[1161344]: error: Received disconnect from 128.8.236.70 port 44888:3: com.jcraft.jsch.JSchException: Auth fail for methods 'publickey,gssapi-keyex,gssapi-with-mic,password,keyboard-interactive' [preauth]
Aug 4 07:22:29 wraith sshd[1161349]: error: Received disconnect from 128.8.236.70 port 44894:3: com.jcraft.jsch.JSchException: Auth fail for methods 'publickey,gssapi-keyex,gssapi-with-mic,password,keyboard-interactive' [preauth]
Aug 4 07:22:30 wraith sshd[1161352]: error: Received disconnect from 128.8.236.70 port 44900:3: com.jcraft.jsch.JSchException: Auth fail for methods 'publickey,gssapi-keyex,gssapi-with-mic,password,keyboard-interactive' [preauth]
== yogurt (2 distinct, 2 total) ==
Aug 4 08:03:11 yogurt sshd-session[904031]: error: Received disconnect from 128.8.236.70 port 50044:3: com.jcraft.jsch.JSchException: Auth fail for methods 'publickey,gssapi-keyex,gssapi-with-mic,password' [preauth]
Aug 4 08:03:11 yogurt sshd-session[904035]: error: Received disconnect from 128.8.236.70 port 50048:3: com.jcraft.jsch.JSchException: Auth fail for methods 'publickey,gssapi-keyex,gssapi-with-mic,password' [preauth]
== zwicker-computer (20 distinct, 25 total) ==
Aug 4 07:28:38 zwicker-computer sshd[1049829]: error: Received disconnect from 128.8.236.70 port 58078:3: com.jcraft.jsch.JSchException: Auth fail for methods 'publickey,gssapi-keyex,gssapi-with-mic,password,keyboard-interactive' [preauth]
Aug 4 07:28:41 zwicker-computer sshd[1049869]: error: Received disconnect from 128.8.236.70 port 58080:3: com.jcraft.jsch.JSchException: Auth fail for methods 'publickey,gssapi-keyex,gssapi-with-mic,password,keyboard-interactive' [preauth]
Aug 4 07:28:43 zwicker-computer sshd[1049877]: error: Received disconnect from 128.8.236.70 port 58102:3: com.jcraft.jsch.JSchException: Auth fail for methods 'publickey,gssapi-keyex,gssapi-with-mic,password,keyboard-interactive' [preauth]
Aug 4 07:28:47 zwicker-computer sshd[1049899]: error: Received disconnect from 128.8.236.70 port 58106:3: com.jcraft.jsch.JSchException: Auth fail for methods 'publickey,gssapi-keyex,gssapi-with-mic,password,keyboard-interactive' [preauth]
Aug 4 07:28:47 zwicker-computer sshd[1049925]: error: Received disconnect from 128.8.236.70 port 58116:3: com.jcraft.jsch.JSchException: Auth fail for methods 'publickey,gssapi-keyex,gssapi-with-mic,password,keyboard-interactive' [preauth]
Aug 4 07:28:49 zwicker-computer sshd[1049928]: error: Received disconnect from 128.8.236.70 port 58118:3: com.jcraft.jsch.JSchException: Auth fail for methods 'publickey,gssapi-keyex,gssapi-with-mic,password,keyboard-interactive' [preauth]
Aug 4 07:28:51 zwicker-computer sshd[1049968]: error: Received disconnect from 128.8.236.70 port 58130:3: com.jcraft.jsch.JSchException: Auth fail for methods 'publickey,gssapi-keyex,gssapi-with-mic,password,keyboard-interactive' [preauth]
Aug 4 07:28:55 zwicker-computer sshd[1049972]: error: Received disconnect from 128.8.236.70 port 58138:3: com.jcraft.jsch.JSchException: Auth fail for methods 'publickey,gssapi-keyex,gssapi-with-mic,password,keyboard-interactive' [preauth]
Aug 4 07:28:59 zwicker-computer sshd[1049994]: error: Received disconnect from 128.8.236.70 port 58146:3: com.jcraft.jsch.JSchException: Auth fail for methods 'publickey,gssapi-keyex,gssapi-with-mic,password,keyboard-interactive' [preauth]
Aug 4 07:28:59 zwicker-computer krb5_child[1050056]: Client 'admin(a)UMD.EDU' not found in Kerberos database [x6]
Aug 4 07:29:02 zwicker-computer sshd[1050054]: error: Received disconnect from 128.8.236.70 port 58156:3: com.jcraft.jsch.JSchException: Auth fail for methods 'publickey,gssapi-keyex,gssapi-with-mic,password,keyboard-interactive' [preauth]
Aug 4 07:29:05 zwicker-computer sshd[1050064]: error: Received disconnect from 128.8.236.70 port 58164:3: com.jcraft.jsch.JSchException: Auth fail for methods 'publickey,gssapi-keyex,gssapi-with-mic,password,keyboard-interactive' [preauth]
Aug 4 07:29:09 zwicker-computer sshd[1050099]: error: Received disconnect from 128.8.236.70 port 58174:3: com.jcraft.jsch.JSchException: Auth fail for methods 'publickey,gssapi-keyex,gssapi-with-mic,password,keyboard-interactive' [preauth]
Aug 4 07:29:12 zwicker-computer sshd[1050141]: error: Received disconnect from 128.8.236.70 port 58180:3: com.jcraft.jsch.JSchException: Auth fail for methods 'publickey,gssapi-keyex,gssapi-with-mic,password,keyboard-interactive' [preauth]
Aug 4 07:29:15 zwicker-computer sshd[1050164]: error: Received disconnect from 128.8.236.70 port 58190:3: com.jcraft.jsch.JSchException: Auth fail for methods 'publickey,gssapi-keyex,gssapi-with-mic,password,keyboard-interactive' [preauth]
Aug 4 07:29:18 zwicker-computer sshd[1050188]: error: Received disconnect from 128.8.236.70 port 58200:3: com.jcraft.jsch.JSchException: Auth fail for methods 'publickey,gssapi-keyex,gssapi-with-mic,password,keyboard-interactive' [preauth]
Aug 4 07:29:22 zwicker-computer sshd[1050231]: error: Received disconnect from 128.8.236.70 port 58204:3: com.jcraft.jsch.JSchException: Auth fail for methods 'publickey,gssapi-keyex,gssapi-with-mic,password,keyboard-interactive' [preauth]
Aug 4 07:29:25 zwicker-computer sshd[1050248]: error: Received disconnect from 128.8.236.70 port 58230:3: com.jcraft.jsch.JSchException: Auth fail for methods 'publickey,gssapi-keyex,gssapi-with-mic,password,keyboard-interactive' [preauth]
Aug 4 07:29:30 zwicker-computer sshd[1050292]: error: Received disconnect from 128.8.236.70 port 58244:3: com.jcraft.jsch.JSchException: Auth fail for methods 'publickey,gssapi-keyex,gssapi-with-mic,password,keyboard-interactive' [preauth]
Aug 4 07:29:30 zwicker-computer sshd[1050333]: error: Received disconnect from 128.8.236.70 port 58254:3: com.jcraft.jsch.JSchException: Auth fail for methods 'publickey,gssapi-keyex,gssapi-with-mic,password,keyboard-interactive' [preauth]
1
0
Command: /usr/local/sbin/syslog-digest.py
Time : 0.7679s
Status : exited 0
Output :
Syslog digest — 2026-08-04 07:05 EDT
Processed 7,876 lines, filtered 6,847 (86%). 1,029 unknown (273 distinct) from 43 host(s).
== abadi-computer (3 distinct, 3 total) ==
Aug 4 06:15:00 abadi-computer nologin[927943]: Attempted login by UNKNOWN (UID: 65534) on UNKNOWN
Aug 4 06:15:00 abadi-computer pipewire[927941]: mod.jackdbus-detect: Failed to receive jackdbus reply: org.freedesktop.DBus.Error.ServiceUnknown: The name org.jackaudio.service was not provided by any .service files
Aug 4 06:55:35 abadi-computer sshd[932340]: error: Protocol major versions differ: 2 vs. 1
== abuse (1 distinct, 346 total) ==
Aug 4 06:05:06 abuse rsyslogd[21745]: imjournal: open() failed for path: '/var/lib/rsyslog/imjournal.state.tmp': Input/output error [v8.2404.0 try https://www.rsyslog.com/e/2433 ] [x346]
== amoeba (1 distinct, 1 total) ==
Aug 4 07:03:40 amoeba sshd-session[1443123]: error: Protocol major versions differ: 2 vs. 1
== atif01.cs.umd.edu (21 distinct, 21 total) ==
Aug 4 06:41:45 atif01.cs.umd.edu kernel: net_ratelimit: 1 callbacks suppressed
Aug 4 06:41:52 atif01.cs.umd.edu kernel: net_ratelimit: 11 callbacks suppressed
Aug 4 06:58:24 atif01.cs.umd.edu sshd[37241]: error: Received disconnect from 128.8.236.70 port 34966:3: com.jcraft.jsch.JSchException: Auth fail for methods 'publickey,gssapi-keyex,gssapi-with-mic,password' [preauth]
Aug 4 06:58:26 atif01.cs.umd.edu sshd[37254]: error: Received disconnect from 128.8.236.70 port 34978:3: com.jcraft.jsch.JSchException: Auth fail for methods 'publickey,gssapi-keyex,gssapi-with-mic,password' [preauth]
Aug 4 06:58:27 atif01.cs.umd.edu sshd[37257]: error: Received disconnect from 128.8.236.70 port 34980:3: com.jcraft.jsch.JSchException: Auth fail for methods 'publickey,gssapi-keyex,gssapi-with-mic,password' [preauth]
Aug 4 06:58:29 atif01.cs.umd.edu sshd[37261]: error: Received disconnect from 128.8.236.70 port 34992:3: com.jcraft.jsch.JSchException: Auth fail for methods 'publickey,gssapi-keyex,gssapi-with-mic,password' [preauth]
Aug 4 06:58:29 atif01.cs.umd.edu sshd[37267]: error: Received disconnect from 128.8.236.70 port 35000:3: com.jcraft.jsch.JSchException: Auth fail for methods 'publickey,gssapi-keyex,gssapi-with-mic,password' [preauth]
Aug 4 06:58:31 atif01.cs.umd.edu sshd[37271]: error: Received disconnect from 128.8.236.70 port 35002:3: com.jcraft.jsch.JSchException: Auth fail for methods 'publickey,gssapi-keyex,gssapi-with-mic,password' [preauth]
Aug 4 06:58:33 atif01.cs.umd.edu sshd[37276]: error: Received disconnect from 128.8.236.70 port 35008:3: com.jcraft.jsch.JSchException: Auth fail for methods 'publickey,gssapi-keyex,gssapi-with-mic,password' [preauth]
Aug 4 06:58:35 atif01.cs.umd.edu sshd[37280]: error: Received disconnect from 128.8.236.70 port 35016:3: com.jcraft.jsch.JSchException: Auth fail for methods 'publickey,gssapi-keyex,gssapi-with-mic,password' [preauth]
Aug 4 06:58:37 atif01.cs.umd.edu sshd[37284]: error: Received disconnect from 128.8.236.70 port 35024:3: com.jcraft.jsch.JSchException: Auth fail for methods 'publickey,gssapi-keyex,gssapi-with-mic,password' [preauth]
Aug 4 06:58:39 atif01.cs.umd.edu sshd[37288]: error: Received disconnect from 128.8.236.70 port 35040:3: com.jcraft.jsch.JSchException: Auth fail for methods 'publickey,gssapi-keyex,gssapi-with-mic,password' [preauth]
Aug 4 06:58:41 atif01.cs.umd.edu sshd[37292]: error: Received disconnect from 128.8.236.70 port 35044:3: com.jcraft.jsch.JSchException: Auth fail for methods 'publickey,gssapi-keyex,gssapi-with-mic,password' [preauth]
Aug 4 06:58:43 atif01.cs.umd.edu sshd[37298]: error: Received disconnect from 128.8.236.70 port 35066:3: com.jcraft.jsch.JSchException: Auth fail for methods 'publickey,gssapi-keyex,gssapi-with-mic,password' [preauth]
Aug 4 06:58:45 atif01.cs.umd.edu sshd[37302]: error: Received disconnect from 128.8.236.70 port 35074:3: com.jcraft.jsch.JSchException: Auth fail for methods 'publickey,gssapi-keyex,gssapi-with-mic,password' [preauth]
Aug 4 06:58:47 atif01.cs.umd.edu sshd[37306]: error: Received disconnect from 128.8.236.70 port 35080:3: com.jcraft.jsch.JSchException: Auth fail for methods 'publickey,gssapi-keyex,gssapi-with-mic,password' [preauth]
Aug 4 06:58:49 atif01.cs.umd.edu sshd[37310]: error: Received disconnect from 128.8.236.70 port 35086:3: com.jcraft.jsch.JSchException: Auth fail for methods 'publickey,gssapi-keyex,gssapi-with-mic,password' [preauth]
Aug 4 06:58:52 atif01.cs.umd.edu sshd[37314]: error: Received disconnect from 128.8.236.70 port 35090:3: com.jcraft.jsch.JSchException: Auth fail for methods 'publickey,gssapi-keyex,gssapi-with-mic,password' [preauth]
Aug 4 06:58:54 atif01.cs.umd.edu sshd[37318]: error: Received disconnect from 128.8.236.70 port 35098:3: com.jcraft.jsch.JSchException: Auth fail for methods 'publickey,gssapi-keyex,gssapi-with-mic,password' [preauth]
Aug 4 06:58:56 atif01.cs.umd.edu sshd[37321]: error: Received disconnect from 128.8.236.70 port 35104:3: com.jcraft.jsch.JSchException: Auth fail for methods 'publickey,gssapi-keyex,gssapi-with-mic,password' [preauth]
Aug 4 06:58:58 atif01.cs.umd.edu sshd[37326]: error: Received disconnect from 128.8.236.70 port 35118:3: com.jcraft.jsch.JSchException: Auth fail for methods 'publickey,gssapi-keyex,gssapi-with-mic,password' [preauth]
== b0b02.cs.umd.edu (4 distinct, 4 total) ==
Aug 4 06:39:04 b0b02.cs.umd.edu setroubleshoot[2761161]: SELinux is preventing /usr/bin/python3.9 from getattr access on the file /etc/authselect/nsswitch.conf. For complete SELinux messages run: sealert -l 9a1e2952-3fde-4937-a8ab-f7f59791a458
Aug 4 06:39:06 b0b02.cs.umd.edu setroubleshoot[2761161]: SELinux is preventing /usr/bin/python3.9 from read access on the file /etc/authselect/nsswitch.conf. For complete SELinux messages run: sealert -l 97d74423-e027-4cd6-8810-ad80944900b5
Aug 4 06:39:09 b0b02.cs.umd.edu setroubleshoot[2761161]: SELinux is preventing /usr/bin/python3.9 from open access on the file /etc/authselect/nsswitch.conf. For complete SELinux messages run: sealert -l 4f253f6a-62d6-46dd-8eaf-0b4d29df41c6
Aug 4 06:44:41 b0b02.cs.umd.edu rustdesk[2762611]: cannot open display:
== biggulp.cs.umd.edu (7 distinct, 13 total) ==
Aug 4 06:34:16 biggulp.cs.umd.edu sshd-session[2808914]: error: kex_protocol_error: type 20 seq 2 [preauth] [x2]
Aug 4 06:34:16 biggulp.cs.umd.edu sshd-session[2808914]: error: kex_protocol_error: type 30 seq 3 [preauth] [x2]
Aug 4 06:34:17 biggulp.cs.umd.edu sshd-session[2808914]: error: kex_protocol_error: type 20 seq 4 [preauth] [x2]
Aug 4 06:34:17 biggulp.cs.umd.edu sshd-session[2808914]: error: kex_protocol_error: type 30 seq 5 [preauth] [x2]
Aug 4 06:34:19 biggulp.cs.umd.edu sshd-session[2808914]: error: kex_protocol_error: type 20 seq 6 [preauth] [x2]
Aug 4 06:34:19 biggulp.cs.umd.edu sshd-session[2808914]: error: kex_protocol_error: type 30 seq 7 [preauth] [x2]
Aug 4 06:35:05 biggulp.cs.umd.edu sshd-session[2809302]: error: Protocol major versions differ: 2 vs. 1
== cheezit.cs.umd.edu (18 distinct, 25 total) ==
Aug 4 06:15:11 cheezit.cs.umd.edu sshd-session[900025]: pam_access(sshd:auth): access denied for user `root' from `116.110.0.87' [x2]
Aug 4 06:15:14 cheezit.cs.umd.edu sshd-session[900021]: error: PAM: Authentication failure for root from 116.110.0.87 [x2]
Aug 4 06:18:26 cheezit.cs.umd.edu sshd-session[900928]: pam_access(sshd:auth): access denied for user `admin' from `116.110.145.63'
Aug 4 06:18:27 cheezit.cs.umd.edu krb5_child[900931]: Client 'admin(a)UMD.EDU' not found in Kerberos database [x4]
Aug 4 06:18:27 cheezit.cs.umd.edu sshd-session[900926]: error: PAM: System error for admin from 116.110.145.63
Aug 4 06:30:29 cheezit.cs.umd.edu sshd-session[904353]: error: kex_protocol_error: type 20 seq 2 [preauth]
Aug 4 06:30:29 cheezit.cs.umd.edu sshd-session[904353]: error: kex_protocol_error: type 30 seq 3 [preauth]
Aug 4 06:30:30 cheezit.cs.umd.edu sshd-session[904353]: error: kex_protocol_error: type 20 seq 4 [preauth]
Aug 4 06:30:30 cheezit.cs.umd.edu sshd-session[904353]: error: kex_protocol_error: type 30 seq 5 [preauth]
Aug 4 06:30:32 cheezit.cs.umd.edu sshd-session[904353]: error: kex_protocol_error: type 20 seq 6 [preauth]
Aug 4 06:30:32 cheezit.cs.umd.edu sshd-session[904353]: error: kex_protocol_error: type 30 seq 7 [preauth]
Aug 4 06:33:38 cheezit.cs.umd.edu sshd-session[904920]: pam_access(sshd:auth): access denied for user `admin' from `116.99.171.175' [x2]
Aug 4 06:33:39 cheezit.cs.umd.edu sshd-session[904900]: error: PAM: System error for admin from 116.99.171.175 [x2]
Aug 4 06:35:05 cheezit.cs.umd.edu sshd-session[905032]: error: Protocol major versions differ: 2 vs. 1
Aug 4 06:38:34 cheezit.cs.umd.edu sshd-session[905919]: pam_access(sshd:auth): access denied for user `admin' from `27.79.2.21'
Aug 4 06:38:34 cheezit.cs.umd.edu sshd-session[905913]: error: PAM: System error for admin from 27.79.2.21
Aug 4 06:44:27 cheezit.cs.umd.edu sshd-session[907001]: pam_access(sshd:auth): access denied for user `ftp' from `27.79.2.21'
Aug 4 06:44:30 cheezit.cs.umd.edu sshd-session[906993]: error: PAM: Authentication failure for ftp from 27.79.2.21
== cmsc436-0101-redis (12 distinct, 19 total) ==
Aug 4 06:13:51 cmsc436-0101-redis sshd-session[789363]: error: PAM: Authentication failure for root from 116.110.0.87
Aug 4 06:21:04 cmsc436-0101-redis sshd-session[789714]: error: PAM: Authentication failure for root from 116.110.145.63
Aug 4 06:30:00 cmsc436-0101-redis krb5_child[789827]: Client 'admin(a)UMD.EDU' not found in Kerberos database [x5]
Aug 4 06:30:02 cmsc436-0101-redis sshd-session[789823]: error: PAM: Authentication failure for admin from 116.110.0.87
Aug 4 06:33:00 cmsc436-0101-redis sshd-session[790105]: error: PAM: Authentication failure for admin from 27.79.2.21 [x2]
Aug 4 06:35:05 cmsc436-0101-redis sshd-session[790137]: error: Protocol major versions differ: 2 vs. 1
Aug 4 06:36:03 cmsc436-0101-redis sshd-session[790161]: error: PAM: Authentication failure for root from 128.8.236.70 [x2]
Aug 4 06:36:03 cmsc436-0101-redis sshd-session[790161]: error: Received disconnect from 128.8.236.70 port 56378:3: com.jcraft.jsch.JSchException: Auth fail for methods 'publickey,gssapi-with-mic,keyboard-interactive' [preauth]
Aug 4 06:36:05 cmsc436-0101-redis sshd-session[790166]: error: Received disconnect from 128.8.236.70 port 56488:3: com.jcraft.jsch.JSchException: Auth fail for methods 'publickey,gssapi-with-mic,keyboard-interactive' [preauth]
Aug 4 06:38:25 cmsc436-0101-redis sshd-session[790198]: error: PAM: Authentication failure for admin from 116.99.171.175 [x2]
Aug 4 06:45:00 cmsc436-0101-redis sshd-session[790530]: error: PAM: Authentication failure for ftp from 116.99.171.175
Aug 4 06:50:58 cmsc436-0101-redis sshd-session[790866]: error: PAM: Authentication failure for root from 27.79.2.21
== contest (1 distinct, 34 total) ==
Aug 4 06:05:56 contest goferd[1007]: [ERROR][worker-0] gofer.messaging.adapter.connect:33 - connect: proton+amqps://satellite8.cs.umd.edu:5647, failed: Connection amqps://satellite8.cs.umd.edu:5647 disconnected: Condition('proton.pythonio', 'Connection refused to all addresses') [x34]
== csfw00a (1 distinct, 230 total) ==
Aug 4 06:04:51 csfw00a kernel: bnxt_en 0000:09:00.0 eth3: NIC Link is Down [x230]
== dojo (1 distinct, 1 total) ==
Aug 4 06:55:33 dojo sshd[1067970]: error: Protocol major versions differ: 2 vs. 1
== frabjous (1 distinct, 1 total) ==
Aug 4 06:55:33 frabjous sshd-session[3009228]: error: Protocol major versions differ: 2 vs. 1
== galahad.cs.umd.edu (1 distinct, 1 total) ==
Aug 4 07:03:40 galahad.cs.umd.edu sshd-session[2186340]: error: Protocol major versions differ: 2 vs. 1
== hackerman (7 distinct, 12 total) ==
Aug 4 06:20:04 hackerman gnome-software[2060381]: can't reliably fixup error code 4 in domain g-io-error-quark: Not a directory [x4]
Aug 4 06:20:12 hackerman gnome-software[2060381]: Only 0 apps for recent list, hiding
Aug 4 06:20:32 hackerman packagekitd[3716135]: Failed to get cache filename for gh
Aug 4 06:20:32 hackerman packagekitd[3716135]: Failed to get cache filename for libreoffice [x2]
Aug 4 06:20:32 hackerman packagekitd[3716135]: Failed to get cache filename for kernel [x2]
Aug 4 06:20:38 hackerman gnome-software[2060381]: failed to commit changes to dconf: GDBus.Error:org.gtk.GDBus.UnmappedGError.Quark._g_2dfile_2derror_2dquark.Code2: Failed to create file “/adminhomes/sajith/.config/dconf/user.DC6JT3”: Permission denied
Aug 4 06:20:41 hackerman packagekitd[3716135]: failed to parse public key for /etc/pki/rpm-gpg/RPM-GPG-KEY-PQC-redhat-release
== idm00 (1 distinct, 1 total) ==
Aug 4 06:51:17 idm00 named[1455]: client @0x7f330c0dc868 10.73.240.42#58844: update '73.10.in-addr.arpa/IN' denied
== idmp0 (1 distinct, 1 total) ==
Aug 4 06:36:02 idmp0 named[5198]: client @0x7f9910009828 10.73.240.43#63461: update '73.10.in-addr.arpa/IN' denied
== inbound00.cs.umd.edu (4 distinct, 9 total) ==
Aug 4 06:07:01 inbound00.cs.umd.edu systemd[1]: Configuration file /usr/lib/systemd/system/authentication_milter.service is marked executable. Please remove executable permission bits. Proceeding anyway.
Aug 4 06:21:21 inbound00.cs.umd.edu cockpit-ws[2775734]: /usr/share/cockpit/static/login.js/favicon.ico: Failed to open file “/usr/share/cockpit/static/login.js/favicon.ico”: open() failed: Not a directory [x2]
Aug 4 06:28:23 inbound00.cs.umd.edu krb5_child[2778039]: Client 'admin(a)UMD.EDU' not found in Kerberos database [x5]
Aug 4 06:55:33 inbound00.cs.umd.edu sshd-session[2784579]: error: Protocol major versions differ: 2 vs. 1
== inbound01.cs.umd.edu (3 distinct, 5 total) ==
Aug 4 06:18:04 inbound01.cs.umd.edu systemd[1]: Configuration file /usr/lib/systemd/system/authentication_milter.service is marked executable. Please remove executable permission bits. Proceeding anyway.
Aug 4 06:21:17 inbound01.cs.umd.edu cockpit-ws[789167]: /usr/share/cockpit/static/login.js/favicon.ico: Failed to open file “/usr/share/cockpit/static/login.js/favicon.ico”: open() failed: Not a directory [x3]
Aug 4 06:55:33 inbound01.cs.umd.edu sshd-session[798215]: error: Protocol major versions differ: 2 vs. 1
== itmon02 (1 distinct, 37 total) ==
Aug 4 06:07:59 itmon02 sshd[1750555]: error: beginning MaxStartups throttling [x37]
== kadath.cs.umd.edu (1 distinct, 1 total) ==
Aug 4 06:55:35 kadath.cs.umd.edu sshd-session[1875973]: error: Protocol major versions differ: 2 vs. 1
== krispykreme.cs.umd.edu (7 distinct, 13 total) ==
Aug 4 06:22:47 krispykreme.cs.umd.edu sshd-session[3113407]: error: kex_protocol_error: type 20 seq 2 [preauth] [x2]
Aug 4 06:22:47 krispykreme.cs.umd.edu sshd-session[3113407]: error: kex_protocol_error: type 30 seq 3 [preauth] [x2]
Aug 4 06:22:48 krispykreme.cs.umd.edu sshd-session[3113407]: error: kex_protocol_error: type 20 seq 4 [preauth] [x2]
Aug 4 06:22:48 krispykreme.cs.umd.edu sshd-session[3113407]: error: kex_protocol_error: type 30 seq 5 [preauth] [x2]
Aug 4 06:22:50 krispykreme.cs.umd.edu sshd-session[3113407]: error: kex_protocol_error: type 20 seq 6 [preauth] [x2]
Aug 4 06:22:50 krispykreme.cs.umd.edu sshd-session[3113407]: error: kex_protocol_error: type 30 seq 7 [preauth] [x2]
Aug 4 06:35:05 krispykreme.cs.umd.edu sshd-session[3116881]: error: Protocol major versions differ: 2 vs. 1
== matrix (4 distinct, 5 total) ==
Aug 4 06:35:05 matrix sshd[1676488]: error: Protocol major versions differ: 2 vs. 1
Aug 4 06:36:37 matrix sshd[1677945]: error: PAM: Authentication failure for root from 128.8.236.70 [x2]
Aug 4 06:36:39 matrix sshd[1677945]: error: Received disconnect from 128.8.236.70 port 55506:3: com.jcraft.jsch.JSchException: Auth fail for methods 'publickey,gssapi-keyex,gssapi-with-mic,keyboard-interactive' [preauth]
Aug 4 06:36:42 matrix sshd[1677989]: error: Received disconnect from 128.8.236.70 port 55658:3: com.jcraft.jsch.JSchException: Auth fail for methods 'publickey,gssapi-keyex,gssapi-with-mic,keyboard-interactive' [preauth]
== mcstic (4 distinct, 4 total) ==
Aug 4 06:35:05 mcstic sshd[2096709]: error: Protocol major versions differ: 2 vs. 1
Aug 4 06:36:34 mcstic sshd[2096819]: error: Received disconnect from 128.8.236.70 port 52998:3: com.jcraft.jsch.JSchException: Auth fail for methods 'publickey,gssapi-keyex,gssapi-with-mic,password,keyboard-interactive' [preauth]
Aug 4 06:36:37 mcstic sshd[2096822]: error: Received disconnect from 128.8.236.70 port 53060:3: com.jcraft.jsch.JSchException: Auth fail for methods 'publickey,gssapi-keyex,gssapi-with-mic,password,keyboard-interactive' [preauth]
Aug 4 06:36:41 mcstic sshd[2096828]: error: Received disconnect from 128.8.236.70 port 53130:3: com.jcraft.jsch.JSchException: Auth fail for methods 'publickey,gssapi-keyex,gssapi-with-mic,password,keyboard-interactive' [preauth]
== neoavion (1 distinct, 1 total) ==
Aug 4 07:03:40 neoavion sshd[3389334]: error: Protocol major versions differ: 2 vs. 1
== neodontcare.cs.umd.edu (6 distinct, 8 total) ==
Aug 4 06:13:30 neodontcare.cs.umd.edu gnome-software[7556]: Only 0 apps for recent list, hiding
Aug 4 06:13:34 neodontcare.cs.umd.edu packagekitd[2183805]: Failed to get cache filename for gnu-free-mono-fonts
Aug 4 06:13:34 neodontcare.cs.umd.edu packagekitd[2183805]: Failed to get cache filename for gnu-free-serif-fonts
Aug 4 06:13:34 neodontcare.cs.umd.edu packagekitd[2183805]: Failed to get cache filename for libreoffice [x3]
Aug 4 06:13:38 neodontcare.cs.umd.edu packagekitd[2183805]: failed to parse public key for /etc/pki/rpm-gpg/RPM-GPG-KEY-PQC-redhat-release
Aug 4 07:03:40 neodontcare.cs.umd.edu sshd-session[2193638]: error: Protocol major versions differ: 2 vs. 1
== netman.cs.umd.edu (21 distinct, 42 total) ==
Aug 4 06:18:24 netman.cs.umd.edu krb5_child[606288]: Client 'admin(a)UMD.EDU' not found in Kerberos database [x22]
Aug 4 06:35:05 netman.cs.umd.edu sshd[610583]: error: Protocol major versions differ: 2 vs. 1
Aug 4 06:35:42 netman.cs.umd.edu sshd[611303]: error: Received disconnect from 128.8.236.70 port 36422:3: com.jcraft.jsch.JSchException: Auth fail for methods 'publickey,gssapi-keyex,gssapi-with-mic,password,keyboard-interactive' [preauth]
Aug 4 06:35:45 netman.cs.umd.edu sshd[611356]: error: Received disconnect from 128.8.236.70 port 37492:3: com.jcraft.jsch.JSchException: Auth fail for methods 'publickey,gssapi-keyex,gssapi-with-mic,password,keyboard-interactive' [preauth]
Aug 4 06:35:46 netman.cs.umd.edu sshd[611361]: error: Received disconnect from 128.8.236.70 port 37572:3: com.jcraft.jsch.JSchException: Auth fail for methods 'publickey,gssapi-keyex,gssapi-with-mic,password,keyboard-interactive' [preauth]
Aug 4 06:35:49 netman.cs.umd.edu sshd[611365]: error: Received disconnect from 128.8.236.70 port 37576:3: com.jcraft.jsch.JSchException: Auth fail for methods 'publickey,gssapi-keyex,gssapi-with-mic,password,keyboard-interactive' [preauth]
Aug 4 06:35:49 netman.cs.umd.edu sshd[611369]: error: Received disconnect from 128.8.236.70 port 37704:3: com.jcraft.jsch.JSchException: Auth fail for methods 'publickey,gssapi-keyex,gssapi-with-mic,password,keyboard-interactive' [preauth]
Aug 4 06:35:52 netman.cs.umd.edu sshd[611372]: error: Received disconnect from 128.8.236.70 port 37712:3: com.jcraft.jsch.JSchException: Auth fail for methods 'publickey,gssapi-keyex,gssapi-with-mic,password,keyboard-interactive' [preauth]
Aug 4 06:35:55 netman.cs.umd.edu sshd[611376]: error: Received disconnect from 128.8.236.70 port 38144:3: com.jcraft.jsch.JSchException: Auth fail for methods 'publickey,gssapi-keyex,gssapi-with-mic,password,keyboard-interactive' [preauth]
Aug 4 06:35:58 netman.cs.umd.edu sshd[611380]: error: Received disconnect from 128.8.236.70 port 38454:3: com.jcraft.jsch.JSchException: Auth fail for methods 'publickey,gssapi-keyex,gssapi-with-mic,password,keyboard-interactive' [preauth]
Aug 4 06:36:01 netman.cs.umd.edu sshd[611384]: error: Received disconnect from 128.8.236.70 port 38476:3: com.jcraft.jsch.JSchException: Auth fail for methods 'publickey,gssapi-keyex,gssapi-with-mic,password,keyboard-interactive' [preauth]
Aug 4 06:36:05 netman.cs.umd.edu sshd[611387]: error: Received disconnect from 128.8.236.70 port 38484:3: com.jcraft.jsch.JSchException: Auth fail for methods 'publickey,gssapi-keyex,gssapi-with-mic,password,keyboard-interactive' [preauth]
Aug 4 06:36:08 netman.cs.umd.edu sshd[611430]: error: Received disconnect from 128.8.236.70 port 38782:3: com.jcraft.jsch.JSchException: Auth fail for methods 'publickey,gssapi-keyex,gssapi-with-mic,password,keyboard-interactive' [preauth]
Aug 4 06:36:10 netman.cs.umd.edu sshd[611433]: error: Received disconnect from 128.8.236.70 port 38824:3: com.jcraft.jsch.JSchException: Auth fail for methods 'publickey,gssapi-keyex,gssapi-with-mic,password,keyboard-interactive' [preauth]
Aug 4 06:36:14 netman.cs.umd.edu sshd[611437]: error: Received disconnect from 128.8.236.70 port 38992:3: com.jcraft.jsch.JSchException: Auth fail for methods 'publickey,gssapi-keyex,gssapi-with-mic,password,keyboard-interactive' [preauth]
Aug 4 06:36:17 netman.cs.umd.edu sshd[611441]: error: Received disconnect from 128.8.236.70 port 39282:3: com.jcraft.jsch.JSchException: Auth fail for methods 'publickey,gssapi-keyex,gssapi-with-mic,password,keyboard-interactive' [preauth]
Aug 4 06:36:19 netman.cs.umd.edu sshd[611659]: error: Received disconnect from 128.8.236.70 port 39444:3: com.jcraft.jsch.JSchException: Auth fail for methods 'publickey,gssapi-keyex,gssapi-with-mic,password,keyboard-interactive' [preauth]
Aug 4 06:36:22 netman.cs.umd.edu sshd[611684]: error: Received disconnect from 128.8.236.70 port 39584:3: com.jcraft.jsch.JSchException: Auth fail for methods 'publickey,gssapi-keyex,gssapi-with-mic,password,keyboard-interactive' [preauth]
Aug 4 06:36:27 netman.cs.umd.edu sshd[611718]: error: Received disconnect from 128.8.236.70 port 39714:3: com.jcraft.jsch.JSchException: Auth fail for methods 'publickey,gssapi-keyex,gssapi-with-mic,password,keyboard-interactive' [preauth]
Aug 4 06:36:30 netman.cs.umd.edu sshd[611802]: error: Received disconnect from 128.8.236.70 port 40118:3: com.jcraft.jsch.JSchException: Auth fail for methods 'publickey,gssapi-keyex,gssapi-with-mic,password,keyboard-interactive' [preauth]
Aug 4 06:36:31 netman.cs.umd.edu sshd[611805]: error: Received disconnect from 128.8.236.70 port 40278:3: com.jcraft.jsch.JSchException: Auth fail for methods 'publickey,gssapi-keyex,gssapi-with-mic,password,keyboard-interactive' [preauth]
== newhonors.cs.umd.edu (23 distinct, 23 total) ==
Aug 4 06:37:42 newhonors.cs.umd.edu sshd[31392]: fatal: Unable to negotiate with 128.8.236.70 port 48198: no matching host key type found. Their offer: ssh-dss [preauth]
Aug 4 06:37:43 newhonors.cs.umd.edu sshd[31398]: fatal: Unable to negotiate with 128.8.236.70 port 48358: no matching host key type found. Their offer: ecdsa-sha2-nistp384 [preauth]
Aug 4 06:37:43 newhonors.cs.umd.edu sshd[31400]: fatal: Unable to negotiate with 128.8.236.70 port 48398: no matching host key type found. Their offer: ecdsa-sha2-nistp521 [preauth]
Aug 4 07:01:40 newhonors.cs.umd.edu sshd[31677]: fatal: ssh_dispatch_run_fatal: Connection from 128.8.236.70 port 46948: message authentication code incorrect [preauth]
Aug 4 07:01:42 newhonors.cs.umd.edu sshd[31680]: error: Received disconnect from 128.8.236.70 port 46950:3: com.jcraft.jsch.JSchException: Auth fail for methods 'publickey,password' [preauth]
Aug 4 07:01:43 newhonors.cs.umd.edu sshd[31683]: error: Received disconnect from 128.8.236.70 port 46958:3: com.jcraft.jsch.JSchException: Auth fail for methods 'publickey,password' [preauth]
Aug 4 07:01:45 newhonors.cs.umd.edu sshd[31686]: error: Received disconnect from 128.8.236.70 port 46972:3: com.jcraft.jsch.JSchException: Auth fail for methods 'publickey,password' [preauth]
Aug 4 07:01:47 newhonors.cs.umd.edu sshd[31689]: error: Received disconnect from 128.8.236.70 port 46976:3: com.jcraft.jsch.JSchException: Auth fail for methods 'publickey,password' [preauth]
Aug 4 07:01:47 newhonors.cs.umd.edu sshd[31692]: error: Received disconnect from 128.8.236.70 port 46994:3: com.jcraft.jsch.JSchException: Auth fail for methods 'publickey,password' [preauth]
Aug 4 07:01:49 newhonors.cs.umd.edu sshd[31695]: error: Received disconnect from 128.8.236.70 port 46996:3: com.jcraft.jsch.JSchException: Auth fail for methods 'publickey,password' [preauth]
Aug 4 07:01:52 newhonors.cs.umd.edu sshd[31698]: error: Received disconnect from 128.8.236.70 port 47002:3: com.jcraft.jsch.JSchException: Auth fail for methods 'publickey,password' [preauth]
Aug 4 07:01:53 newhonors.cs.umd.edu sshd[31701]: error: Received disconnect from 128.8.236.70 port 47010:3: com.jcraft.jsch.JSchException: Auth fail for methods 'publickey,password' [preauth]
Aug 4 07:01:55 newhonors.cs.umd.edu sshd[31704]: error: Received disconnect from 128.8.236.70 port 47024:3: com.jcraft.jsch.JSchException: Auth fail for methods 'publickey,password' [preauth]
Aug 4 07:01:58 newhonors.cs.umd.edu sshd[31707]: error: Received disconnect from 128.8.236.70 port 47032:3: com.jcraft.jsch.JSchException: Auth fail for methods 'publickey,password' [preauth]
Aug 4 07:02:00 newhonors.cs.umd.edu sshd[31710]: error: Received disconnect from 128.8.236.70 port 47046:3: com.jcraft.jsch.JSchException: Auth fail for methods 'publickey,password' [preauth]
Aug 4 07:02:03 newhonors.cs.umd.edu sshd[31713]: error: Received disconnect from 128.8.236.70 port 47054:3: com.jcraft.jsch.JSchException: Auth fail for methods 'publickey,password' [preauth]
Aug 4 07:02:04 newhonors.cs.umd.edu sshd[31716]: error: Received disconnect from 128.8.236.70 port 47064:3: com.jcraft.jsch.JSchException: Auth fail for methods 'publickey,password' [preauth]
Aug 4 07:02:06 newhonors.cs.umd.edu sshd[31719]: error: Received disconnect from 128.8.236.70 port 47071:3: com.jcraft.jsch.JSchException: Auth fail for methods 'publickey,password' [preauth]
Aug 4 07:02:08 newhonors.cs.umd.edu sshd[31722]: error: Received disconnect from 128.8.236.70 port 47076:3: com.jcraft.jsch.JSchException: Auth fail for methods 'publickey,password' [preauth]
Aug 4 07:02:10 newhonors.cs.umd.edu sshd[31725]: error: Received disconnect from 128.8.236.70 port 47086:3: com.jcraft.jsch.JSchException: Auth fail for methods 'publickey,password' [preauth]
Aug 4 07:02:12 newhonors.cs.umd.edu sshd[31728]: error: Received disconnect from 128.8.236.70 port 47092:3: com.jcraft.jsch.JSchException: Auth fail for methods 'publickey,password' [preauth]
Aug 4 07:02:14 newhonors.cs.umd.edu sshd[31731]: error: Received disconnect from 128.8.236.70 port 47098:3: com.jcraft.jsch.JSchException: Auth fail for methods 'publickey,password' [preauth]
Aug 4 07:02:14 newhonors.cs.umd.edu sshd[31735]: error: Received disconnect from 128.8.236.70 port 47134:3: com.jcraft.jsch.JSchException: Auth fail for methods 'publickey,password' [preauth]
== newhonors2 (38 distinct, 65 total) ==
Aug 4 06:13:03 newhonors2 dhcpcd[713640]: dhcpcd is not running [x28]
Aug 4 06:48:17 newhonors2 puppet-agent[714780]: Could not update: Execution of '/usr/bin/apt-get -q -y -o DPkg::Options::=--force-confold --force-yes install openvox-agent=8.27.0-1+ubuntu24.04' returned 100: Reading package lists...
Aug 4 06:48:17 newhonors2 puppet-agent[714780]: Building dependency tree...
Aug 4 06:48:17 newhonors2 puppet-agent[714780]: Reading state information...
Aug 4 06:48:17 newhonors2 puppet-agent[714780]: Package openvox-agent is not available, but is referred to by another package.
Aug 4 06:48:17 newhonors2 puppet-agent[714780]: This may mean that the package is missing, has been obsoleted, or
Aug 4 06:48:17 newhonors2 puppet-agent[714780]: is only available from another source
Aug 4 06:48:17 newhonors2 puppet-agent[714780]:
Aug 4 06:48:17 newhonors2 puppet-agent[714780]: W: --force-yes is deprecated, use one of the options starting with --allow instead.
Aug 4 06:48:17 newhonors2 puppet-agent[714780]: E: Version '8.27.0-1+ubuntu24.04' for 'openvox-agent' was not found
Aug 4 06:48:17 newhonors2 puppet-agent[714780]: (/Stage[main]/Puppet::Agent::Install/Package[openvox-agent]/ensure) change from '7.37.2-1+ubuntu24.04' to '8.27.0-1+ubuntu24.04' failed: Could not update: Execution of '/usr/bin/apt-get -q -y -o DPkg::Options::=--force-confold --force-yes install openvox-agent=8.27.0-1+ubuntu24.04' returned 100: Reading package lists...
Aug 4 06:48:17 newhonors2 puppet-agent[714780]: (/Stage[main]/Puppet::Agent::Install/Package[openvox-agent]/ensure) Building dependency tree...
Aug 4 06:48:17 newhonors2 puppet-agent[714780]: (/Stage[main]/Puppet::Agent::Install/Package[openvox-agent]/ensure) Reading state information...
Aug 4 06:48:17 newhonors2 puppet-agent[714780]: (/Stage[main]/Puppet::Agent::Install/Package[openvox-agent]/ensure) Package openvox-agent is not available, but is referred to by another package.
Aug 4 06:48:17 newhonors2 puppet-agent[714780]: (/Stage[main]/Puppet::Agent::Install/Package[openvox-agent]/ensure) This may mean that the package is missing, has been obsoleted, or
Aug 4 06:48:17 newhonors2 puppet-agent[714780]: (/Stage[main]/Puppet::Agent::Install/Package[openvox-agent]/ensure) is only available from another source
Aug 4 06:48:17 newhonors2 puppet-agent[714780]: (/Stage[main]/Puppet::Agent::Install/Package[openvox-agent]/ensure)
Aug 4 06:48:17 newhonors2 puppet-agent[714780]: (/Stage[main]/Puppet::Agent::Install/Package[openvox-agent]/ensure) W: --force-yes is deprecated, use one of the options starting with --allow instead.
Aug 4 06:48:17 newhonors2 puppet-agent[714780]: (/Stage[main]/Puppet::Agent::Install/Package[openvox-agent]/ensure) E: Version '8.27.0-1+ubuntu24.04' for 'openvox-agent' was not found
Aug 4 06:48:41 newhonors2 puppet-agent[714780]: (/Stage[main]/Puppet::Agent::Config/Puppet::Config::Agent[classfile]/Puppet::Config::Entry[agent_classfile]/Concat::Fragment[puppet.conf_agent]/Concat_fragment[puppet.conf_agent]) Skipping because of failed dependencies
Aug 4 06:48:41 newhonors2 puppet-agent[714780]: (/Stage[main]/Puppet::Agent::Config/Puppet::Config::Agent[classfile]/Puppet::Config::Entry[agent_classfile]/Concat::Fragment[puppet.conf_agent_end]/Concat_fragment[puppet.conf_agent_end]) Skipping because of failed dependencies
Aug 4 06:48:41 newhonors2 puppet-agent[714780]: (/Stage[main]/Puppet::Agent::Config/Puppet::Config::Agent[classfile]/Puppet::Config::Entry[agent_classfile]/Concat::Fragment[puppet.conf_agent_classfile]/Concat_fragment[puppet.conf_agent_classfile]) Skipping because of failed dependencies
Aug 4 06:48:41 newhonors2 puppet-agent[714780]: (/Stage[main]/Puppet::Agent::Config/Puppet::Config::Agent[default_schedules]/Puppet::Config::Entry[agent_default_schedules]/Concat::Fragment[puppet.conf_agent_default_schedules]/Concat_fragment[puppet.conf_agent_default_schedules]) Skipping because of failed dependencies
Aug 4 06:48:41 newhonors2 puppet-agent[714780]: (/Stage[main]/Puppet::Agent::Config/Puppet::Config::Agent[report]/Puppet::Config::Entry[agent_report]/Concat::Fragment[puppet.conf_agent_report]/Concat_fragment[puppet.conf_agent_report]) Skipping because of failed dependencies
Aug 4 06:48:41 newhonors2 puppet-agent[714780]: (/Stage[main]/Puppet::Agent::Config/Puppet::Config::Agent[masterport]/Puppet::Config::Entry[agent_masterport]/Concat::Fragment[puppet.conf_agent_masterport]/Concat_fragment[puppet.conf_agent_masterport]) Skipping because of failed dependencies
Aug 4 06:48:41 newhonors2 puppet-agent[714780]: (/Stage[main]/Puppet::Agent::Config/Puppet::Config::Agent[splay]/Puppet::Config::Entry[agent_splay]/Concat::Fragment[puppet.conf_agent_splay]/Concat_fragment[puppet.conf_agent_splay]) Skipping because of failed dependencies
Aug 4 06:48:41 newhonors2 puppet-agent[714780]: (/Stage[main]/Puppet::Agent::Config/Puppet::Config::Agent[splaylimit]/Puppet::Config::Entry[agent_splaylimit]/Concat::Fragment[puppet.conf_agent_splaylimit]/Concat_fragment[puppet.conf_agent_splaylimit]) Skipping because of failed dependencies
Aug 4 06:48:41 newhonors2 puppet-agent[714780]: (/Stage[main]/Puppet::Agent::Config/Puppet::Config::Agent[runinterval]/Puppet::Config::Entry[agent_runinterval]/Concat::Fragment[puppet.conf_agent_runinterval]/Concat_fragment[puppet.conf_agent_runinterval]) Skipping because of failed dependencies
Aug 4 06:48:41 newhonors2 puppet-agent[714780]: (/Stage[main]/Puppet::Agent::Config/Puppet::Config::Agent[noop]/Puppet::Config::Entry[agent_noop]/Concat::Fragment[puppet.conf_agent_noop]/Concat_fragment[puppet.conf_agent_noop]) Skipping because of failed dependencies
Aug 4 06:48:41 newhonors2 puppet-agent[714780]: (/Stage[main]/Puppet::Agent::Config/Puppet::Config::Agent[usecacheonfailure]/Puppet::Config::Entry[agent_usecacheonfailure]/Concat::Fragment[puppet.conf_agent_usecacheonfailure]/Concat_fragment[puppet.conf_agent_usecacheonfailure]) Skipping because of failed dependencies
... 8 more distinct messages not shown
== orchids (3 distinct, 3 total) ==
Aug 4 06:11:31 orchids gnome-software[1516991]: Only 0 apps for recent list, hiding
Aug 4 06:11:34 orchids packagekitd[2865607]: Failed to get cache filename for libreoffice
Aug 4 06:11:36 orchids packagekitd[2865607]: failed to parse public key for /etc/pki/rpm-gpg/RPM-GPG-KEY-PQC-redhat-release
== outbound00.cs.umd.edu (8 distinct, 14 total) ==
Aug 4 06:09:09 outbound00.cs.umd.edu python3[2731519]: ldapdb [x6]
Aug 4 06:17:07 outbound00.cs.umd.edu cockpit-ws[2733151]: /usr/share/cockpit/static/login.js/favicon.ico: Failed to open file “/usr/share/cockpit/static/login.js/favicon.ico”: open() failed: Not a directory [x2]
Aug 4 06:35:05 outbound00.cs.umd.edu sshd-session[2737938]: error: Protocol major versions differ: 2 vs. 1
Aug 4 06:36:46 outbound00.cs.umd.edu sshd-session[2738851]: error: Received disconnect from 128.8.236.70 port 44814:3: com.jcraft.jsch.JSchException: Auth fail for methods 'publickey,gssapi-keyex,gssapi-with-mic,password' [preauth]
Aug 4 06:36:50 outbound00.cs.umd.edu sshd-session[2738857]: error: Received disconnect from 128.8.236.70 port 44820:3: com.jcraft.jsch.JSchException: Auth fail for methods 'publickey,gssapi-keyex,gssapi-with-mic,password' [preauth]
Aug 4 06:36:54 outbound00.cs.umd.edu sshd-session[2738860]: error: Received disconnect from 128.8.236.70 port 44836:3: com.jcraft.jsch.JSchException: Auth fail for methods 'publickey,gssapi-keyex,gssapi-with-mic,password' [preauth]
Aug 4 06:36:57 outbound00.cs.umd.edu sshd-session[2738865]: error: Received disconnect from 128.8.236.70 port 44850:3: com.jcraft.jsch.JSchException: Auth fail for methods 'publickey,gssapi-keyex,gssapi-with-mic,password' [preauth]
Aug 4 06:36:57 outbound00.cs.umd.edu sshd-session[2738872]: error: Received disconnect from 128.8.236.70 port 45044:3: com.jcraft.jsch.JSchException: Auth fail for methods 'publickey,gssapi-keyex,gssapi-with-mic,password' [preauth]
== outbound01.cs.umd.edu (8 distinct, 14 total) ==
Aug 4 06:13:06 outbound01.cs.umd.edu python3[765616]: ldapdb [x6]
Aug 4 06:31:20 outbound01.cs.umd.edu cockpit-ws[770123]: /usr/share/cockpit/static/login.js/favicon.ico: Failed to open file “/usr/share/cockpit/static/login.js/favicon.ico”: open() failed: Not a directory [x2]
Aug 4 06:35:05 outbound01.cs.umd.edu sshd-session[771052]: error: Protocol major versions differ: 2 vs. 1
Aug 4 06:37:19 outbound01.cs.umd.edu sshd-session[772012]: error: Received disconnect from 128.8.236.70 port 33134:3: com.jcraft.jsch.JSchException: Auth fail for methods 'publickey,gssapi-keyex,gssapi-with-mic,password' [preauth]
Aug 4 06:37:23 outbound01.cs.umd.edu sshd-session[772016]: error: Received disconnect from 128.8.236.70 port 33312:3: com.jcraft.jsch.JSchException: Auth fail for methods 'publickey,gssapi-keyex,gssapi-with-mic,password' [preauth]
Aug 4 06:37:27 outbound01.cs.umd.edu sshd-session[772020]: error: Received disconnect from 128.8.236.70 port 34002:3: com.jcraft.jsch.JSchException: Auth fail for methods 'publickey,gssapi-keyex,gssapi-with-mic,password' [preauth]
Aug 4 06:37:31 outbound01.cs.umd.edu sshd-session[772028]: error: Received disconnect from 128.8.236.70 port 34058:3: com.jcraft.jsch.JSchException: Auth fail for methods 'publickey,gssapi-keyex,gssapi-with-mic,password' [preauth]
Aug 4 06:37:31 outbound01.cs.umd.edu sshd-session[772032]: error: Received disconnect from 128.8.236.70 port 34240:3: com.jcraft.jsch.JSchException: Auth fail for methods 'publickey,gssapi-keyex,gssapi-with-mic,password' [preauth]
== peach.cs.umd.edu (1 distinct, 1 total) ==
Aug 4 07:03:40 peach.cs.umd.edu sshd-session[773229]: error: Protocol major versions differ: 2 vs. 1
== sebatinsky.cs.umd.edu (1 distinct, 1 total) ==
Aug 4 06:25:53 sebatinsky.cs.umd.edu kernel: hpet1: lost 7 rtc interrupts
== sentry-docker00.cs.umd.edu (34 distinct, 34 total) ==
Aug 4 06:08:03 sentry-docker00.cs.umd.edu systemd-udevd[1561791]: link_config: could not get ethtool features for veth65786ee
Aug 4 06:08:03 sentry-docker00.cs.umd.edu systemd-udevd[1561791]: Could not set offload features of veth65786ee: No such device
Aug 4 06:08:03 sentry-docker00.cs.umd.edu systemd-udevd[1561824]: Could not generate persistent MAC address for veth7996a73: No such file or directory
Aug 4 06:08:03 sentry-docker00.cs.umd.edu systemd-udevd[1561825]: Could not generate persistent MAC address for vethf3ea33b: No such file or directory
Aug 4 06:08:03 sentry-docker00.cs.umd.edu systemd-udevd[1561828]: Could not generate persistent MAC address for veth2478868: No such file or directory
Aug 4 06:08:03 sentry-docker00.cs.umd.edu systemd-udevd[1561829]: Could not generate persistent MAC address for veth3b301f3: No such file or directory
Aug 4 06:08:03 sentry-docker00.cs.umd.edu systemd-udevd[1561835]: Could not generate persistent MAC address for vethe05bef3: No such file or directory
Aug 4 06:08:03 sentry-docker00.cs.umd.edu systemd-udevd[1561825]: Could not generate persistent MAC address for vethd7e0dba: No such file or directory
Aug 4 06:08:03 sentry-docker00.cs.umd.edu systemd-udevd[1561854]: Could not generate persistent MAC address for veth5953e17: No such file or directory
Aug 4 06:08:03 sentry-docker00.cs.umd.edu systemd-udevd[1561855]: Could not generate persistent MAC address for vethe831f3d: No such file or directory
Aug 4 06:08:03 sentry-docker00.cs.umd.edu systemd-udevd[1561888]: Could not generate persistent MAC address for veth2e752b1: No such file or directory
Aug 4 06:08:03 sentry-docker00.cs.umd.edu systemd-udevd[1561909]: Could not generate persistent MAC address for vethb4b1510: No such file or directory
Aug 4 06:28:11 sentry-docker00.cs.umd.edu systemd-udevd[1572161]: link_config: could not get ethtool features for veth2e752b1
Aug 4 06:28:11 sentry-docker00.cs.umd.edu systemd-udevd[1572161]: Could not set offload features of veth2e752b1: No such device
Aug 4 06:28:11 sentry-docker00.cs.umd.edu systemd-udevd[1572196]: Could not generate persistent MAC address for veth0bba8e7: No such file or directory
Aug 4 06:28:11 sentry-docker00.cs.umd.edu systemd-udevd[1572199]: Could not generate persistent MAC address for veth7b327a3: No such file or directory
Aug 4 06:28:11 sentry-docker00.cs.umd.edu systemd-udevd[1572201]: Could not generate persistent MAC address for vethb58a81b: No such file or directory
Aug 4 06:28:11 sentry-docker00.cs.umd.edu systemd-udevd[1572197]: Could not generate persistent MAC address for vethe15e48c: No such file or directory
Aug 4 06:28:11 sentry-docker00.cs.umd.edu systemd-udevd[1572222]: Could not generate persistent MAC address for vethfcd9f96: No such file or directory
Aug 4 06:28:11 sentry-docker00.cs.umd.edu systemd-udevd[1572223]: Could not generate persistent MAC address for vethe3c7a72: No such file or directory
Aug 4 06:28:11 sentry-docker00.cs.umd.edu systemd-udevd[1572216]: Could not generate persistent MAC address for veth388c23a: No such file or directory
Aug 4 06:28:11 sentry-docker00.cs.umd.edu systemd-udevd[1572214]: Could not generate persistent MAC address for vethdbf0f71: No such file or directory
Aug 4 06:28:12 sentry-docker00.cs.umd.edu systemd-udevd[1572223]: Could not generate persistent MAC address for vethd125858: No such file or directory
Aug 4 06:28:12 sentry-docker00.cs.umd.edu systemd-udevd[1572202]: Could not generate persistent MAC address for veth1bb5f18: No such file or directory
Aug 4 06:48:20 sentry-docker00.cs.umd.edu systemd-udevd[1581617]: Could not generate persistent MAC address for vethb33fc65: No such file or directory
Aug 4 06:48:20 sentry-docker00.cs.umd.edu systemd-udevd[1581618]: Could not generate persistent MAC address for veth4ec73ab: No such file or directory
Aug 4 06:48:20 sentry-docker00.cs.umd.edu systemd-udevd[1581636]: Could not generate persistent MAC address for veth38ba591: No such file or directory
Aug 4 06:48:20 sentry-docker00.cs.umd.edu systemd-udevd[1581637]: Could not generate persistent MAC address for veth8ca051b: No such file or directory
Aug 4 06:48:20 sentry-docker00.cs.umd.edu systemd-udevd[1581645]: Could not generate persistent MAC address for veth308f231: No such file or directory
Aug 4 06:48:20 sentry-docker00.cs.umd.edu systemd-udevd[1581646]: Could not generate persistent MAC address for veth9ee90cc: No such file or directory
... 4 more distinct messages not shown
== soul (5 distinct, 11 total) ==
Aug 4 06:17:57 soul krb5_child[3513956]: Client 'admin(a)UMD.EDU' not found in Kerberos database [x7]
Aug 4 06:35:08 soul sshd-session[3516857]: error: Protocol major versions differ: 2 vs. 1
Aug 4 06:55:15 soul sshd-session[3519318]: error: Received disconnect from 128.8.236.70 port 41506:3: com.jcraft.jsch.JSchException: Auth fail for methods 'publickey,gssapi-keyex,gssapi-with-mic,password' [preauth]
Aug 4 06:55:16 soul sshd-session[3519322]: error: Received disconnect from 128.8.236.70 port 41514:3: com.jcraft.jsch.JSchException: Auth fail for methods 'publickey,gssapi-keyex,gssapi-with-mic,password' [preauth]
Aug 4 06:55:18 soul sshd-session[3519325]: error: Received disconnect from 128.8.236.70 port 41534:3: com.jcraft.jsch.JSchException: Auth fail for methods 'publickey,gssapi-keyex,gssapi-with-mic,password' [preauth]
== strawberry (5 distinct, 11 total) ==
Aug 4 06:09:44 strawberry udisksd[1067]: Error performing housekeeping for drive /org/freedesktop/UDisks2/drives/ST2000DM001_1CH164_W1E8J5KJ: Error updating SMART data: Error sending ATA command CHECK POWER MODE: Unexpected sense data returned:#0120000: 00 00 00 00 00 00 00 00 00 00 00 00 00 00 00 00 ................#0120010: 00 00 00 00 00 00 00 00 00 00 00 00 00 00 00 00 ................#012 (g-io-error-quark, 0) [x6]
Aug 4 06:31:04 strawberry nologin[3523984]: Attempted login by UNKNOWN (UID: 65534) on UNKNOWN
Aug 4 06:31:04 strawberry pipewire[3523983]: mod.jackdbus-detect: Failed to receive jackdbus reply: org.freedesktop.DBus.Error.ServiceUnknown: The name org.jackaudio.service was not provided by any .service files
Aug 4 06:34:42 strawberry smartd[5314]: Device: /dev/sda [SAT], failed to read SMART Attribute Data [x2]
Aug 4 06:55:35 strawberry sshd[3525513]: error: Protocol major versions differ: 2 vs. 1
== stuckeys (1 distinct, 1 total) ==
Aug 4 06:55:33 stuckeys sshd-session[1925510]: error: Protocol major versions differ: 2 vs. 1
== teaching-awards (4 distinct, 4 total) ==
Aug 4 06:35:05 teaching-awards sshd-session[1855871]: error: Protocol major versions differ: 2 vs. 1
Aug 4 06:36:33 teaching-awards sshd-session[1855903]: error: Received disconnect from 128.8.236.70 port 55858:3: com.jcraft.jsch.JSchException: Auth fail for methods 'publickey,gssapi-keyex,gssapi-with-mic,password' [preauth]
Aug 4 06:36:37 teaching-awards sshd-session[1855907]: error: Received disconnect from 128.8.236.70 port 55924:3: com.jcraft.jsch.JSchException: Auth fail for methods 'publickey,gssapi-keyex,gssapi-with-mic,password' [preauth]
Aug 4 06:36:40 teaching-awards sshd-session[1855910]: error: Received disconnect from 128.8.236.70 port 55994:3: com.jcraft.jsch.JSchException: Auth fail for methods 'publickey,gssapi-keyex,gssapi-with-mic,password' [preauth]
== tlsrpt (1 distinct, 1 total) ==
Aug 4 06:38:03 tlsrpt (httpd)[655554]: httpd.service: Referenced but unset environment variable evaluates to an empty string: OPTIONS
== tma-0 (5 distinct, 5 total) ==
Aug 4 06:36:36 tma-0 sshd[11286]: error: Received disconnect from 128.8.236.70 port 60444:3: com.jcraft.jsch.JSchException: Auth fail for methods 'publickey,gssapi-keyex,gssapi-with-mic,password,keyboard-interactive' [preauth]
Aug 4 06:36:38 tma-0 sshd[11292]: error: Received disconnect from 128.8.236.70 port 60464:3: com.jcraft.jsch.JSchException: Auth fail for methods 'publickey,gssapi-keyex,gssapi-with-mic,password,keyboard-interactive' [preauth]
Aug 4 06:36:40 tma-0 sshd[11295]: error: Received disconnect from 128.8.236.70 port 60526:3: com.jcraft.jsch.JSchException: Auth fail for methods 'publickey,gssapi-keyex,gssapi-with-mic,password,keyboard-interactive' [preauth]
Aug 4 06:36:42 tma-0 sshd[11300]: error: Received disconnect from 128.8.236.70 port 60620:3: com.jcraft.jsch.JSchException: Auth fail for methods 'publickey,gssapi-keyex,gssapi-with-mic,password,keyboard-interactive' [preauth]
Aug 4 06:36:42 tma-0 sshd[11304]: error: Received disconnect from 128.8.236.70 port 60630:3: com.jcraft.jsch.JSchException: Auth fail for methods 'publickey,gssapi-keyex,gssapi-with-mic,password,keyboard-interactive' [preauth]
== wraith (1 distinct, 1 total) ==
Aug 4 06:55:33 wraith sshd[1159885]: error: Protocol major versions differ: 2 vs. 1
== yogurt (1 distinct, 1 total) ==
Aug 4 07:03:40 yogurt sshd-session[895072]: error: Protocol major versions differ: 2 vs. 1
== zwicker-computer (1 distinct, 1 total) ==
Aug 4 06:55:35 zwicker-computer sshd[1030553]: error: Protocol major versions differ: 2 vs. 1
1
0
Command: /usr/local/sbin/syslog-digest.py
Time : 0.5145s
Status : exited 0
Output :
Syslog digest — 2026-08-04 06:05 EDT
Processed 4,529 lines, filtered 3,681 (81%). 848 unknown (128 distinct) from 28 host(s).
== abuse (1 distinct, 346 total) ==
Aug 4 05:05:06 abuse rsyslogd[21745]: imjournal: open() failed for path: '/var/lib/rsyslog/imjournal.state.tmp': Input/output error [v8.2404.0 try https://www.rsyslog.com/e/2433 ] [x346]
== b0b02.cs.umd.edu (4 distinct, 4 total) ==
Aug 4 05:39:00 b0b02.cs.umd.edu setroubleshoot[2746061]: SELinux is preventing /usr/bin/python3.9 from getattr access on the file /etc/authselect/nsswitch.conf. For complete SELinux messages run: sealert -l 9a1e2952-3fde-4937-a8ab-f7f59791a458
Aug 4 05:39:02 b0b02.cs.umd.edu setroubleshoot[2746061]: SELinux is preventing /usr/bin/python3.9 from read access on the file /etc/authselect/nsswitch.conf. For complete SELinux messages run: sealert -l 97d74423-e027-4cd6-8810-ad80944900b5
Aug 4 05:39:05 b0b02.cs.umd.edu setroubleshoot[2746061]: SELinux is preventing /usr/bin/python3.9 from open access on the file /etc/authselect/nsswitch.conf. For complete SELinux messages run: sealert -l 4f253f6a-62d6-46dd-8eaf-0b4d29df41c6
Aug 4 05:44:37 b0b02.cs.umd.edu rustdesk[2747538]: cannot open display:
== biggulp.cs.umd.edu (6 distinct, 6 total) ==
Aug 4 05:25:48 biggulp.cs.umd.edu sshd-session[2795877]: error: kex_protocol_error: type 20 seq 2 [preauth]
Aug 4 05:25:48 biggulp.cs.umd.edu sshd-session[2795877]: error: kex_protocol_error: type 30 seq 3 [preauth]
Aug 4 05:25:50 biggulp.cs.umd.edu sshd-session[2795877]: error: kex_protocol_error: type 20 seq 4 [preauth]
Aug 4 05:25:50 biggulp.cs.umd.edu sshd-session[2795877]: error: kex_protocol_error: type 30 seq 5 [preauth]
Aug 4 05:25:52 biggulp.cs.umd.edu sshd-session[2795877]: error: kex_protocol_error: type 20 seq 6 [preauth]
Aug 4 05:25:52 biggulp.cs.umd.edu sshd-session[2795877]: error: kex_protocol_error: type 30 seq 7 [preauth]
== cheezit.cs.umd.edu (11 distinct, 11 total) ==
Aug 4 05:47:25 cheezit.cs.umd.edu sshd-session[893576]: error: kex_protocol_error: type 20 seq 2 [preauth]
Aug 4 05:47:25 cheezit.cs.umd.edu sshd-session[893576]: error: kex_protocol_error: type 30 seq 3 [preauth]
Aug 4 05:47:26 cheezit.cs.umd.edu sshd-session[893576]: error: kex_protocol_error: type 20 seq 4 [preauth]
Aug 4 05:47:26 cheezit.cs.umd.edu sshd-session[893576]: error: kex_protocol_error: type 30 seq 5 [preauth]
Aug 4 05:47:28 cheezit.cs.umd.edu sshd-session[893576]: error: kex_protocol_error: type 20 seq 6 [preauth]
Aug 4 05:47:28 cheezit.cs.umd.edu sshd-session[893576]: error: kex_protocol_error: type 30 seq 7 [preauth]
Aug 4 05:56:23 cheezit.cs.umd.edu sshd-session[896227]: pam_access(sshd:auth): access denied for user `admin' from `116.110.0.87'
Aug 4 05:56:24 cheezit.cs.umd.edu krb5_child[896229]: Client 'admin(a)UMD.EDU' not found in Kerberos database
Aug 4 05:56:24 cheezit.cs.umd.edu sshd-session[896221]: error: PAM: System error for admin from 116.110.0.87
Aug 4 05:57:57 cheezit.cs.umd.edu sshd-session[896349]: pam_access(sshd:auth): access denied for user `root' from `116.110.0.87'
Aug 4 05:58:00 cheezit.cs.umd.edu sshd-session[896320]: error: PAM: Authentication failure for root from 116.110.0.87
== cmsc436-0101-redis (3 distinct, 3 total) ==
Aug 4 05:57:55 cmsc436-0101-redis sshd-session[788485]: error: PAM: Authentication failure for root from 116.110.0.87
Aug 4 05:58:30 cmsc436-0101-redis krb5_child[788504]: Client 'admin(a)UMD.EDU' not found in Kerberos database
Aug 4 05:58:31 cmsc436-0101-redis sshd-session[788490]: error: PAM: Authentication failure for admin from 116.110.145.63
== contest (9 distinct, 42 total) ==
Aug 4 05:05:14 contest goferd[1007]: [ERROR][worker-0] gofer.messaging.adapter.connect:33 - connect: proton+amqps://satellite8.cs.umd.edu:5647, failed: Connection amqps://satellite8.cs.umd.edu:5647 disconnected: Condition('proton.pythonio', 'Connection refused to all addresses') [x34]
Aug 4 05:48:17 contest setroubleshoot[600834]: SELinux is preventing /usr/libexec/platform-python3.6 from create access on the directory libdnf.NjSuqR. For complete SELinux messages run: sealert -l cb6b25c6-4765-4cf2-88a0-9b3b508e94e9
Aug 4 05:48:17 contest setroubleshoot[600834]: SELinux is preventing /usr/bin/gpgconf from add_name access on the directory repodata. For complete SELinux messages run: sealert -l 41cf7b1b-0f34-4609-98f2-b66e7825fef7
Aug 4 05:48:17 contest setroubleshoot[600834]: SELinux is preventing /usr/libexec/platform-python3.6 from create access on the file mirrorlist. For complete SELinux messages run: sealert -l fc20ff92-ea83-4f38-a24b-ddfd737a3141
Aug 4 05:48:17 contest setroubleshoot[600834]: SELinux is preventing /usr/libexec/platform-python3.6 from setattr access on the file repomd.xml. For complete SELinux messages run: sealert -l ac675631-fa35-4e93-adc9-b692b18e53e5
Aug 4 05:48:18 contest setroubleshoot[600834]: SELinux is preventing /usr/libexec/platform-python3.6 from read access on the directory libdnf.NjSuqR. For complete SELinux messages run: sealert -l 45d103b6-0810-4890-a705-990118577ce8
Aug 4 05:48:22 contest setroubleshoot[600834]: SELinux is preventing /usr/libexec/platform-python3.6 from remove_name access on the directory repomd.xml. For complete SELinux messages run: sealert -l 7e499113-2fd7-4f67-bec6-3521efbe3637
Aug 4 05:48:25 contest setroubleshoot[600834]: SELinux is preventing rhsmcertd-worke from unlink access on the file repomd.xml. For complete SELinux messages run: sealert -l 22835727-7fef-4cfb-b3b5-881f66888317
Aug 4 05:48:38 contest setroubleshoot[600886]: SELinux is preventing /usr/libexec/platform-python3.6 from rmdir access on the directory repodata. For complete SELinux messages run: sealert -l 3928930b-a1ed-448d-950b-0665ac2adef8
== csfw00a (2 distinct, 260 total) ==
Aug 4 05:04:42 csfw00a kernel: bnxt_en 0000:09:00.0 eth3: NIC Link is Down [x252]
Aug 4 05:44:35 csfw00a ospf6d[1477]: [EC 100663307] Could not send entire message [x8]
== grades01.cs.umd.edu (1 distinct, 1 total) ==
Aug 4 05:48:22 grades01.cs.umd.edu puppet-agent[2265]: The directory '/srv/grades' contains 2471 entries, which exceeds the default soft limit 1000 and may cause excessive resource consumption and degraded performance. To remove this warning set a value for `max_files` parameter or consider using an alternate method to manage large directory trees
== hackerman (1 distinct, 1 total) ==
Aug 4 05:19:01 hackerman gnome-software[2060381]: failed to commit changes to dconf: GDBus.Error:org.gtk.GDBus.UnmappedGError.Quark._g_2dfile_2derror_2dquark.Code2: Failed to create file “/adminhomes/sajith/.config/dconf/user.GJZVT3”: Permission denied
== idm00 (1 distinct, 1 total) ==
Aug 4 05:51:17 idm00 named[1455]: client @0x7f3310373c58 10.73.240.42#65218: update '73.10.in-addr.arpa/IN' denied
== idmp0 (1 distinct, 1 total) ==
Aug 4 05:36:02 idmp0 named[5198]: client @0x7f9908014618 10.73.240.43#63043: update '73.10.in-addr.arpa/IN' denied
== inbound00.cs.umd.edu (2 distinct, 3 total) ==
Aug 4 05:43:39 inbound00.cs.umd.edu cockpit-ws[2765943]: /usr/share/cockpit/static/login.js/favicon.ico: Failed to open file “/usr/share/cockpit/static/login.js/favicon.ico”: open() failed: Not a directory [x2]
Aug 4 05:58:05 inbound00.cs.umd.edu krb5_child[2769797]: Client 'admin(a)UMD.EDU' not found in Kerberos database
== inbound01.cs.umd.edu (1 distinct, 3 total) ==
Aug 4 05:43:35 inbound01.cs.umd.edu cockpit-ws[779552]: /usr/share/cockpit/static/login.js/favicon.ico: Failed to open file “/usr/share/cockpit/static/login.js/favicon.ico”: open() failed: Not a directory [x3]
== itmon02 (1 distinct, 35 total) ==
Aug 4 05:07:55 itmon02 sshd[1750555]: error: beginning MaxStartups throttling [x35]
== krispykreme.cs.umd.edu (6 distinct, 6 total) ==
Aug 4 05:47:26 krispykreme.cs.umd.edu sshd-session[3103856]: error: kex_protocol_error: type 20 seq 2 [preauth]
Aug 4 05:47:26 krispykreme.cs.umd.edu sshd-session[3103856]: error: kex_protocol_error: type 30 seq 3 [preauth]
Aug 4 05:47:28 krispykreme.cs.umd.edu sshd-session[3103856]: error: kex_protocol_error: type 20 seq 4 [preauth]
Aug 4 05:47:28 krispykreme.cs.umd.edu sshd-session[3103856]: error: kex_protocol_error: type 30 seq 5 [preauth]
Aug 4 05:47:30 krispykreme.cs.umd.edu sshd-session[3103856]: error: kex_protocol_error: type 20 seq 6 [preauth]
Aug 4 05:47:30 krispykreme.cs.umd.edu sshd-session[3103856]: error: kex_protocol_error: type 30 seq 7 [preauth]
== netman.cs.umd.edu (1 distinct, 2 total) ==
Aug 4 05:58:10 netman.cs.umd.edu krb5_child[600789]: Client 'admin(a)UMD.EDU' not found in Kerberos database [x2]
== newhonors2 (1 distinct, 24 total) ==
Aug 4 05:13:03 newhonors2 dhcpcd[711815]: dhcpcd is not running [x24]
== outbound00.cs.umd.edu (2 distinct, 8 total) ==
Aug 4 05:09:09 outbound00.cs.umd.edu python3[2717432]: ldapdb [x6]
Aug 4 05:40:44 outbound00.cs.umd.edu cockpit-ws[2724893]: /usr/share/cockpit/static/login.js/favicon.ico: Failed to open file “/usr/share/cockpit/static/login.js/favicon.ico”: open() failed: Not a directory [x2]
== outbound01.cs.umd.edu (3 distinct, 9 total) ==
Aug 4 05:08:18 outbound01.cs.umd.edu python3[749795]: ldapdb [x7]
Aug 4 05:09:24 outbound01.cs.umd.edu systemd[1]: Configuration file /usr/lib/systemd/system/authentication_milter.service is marked executable. Please remove executable permission bits. Proceeding anyway.
Aug 4 05:40:52 outbound01.cs.umd.edu cockpit-ws[757944]: /usr/share/cockpit/static/login.js/favicon.ico: Failed to open file “/usr/share/cockpit/static/login.js/favicon.ico”: open() failed: Not a directory
== peach.cs.umd.edu (2 distinct, 2 total) ==
Aug 4 05:32:09 peach.cs.umd.edu setroubleshoot[768747]: SELinux is preventing /usr/bin/qemu-ga from search access on the directory /var/lib/containers/storage/overlay. For complete SELinux messages run: sealert -l 007f2494-1b82-4ff6-bd59-5f449ab9de99
Aug 4 05:32:09 peach.cs.umd.edu setroubleshoot[768747]: SELinux is preventing /usr/bin/qemu-ga from search access on the directory /var/lib/containers/storage/overlay. For complete SELinux messages run: sealert -l a801d9aa-5cee-4f5c-b9a9-bd22e572596b
== sentry-docker00.cs.umd.edu (34 distinct, 34 total) ==
Aug 4 05:07:38 sentry-docker00.cs.umd.edu systemd-udevd[1533136]: link_config: could not get ethtool features for veth865178f
Aug 4 05:07:38 sentry-docker00.cs.umd.edu systemd-udevd[1533136]: Could not set offload features of veth865178f: No such device
Aug 4 05:07:38 sentry-docker00.cs.umd.edu systemd-udevd[1533156]: Could not generate persistent MAC address for vethdc06e6e: No such file or directory
Aug 4 05:07:38 sentry-docker00.cs.umd.edu systemd-udevd[1533157]: Could not generate persistent MAC address for veth996378b: No such file or directory
Aug 4 05:07:38 sentry-docker00.cs.umd.edu systemd-udevd[1533213]: Could not generate persistent MAC address for veth3ed92c2: No such file or directory
Aug 4 05:07:38 sentry-docker00.cs.umd.edu systemd-udevd[1533214]: Could not generate persistent MAC address for veth7745eec: No such file or directory
Aug 4 05:07:38 sentry-docker00.cs.umd.edu systemd-udevd[1533217]: Could not generate persistent MAC address for veth414c6f5: No such file or directory
Aug 4 05:07:38 sentry-docker00.cs.umd.edu systemd-udevd[1533218]: Could not generate persistent MAC address for veth9aa9c5c: No such file or directory
Aug 4 05:07:38 sentry-docker00.cs.umd.edu systemd-udevd[1533214]: Could not generate persistent MAC address for veth538159b: No such file or directory
Aug 4 05:07:38 sentry-docker00.cs.umd.edu systemd-udevd[1533230]: Could not generate persistent MAC address for veth58a7e7e: No such file or directory
Aug 4 05:07:38 sentry-docker00.cs.umd.edu systemd-udevd[1533227]: Could not generate persistent MAC address for vethef5b590: No such file or directory
Aug 4 05:07:38 sentry-docker00.cs.umd.edu systemd-udevd[1533222]: Could not generate persistent MAC address for veth4f578a4: No such file or directory
Aug 4 05:27:46 sentry-docker00.cs.umd.edu systemd-udevd[1542838]: Could not generate persistent MAC address for vetha710017: No such file or directory
Aug 4 05:27:46 sentry-docker00.cs.umd.edu systemd-udevd[1542839]: Could not generate persistent MAC address for vethd66a11a: No such file or directory
Aug 4 05:27:46 sentry-docker00.cs.umd.edu systemd-udevd[1542857]: Could not generate persistent MAC address for vetha8a85ee: No such file or directory
Aug 4 05:27:46 sentry-docker00.cs.umd.edu systemd-udevd[1542843]: Could not generate persistent MAC address for veth203db46: No such file or directory
Aug 4 05:27:46 sentry-docker00.cs.umd.edu systemd-udevd[1542838]: Could not generate persistent MAC address for veth4bbfdd6: No such file or directory
Aug 4 05:27:46 sentry-docker00.cs.umd.edu systemd-udevd[1542844]: Could not generate persistent MAC address for veth0b300f8: No such file or directory
Aug 4 05:27:46 sentry-docker00.cs.umd.edu systemd-udevd[1542843]: Could not generate persistent MAC address for vethe7a9930: No such file or directory
Aug 4 05:27:46 sentry-docker00.cs.umd.edu systemd-udevd[1542838]: Could not generate persistent MAC address for vethadba48a: No such file or directory
Aug 4 05:27:46 sentry-docker00.cs.umd.edu systemd-udevd[1542856]: Could not generate persistent MAC address for vethd7e2ec0: No such file or directory
Aug 4 05:27:46 sentry-docker00.cs.umd.edu systemd-udevd[1542859]: Could not generate persistent MAC address for veth5b0fa5f: No such file or directory
Aug 4 05:47:55 sentry-docker00.cs.umd.edu systemd-udevd[1552255]: link_config: could not get ethtool features for vethe7a9930
Aug 4 05:47:55 sentry-docker00.cs.umd.edu systemd-udevd[1552255]: Could not set offload features of vethe7a9930: No such device
Aug 4 05:47:55 sentry-docker00.cs.umd.edu systemd-udevd[1552282]: Could not generate persistent MAC address for veth82d7e68: No such file or directory
Aug 4 05:47:55 sentry-docker00.cs.umd.edu systemd-udevd[1552281]: Could not generate persistent MAC address for veth4b261dd: No such file or directory
Aug 4 05:47:55 sentry-docker00.cs.umd.edu systemd-udevd[1552307]: Could not generate persistent MAC address for veth65786ee: No such file or directory
Aug 4 05:47:55 sentry-docker00.cs.umd.edu systemd-udevd[1552308]: Could not generate persistent MAC address for vethb288d6e: No such file or directory
Aug 4 05:47:55 sentry-docker00.cs.umd.edu systemd-udevd[1552326]: Could not generate persistent MAC address for vethd21bdab: No such file or directory
Aug 4 05:47:55 sentry-docker00.cs.umd.edu systemd-udevd[1552311]: Could not generate persistent MAC address for vethf5ed31f: No such file or directory
... 4 more distinct messages not shown
== soul (1 distinct, 1 total) ==
Aug 4 05:58:58 soul krb5_child[3511483]: Client 'admin(a)UMD.EDU' not found in Kerberos database
== strawberry (2 distinct, 8 total) ==
Aug 4 05:09:44 strawberry udisksd[1067]: Error performing housekeeping for drive /org/freedesktop/UDisks2/drives/ST2000DM001_1CH164_W1E8J5KJ: Error updating SMART data: Error sending ATA command CHECK POWER MODE: Unexpected sense data returned:#0120000: 00 00 00 00 00 00 00 00 00 00 00 00 00 00 00 00 ................#0120010: 00 00 00 00 00 00 00 00 00 00 00 00 00 00 00 00 ................#012 (g-io-error-quark, 0) [x6]
Aug 4 05:34:42 strawberry smartd[5314]: Device: /dev/sda [SAT], failed to read SMART Attribute Data [x2]
== submit26-b9-2 (9 distinct, 9 total) ==
Aug 4 05:12:52 submit26-b9-2 setroubleshoot[993262]: SELinux is preventing /usr/bin/python3.9 from create access on the directory /(null). For complete SELinux messages run: sealert -l d506243c-d61e-48f3-b42a-4592c913deb0
Aug 4 05:12:52 submit26-b9-2 setroubleshoot[993262]: SELinux is preventing /usr/bin/python3.9 from add_name access on the directory /(null). For complete SELinux messages run: sealert -l 3b4752ac-1b9a-4af9-a05b-32e4c2eb13ab
Aug 4 05:12:52 submit26-b9-2 setroubleshoot[993262]: SELinux is preventing /usr/bin/python3.9 from create access on the file /(null). For complete SELinux messages run: sealert -l 29e5adbd-4381-4467-b40d-a2219101e096
Aug 4 05:12:52 submit26-b9-2 setroubleshoot[993262]: SELinux is preventing /usr/bin/python3.9 from open access on the file /tmp/libdnf.2I0Ov3/repodata/repomd.xml. For complete SELinux messages run: sealert -l 1b38f2ec-01ce-4343-8059-ba7494ecc5c4
Aug 4 05:12:52 submit26-b9-2 setroubleshoot[993262]: SELinux is preventing /usr/bin/python3.9 from setattr access on the file repomd.xml. For complete SELinux messages run: sealert -l e5f9af40-1f63-4924-b012-27ab2a7b2266
Aug 4 05:12:52 submit26-b9-2 setroubleshoot[993262]: SELinux is preventing /usr/bin/python3.9 from read access on the directory libdnf.2I0Ov3. For complete SELinux messages run: sealert -l 5c54db87-54a3-4a7c-97b4-b5c48d6c3543
Aug 4 05:12:52 submit26-b9-2 setroubleshoot[993262]: SELinux is preventing /usr/bin/python3.9 from remove_name access on the directory repomd.xml. For complete SELinux messages run: sealert -l 63cd60e1-1e61-4276-afea-dd8526ffe8b2
Aug 4 05:12:52 submit26-b9-2 setroubleshoot[993262]: SELinux is preventing /usr/bin/python3.9 from unlink access on the file repomd.xml. For complete SELinux messages run: sealert -l 81c7e9ec-e023-4c6d-b1ad-c02a242e655e
Aug 4 05:12:52 submit26-b9-2 setroubleshoot[993262]: SELinux is preventing /usr/bin/python3.9 from rmdir access on the directory repodata. For complete SELinux messages run: sealert -l 6ae9a597-e123-4d74-8eec-a8ebe0f5e4d0
== submit26-b9-3 (9 distinct, 9 total) ==
Aug 4 05:20:38 submit26-b9-3 setroubleshoot[822556]: SELinux is preventing /usr/bin/python3.9 from create access on the directory /(null). For complete SELinux messages run: sealert -l 5b912a44-22fd-4560-b201-2a4e289b73f5
Aug 4 05:20:38 submit26-b9-3 setroubleshoot[822556]: SELinux is preventing /usr/bin/python3.9 from add_name access on the directory /(null). For complete SELinux messages run: sealert -l 7f1df1e4-725e-4953-98eb-1079f908f543
Aug 4 05:20:38 submit26-b9-3 setroubleshoot[822556]: SELinux is preventing /usr/bin/python3.9 from create access on the file /(null). For complete SELinux messages run: sealert -l 40b8852a-f77b-44b4-affe-5f11fa33de43
Aug 4 05:20:38 submit26-b9-3 setroubleshoot[822556]: SELinux is preventing /usr/bin/python3.9 from open access on the file /tmp/libdnf.ZpbhZH/repodata/repomd.xml. For complete SELinux messages run: sealert -l 45a8019e-f6b5-4baa-92c1-862594b40d46
Aug 4 05:20:38 submit26-b9-3 setroubleshoot[822556]: SELinux is preventing /usr/bin/python3.9 from setattr access on the file repomd.xml. For complete SELinux messages run: sealert -l e9f0bfff-7784-4126-baa4-2bb06da56591
Aug 4 05:20:38 submit26-b9-3 setroubleshoot[822556]: SELinux is preventing /usr/bin/python3.9 from read access on the directory libdnf.ZpbhZH. For complete SELinux messages run: sealert -l 0b17cc3d-cdc6-4fe2-a11f-3892e7c41dc7
Aug 4 05:20:39 submit26-b9-3 setroubleshoot[822556]: SELinux is preventing /usr/bin/python3.9 from remove_name access on the directory repomd.xml. For complete SELinux messages run: sealert -l 10e38c64-b65f-4cdd-901e-4375652d9a42
Aug 4 05:20:39 submit26-b9-3 setroubleshoot[822556]: SELinux is preventing /usr/bin/python3.9 from unlink access on the file repomd.xml. For complete SELinux messages run: sealert -l 7fd9cf72-ef38-48e1-b6aa-b571b26a7b22
Aug 4 05:20:39 submit26-b9-3 setroubleshoot[822556]: SELinux is preventing /usr/bin/python3.9 from rmdir access on the directory repodata. For complete SELinux messages run: sealert -l b9b11116-89bd-4a3c-980c-1d422c5dcee4
== submit26-clnb9 (10 distinct, 14 total) ==
Aug 4 05:31:57 submit26-clnb9 setroubleshoot[1769712]: SELinux is preventing /usr/bin/python3.9 from create access on the directory /(null). For complete SELinux messages run: sealert -l 6783ed2b-5ae4-42b5-975a-4bf50eec4658 [x2]
Aug 4 05:31:57 submit26-clnb9 setroubleshoot[1769712]: SELinux is preventing /usr/bin/python3.9 from add_name access on the directory /(null). For complete SELinux messages run: sealert -l 9e7fa955-cc30-4804-ac8c-e1779e85946c [x2]
Aug 4 05:31:57 submit26-clnb9 setroubleshoot[1769712]: SELinux is preventing /usr/bin/python3.9 from create access on the file /(null). For complete SELinux messages run: sealert -l 69bfa6e3-089c-40ff-9563-fd30787d0774
Aug 4 05:31:57 submit26-clnb9 setroubleshoot[1769712]: SELinux is preventing /usr/bin/python3.9 from open access on the file /tmp/libdnf.Ct8EDj/repodata/repomd.xml. For complete SELinux messages run: sealert -l 001acdb5-31ef-4e52-b10b-90f467a89ddc
Aug 4 05:31:57 submit26-clnb9 setroubleshoot[1769712]: SELinux is preventing /usr/bin/python3.9 from setattr access on the file repomd.xml. For complete SELinux messages run: sealert -l edacddcf-16ed-4dc3-8d82-7c597d5dee23
Aug 4 05:31:57 submit26-clnb9 setroubleshoot[1769712]: SELinux is preventing /usr/bin/python3.9 from read access on the directory libdnf.Ct8EDj. For complete SELinux messages run: sealert -l 62b3782e-4730-4488-8178-94dafe9b552c
Aug 4 05:31:57 submit26-clnb9 setroubleshoot[1769712]: SELinux is preventing /usr/bin/python3.9 from remove_name access on the directory repomd.xml. For complete SELinux messages run: sealert -l 81cb3698-78f8-440a-8e3c-e5d1041e6b78 [x2]
Aug 4 05:31:57 submit26-clnb9 setroubleshoot[1769712]: SELinux is preventing /usr/bin/python3.9 from unlink access on the file repomd.xml. For complete SELinux messages run: sealert -l 792b472a-115c-4799-9805-fc7436f916b9
Aug 4 05:31:57 submit26-clnb9 setroubleshoot[1769712]: SELinux is preventing /usr/bin/python3.9 from rmdir access on the directory repodata. For complete SELinux messages run: sealert -l 15c83a86-837b-41e2-b662-b39cd4e361cb [x2]
Aug 4 05:31:57 submit26-clnb9 setroubleshoot[1769712]: SELinux is preventing /usr/bin/python3.9 from read access on the directory libdnf.DPCPjo. For complete SELinux messages run: sealert -l 62b3782e-4730-4488-8178-94dafe9b552c
== talkhosts9 (1 distinct, 2 total) ==
Aug 4 05:07:56 talkhosts9 setroubleshoot[1182286]: SELinux is preventing /usr/bin/lsof from getattr access on the unix_stream_socket unix_stream_socket. For complete SELinux messages run: sealert -l a6df89b3-c497-469c-8232-c4fde0508abf [x2]
== updates00.cs.umd.edu (3 distinct, 3 total) ==
Aug 4 05:18:32 updates00.cs.umd.edu puppet-agent[2209]: Could not retrieve catalog from remote server: Error 500 on SERVER: Server Error: Function lookup() did not find a value for the name 'vault::kerberos' on node updates00.cs.umd.edu
Aug 4 05:18:32 updates00.cs.umd.edu puppet-agent[2209]: Not using cache on failed catalog
Aug 4 05:18:32 updates00.cs.umd.edu puppet-agent[2209]: Could not retrieve catalog; skipping run
1
0
Command: /usr/local/sbin/syslog-digest.py
Time : 0.5042s
Status : exited 0
Output :
Syslog digest — 2026-08-04 05:05 EDT
Processed 4,674 lines, filtered 3,900 (83%). 774 unknown (84 distinct) from 19 host(s).
== abadi-computer (2 distinct, 2 total) ==
Aug 4 04:15:00 abadi-computer nologin[917291]: Attempted login by UNKNOWN (UID: 65534) on UNKNOWN
Aug 4 04:15:00 abadi-computer pipewire[917290]: mod.jackdbus-detect: Failed to receive jackdbus reply: org.freedesktop.DBus.Error.ServiceUnknown: The name org.jackaudio.service was not provided by any .service files
== abuse (1 distinct, 345 total) ==
Aug 4 04:05:06 abuse rsyslogd[21745]: imjournal: open() failed for path: '/var/lib/rsyslog/imjournal.state.tmp': Input/output error [v8.2404.0 try https://www.rsyslog.com/e/2433 ] [x345]
== b0b02.cs.umd.edu (4 distinct, 5 total) ==
Aug 4 04:38:55 b0b02.cs.umd.edu setroubleshoot[2730984]: SELinux is preventing /usr/bin/python3.9 from getattr access on the file /etc/authselect/nsswitch.conf. For complete SELinux messages run: sealert -l 9a1e2952-3fde-4937-a8ab-f7f59791a458 [x2]
Aug 4 04:38:58 b0b02.cs.umd.edu setroubleshoot[2730984]: SELinux is preventing /usr/bin/python3.9 from read access on the file /etc/authselect/nsswitch.conf. For complete SELinux messages run: sealert -l 97d74423-e027-4cd6-8810-ad80944900b5
Aug 4 04:39:01 b0b02.cs.umd.edu setroubleshoot[2730984]: SELinux is preventing /usr/bin/python3.9 from open access on the file /etc/authselect/nsswitch.conf. For complete SELinux messages run: sealert -l 4f253f6a-62d6-46dd-8eaf-0b4d29df41c6
Aug 4 04:44:33 b0b02.cs.umd.edu rustdesk[2732457]: cannot open display:
== contest (1 distinct, 33 total) ==
Aug 4 04:06:19 contest goferd[1007]: [ERROR][worker-0] gofer.messaging.adapter.connect:33 - connect: proton+amqps://satellite8.cs.umd.edu:5647, failed: Connection amqps://satellite8.cs.umd.edu:5647 disconnected: Condition('proton.pythonio', 'Connection refused to all addresses') [x33]
== csfw00a (2 distinct, 232 total) ==
Aug 4 04:05:19 csfw00a kernel: bnxt_en 0000:09:00.0 eth3: NIC Link is Down [x228]
Aug 4 04:14:05 csfw00a ospf6d[1477]: [EC 100663307] Could not send entire message [x4]
== dojo (1 distinct, 1 total) ==
Aug 4 04:15:18 dojo nologin[1058723]: Attempted login by UNKNOWN (UID: 65534) on UNKNOWN
== forge00 (1 distinct, 1 total) ==
Aug 4 04:09:03 forge00 (httpd)[1751455]: httpd.service: Referenced but unset environment variable evaluates to an empty string: OPTIONS
== idm00 (1 distinct, 1 total) ==
Aug 4 04:51:17 idm00 named[1455]: client @0x7f3314ae3878 10.73.240.42#61438: update '73.10.in-addr.arpa/IN' denied
== idmp0 (1 distinct, 1 total) ==
Aug 4 04:36:02 idmp0 named[5198]: client @0x7f98fc03bf48 10.73.240.43#64801: update '73.10.in-addr.arpa/IN' denied
== itmon02 (1 distinct, 40 total) ==
Aug 4 04:08:06 itmon02 sshd[1750555]: error: beginning MaxStartups throttling [x40]
== matrix (12 distinct, 14 total) ==
Aug 4 05:02:52 matrix systemd[1]: networkd-dispatcher.service: Got notification message from PID 1623651, but reception only permitted for main PID 720
Aug 4 05:02:52 matrix systemd[1]: networkd-dispatcher.service: Got notification message from PID 1623663, but reception only permitted for main PID 720
Aug 4 05:03:00 matrix systemd[1]: networkd-dispatcher.service: Got notification message from PID 1623793, but reception only permitted for main PID 720
Aug 4 05:03:00 matrix systemd[1]: networkd-dispatcher.service: Got notification message from PID 1623799, but reception only permitted for main PID 720
Aug 4 05:03:00 matrix networkctl[1623810]: Interface "veth490c137" not found.
Aug 4 05:03:00 matrix systemd[1]: networkd-dispatcher.service: Got notification message from PID 1623810, but reception only permitted for main PID 720 [x2]
Aug 4 05:03:00 matrix systemd[1]: networkd-dispatcher.service: Got notification message from PID 1623871, but reception only permitted for main PID 720
Aug 4 05:03:00 matrix systemd[1]: networkd-dispatcher.service: Got notification message from PID 1623884, but reception only permitted for main PID 720
Aug 4 05:03:10 matrix systemd[1]: networkd-dispatcher.service: Got notification message from PID 1623978, but reception only permitted for main PID 720
Aug 4 05:03:10 matrix systemd[1]: networkd-dispatcher.service: Got notification message from PID 1623984, but reception only permitted for main PID 720
Aug 4 05:03:10 matrix networkctl[1623997]: Interface "veth8c66095" not found.
Aug 4 05:03:10 matrix systemd[1]: networkd-dispatcher.service: Got notification message from PID 1623997, but reception only permitted for main PID 720 [x2]
== netman.cs.umd.edu (3 distinct, 3 total) ==
Aug 4 04:30:01 netman.cs.umd.edu setroubleshoot[576540]: SELinux is preventing /usr/bin/gpg from read access on the file gpg.conf. For complete SELinux messages run: sealert -l 019ad1da-a874-4814-8037-3b3e5f413ad2
Aug 4 04:30:02 netman.cs.umd.edu setroubleshoot[576540]: SELinux is preventing /usr/bin/gpg from open access on the file /root/.gnupg/gpg.conf. For complete SELinux messages run: sealert -l cb54177e-d44c-46a1-b246-5c0bbb8343be
Aug 4 04:30:02 netman.cs.umd.edu setroubleshoot[576540]: SELinux is preventing /usr/bin/gpg from getattr access on the file /root/.gnupg/gpg.conf. For complete SELinux messages run: sealert -l fbba2e30-b7ab-491c-9ec6-f553e9ef72af
== newhonors2 (1 distinct, 24 total) ==
Aug 4 04:13:02 newhonors2 dhcpcd[709901]: dhcpcd is not running [x24]
== outbound00.cs.umd.edu (2 distinct, 7 total) ==
Aug 4 04:09:08 outbound00.cs.umd.edu python3[2703493]: ldapdb [x6]
Aug 4 04:15:41 outbound00.cs.umd.edu kernel: hrtimer: interrupt took 2815482 ns
== outbound01.cs.umd.edu (1 distinct, 6 total) ==
Aug 4 04:13:06 outbound01.cs.umd.edu python3[736681]: ldapdb [x6]
== sentry-docker00.cs.umd.edu (36 distinct, 36 total) ==
Aug 4 04:07:13 sentry-docker00.cs.umd.edu systemd-udevd[1504785]: link_config: could not set ethtool features for veth763e45f
Aug 4 04:07:13 sentry-docker00.cs.umd.edu systemd-udevd[1504785]: Could not set offload features of veth763e45f: Operation not permitted
Aug 4 04:07:13 sentry-docker00.cs.umd.edu systemd-udevd[1504817]: Could not generate persistent MAC address for veth27134a9: No such file or directory
Aug 4 04:07:13 sentry-docker00.cs.umd.edu systemd-udevd[1504818]: Could not generate persistent MAC address for veth204459b: No such file or directory
Aug 4 04:07:13 sentry-docker00.cs.umd.edu systemd-udevd[1504821]: Could not generate persistent MAC address for vethe589654: No such file or directory
Aug 4 04:07:13 sentry-docker00.cs.umd.edu systemd-udevd[1504822]: Could not generate persistent MAC address for veth44176fc: No such file or directory
Aug 4 04:07:13 sentry-docker00.cs.umd.edu systemd-udevd[1504845]: Could not generate persistent MAC address for vethe360ab3: No such file or directory
Aug 4 04:07:13 sentry-docker00.cs.umd.edu systemd-udevd[1504846]: Could not generate persistent MAC address for veth5cb5b69: No such file or directory
Aug 4 04:07:13 sentry-docker00.cs.umd.edu systemd-udevd[1504852]: Could not generate persistent MAC address for veth8186b60: No such file or directory
Aug 4 04:07:13 sentry-docker00.cs.umd.edu systemd-udevd[1504853]: Could not generate persistent MAC address for vethdc773a2: No such file or directory
Aug 4 04:07:13 sentry-docker00.cs.umd.edu systemd-udevd[1504851]: Could not generate persistent MAC address for veth0c8c743: No such file or directory
Aug 4 04:07:13 sentry-docker00.cs.umd.edu systemd-udevd[1504862]: Could not generate persistent MAC address for vethc1ebaec: No such file or directory
Aug 4 04:27:21 sentry-docker00.cs.umd.edu systemd-udevd[1514254]: link_config: could not get ethtool features for vethe360ab3
Aug 4 04:27:21 sentry-docker00.cs.umd.edu systemd-udevd[1514254]: Could not set offload features of vethe360ab3: No such device
Aug 4 04:27:21 sentry-docker00.cs.umd.edu systemd-udevd[1514342]: Could not generate persistent MAC address for veth9f15368: No such file or directory
Aug 4 04:27:21 sentry-docker00.cs.umd.edu systemd-udevd[1514343]: Could not generate persistent MAC address for veth2f4d4c4: No such file or directory
Aug 4 04:27:21 sentry-docker00.cs.umd.edu systemd-udevd[1514346]: Could not generate persistent MAC address for vethbe7414a: No such file or directory
Aug 4 04:27:22 sentry-docker00.cs.umd.edu systemd-udevd[1514363]: Could not generate persistent MAC address for veth10e6293: No such file or directory
Aug 4 04:27:22 sentry-docker00.cs.umd.edu systemd-udevd[1514354]: Could not generate persistent MAC address for veth27f8175: No such file or directory
Aug 4 04:27:22 sentry-docker00.cs.umd.edu systemd-udevd[1514352]: Could not generate persistent MAC address for veth2bb50cb: No such file or directory
Aug 4 04:27:22 sentry-docker00.cs.umd.edu systemd-udevd[1514366]: Could not generate persistent MAC address for vethd5e8abc: No such file or directory
Aug 4 04:27:22 sentry-docker00.cs.umd.edu systemd-udevd[1514363]: Could not generate persistent MAC address for veth5e65da3: No such file or directory
Aug 4 04:27:22 sentry-docker00.cs.umd.edu systemd-udevd[1514374]: Could not generate persistent MAC address for veth1217254: No such file or directory
Aug 4 04:27:22 sentry-docker00.cs.umd.edu systemd-udevd[1514375]: Could not generate persistent MAC address for veth2a69c23: No such file or directory
Aug 4 04:47:30 sentry-docker00.cs.umd.edu systemd-udevd[1523683]: link_config: could not get ethtool features for veth1217254
Aug 4 04:47:30 sentry-docker00.cs.umd.edu systemd-udevd[1523683]: Could not set offload features of veth1217254: No such device
Aug 4 04:47:30 sentry-docker00.cs.umd.edu systemd-udevd[1523720]: Could not generate persistent MAC address for veth74decff: No such file or directory
Aug 4 04:47:30 sentry-docker00.cs.umd.edu systemd-udevd[1523719]: Could not generate persistent MAC address for vethf394259: No such file or directory
Aug 4 04:47:30 sentry-docker00.cs.umd.edu systemd-udevd[1523723]: Could not generate persistent MAC address for veth04897d4: No such file or directory
Aug 4 04:47:30 sentry-docker00.cs.umd.edu systemd-udevd[1523724]: Could not generate persistent MAC address for vethf35dada: No such file or directory
... 6 more distinct messages not shown
== smokeping-slave (1 distinct, 1 total) ==
Aug 4 04:15:31 smokeping-slave nologin[743095]: Attempted login by UNKNOWN (UID: 65534) on UNKNOWN
== strawberry (4 distinct, 10 total) ==
Aug 4 04:09:44 strawberry udisksd[1067]: Error performing housekeeping for drive /org/freedesktop/UDisks2/drives/ST2000DM001_1CH164_W1E8J5KJ: Error updating SMART data: Error sending ATA command CHECK POWER MODE: Unexpected sense data returned:#0120000: 00 00 00 00 00 00 00 00 00 00 00 00 00 00 00 00 ................#0120010: 00 00 00 00 00 00 00 00 00 00 00 00 00 00 00 00 ................#012 (g-io-error-quark, 0) [x6]
Aug 4 04:15:04 strawberry nologin[3518028]: Attempted login by UNKNOWN (UID: 65534) on UNKNOWN
Aug 4 04:15:04 strawberry pipewire[3518027]: mod.jackdbus-detect: Failed to receive jackdbus reply: org.freedesktop.DBus.Error.ServiceUnknown: The name org.jackaudio.service was not provided by any .service files
Aug 4 04:34:42 strawberry smartd[5314]: Device: /dev/sda [SAT], failed to read SMART Attribute Data [x2]
== submit26-b9-4 (9 distinct, 12 total) ==
Aug 4 04:16:11 submit26-b9-4 setroubleshoot[1001809]: SELinux is preventing /usr/bin/python3.9 from create access on the directory /(null). For complete SELinux messages run: sealert -l a4e66030-8621-4da9-bd27-5988bb1bf8ad
Aug 4 04:16:11 submit26-b9-4 setroubleshoot[1001809]: SELinux is preventing /usr/bin/python3.9 from add_name access on the directory /(null). For complete SELinux messages run: sealert -l c055e37d-bbf5-4800-9083-d606f792c8c1
Aug 4 04:16:11 submit26-b9-4 setroubleshoot[1001809]: SELinux is preventing /usr/bin/python3.9 from create access on the file /(null). For complete SELinux messages run: sealert -l e5bc3a56-6d6f-4776-954f-ddde1579648f [x2]
Aug 4 04:16:11 submit26-b9-4 setroubleshoot[1001809]: SELinux is preventing /usr/bin/python3.9 from open access on the file /tmp/libdnf.cxuYqG/repodata/repomd.xml. For complete SELinux messages run: sealert -l a8ec5e1b-49f9-4fbc-a8ae-22e800f7abf2 [x2]
Aug 4 04:16:11 submit26-b9-4 setroubleshoot[1001809]: SELinux is preventing /usr/bin/python3.9 from setattr access on the file repomd.xml. For complete SELinux messages run: sealert -l 945db714-d0c0-4402-911e-932978b8b036 [x2]
Aug 4 04:16:11 submit26-b9-4 setroubleshoot[1001809]: SELinux is preventing /usr/bin/python3.9 from read access on the directory libdnf.cxuYqG. For complete SELinux messages run: sealert -l 463998a0-fb0d-463c-82b1-471135710a14
Aug 4 04:16:11 submit26-b9-4 setroubleshoot[1001809]: SELinux is preventing /usr/bin/python3.9 from remove_name access on the directory repomd.xml. For complete SELinux messages run: sealert -l 473d2e21-15d8-407a-a9ee-2b842607fa00
Aug 4 04:16:11 submit26-b9-4 setroubleshoot[1001809]: SELinux is preventing /usr/bin/python3.9 from unlink access on the file repomd.xml. For complete SELinux messages run: sealert -l 80c54d4f-bf4b-4501-addb-1627383587d0
Aug 4 04:16:11 submit26-b9-4 setroubleshoot[1001809]: SELinux is preventing /usr/bin/python3.9 from rmdir access on the directory repodata. For complete SELinux messages run: sealert -l c63d3890-151e-49a0-83f0-3dfb69d051e5
1
0
Command: /usr/local/sbin/syslog-digest.py
Time : 0.4919s
Status : exited 0
Output :
Syslog digest — 2026-08-04 04:05 EDT
Processed 4,567 lines, filtered 3,800 (83%). 767 unknown (72 distinct) from 18 host(s).
== abuse (1 distinct, 347 total) ==
Aug 4 03:05:06 abuse rsyslogd[21745]: imjournal: open() failed for path: '/var/lib/rsyslog/imjournal.state.tmp': Input/output error [v8.2404.0 try https://www.rsyslog.com/e/2433 ] [x347]
== b0b02.cs.umd.edu (4 distinct, 4 total) ==
Aug 4 03:38:51 b0b02.cs.umd.edu setroubleshoot[2715623]: SELinux is preventing /usr/bin/python3.9 from getattr access on the file /etc/authselect/nsswitch.conf. For complete SELinux messages run: sealert -l 9a1e2952-3fde-4937-a8ab-f7f59791a458
Aug 4 03:38:54 b0b02.cs.umd.edu setroubleshoot[2715623]: SELinux is preventing /usr/bin/python3.9 from read access on the file /etc/authselect/nsswitch.conf. For complete SELinux messages run: sealert -l 97d74423-e027-4cd6-8810-ad80944900b5
Aug 4 03:38:56 b0b02.cs.umd.edu setroubleshoot[2715623]: SELinux is preventing /usr/bin/python3.9 from open access on the file /etc/authselect/nsswitch.conf. For complete SELinux messages run: sealert -l 4f253f6a-62d6-46dd-8eaf-0b4d29df41c6
Aug 4 03:44:29 b0b02.cs.umd.edu rustdesk[2717098]: cannot open display:
== cheezit.cs.umd.edu (12 distinct, 16 total) ==
Aug 4 03:07:24 cheezit.cs.umd.edu sshd-session[852613]: error: send_error: write: Connection reset by peer
Aug 4 03:08:33 cheezit.cs.umd.edu setroubleshoot[853074]: failed to retrieve rpm info for path '/var/lib/sss/pipes/nss': [x3]
Aug 4 03:08:34 cheezit.cs.umd.edu setroubleshoot[853074]: SELinux is preventing /usr/bin/lsof from write access on the sock_file /var/lib/sss/pipes/nss. For complete SELinux messages run: sealert -l f570494d-54d2-4dac-97e2-28395659abf1 [x3]
Aug 4 03:08:51 cheezit.cs.umd.edu setroubleshoot[853668]: failed to retrieve rpm info for path '/var/log/falconctl.log':
Aug 4 03:08:52 cheezit.cs.umd.edu setroubleshoot[853668]: SELinux is preventing /opt/CrowdStrike/falconctl18708 from append access on the file /var/log/falconctl.log. For complete SELinux messages run: sealert -l 63f66d53-fcfc-44da-a79e-c789b1ce2ce8
Aug 4 03:08:54 cheezit.cs.umd.edu setroubleshoot[853668]: SELinux is preventing /opt/CrowdStrike/falconctl18708 from write access on the file falconstore. For complete SELinux messages run: sealert -l 386506af-597f-4357-89de-bc382f369a6e
Aug 4 03:09:07 cheezit.cs.umd.edu setroubleshoot[854084]: SELinux is preventing /usr/bin/lsof from write access on the sock_file socket. For complete SELinux messages run: sealert -l 9ff2383b-9e1d-44ff-b8ae-af91637450ae
Aug 4 03:09:47 cheezit.cs.umd.edu setroubleshoot[854512]: SELinux is preventing /usr/bin/python3.9 from read access on the file /etc/selinux/targeted/contexts/files/file_contexts.subs_dist. For complete SELinux messages run: sealert -l 679eb260-cf5d-4783-99f4-ce308edb3295
Aug 4 03:09:47 cheezit.cs.umd.edu setroubleshoot[854512]: SELinux is preventing /usr/bin/python3.9 from open access on the file /etc/selinux/targeted/contexts/files/file_contexts.subs_dist. For complete SELinux messages run: sealert -l 77caba8a-5cd0-4e18-b188-6e35c461772d
Aug 4 03:09:47 cheezit.cs.umd.edu setroubleshoot[854512]: SELinux is preventing /usr/bin/python3.9 from read access on the file /etc/selinux/targeted/contexts/files/file_contexts.subs. For complete SELinux messages run: sealert -l d9c6dd0d-0a34-4430-a5ff-e985c55cb064
Aug 4 03:09:47 cheezit.cs.umd.edu setroubleshoot[854512]: SELinux is preventing /usr/bin/python3.9 from open access on the file /etc/selinux/targeted/contexts/files/file_contexts.subs. For complete SELinux messages run: sealert -l 8edbce57-8212-4ac8-af50-3fe403231eda
Aug 4 03:09:47 cheezit.cs.umd.edu setroubleshoot[854512]: SELinux is preventing /usr/bin/python3.9 from map access on the file /etc/selinux/targeted/contexts/files/file_contexts.bin. For complete SELinux messages run: sealert -l 4a0cbe3b-6f49-4c7e-95c6-380f7aef806e
== contest (1 distinct, 34 total) ==
Aug 4 03:05:37 contest goferd[1007]: [ERROR][worker-0] gofer.messaging.adapter.connect:33 - connect: proton+amqps://satellite8.cs.umd.edu:5647, failed: Connection amqps://satellite8.cs.umd.edu:5647 disconnected: Condition('proton.pythonio', 'Connection refused to all addresses') [x34]
== csfw00a (1 distinct, 234 total) ==
Aug 4 03:04:31 csfw00a kernel: bnxt_en 0000:09:00.0 eth3: NIC Link is Down [x234]
== grafana (2 distinct, 2 total) ==
Aug 4 03:59:23 grafana systemd-resolved[787]: Using degraded feature set UDP instead of UDP+EDNS0 for DNS server 10.73.244.100.
Aug 4 03:59:39 grafana systemd-resolved[787]: Using degraded feature set TCP instead of UDP for DNS server 10.73.244.100.
== hackerman (1 distinct, 1 total) ==
Aug 4 03:19:01 hackerman gnome-software[2060381]: failed to commit changes to dconf: GDBus.Error:org.gtk.GDBus.UnmappedGError.Quark._g_2dfile_2derror_2dquark.Code2: Failed to create file “/adminhomes/sajith/.config/dconf/user.QBIYT3”: Permission denied
== idm00 (1 distinct, 1 total) ==
Aug 4 03:51:17 idm00 named[1455]: client @0x7f3310357448 10.73.240.42#57294: update '73.10.in-addr.arpa/IN' denied
== idmp0 (1 distinct, 1 total) ==
Aug 4 03:36:02 idmp0 named[5198]: client @0x7f9936f9c848 10.73.240.43#64911: update '73.10.in-addr.arpa/IN' denied
== itmon02 (2 distinct, 38 total) ==
Aug 4 03:07:53 itmon02 sshd[1750555]: error: beginning MaxStartups throttling [x37]
Aug 4 03:15:03 itmon02 (httpd)[2268850]: httpd.service: Referenced but unset environment variable evaluates to an empty string: OPTIONS
== kadath.cs.umd.edu (1 distinct, 1 total) ==
Aug 4 03:47:31 kadath.cs.umd.edu puppet-agent[1843516]: (Facter) invalid or malformed lldp data: MalformedDataError: no lldp interface data found
== mcstic (2 distinct, 5 total) ==
Aug 4 03:30:02 mcstic krb5_child[2090266]: Client 'admin(a)UMD.EDU' not found in Kerberos database [x4]
Aug 4 03:30:08 mcstic sshd[2090258]: error: PAM: Authentication failure for admin from 34.156.242.5
== netbox (1 distinct, 1 total) ==
Aug 4 03:08:03 netbox (httpd)[1607354]: httpd.service: Referenced but unset environment variable evaluates to an empty string: OPTIONS
== newhonors2 (1 distinct, 24 total) ==
Aug 4 03:13:03 newhonors2 dhcpcd[708055]: dhcpcd is not running [x24]
== outbound00.cs.umd.edu (2 distinct, 8 total) ==
Aug 4 03:09:09 outbound00.cs.umd.edu python3[2688929]: ldapdb [x7]
Aug 4 03:24:49 outbound00.cs.umd.edu systemd[1]: Configuration file /usr/lib/systemd/system/authentication_milter.service is marked executable. Please remove executable permission bits. Proceeding anyway.
== outbound01.cs.umd.edu (1 distinct, 6 total) ==
Aug 4 03:13:06 outbound01.cs.umd.edu python3[722892]: ldapdb [x6]
== sentry-docker00.cs.umd.edu (36 distinct, 36 total) ==
Aug 4 03:06:48 sentry-docker00.cs.umd.edu systemd-udevd[1476627]: link_config: could not get ethtool features for vethff7f9a1
Aug 4 03:06:48 sentry-docker00.cs.umd.edu systemd-udevd[1476627]: Could not set offload features of vethff7f9a1: No such device
Aug 4 03:06:48 sentry-docker00.cs.umd.edu systemd-udevd[1476663]: Could not generate persistent MAC address for vethfcc3d51: No such file or directory
Aug 4 03:06:48 sentry-docker00.cs.umd.edu systemd-udevd[1476664]: Could not generate persistent MAC address for veth4dc19f2: No such file or directory
Aug 4 03:06:48 sentry-docker00.cs.umd.edu systemd-udevd[1476667]: Could not generate persistent MAC address for veth0c35fe5: No such file or directory
Aug 4 03:06:48 sentry-docker00.cs.umd.edu systemd-udevd[1476677]: Could not generate persistent MAC address for veth33f8051: No such file or directory
Aug 4 03:06:48 sentry-docker00.cs.umd.edu systemd-udevd[1476675]: Could not generate persistent MAC address for veth595dff4: No such file or directory
Aug 4 03:06:48 sentry-docker00.cs.umd.edu systemd-udevd[1476664]: Could not generate persistent MAC address for veth8216b87: No such file or directory
Aug 4 03:06:48 sentry-docker00.cs.umd.edu systemd-udevd[1476693]: Could not generate persistent MAC address for vethc6ae6a1: No such file or directory
Aug 4 03:06:48 sentry-docker00.cs.umd.edu systemd-udevd[1476694]: Could not generate persistent MAC address for vethc290bbf: No such file or directory
Aug 4 03:06:49 sentry-docker00.cs.umd.edu systemd-udevd[1476712]: Could not generate persistent MAC address for vethdb26308: No such file or directory
Aug 4 03:06:49 sentry-docker00.cs.umd.edu systemd-udevd[1476718]: Could not generate persistent MAC address for vethb38682c: No such file or directory
Aug 4 03:26:56 sentry-docker00.cs.umd.edu systemd-udevd[1485953]: link_config: could not get ethtool features for vethc6ae6a1
Aug 4 03:26:56 sentry-docker00.cs.umd.edu systemd-udevd[1485953]: Could not set offload features of vethc6ae6a1: No such device
Aug 4 03:26:57 sentry-docker00.cs.umd.edu systemd-udevd[1486042]: Could not generate persistent MAC address for veth669847b: No such file or directory
Aug 4 03:26:57 sentry-docker00.cs.umd.edu systemd-udevd[1486043]: Could not generate persistent MAC address for veth58bedb4: No such file or directory
Aug 4 03:26:57 sentry-docker00.cs.umd.edu systemd-udevd[1486046]: Could not generate persistent MAC address for veth0338fe7: No such file or directory
Aug 4 03:26:57 sentry-docker00.cs.umd.edu systemd-udevd[1486060]: Could not generate persistent MAC address for veth0e5ea68: No such file or directory
Aug 4 03:26:57 sentry-docker00.cs.umd.edu systemd-udevd[1486048]: Could not generate persistent MAC address for veth298f2fe: No such file or directory
Aug 4 03:26:57 sentry-docker00.cs.umd.edu systemd-udevd[1486051]: Could not generate persistent MAC address for veth2aae9ce: No such file or directory
Aug 4 03:26:57 sentry-docker00.cs.umd.edu systemd-udevd[1486074]: Could not generate persistent MAC address for veth12da249: No such file or directory
Aug 4 03:26:57 sentry-docker00.cs.umd.edu systemd-udevd[1486075]: Could not generate persistent MAC address for veth9d8f881: No such file or directory
Aug 4 03:26:57 sentry-docker00.cs.umd.edu systemd-udevd[1486093]: Could not generate persistent MAC address for veth54341e2: No such file or directory
Aug 4 03:26:57 sentry-docker00.cs.umd.edu systemd-udevd[1486091]: Could not generate persistent MAC address for veth1d05719: No such file or directory
Aug 4 03:47:05 sentry-docker00.cs.umd.edu systemd-udevd[1495304]: link_config: could not get ethtool features for veth0338fe7
Aug 4 03:47:05 sentry-docker00.cs.umd.edu systemd-udevd[1495304]: Could not set offload features of veth0338fe7: No such device
Aug 4 03:47:05 sentry-docker00.cs.umd.edu systemd-udevd[1495424]: Could not generate persistent MAC address for veth74f5b7a: No such file or directory
Aug 4 03:47:05 sentry-docker00.cs.umd.edu systemd-udevd[1495425]: Could not generate persistent MAC address for veth4492234: No such file or directory
Aug 4 03:47:05 sentry-docker00.cs.umd.edu systemd-udevd[1495434]: Could not generate persistent MAC address for veth728b669: No such file or directory
Aug 4 03:47:05 sentry-docker00.cs.umd.edu systemd-udevd[1495443]: Could not generate persistent MAC address for veth763e45f: No such file or directory
... 6 more distinct messages not shown
== strawberry (2 distinct, 8 total) ==
Aug 4 03:09:44 strawberry udisksd[1067]: Error performing housekeeping for drive /org/freedesktop/UDisks2/drives/ST2000DM001_1CH164_W1E8J5KJ: Error updating SMART data: Error sending ATA command CHECK POWER MODE: Unexpected sense data returned:#0120000: 00 00 00 00 00 00 00 00 00 00 00 00 00 00 00 00 ................#0120010: 00 00 00 00 00 00 00 00 00 00 00 00 00 00 00 00 ................#012 (g-io-error-quark, 0) [x6]
Aug 4 03:34:42 strawberry smartd[5314]: Device: /dev/sda [SAT], failed to read SMART Attribute Data [x2]
1
0
Command: /usr/local/sbin/syslog-digest.py
Time : 0.5024s
Status : exited 0
Output :
Syslog digest — 2026-08-04 03:05 EDT
Processed 4,281 lines, filtered 3,463 (80%). 818 unknown (91 distinct) from 17 host(s).
== abuse (1 distinct, 348 total) ==
Aug 4 02:05:06 abuse rsyslogd[21745]: imjournal: open() failed for path: '/var/lib/rsyslog/imjournal.state.tmp': Input/output error [v8.2404.0 try https://www.rsyslog.com/e/2433 ] [x348]
== b0b02.cs.umd.edu (4 distinct, 4 total) ==
Aug 4 02:38:47 b0b02.cs.umd.edu setroubleshoot[2700476]: SELinux is preventing /usr/bin/python3.9 from getattr access on the file /etc/authselect/nsswitch.conf. For complete SELinux messages run: sealert -l 9a1e2952-3fde-4937-a8ab-f7f59791a458
Aug 4 02:38:49 b0b02.cs.umd.edu setroubleshoot[2700476]: SELinux is preventing /usr/bin/python3.9 from read access on the file /etc/authselect/nsswitch.conf. For complete SELinux messages run: sealert -l 97d74423-e027-4cd6-8810-ad80944900b5
Aug 4 02:38:52 b0b02.cs.umd.edu setroubleshoot[2700476]: SELinux is preventing /usr/bin/python3.9 from open access on the file /etc/authselect/nsswitch.conf. For complete SELinux messages run: sealert -l 4f253f6a-62d6-46dd-8eaf-0b4d29df41c6
Aug 4 02:44:26 b0b02.cs.umd.edu rustdesk[2701952]: cannot open display:
== contest (1 distinct, 33 total) ==
Aug 4 02:06:42 contest goferd[1007]: [ERROR][worker-0] gofer.messaging.adapter.connect:33 - connect: proton+amqps://satellite8.cs.umd.edu:5647, failed: Connection amqps://satellite8.cs.umd.edu:5647 disconnected: Condition('proton.pythonio', 'Connection refused to all addresses') [x33]
== csfw00a (2 distinct, 248 total) ==
Aug 4 02:05:16 csfw00a kernel: bnxt_en 0000:09:00.0 eth3: NIC Link is Down [x244]
Aug 4 02:57:25 csfw00a ospf6d[1477]: [EC 100663307] Could not send entire message [x4]
== idm00 (1 distinct, 1 total) ==
Aug 4 02:51:16 idm00 named[1455]: client @0x7f3310201ff8 10.73.240.42#55255: update '73.10.in-addr.arpa/IN' denied
== idmp0 (1 distinct, 1 total) ==
Aug 4 02:36:02 idmp0 named[5198]: client @0x7f992801b8a8 10.73.240.43#60439: update '73.10.in-addr.arpa/IN' denied
== inbound01.cs.umd.edu (23 distinct, 51 total) ==
Aug 4 02:52:37 inbound01.cs.umd.edu sshd-session[739303]: error: maximum authentication attempts exceeded for root from 84.217.211.200 port 50512 ssh2 [preauth]
Aug 4 02:52:59 inbound01.cs.umd.edu sshd-session[739386]: error: maximum authentication attempts exceeded for root from 84.217.211.200 port 54144 ssh2 [preauth]
Aug 4 02:53:20 inbound01.cs.umd.edu sshd-session[739424]: error: maximum authentication attempts exceeded for root from 84.217.211.200 port 57812 ssh2 [preauth]
Aug 4 02:53:26 inbound01.cs.umd.edu krb5_child[739464]: Client 'admin(a)UMD.EDU' not found in Kerberos database [x16]
Aug 4 02:53:47 inbound01.cs.umd.edu sshd-session[739461]: error: maximum authentication attempts exceeded for admin from 84.217.211.200 port 34042 ssh2 [preauth]
Aug 4 02:54:06 inbound01.cs.umd.edu sshd-session[739572]: error: maximum authentication attempts exceeded for admin from 84.217.211.200 port 37900 ssh2 [preauth]
Aug 4 02:54:37 inbound01.cs.umd.edu sshd-session[739607]: error: maximum authentication attempts exceeded for invalid user oracle from 84.217.211.200 port 42888 ssh2 [preauth]
Aug 4 02:54:59 inbound01.cs.umd.edu sshd-session[739680]: error: maximum authentication attempts exceeded for invalid user oracle from 84.217.211.200 port 46596 ssh2 [preauth]
Aug 4 02:55:26 inbound01.cs.umd.edu sshd-session[740293]: error: maximum authentication attempts exceeded for invalid user usuario from 84.217.211.200 port 51828 ssh2 [preauth]
Aug 4 02:55:41 inbound01.cs.umd.edu sshd-session[740398]: error: maximum authentication attempts exceeded for invalid user usuario from 84.217.211.200 port 55250 ssh2 [preauth]
Aug 4 02:56:06 inbound01.cs.umd.edu sshd-session[740807]: error: maximum authentication attempts exceeded for invalid user test from 84.217.211.200 port 58814 ssh2 [preauth]
Aug 4 02:56:28 inbound01.cs.umd.edu sshd-session[740814]: error: maximum authentication attempts exceeded for invalid user test from 84.217.211.200 port 34038 ssh2 [preauth]
Aug 4 02:56:56 inbound01.cs.umd.edu sshd-session[740900]: error: maximum authentication attempts exceeded for invalid user user from 84.217.211.200 port 39250 ssh2 [preauth]
Aug 4 02:57:14 inbound01.cs.umd.edu sshd-session[740932]: error: maximum authentication attempts exceeded for invalid user user from 84.217.211.200 port 42150 ssh2 [preauth]
Aug 4 02:57:44 inbound01.cs.umd.edu sshd-session[740945]: error: maximum authentication attempts exceeded for invalid user ftpuser from 84.217.211.200 port 46792 ssh2 [preauth]
Aug 4 02:58:04 inbound01.cs.umd.edu sshd-session[741019]: error: maximum authentication attempts exceeded for invalid user ftpuser from 84.217.211.200 port 49810 ssh2 [preauth]
Aug 4 02:58:20 inbound01.cs.umd.edu krb5_child[741275]: Client 'test1(a)UMD.EDU' not found in Kerberos database [x14]
Aug 4 02:58:41 inbound01.cs.umd.edu sshd-session[741272]: error: maximum authentication attempts exceeded for test1 from 84.217.211.200 port 55520 ssh2 [preauth]
Aug 4 02:59:07 inbound01.cs.umd.edu sshd-session[741362]: error: maximum authentication attempts exceeded for test1 from 84.217.211.200 port 59112 ssh2 [preauth]
Aug 4 02:59:35 inbound01.cs.umd.edu sshd-session[741413]: error: maximum authentication attempts exceeded for invalid user test2 from 84.217.211.200 port 36422 ssh2 [preauth]
Aug 4 02:59:55 inbound01.cs.umd.edu sshd-session[741489]: error: maximum authentication attempts exceeded for invalid user test2 from 84.217.211.200 port 39704 ssh2 [preauth]
Aug 4 03:00:28 inbound01.cs.umd.edu sshd-session[741527]: error: maximum authentication attempts exceeded for invalid user ubuntu from 84.217.211.200 port 44508 ssh2 [preauth]
Aug 4 03:00:47 inbound01.cs.umd.edu sshd-session[741821]: error: maximum authentication attempts exceeded for invalid user ubuntu from 84.217.211.200 port 48298 ssh2 [preauth]
== itmon02 (1 distinct, 33 total) ==
Aug 4 02:08:00 itmon02 sshd[1750555]: error: beginning MaxStartups throttling [x33]
== networkvm01.cs.umd.edu (10 distinct, 12 total) ==
Aug 4 02:33:54 networkvm01.cs.umd.edu setroubleshoot[154201]: SELinux is preventing /usr/bin/gpg from write access on the directory /(null). For complete SELinux messages run: sealert -l 8ead1354-ae8a-4a17-bb3f-146ebf6c892c
Aug 4 02:33:54 networkvm01.cs.umd.edu setroubleshoot[154201]: SELinux is preventing /usr/bin/gpg from add_name access on the directory /(null). For complete SELinux messages run: sealert -l f9b51e91-5dbc-455f-88c2-f0746a2f0f4c
Aug 4 02:33:54 networkvm01.cs.umd.edu setroubleshoot[154201]: SELinux is preventing /usr/bin/gpg from create access on the file /(null). For complete SELinux messages run: sealert -l af0a60e6-c449-4bdd-bfb8-c69b58472884 [x2]
Aug 4 02:33:54 networkvm01.cs.umd.edu setroubleshoot[154201]: SELinux is preventing /usr/bin/gpg from link access on the file /(null). For complete SELinux messages run: sealert -l 3df452f6-4d9e-4e38-946b-ea8e1edd356c [x2]
Aug 4 02:33:54 networkvm01.cs.umd.edu setroubleshoot[154201]: SELinux is preventing /usr/bin/gpg from remove_name access on the directory .#lk0x000055a87bf38ed0.networkvm01.cs.umd.edu.154200x. For complete SELinux messages run: sealert -l fcac71c9-c7c0-45a9-9dc2-a8dcbeccfc75
Aug 4 02:33:54 networkvm01.cs.umd.edu setroubleshoot[154201]: SELinux is preventing /usr/bin/gpg from unlink access on the file .#lk0x000055a87bf38ed0.networkvm01.cs.umd.edu.154200x. For complete SELinux messages run: sealert -l a672ebb7-fa69-419c-b1f0-fb386b8b48a6
Aug 4 02:33:55 networkvm01.cs.umd.edu setroubleshoot[154201]: SELinux is preventing /usr/bin/gpg from write access on the directory /(null). For complete SELinux messages run: sealert -l fec9104e-d27a-4fd4-9872-6b17088c2951
Aug 4 02:33:55 networkvm01.cs.umd.edu setroubleshoot[154201]: SELinux is preventing /usr/bin/gpg from add_name access on the directory /(null). For complete SELinux messages run: sealert -l 26718b2a-493d-457d-818c-244bd8d4ec9d
Aug 4 02:33:55 networkvm01.cs.umd.edu setroubleshoot[154201]: SELinux is preventing /usr/bin/gpg from remove_name access on the directory .#lk0x000055d3df0c2ee0.networkvm01.cs.umd.edu.154218x. For complete SELinux messages run: sealert -l 80e6efe4-93f3-4219-8132-b2b52db1f517
Aug 4 02:33:55 networkvm01.cs.umd.edu setroubleshoot[154201]: SELinux is preventing /usr/bin/gpg from unlink access on the file .#lk0x000055d3df0c2ee0.networkvm01.cs.umd.edu.154218x. For complete SELinux messages run: sealert -l a672ebb7-fa69-419c-b1f0-fb386b8b48a6
== newhonors2 (1 distinct, 24 total) ==
Aug 4 02:13:03 newhonors2 dhcpcd[706209]: dhcpcd is not running [x24]
== outbound00.cs.umd.edu (1 distinct, 6 total) ==
Aug 4 02:09:09 outbound00.cs.umd.edu python3[2674955]: ldapdb [x6]
== outbound01.cs.umd.edu (1 distinct, 6 total) ==
Aug 4 02:13:06 outbound01.cs.umd.edu python3[709051]: ldapdb [x6]
== sentry-docker00.cs.umd.edu (38 distinct, 38 total) ==
Aug 4 02:06:23 sentry-docker00.cs.umd.edu systemd-udevd[1447843]: link_config: could not get ethtool features for vethc24ab1e
Aug 4 02:06:23 sentry-docker00.cs.umd.edu systemd-udevd[1447843]: Could not set offload features of vethc24ab1e: No such device
Aug 4 02:06:24 sentry-docker00.cs.umd.edu systemd-udevd[1447866]: Could not generate persistent MAC address for veth94c6fd4: No such file or directory
Aug 4 02:06:24 sentry-docker00.cs.umd.edu systemd-udevd[1447867]: Could not generate persistent MAC address for veth16ae5ae: No such file or directory
Aug 4 02:06:24 sentry-docker00.cs.umd.edu systemd-udevd[1447872]: Could not generate persistent MAC address for veth683ec13: No such file or directory
Aug 4 02:06:24 sentry-docker00.cs.umd.edu systemd-udevd[1447889]: Could not generate persistent MAC address for veth51b1cae: No such file or directory
Aug 4 02:06:24 sentry-docker00.cs.umd.edu systemd-udevd[1447894]: Could not generate persistent MAC address for vethb5e22fd: No such file or directory
Aug 4 02:06:24 sentry-docker00.cs.umd.edu systemd-udevd[1447895]: Could not generate persistent MAC address for veth1a571bd: No such file or directory
Aug 4 02:06:24 sentry-docker00.cs.umd.edu systemd-udevd[1447913]: Could not generate persistent MAC address for veth66e8ed5: No such file or directory
Aug 4 02:06:24 sentry-docker00.cs.umd.edu systemd-udevd[1447912]: Could not generate persistent MAC address for vethea2c72b: No such file or directory
Aug 4 02:06:24 sentry-docker00.cs.umd.edu systemd-udevd[1447951]: Could not generate persistent MAC address for veth8f8abc2: No such file or directory
Aug 4 02:06:24 sentry-docker00.cs.umd.edu systemd-udevd[1447950]: Could not generate persistent MAC address for vethac4f532: No such file or directory
Aug 4 02:26:31 sentry-docker00.cs.umd.edu systemd-udevd[1457232]: link_config: could not get ethtool features for vethb5e22fd
Aug 4 02:26:31 sentry-docker00.cs.umd.edu systemd-udevd[1457232]: Could not set offload features of vethb5e22fd: No such device
Aug 4 02:26:31 sentry-docker00.cs.umd.edu systemd-udevd[1457308]: link_config: could not get ethtool features for veth94c6fd4
Aug 4 02:26:31 sentry-docker00.cs.umd.edu systemd-udevd[1457308]: Could not set offload features of veth94c6fd4: No such device
Aug 4 02:26:32 sentry-docker00.cs.umd.edu systemd-udevd[1457330]: Could not generate persistent MAC address for vethac90317: No such file or directory
Aug 4 02:26:32 sentry-docker00.cs.umd.edu systemd-udevd[1457331]: Could not generate persistent MAC address for vethf3f5ba4: No such file or directory
Aug 4 02:26:32 sentry-docker00.cs.umd.edu systemd-udevd[1457349]: Could not generate persistent MAC address for vethac72d20: No such file or directory
Aug 4 02:26:32 sentry-docker00.cs.umd.edu systemd-udevd[1457331]: Could not generate persistent MAC address for veth2454a8c: No such file or directory
Aug 4 02:26:32 sentry-docker00.cs.umd.edu systemd-udevd[1457350]: Could not generate persistent MAC address for vethd9278fb: No such file or directory
Aug 4 02:26:32 sentry-docker00.cs.umd.edu systemd-udevd[1457339]: Could not generate persistent MAC address for vethf8c0e2a: No such file or directory
Aug 4 02:26:32 sentry-docker00.cs.umd.edu systemd-udevd[1457360]: Could not generate persistent MAC address for vethd2d764a: No such file or directory
Aug 4 02:26:32 sentry-docker00.cs.umd.edu systemd-udevd[1457361]: Could not generate persistent MAC address for veth0afbc6a: No such file or directory
Aug 4 02:26:32 sentry-docker00.cs.umd.edu systemd-udevd[1457380]: Could not generate persistent MAC address for veth068c0ef: No such file or directory
Aug 4 02:26:32 sentry-docker00.cs.umd.edu systemd-udevd[1457368]: Could not generate persistent MAC address for veth380640f: No such file or directory
Aug 4 02:46:40 sentry-docker00.cs.umd.edu systemd-udevd[1467154]: link_config: could not set ethtool features for veth068c0ef
Aug 4 02:46:40 sentry-docker00.cs.umd.edu systemd-udevd[1467154]: Could not set offload features of veth068c0ef: Operation not permitted
Aug 4 02:46:40 sentry-docker00.cs.umd.edu systemd-udevd[1467180]: Could not generate persistent MAC address for veth38e2a46: No such file or directory
Aug 4 02:46:40 sentry-docker00.cs.umd.edu systemd-udevd[1467181]: Could not generate persistent MAC address for veth869381f: No such file or directory
... 8 more distinct messages not shown
== soul (2 distinct, 2 total) ==
Aug 4 02:25:45 soul krb5_child[3485168]: Client 'admin(a)UMD.EDU' not found in Kerberos database
Aug 4 02:25:52 soul sshd-session[3485185]: error: Protocol major versions differ: 2 vs. 1
== strawberry (2 distinct, 8 total) ==
Aug 4 02:09:44 strawberry udisksd[1067]: Error performing housekeeping for drive /org/freedesktop/UDisks2/drives/ST2000DM001_1CH164_W1E8J5KJ: Error updating SMART data: Error sending ATA command CHECK POWER MODE: Unexpected sense data returned:#0120000: 00 00 00 00 00 00 00 00 00 00 00 00 00 00 00 00 ................#0120010: 00 00 00 00 00 00 00 00 00 00 00 00 00 00 00 00 ................#012 (g-io-error-quark, 0) [x6]
Aug 4 02:34:42 strawberry smartd[5314]: Device: /dev/sda [SAT], failed to read SMART Attribute Data [x2]
== submit26-b9-2 (1 distinct, 1 total) ==
Aug 4 02:10:06 submit26-b9-2 systemd[1]: user(a)1001.service: Main process exited, code=killed, status=9/KILL
== zwicker-computer (1 distinct, 2 total) ==
Aug 4 02:07:33 zwicker-computer krb5_child[847976]: Preauthentication failed [x2]
1
0
Command: /usr/local/sbin/syslog-digest.py
Time : 0.5027s
Status : exited 0
Output :
Syslog digest — 2026-08-04 02:05 EDT
Processed 4,157 lines, filtered 3,318 (79%). 839 unknown (104 distinct) from 22 host(s).
== abuse (1 distinct, 347 total) ==
Aug 4 01:05:06 abuse rsyslogd[21745]: imjournal: open() failed for path: '/var/lib/rsyslog/imjournal.state.tmp': Input/output error [v8.2404.0 try https://www.rsyslog.com/e/2433 ] [x347]
== b0b02.cs.umd.edu (1 distinct, 1 total) ==
Aug 4 01:44:22 b0b02.cs.umd.edu rustdesk[2686851]: cannot open display:
== contest (10 distinct, 44 total) ==
Aug 4 01:06:01 contest goferd[1007]: [ERROR][worker-0] gofer.messaging.adapter.connect:33 - connect: proton+amqps://satellite8.cs.umd.edu:5647, failed: Connection amqps://satellite8.cs.umd.edu:5647 disconnected: Condition('proton.pythonio', 'Connection refused to all addresses') [x34]
Aug 4 01:48:17 contest setroubleshoot[591587]: SELinux is preventing /usr/libexec/platform-python3.6 from create access on the directory libdnf.CKbySB. For complete SELinux messages run: sealert -l cb6b25c6-4765-4cf2-88a0-9b3b508e94e9
Aug 4 01:48:18 contest setroubleshoot[591587]: SELinux is preventing /usr/bin/gpgconf from add_name access on the directory repodata. For complete SELinux messages run: sealert -l 41cf7b1b-0f34-4609-98f2-b66e7825fef7
Aug 4 01:48:18 contest setroubleshoot[591587]: SELinux is preventing /usr/libexec/platform-python3.6 from create access on the file mirrorlist. For complete SELinux messages run: sealert -l fc20ff92-ea83-4f38-a24b-ddfd737a3141
Aug 4 01:48:18 contest setroubleshoot[591587]: SELinux is preventing /usr/libexec/platform-python3.6 from setattr access on the file repomd.xml. For complete SELinux messages run: sealert -l ac675631-fa35-4e93-adc9-b692b18e53e5
Aug 4 01:48:18 contest setroubleshoot[591587]: SELinux is preventing /usr/bin/gpgconf from add_name access on the directory repomd.xml.asc. For complete SELinux messages run: sealert -l 41cf7b1b-0f34-4609-98f2-b66e7825fef7
Aug 4 01:48:18 contest setroubleshoot[591587]: SELinux is preventing /usr/libexec/platform-python3.6 from read access on the directory libdnf.CKbySB. For complete SELinux messages run: sealert -l 45d103b6-0810-4890-a705-990118577ce8
Aug 4 01:48:18 contest setroubleshoot[591587]: SELinux is preventing /usr/libexec/platform-python3.6 from remove_name access on the directory repomd.xml. For complete SELinux messages run: sealert -l 7e499113-2fd7-4f67-bec6-3521efbe3637 [x2]
Aug 4 01:48:18 contest setroubleshoot[591587]: SELinux is preventing /usr/libexec/platform-python3.6 from rmdir access on the directory repodata. For complete SELinux messages run: sealert -l 3928930b-a1ed-448d-950b-0665ac2adef8
Aug 4 01:48:19 contest setroubleshoot[591587]: SELinux is preventing /usr/libexec/platform-python3.6 from create access on the directory libdnf.I2R0TW. For complete SELinux messages run: sealert -l cb6b25c6-4765-4cf2-88a0-9b3b508e94e9
== csfw00a (1 distinct, 218 total) ==
Aug 4 01:04:55 csfw00a kernel: bnxt_en 0000:09:00.0 eth3: NIC Link is Down [x218]
== dojo (1 distinct, 1 total) ==
Aug 4 01:46:36 dojo sshd[1049409]: error: Protocol major versions differ: 2 vs. 1
== frabjous (2 distinct, 2 total) ==
Aug 4 01:52:05 frabjous krb5_child[2972448]: Client 'admin(a)UMD.EDU' not found in Kerberos database
Aug 4 01:52:07 frabjous sshd-session[2972444]: error: PAM: Authentication failure for admin from 34.38.14.198
== hackerman (1 distinct, 1 total) ==
Aug 4 01:19:01 hackerman gnome-software[2060381]: failed to commit changes to dconf: GDBus.Error:org.gtk.GDBus.UnmappedGError.Quark._g_2dfile_2derror_2dquark.Code2: Failed to create file “/adminhomes/sajith/.config/dconf/user.GTLYT3”: Permission denied
== hazfs.cs.umd.edu (11 distinct, 66 total) ==
Aug 4 01:52:28 hazfs.cs.umd.edu snmpd[1431]: send response: Failure in sendto [x6]
Aug 4 01:52:28 hazfs.cs.umd.edu snmpd[1431]: -- NET-SNMP-EXTEND-MIB::nsExtendStatus."userweb" [x6]
Aug 4 01:52:28 hazfs.cs.umd.edu snmpd[1431]: -- NET-SNMP-EXTEND-MIB::nsExtendStatus."zfslist" [x6]
Aug 4 01:52:28 hazfs.cs.umd.edu snmpd[1431]: -- NET-SNMP-EXTEND-MIB::nsExtendStatus."userhome" [x6]
Aug 4 01:52:28 hazfs.cs.umd.edu snmpd[1431]: -- NET-SNMP-EXTEND-MIB::nsExtendOutput1Line."userweb" [x6]
Aug 4 01:52:28 hazfs.cs.umd.edu snmpd[1431]: -- NET-SNMP-EXTEND-MIB::nsExtendOutput1Line."zfslist" [x6]
Aug 4 01:52:28 hazfs.cs.umd.edu snmpd[1431]: -- NET-SNMP-EXTEND-MIB::nsExtendOutput1Line."userhome" [x6]
Aug 4 01:52:28 hazfs.cs.umd.edu snmpd[1431]: -- NET-SNMP-EXTEND-MIB::nsExtendOutputFull."userweb" [x6]
Aug 4 01:52:28 hazfs.cs.umd.edu snmpd[1431]: -- NET-SNMP-EXTEND-MIB::nsExtendOutputFull."zfslist" [x6]
Aug 4 01:52:28 hazfs.cs.umd.edu snmpd[1431]: -- NET-SNMP-EXTEND-MIB::nsExtendOutputFull."userhome" [x6]
Aug 4 01:52:28 hazfs.cs.umd.edu snmpd[1431]: -- NET-SNMP-EXTEND-MIB::nsExtendOutNumLines."userweb" [x6]
== idm00 (2 distinct, 2 total) ==
Aug 4 01:24:05 idm00 named[1455]: client @0x7f33157df218 10.73.245.12#63922: update '73.10.in-addr.arpa/IN' denied
Aug 4 01:51:16 idm00 named[1455]: client @0x7f3310552688 10.73.240.42#58039: update '73.10.in-addr.arpa/IN' denied
== idmp0 (1 distinct, 1 total) ==
Aug 4 01:36:02 idmp0 named[5198]: client @0x7f9924071208 10.73.240.43#53708: update '73.10.in-addr.arpa/IN' denied
== inbound00.cs.umd.edu (1 distinct, 1 total) ==
Aug 4 01:54:19 inbound00.cs.umd.edu sshd-session[2711745]: fatal: userauth_pubkey: parse publickey packet: incomplete message [preauth]
== itmon02 (1 distinct, 39 total) ==
Aug 4 01:08:13 itmon02 sshd[1750555]: error: beginning MaxStartups throttling [x39]
== newhonors2 (1 distinct, 24 total) ==
Aug 4 01:13:03 newhonors2 dhcpcd[704385]: dhcpcd is not running [x24]
== outbound00.cs.umd.edu (1 distinct, 6 total) ==
Aug 4 01:09:09 outbound00.cs.umd.edu python3[2661088]: ldapdb [x6]
== outbound01.cs.umd.edu (1 distinct, 6 total) ==
Aug 4 01:13:06 outbound01.cs.umd.edu python3[695043]: ldapdb [x6]
== sentry-docker00.cs.umd.edu (34 distinct, 34 total) ==
Aug 4 01:05:58 sentry-docker00.cs.umd.edu systemd-udevd[1419439]: Could not generate persistent MAC address for veth0b4ca6f: No such file or directory
Aug 4 01:05:58 sentry-docker00.cs.umd.edu systemd-udevd[1419440]: Could not generate persistent MAC address for veth430d9d7: No such file or directory
Aug 4 01:05:58 sentry-docker00.cs.umd.edu systemd-udevd[1419443]: Could not generate persistent MAC address for veth3a163ca: No such file or directory
Aug 4 01:05:58 sentry-docker00.cs.umd.edu systemd-udevd[1419444]: Could not generate persistent MAC address for vethce3520e: No such file or directory
Aug 4 01:05:58 sentry-docker00.cs.umd.edu systemd-udevd[1419466]: Could not generate persistent MAC address for veth6bb3a59: No such file or directory
Aug 4 01:05:58 sentry-docker00.cs.umd.edu systemd-udevd[1419465]: Could not generate persistent MAC address for veth73c552f: No such file or directory
Aug 4 01:05:58 sentry-docker00.cs.umd.edu systemd-udevd[1419458]: Could not generate persistent MAC address for vethadc0424: No such file or directory
Aug 4 01:05:58 sentry-docker00.cs.umd.edu systemd-udevd[1419446]: Could not generate persistent MAC address for veth10c868f: No such file or directory
Aug 4 01:05:58 sentry-docker00.cs.umd.edu systemd-udevd[1419466]: Could not generate persistent MAC address for veth39b4306: No such file or directory
Aug 4 01:05:58 sentry-docker00.cs.umd.edu systemd-udevd[1419463]: Could not generate persistent MAC address for veth17dfdb2: No such file or directory
Aug 4 01:26:06 sentry-docker00.cs.umd.edu systemd-udevd[1428924]: link_config: could not get ethtool features for vethadc0424
Aug 4 01:26:06 sentry-docker00.cs.umd.edu systemd-udevd[1428924]: Could not set offload features of vethadc0424: No such device
Aug 4 01:26:07 sentry-docker00.cs.umd.edu systemd-udevd[1429017]: Could not generate persistent MAC address for vethe7dcde6: No such file or directory
Aug 4 01:26:07 sentry-docker00.cs.umd.edu systemd-udevd[1429018]: Could not generate persistent MAC address for veth8b222cb: No such file or directory
Aug 4 01:26:07 sentry-docker00.cs.umd.edu systemd-udevd[1429021]: Could not generate persistent MAC address for vetha27f423: No such file or directory
Aug 4 01:26:07 sentry-docker00.cs.umd.edu systemd-udevd[1429022]: Could not generate persistent MAC address for veth42fe57a: No such file or directory
Aug 4 01:26:07 sentry-docker00.cs.umd.edu systemd-udevd[1429018]: Could not generate persistent MAC address for veth95aa580: No such file or directory
Aug 4 01:26:07 sentry-docker00.cs.umd.edu systemd-udevd[1429043]: Could not generate persistent MAC address for vethbaae21c: No such file or directory
Aug 4 01:26:07 sentry-docker00.cs.umd.edu systemd-udevd[1429047]: Could not generate persistent MAC address for veth644e6be: No such file or directory
Aug 4 01:26:07 sentry-docker00.cs.umd.edu systemd-udevd[1429048]: Could not generate persistent MAC address for veth39248a5: No such file or directory
Aug 4 01:26:07 sentry-docker00.cs.umd.edu systemd-udevd[1429067]: Could not generate persistent MAC address for veth936803b: No such file or directory
Aug 4 01:26:07 sentry-docker00.cs.umd.edu systemd-udevd[1429051]: Could not generate persistent MAC address for veth7aea59a: No such file or directory
Aug 4 01:46:15 sentry-docker00.cs.umd.edu systemd-udevd[1438343]: link_config: could not get ethtool features for veth936803b
Aug 4 01:46:15 sentry-docker00.cs.umd.edu systemd-udevd[1438343]: Could not set offload features of veth936803b: No such device
Aug 4 01:46:15 sentry-docker00.cs.umd.edu systemd-udevd[1438413]: Could not generate persistent MAC address for vethd73cee5: No such file or directory
Aug 4 01:46:15 sentry-docker00.cs.umd.edu systemd-udevd[1438414]: Could not generate persistent MAC address for veth76a36db: No such file or directory
Aug 4 01:46:15 sentry-docker00.cs.umd.edu systemd-udevd[1438417]: Could not generate persistent MAC address for veth59e3bb9: No such file or directory
Aug 4 01:46:15 sentry-docker00.cs.umd.edu systemd-udevd[1438418]: Could not generate persistent MAC address for veth97a185c: No such file or directory
Aug 4 01:46:15 sentry-docker00.cs.umd.edu systemd-udevd[1438423]: Could not generate persistent MAC address for vethc24ab1e: No such file or directory
Aug 4 01:46:15 sentry-docker00.cs.umd.edu systemd-udevd[1438431]: Could not generate persistent MAC address for veth8d50f67: No such file or directory
... 4 more distinct messages not shown
== strawberry (2 distinct, 8 total) ==
Aug 4 01:09:44 strawberry udisksd[1067]: Error performing housekeeping for drive /org/freedesktop/UDisks2/drives/ST2000DM001_1CH164_W1E8J5KJ: Error updating SMART data: Error sending ATA command CHECK POWER MODE: Unexpected sense data returned:#0120000: 00 00 00 00 00 00 00 00 00 00 00 00 00 00 00 00 ................#0120010: 00 00 00 00 00 00 00 00 00 00 00 00 00 00 00 00 ................#012 (g-io-error-quark, 0) [x6]
Aug 4 01:34:42 strawberry smartd[5314]: Device: /dev/sda [SAT], failed to read SMART Attribute Data [x2]
== submit26-b9-2 (11 distinct, 14 total) ==
Aug 4 01:12:52 submit26-b9-2 setroubleshoot[982824]: SELinux is preventing /usr/bin/python3.9 from create access on the directory /(null). For complete SELinux messages run: sealert -l d506243c-d61e-48f3-b42a-4592c913deb0
Aug 4 01:12:52 submit26-b9-2 setroubleshoot[982824]: SELinux is preventing /usr/bin/python3.9 from add_name access on the directory /(null). For complete SELinux messages run: sealert -l 3b4752ac-1b9a-4af9-a05b-32e4c2eb13ab
Aug 4 01:12:52 submit26-b9-2 setroubleshoot[982824]: SELinux is preventing /usr/bin/python3.9 from create access on the file /(null). For complete SELinux messages run: sealert -l 29e5adbd-4381-4467-b40d-a2219101e096 [x2]
Aug 4 01:12:52 submit26-b9-2 setroubleshoot[982824]: SELinux is preventing /usr/bin/python3.9 from open access on the file /tmp/libdnf.FTd0uv/repodata/repomd.xml. For complete SELinux messages run: sealert -l 1b38f2ec-01ce-4343-8059-ba7494ecc5c4
Aug 4 01:12:52 submit26-b9-2 setroubleshoot[982824]: SELinux is preventing /usr/bin/python3.9 from setattr access on the file repomd.xml. For complete SELinux messages run: sealert -l e5f9af40-1f63-4924-b012-27ab2a7b2266 [x2]
Aug 4 01:12:52 submit26-b9-2 setroubleshoot[982824]: SELinux is preventing /usr/bin/python3.9 from read access on the directory libdnf.FTd0uv. For complete SELinux messages run: sealert -l 5c54db87-54a3-4a7c-97b4-b5c48d6c3543
Aug 4 01:12:52 submit26-b9-2 setroubleshoot[982824]: SELinux is preventing /usr/bin/python3.9 from remove_name access on the directory repomd.xml. For complete SELinux messages run: sealert -l 63cd60e1-1e61-4276-afea-dd8526ffe8b2
Aug 4 01:12:52 submit26-b9-2 setroubleshoot[982824]: SELinux is preventing /usr/bin/python3.9 from unlink access on the file repomd.xml. For complete SELinux messages run: sealert -l 81c7e9ec-e023-4c6d-b1ad-c02a242e655e [x2]
Aug 4 01:12:52 submit26-b9-2 setroubleshoot[982824]: SELinux is preventing /usr/bin/python3.9 from rmdir access on the directory repodata. For complete SELinux messages run: sealert -l 6ae9a597-e123-4d74-8eec-a8ebe0f5e4d0
Aug 4 01:12:52 submit26-b9-2 setroubleshoot[982824]: SELinux is preventing /usr/bin/python3.9 from open access on the file /tmp/libdnf.oHXH4y/repodata/repomd.xml. For complete SELinux messages run: sealert -l 1b38f2ec-01ce-4343-8059-ba7494ecc5c4
Aug 4 01:28:37 submit26-b9-2 systemd[1]: user(a)1001.service: Main process exited, code=killed, status=9/KILL
== submit26-b9-3 (10 distinct, 13 total) ==
Aug 4 01:20:38 submit26-b9-3 setroubleshoot[818360]: SELinux is preventing /usr/bin/python3.9 from create access on the directory /(null). For complete SELinux messages run: sealert -l 5b912a44-22fd-4560-b201-2a4e289b73f5
Aug 4 01:20:38 submit26-b9-3 setroubleshoot[818360]: SELinux is preventing /usr/bin/python3.9 from add_name access on the directory /(null). For complete SELinux messages run: sealert -l 7f1df1e4-725e-4953-98eb-1079f908f543
Aug 4 01:20:38 submit26-b9-3 setroubleshoot[818360]: SELinux is preventing /usr/bin/python3.9 from create access on the file /(null). For complete SELinux messages run: sealert -l 40b8852a-f77b-44b4-affe-5f11fa33de43 [x2]
Aug 4 01:20:38 submit26-b9-3 setroubleshoot[818360]: SELinux is preventing /usr/bin/python3.9 from open access on the file /tmp/libdnf.luOhjQ/repodata/repomd.xml. For complete SELinux messages run: sealert -l 45a8019e-f6b5-4baa-92c1-862594b40d46
Aug 4 01:20:38 submit26-b9-3 setroubleshoot[818360]: SELinux is preventing /usr/bin/python3.9 from setattr access on the file repomd.xml. For complete SELinux messages run: sealert -l e9f0bfff-7784-4126-baa4-2bb06da56591 [x2]
Aug 4 01:20:38 submit26-b9-3 setroubleshoot[818360]: SELinux is preventing /usr/bin/python3.9 from read access on the directory libdnf.luOhjQ. For complete SELinux messages run: sealert -l 0b17cc3d-cdc6-4fe2-a11f-3892e7c41dc7
Aug 4 01:20:38 submit26-b9-3 setroubleshoot[818360]: SELinux is preventing /usr/bin/python3.9 from remove_name access on the directory repomd.xml. For complete SELinux messages run: sealert -l 10e38c64-b65f-4cdd-901e-4375652d9a42
Aug 4 01:20:38 submit26-b9-3 setroubleshoot[818360]: SELinux is preventing /usr/bin/python3.9 from unlink access on the file repomd.xml. For complete SELinux messages run: sealert -l 7fd9cf72-ef38-48e1-b6aa-b571b26a7b22 [x2]
Aug 4 01:20:38 submit26-b9-3 setroubleshoot[818360]: SELinux is preventing /usr/bin/python3.9 from rmdir access on the directory repodata. For complete SELinux messages run: sealert -l b9b11116-89bd-4a3c-980c-1d422c5dcee4
Aug 4 01:20:38 submit26-b9-3 setroubleshoot[818360]: SELinux is preventing /usr/bin/python3.9 from open access on the file /tmp/libdnf.fmKBiv/repodata/repomd.xml. For complete SELinux messages run: sealert -l 45a8019e-f6b5-4baa-92c1-862594b40d46
== submit26-b9-4 (1 distinct, 1 total) ==
Aug 4 01:50:05 submit26-b9-4 systemd[1]: user(a)1001.service: Main process exited, code=killed, status=9/KILL
== submit26-clnb9 (9 distinct, 9 total) ==
Aug 4 01:31:57 submit26-clnb9 setroubleshoot[1761443]: SELinux is preventing /usr/bin/python3.9 from create access on the directory /(null). For complete SELinux messages run: sealert -l 6783ed2b-5ae4-42b5-975a-4bf50eec4658
Aug 4 01:31:57 submit26-clnb9 setroubleshoot[1761443]: SELinux is preventing /usr/bin/python3.9 from add_name access on the directory /(null). For complete SELinux messages run: sealert -l 9e7fa955-cc30-4804-ac8c-e1779e85946c
Aug 4 01:31:57 submit26-clnb9 setroubleshoot[1761443]: SELinux is preventing /usr/bin/python3.9 from create access on the file /(null). For complete SELinux messages run: sealert -l 69bfa6e3-089c-40ff-9563-fd30787d0774
Aug 4 01:31:57 submit26-clnb9 setroubleshoot[1761443]: SELinux is preventing /usr/bin/python3.9 from open access on the file /tmp/libdnf.ZfpLWU/repodata/repomd.xml. For complete SELinux messages run: sealert -l 001acdb5-31ef-4e52-b10b-90f467a89ddc
Aug 4 01:31:57 submit26-clnb9 setroubleshoot[1761443]: SELinux is preventing /usr/bin/python3.9 from setattr access on the file repomd.xml. For complete SELinux messages run: sealert -l edacddcf-16ed-4dc3-8d82-7c597d5dee23
Aug 4 01:31:57 submit26-clnb9 setroubleshoot[1761443]: SELinux is preventing /usr/bin/python3.9 from read access on the directory libdnf.ZfpLWU. For complete SELinux messages run: sealert -l 62b3782e-4730-4488-8178-94dafe9b552c
Aug 4 01:31:57 submit26-clnb9 setroubleshoot[1761443]: SELinux is preventing /usr/bin/python3.9 from remove_name access on the directory repomd.xml. For complete SELinux messages run: sealert -l 81cb3698-78f8-440a-8e3c-e5d1041e6b78
Aug 4 01:31:57 submit26-clnb9 setroubleshoot[1761443]: SELinux is preventing /usr/bin/python3.9 from unlink access on the file repomd.xml. For complete SELinux messages run: sealert -l 792b472a-115c-4799-9805-fc7436f916b9
Aug 4 01:31:57 submit26-clnb9 setroubleshoot[1761443]: SELinux is preventing /usr/bin/python3.9 from rmdir access on the directory repodata. For complete SELinux messages run: sealert -l 15c83a86-837b-41e2-b662-b39cd4e361cb
== zwicker-computer (1 distinct, 1 total) ==
Aug 4 02:01:47 zwicker-computer pipewire[843669]: mod.jackdbus-detect: Failed to receive jackdbus reply: org.freedesktop.DBus.Error.ServiceUnknown: The name org.jackaudio.service was not provided by any .service files
1
0
Command: /usr/local/sbin/syslog-digest.py
Time : 0.4875s
Status : exited 0
Output :
Syslog digest — 2026-08-04 01:05 EDT
Processed 4,039 lines, filtered 3,252 (80%). 787 unknown (101 distinct) from 28 host(s).
== abuse (1 distinct, 347 total) ==
Aug 4 00:05:06 abuse rsyslogd[21745]: imjournal: open() failed for path: '/var/lib/rsyslog/imjournal.state.tmp': Input/output error [v8.2404.0 try https://www.rsyslog.com/e/2433 ] [x347]
== b0b02.cs.umd.edu (1 distinct, 1 total) ==
Aug 4 00:44:18 b0b02.cs.umd.edu rustdesk[2671789]: cannot open display:
== cheezit.cs.umd.edu (1 distinct, 1 total) ==
Aug 4 00:27:38 cheezit.cs.umd.edu sshd-session[814541]: pam_access(sshd:auth): access denied for user `larry' from `71.191.93.172'
== cmsc436-0101-redis (3 distinct, 3 total) ==
Aug 4 00:50:29 cmsc436-0101-redis krb5_child[776751]: Client 'admin(a)UMD.EDU' not found in Kerberos database
Aug 4 00:50:32 cmsc436-0101-redis sshd-session[776747]: error: PAM: Authentication failure for admin from 34.156.170.224
Aug 4 00:51:04 cmsc436-0101-redis sshd-session[776756]: error: Protocol major versions differ: 2 vs. 1
== contest (1 distinct, 34 total) ==
Aug 4 00:05:19 contest goferd[1007]: [ERROR][worker-0] gofer.messaging.adapter.connect:33 - connect: proton+amqps://satellite8.cs.umd.edu:5647, failed: Connection amqps://satellite8.cs.umd.edu:5647 disconnected: Condition('proton.pythonio', 'Connection refused to all addresses') [x34]
== csfw00a (1 distinct, 224 total) ==
Aug 4 00:05:59 csfw00a kernel: bnxt_en 0000:09:00.0 eth3: NIC Link is Down [x224]
== grades01.cs.umd.edu (3 distinct, 4 total) ==
Aug 4 00:10:14 grades01.cs.umd.edu systemd[1]: New main PID 26515 does not belong to service, and PID file is not owned by root. Refusing. [x2]
Aug 4 00:10:38 grades01.cs.umd.edu systemd[1]: Daemon never wrote its PID file. Failing.
Aug 4 00:10:53 grades01.cs.umd.edu systemd[1]: pmlogger.service: Supervising process 1862 which is not our child. We'll most likely not notice when it exits.
== idm00 (1 distinct, 1 total) ==
Aug 4 00:51:16 idm00 named[1455]: client @0x7f3310201ff8 10.73.240.42#60425: update '73.10.in-addr.arpa/IN' denied
== idmp0 (1 distinct, 1 total) ==
Aug 4 00:36:02 idmp0 named[5198]: client @0x7f9918084e38 10.73.240.43#49559: update '73.10.in-addr.arpa/IN' denied
== itmon02 (1 distinct, 36 total) ==
Aug 4 00:08:14 itmon02 sshd[1750555]: error: beginning MaxStartups throttling [x36]
== jubjub.cs.umd.edu (3 distinct, 4 total) ==
Aug 4 00:10:13 jubjub.cs.umd.edu systemd[1]: New main PID 1688833 does not belong to service, and PID file is not owned by root. Refusing. [x2]
Aug 4 00:10:32 jubjub.cs.umd.edu systemd[1]: Daemon never wrote its PID file. Failing.
Aug 4 00:10:40 jubjub.cs.umd.edu systemd[1]: pmlogger.service: Supervising process 1696078 which is not our child. We'll most likely not notice when it exits.
== krispykreme.cs.umd.edu (3 distinct, 3 total) ==
Aug 4 00:22:36 krispykreme.cs.umd.edu sshd-session[3013803]: pam_access(sshd:auth): access denied for user `admin' from `34.156.170.224'
Aug 4 00:22:36 krispykreme.cs.umd.edu krb5_child[3013805]: Client 'admin(a)UMD.EDU' not found in Kerberos database
Aug 4 00:22:36 krispykreme.cs.umd.edu sshd-session[3013800]: error: PAM: System error for admin from 34.156.170.224
== mirrors.cs.umd.edu (3 distinct, 4 total) ==
Aug 4 00:10:27 mirrors.cs.umd.edu systemd[1]: New main PID 2747 does not belong to service, and PID file is not owned by root. Refusing. [x2]
Aug 4 00:10:46 mirrors.cs.umd.edu systemd[1]: Daemon never wrote its PID file. Failing.
Aug 4 00:11:00 mirrors.cs.umd.edu systemd[1]: pmlogger.service: Supervising process 9758 which is not our child. We'll most likely not notice when it exits.
== misty.cs.umd.edu (3 distinct, 4 total) ==
Aug 4 00:10:15 misty.cs.umd.edu systemd[1]: New main PID 8850 does not belong to service, and PID file is not owned by root. Refusing. [x2]
Aug 4 00:10:35 misty.cs.umd.edu systemd[1]: Daemon never wrote its PID file. Failing.
Aug 4 00:10:50 misty.cs.umd.edu systemd[1]: pmlogger.service: Supervising process 16711 which is not our child. We'll most likely not notice when it exits.
== netman.cs.umd.edu (3 distinct, 3 total) ==
Aug 4 00:30:01 netman.cs.umd.edu setroubleshoot[507931]: SELinux is preventing /usr/bin/gpg from read access on the file gpg.conf. For complete SELinux messages run: sealert -l 019ad1da-a874-4814-8037-3b3e5f413ad2
Aug 4 00:30:01 netman.cs.umd.edu setroubleshoot[507931]: SELinux is preventing /usr/bin/gpg from open access on the file /root/.gnupg/gpg.conf. For complete SELinux messages run: sealert -l cb54177e-d44c-46a1-b246-5c0bbb8343be
Aug 4 00:30:02 netman.cs.umd.edu setroubleshoot[507931]: SELinux is preventing /usr/bin/gpg from getattr access on the file /root/.gnupg/gpg.conf. For complete SELinux messages run: sealert -l fbba2e30-b7ab-491c-9ec6-f553e9ef72af
== newhonors2 (1 distinct, 24 total) ==
Aug 4 00:13:02 newhonors2 dhcpcd[702542]: dhcpcd is not running [x24]
== openrepo (1 distinct, 1 total) ==
Aug 4 00:32:53 openrepo (nin-node)[1143677]: munin-node.service: Referenced but unset environment variable evaluates to an empty string: DAEMON_ARGS
== outbound00.cs.umd.edu (1 distinct, 6 total) ==
Aug 4 00:09:09 outbound00.cs.umd.edu python3[2646688]: ldapdb [x6]
== outbound01.cs.umd.edu (2 distinct, 7 total) ==
Aug 4 00:13:06 outbound01.cs.umd.edu python3[681176]: ldapdb [x6]
Aug 4 00:56:58 outbound01.cs.umd.edu krb5_child[691548]: Client 'admin(a)UMD.EDU' not found in Kerberos database
== sentry-docker00.cs.umd.edu (36 distinct, 36 total) ==
Aug 4 00:05:33 sentry-docker00.cs.umd.edu systemd-udevd[1391009]: link_config: could not get ethtool features for vethaee3c30
Aug 4 00:05:33 sentry-docker00.cs.umd.edu systemd-udevd[1391009]: Could not set offload features of vethaee3c30: No such device
Aug 4 00:05:33 sentry-docker00.cs.umd.edu systemd-udevd[1391079]: link_config: could not get ethtool features for veth0f2f5de
Aug 4 00:05:33 sentry-docker00.cs.umd.edu systemd-udevd[1391079]: Could not set offload features of veth0f2f5de: No such device
Aug 4 00:05:33 sentry-docker00.cs.umd.edu systemd-udevd[1391098]: Could not generate persistent MAC address for veth3b91b9a: No such file or directory
Aug 4 00:05:33 sentry-docker00.cs.umd.edu systemd-udevd[1391099]: Could not generate persistent MAC address for veth0df7ad8: No such file or directory
Aug 4 00:05:33 sentry-docker00.cs.umd.edu systemd-udevd[1391102]: Could not generate persistent MAC address for vethf38f8c5: No such file or directory
Aug 4 00:05:33 sentry-docker00.cs.umd.edu systemd-udevd[1391103]: Could not generate persistent MAC address for veth4109275: No such file or directory
Aug 4 00:05:33 sentry-docker00.cs.umd.edu systemd-udevd[1391126]: Could not generate persistent MAC address for vethd6e70de: No such file or directory
Aug 4 00:05:33 sentry-docker00.cs.umd.edu systemd-udevd[1391127]: Could not generate persistent MAC address for vethc41cc88: No such file or directory
Aug 4 00:05:33 sentry-docker00.cs.umd.edu systemd-udevd[1391139]: Could not generate persistent MAC address for veth8b5ef94: No such file or directory
Aug 4 00:05:33 sentry-docker00.cs.umd.edu systemd-udevd[1391149]: Could not generate persistent MAC address for veth4aa7f6f: No such file or directory
Aug 4 00:05:33 sentry-docker00.cs.umd.edu systemd-udevd[1391154]: Could not generate persistent MAC address for veth267b390: No such file or directory
Aug 4 00:05:33 sentry-docker00.cs.umd.edu systemd-udevd[1391155]: Could not generate persistent MAC address for vetha15b0dd: No such file or directory
Aug 4 00:25:42 sentry-docker00.cs.umd.edu systemd-udevd[1400560]: Could not generate persistent MAC address for veth5407ba1: No such file or directory
Aug 4 00:25:42 sentry-docker00.cs.umd.edu systemd-udevd[1400563]: Could not generate persistent MAC address for vetheedef26: No such file or directory
Aug 4 00:25:42 sentry-docker00.cs.umd.edu systemd-udevd[1400638]: Could not generate persistent MAC address for veth0c5e4a1: No such file or directory
Aug 4 00:25:42 sentry-docker00.cs.umd.edu systemd-udevd[1400639]: Could not generate persistent MAC address for vethd7f3c60: No such file or directory
Aug 4 00:25:42 sentry-docker00.cs.umd.edu systemd-udevd[1400662]: Could not generate persistent MAC address for veth63682be: No such file or directory
Aug 4 00:25:42 sentry-docker00.cs.umd.edu systemd-udevd[1400659]: Could not generate persistent MAC address for veth2b1bff0: No such file or directory
Aug 4 00:25:42 sentry-docker00.cs.umd.edu systemd-udevd[1400672]: Could not generate persistent MAC address for vethb8851c0: No such file or directory
Aug 4 00:25:42 sentry-docker00.cs.umd.edu systemd-udevd[1400673]: Could not generate persistent MAC address for veth9b6218d: No such file or directory
Aug 4 00:25:42 sentry-docker00.cs.umd.edu systemd-udevd[1400717]: Could not generate persistent MAC address for veth4b680b4: No such file or directory
Aug 4 00:25:42 sentry-docker00.cs.umd.edu systemd-udevd[1400718]: Could not generate persistent MAC address for veth5fd39ef: No such file or directory
Aug 4 00:45:50 sentry-docker00.cs.umd.edu systemd-udevd[1409967]: link_config: could not get ethtool features for vethb8851c0
Aug 4 00:45:50 sentry-docker00.cs.umd.edu systemd-udevd[1409967]: Could not set offload features of vethb8851c0: No such device
Aug 4 00:45:50 sentry-docker00.cs.umd.edu systemd-udevd[1410004]: Could not generate persistent MAC address for veth44355c3: No such file or directory
Aug 4 00:45:50 sentry-docker00.cs.umd.edu systemd-udevd[1410005]: Could not generate persistent MAC address for veth69965d2: No such file or directory
Aug 4 00:45:50 sentry-docker00.cs.umd.edu systemd-udevd[1410008]: Could not generate persistent MAC address for vetha16fa78: No such file or directory
Aug 4 00:45:50 sentry-docker00.cs.umd.edu systemd-udevd[1410009]: Could not generate persistent MAC address for vethf77cd57: No such file or directory
... 6 more distinct messages not shown
== strawberry (3 distinct, 9 total) ==
Aug 4 00:09:44 strawberry udisksd[1067]: Error performing housekeeping for drive /org/freedesktop/UDisks2/drives/ST2000DM001_1CH164_W1E8J5KJ: Error updating SMART data: Error sending ATA command CHECK POWER MODE: Unexpected sense data returned:#0120000: 00 00 00 00 00 00 00 00 00 00 00 00 00 00 00 00 ................#0120010: 00 00 00 00 00 00 00 00 00 00 00 00 00 00 00 00 ................#012 (g-io-error-quark, 0) [x6]
Aug 4 00:34:42 strawberry smartd[5314]: Device: /dev/sda [SAT], failed to read SMART Attribute Data [x2]
Aug 4 01:04:42 strawberry smartd[5314]: Device: /dev/sda [SAT], not capable of Offline or Self-Testing.
== submit10-cln25 (3 distinct, 4 total) ==
Aug 4 00:10:12 submit10-cln25 systemd: New main PID 15396 does not belong to service, and PID file is not owned by root. Refusing. [x2]
Aug 4 00:10:30 submit10-cln25 systemd: Daemon never wrote its PID file. Failing.
Aug 4 00:10:36 submit10-cln25 systemd: pmlogger.service: Supervising process 22294 which is not our child. We'll most likely not notice when it exits.
== submit26-b9-4 (9 distinct, 9 total) ==
Aug 4 00:15:29 submit26-b9-4 setroubleshoot[991687]: SELinux is preventing /usr/bin/python3.9 from create access on the directory /(null). For complete SELinux messages run: sealert -l a4e66030-8621-4da9-bd27-5988bb1bf8ad
Aug 4 00:15:29 submit26-b9-4 setroubleshoot[991687]: SELinux is preventing /usr/bin/python3.9 from add_name access on the directory /(null). For complete SELinux messages run: sealert -l c055e37d-bbf5-4800-9083-d606f792c8c1
Aug 4 00:15:29 submit26-b9-4 setroubleshoot[991687]: SELinux is preventing /usr/bin/python3.9 from create access on the file /(null). For complete SELinux messages run: sealert -l e5bc3a56-6d6f-4776-954f-ddde1579648f
Aug 4 00:15:29 submit26-b9-4 setroubleshoot[991687]: SELinux is preventing /usr/bin/python3.9 from open access on the file /tmp/libdnf.m27Q8P/repodata/repomd.xml. For complete SELinux messages run: sealert -l a8ec5e1b-49f9-4fbc-a8ae-22e800f7abf2
Aug 4 00:15:29 submit26-b9-4 setroubleshoot[991687]: SELinux is preventing /usr/bin/python3.9 from setattr access on the file repomd.xml. For complete SELinux messages run: sealert -l 945db714-d0c0-4402-911e-932978b8b036
Aug 4 00:15:29 submit26-b9-4 setroubleshoot[991687]: SELinux is preventing /usr/bin/python3.9 from read access on the directory libdnf.m27Q8P. For complete SELinux messages run: sealert -l 463998a0-fb0d-463c-82b1-471135710a14
Aug 4 00:15:29 submit26-b9-4 setroubleshoot[991687]: SELinux is preventing /usr/bin/python3.9 from remove_name access on the directory repomd.xml. For complete SELinux messages run: sealert -l 473d2e21-15d8-407a-a9ee-2b842607fa00
Aug 4 00:15:29 submit26-b9-4 setroubleshoot[991687]: SELinux is preventing /usr/bin/python3.9 from unlink access on the file repomd.xml. For complete SELinux messages run: sealert -l 80c54d4f-bf4b-4501-addb-1627383587d0
Aug 4 00:15:29 submit26-b9-4 setroubleshoot[991687]: SELinux is preventing /usr/bin/python3.9 from rmdir access on the directory repodata. For complete SELinux messages run: sealert -l c63d3890-151e-49a0-83f0-3dfb69d051e5
== tma-0 (4 distinct, 5 total) ==
Aug 4 00:10:13 tma-0 systemd[1]: New main PID 21236 does not belong to service, and PID file is not owned by root. Refusing. [x2]
Aug 4 00:10:31 tma-0 systemd[1]: Daemon never wrote its PID file. Failing.
Aug 4 00:10:38 tma-0 systemd[1]: pmlogger.service: Supervising process 28473 which is not our child. We'll most likely not notice when it exits.
Aug 4 00:29:40 tma-0 sshd[32731]: error: PAM: Authentication failure for admin from 69.164.52.34.bc.googleusercontent.com
== uffish.cs.umd.edu (3 distinct, 4 total) ==
Aug 4 00:10:12 uffish.cs.umd.edu systemd[1]: New main PID 1025046 does not belong to service, and PID file is not owned by root. Refusing. [x2]
Aug 4 00:10:34 uffish.cs.umd.edu systemd[1]: Daemon never wrote its PID file. Failing.
Aug 4 00:10:50 uffish.cs.umd.edu systemd[1]: pmlogger.service: Supervising process 1032625 which is not our child. We'll most likely not notice when it exits.
== updates00.cs.umd.edu (3 distinct, 4 total) ==
Aug 4 00:10:12 updates00.cs.umd.edu systemd[1]: New main PID 3347 does not belong to service, and PID file is not owned by root. Refusing. [x2]
Aug 4 00:10:30 updates00.cs.umd.edu systemd[1]: Daemon never wrote its PID file. Failing.
Aug 4 00:10:37 updates00.cs.umd.edu systemd[1]: pmlogger.service: Supervising process 10342 which is not our child. We'll most likely not notice when it exits.
== vacuum.cs.umd.edu (3 distinct, 4 total) ==
Aug 4 00:10:14 vacuum.cs.umd.edu systemd[1]: New main PID 9987 does not belong to service, and PID file is not owned by root. Refusing. [x2]
Aug 4 00:10:33 vacuum.cs.umd.edu systemd[1]: Daemon never wrote its PID file. Failing.
Aug 4 00:10:44 vacuum.cs.umd.edu systemd[1]: pmlogger.service: Supervising process 17632 which is not our child. We'll most likely not notice when it exits.
== whiffle.cs.umd.edu (3 distinct, 4 total) ==
Aug 4 00:10:13 whiffle.cs.umd.edu systemd[1]: New main PID 824474 does not belong to service, and PID file is not owned by root. Refusing. [x2]
Aug 4 00:10:32 whiffle.cs.umd.edu systemd[1]: Daemon never wrote its PID file. Failing.
Aug 4 00:10:45 whiffle.cs.umd.edu systemd[1]: pmlogger.service: Supervising process 832037 which is not our child. We'll most likely not notice when it exits.
1
0
Command: /usr/local/sbin/syslog-digest.py
Time : 0.4734s
Status : exited 0
Output :
Syslog digest — 2026-08-04 00:05 EDT
Processed 4,228 lines, filtered 3,510 (83%). 718 unknown (79 distinct) from 24 host(s).
== abuse (1 distinct, 346 total) ==
Aug 3 23:05:06 abuse rsyslogd[21745]: imjournal: open() failed for path: '/var/lib/rsyslog/imjournal.state.tmp': Input/output error [v8.2404.0 try https://www.rsyslog.com/e/2433 ] [x346]
== b0b02.cs.umd.edu (1 distinct, 1 total) ==
Aug 3 23:44:14 b0b02.cs.umd.edu rustdesk[2655785]: cannot open display:
== biggulp.cs.umd.edu (3 distinct, 3 total) ==
Aug 3 23:50:01 biggulp.cs.umd.edu sshd-session[2734024]: pam_access(sshd:auth): access denied for user `admin' from `34.52.164.69'
Aug 3 23:50:01 biggulp.cs.umd.edu krb5_child[2734026]: Client 'admin(a)UMD.EDU' not found in Kerberos database
Aug 3 23:50:01 biggulp.cs.umd.edu sshd-session[2734022]: error: PAM: System error for admin from 34.52.164.69
== cheezit.cs.umd.edu (4 distinct, 4 total) ==
Aug 3 23:33:13 cheezit.cs.umd.edu sshd-session[800727]: pam_access(sshd:auth): access denied for user `admin' from `34.77.40.58'
Aug 3 23:33:14 cheezit.cs.umd.edu krb5_child[800729]: Client 'admin(a)UMD.EDU' not found in Kerberos database
Aug 3 23:33:14 cheezit.cs.umd.edu sshd-session[800723]: error: PAM: System error for admin from 34.77.40.58
Aug 3 23:34:03 cheezit.cs.umd.edu sshd-session[800823]: error: Protocol major versions differ: 2 vs. 1
== contest (1 distinct, 33 total) ==
Aug 3 23:06:24 contest goferd[1007]: [ERROR][worker-0] gofer.messaging.adapter.connect:33 - connect: proton+amqps://satellite8.cs.umd.edu:5647, failed: Connection amqps://satellite8.cs.umd.edu:5647 disconnected: Condition('proton.pythonio', 'Connection refused to all addresses') [x33]
== csfw00a (1 distinct, 180 total) ==
Aug 3 23:07:30 csfw00a kernel: bnxt_en 0000:09:00.0 eth3: NIC Link is Down [x180]
== cskayako (2 distinct, 2 total) ==
Aug 4 00:00:05 cskayako setroubleshoot[2011474]: failed to retrieve rpm info for path '/var/log/php82-fpm_error.log':
Aug 4 00:00:06 cskayako setroubleshoot[2011474]: SELinux is preventing /opt/remi/php82/root/usr/sbin/php-fpm from open access on the file /var/log/php82-fpm_error.log. For complete SELinux messages run: sealert -l 0ba5d5da-2df6-4c48-bd39-9b458b25a6cc
== hackerman (6 distinct, 8 total) ==
Aug 3 23:19:01 hackerman gnome-software[2060381]: failed to commit changes to dconf: GDBus.Error:org.gtk.GDBus.UnmappedGError.Quark._g_2dfile_2derror_2dquark.Code2: Failed to create file “/adminhomes/sajith/.config/dconf/user.P78YT3”: Permission denied
Aug 3 23:20:04 hackerman gnome-software[2060381]: can't reliably fixup error code 4 in domain g-io-error-quark: Not a directory [x3]
Aug 3 23:20:12 hackerman gnome-software[2060381]: Only 0 apps for recent list, hiding
Aug 3 23:20:30 hackerman packagekitd[3615926]: Failed to get cache filename for libreoffice
Aug 3 23:20:30 hackerman packagekitd[3615926]: Failed to get cache filename for kernel
Aug 3 23:20:37 hackerman gnome-software[2060381]: failed to commit changes to dconf: GDBus.Error:org.gtk.GDBus.UnmappedGError.Quark._g_2dfile_2derror_2dquark.Code2: Failed to create file “/adminhomes/sajith/.config/dconf/user.9PUZT3”: Permission denied
== idm00 (1 distinct, 1 total) ==
Aug 3 23:51:16 idm00 named[1455]: client @0x7f330c5f12a8 10.73.240.42#59350: update '73.10.in-addr.arpa/IN' denied
== idmp0 (1 distinct, 1 total) ==
Aug 3 23:36:02 idmp0 named[5198]: client @0x7f98f4005288 10.73.240.43#58913: update '73.10.in-addr.arpa/IN' denied
== inbound00.cs.umd.edu (1 distinct, 1 total) ==
Aug 3 23:26:07 inbound00.cs.umd.edu krb5_child[2677069]: Client 'admin(a)UMD.EDU' not found in Kerberos database
== itmon02 (1 distinct, 41 total) ==
Aug 3 23:07:56 itmon02 sshd[1750555]: error: beginning MaxStartups throttling [x41]
== krispykreme.cs.umd.edu (4 distinct, 4 total) ==
Aug 3 23:47:11 krispykreme.cs.umd.edu sshd-session[3002597]: pam_access(sshd:auth): access denied for user `admin' from `104.155.88.193'
Aug 3 23:47:11 krispykreme.cs.umd.edu krb5_child[3002601]: Client 'admin(a)UMD.EDU' not found in Kerberos database
Aug 3 23:47:11 krispykreme.cs.umd.edu sshd-session[3002591]: error: PAM: System error for admin from 104.155.88.193
Aug 3 23:48:01 krispykreme.cs.umd.edu sshd-session[3003094]: error: Protocol major versions differ: 2 vs. 1
== matrix (4 distinct, 5 total) ==
Aug 3 23:37:16 matrix krb5_child[1434796]: Client 'admin(a)UMD.EDU' not found in Kerberos database [x2]
Aug 3 23:37:18 matrix sshd[1434790]: error: PAM: Authentication failure for admin from 34.156.242.5
Aug 3 23:37:32 matrix sshd[1434901]: error: Protocol major versions differ: 2 vs. 1
Aug 4 00:00:20 matrix (nin-node)[1447422]: munin-node.service: Referenced but unset environment variable evaluates to an empty string: DAEMON_ARGS
== neo-gizmonic (1 distinct, 1 total) ==
Aug 4 00:00:14 neo-gizmonic (nin-node)[520064]: munin-node.service: Referenced but unset environment variable evaluates to an empty string: DAEMON_ARGS
== neoavion (1 distinct, 1 total) ==
Aug 4 00:00:07 neoavion (nin-node)[3333693]: munin-node.service: Referenced but unset environment variable evaluates to an empty string: DAEMON_ARGS
== newhonors2 (2 distinct, 25 total) ==
Aug 3 23:13:03 newhonors2 dhcpcd[700481]: dhcpcd is not running [x24]
Aug 4 00:00:46 newhonors2 (nin-node)[702003]: munin-node.service: Referenced but unset environment variable evaluates to an empty string: DAEMON_ARGS
== outbound00.cs.umd.edu (3 distinct, 8 total) ==
Aug 3 23:09:09 outbound00.cs.umd.edu python3[2632624]: ldapdb [x6]
Aug 3 23:58:20 outbound00.cs.umd.edu krb5_child[2644103]: Client 'admin(a)UMD.EDU' not found in Kerberos database
Aug 3 23:58:46 outbound00.cs.umd.edu sshd-session[2644252]: error: Protocol major versions differ: 2 vs. 1
== outbound01.cs.umd.edu (1 distinct, 6 total) ==
Aug 3 23:13:06 outbound01.cs.umd.edu python3[666545]: ldapdb [x6]
== sentry-docker00.cs.umd.edu (34 distinct, 34 total) ==
Aug 3 23:05:08 sentry-docker00.cs.umd.edu systemd-udevd[1362439]: link_config: could not get ethtool features for vethadb936a
Aug 3 23:05:08 sentry-docker00.cs.umd.edu systemd-udevd[1362439]: Could not set offload features of vethadb936a: No such device
Aug 3 23:05:08 sentry-docker00.cs.umd.edu systemd-udevd[1362477]: Could not generate persistent MAC address for vethc3f8888: No such file or directory
Aug 3 23:05:08 sentry-docker00.cs.umd.edu systemd-udevd[1362478]: Could not generate persistent MAC address for veth26d9170: No such file or directory
Aug 3 23:05:08 sentry-docker00.cs.umd.edu systemd-udevd[1362503]: Could not generate persistent MAC address for vethe21c0ae: No such file or directory
Aug 3 23:05:08 sentry-docker00.cs.umd.edu systemd-udevd[1362504]: Could not generate persistent MAC address for veth00ae28a: No such file or directory
Aug 3 23:05:09 sentry-docker00.cs.umd.edu systemd-udevd[1362529]: Could not generate persistent MAC address for veth6f2bf53: No such file or directory
Aug 3 23:05:09 sentry-docker00.cs.umd.edu systemd-udevd[1362530]: Could not generate persistent MAC address for vetha4c08ba: No such file or directory
Aug 3 23:05:09 sentry-docker00.cs.umd.edu systemd-udevd[1362548]: Could not generate persistent MAC address for vethfb21f5b: No such file or directory
Aug 3 23:05:09 sentry-docker00.cs.umd.edu systemd-udevd[1362536]: Could not generate persistent MAC address for vethf21844d: No such file or directory
Aug 3 23:05:09 sentry-docker00.cs.umd.edu systemd-udevd[1362555]: Could not generate persistent MAC address for vethfa268d1: No such file or directory
Aug 3 23:05:09 sentry-docker00.cs.umd.edu systemd-udevd[1362546]: Could not generate persistent MAC address for veth958845c: No such file or directory
Aug 3 23:25:16 sentry-docker00.cs.umd.edu systemd-udevd[1371850]: link_config: could not get ethtool features for vethfb21f5b
Aug 3 23:25:16 sentry-docker00.cs.umd.edu systemd-udevd[1371850]: Could not set offload features of vethfb21f5b: No such device
Aug 3 23:25:17 sentry-docker00.cs.umd.edu systemd-udevd[1371966]: Could not generate persistent MAC address for veth2b69a12: No such file or directory
Aug 3 23:25:17 sentry-docker00.cs.umd.edu systemd-udevd[1371967]: Could not generate persistent MAC address for vethbcfad36: No such file or directory
Aug 3 23:25:17 sentry-docker00.cs.umd.edu systemd-udevd[1371970]: Could not generate persistent MAC address for vethb22142b: No such file or directory
Aug 3 23:25:17 sentry-docker00.cs.umd.edu systemd-udevd[1371971]: Could not generate persistent MAC address for veth880bffc: No such file or directory
Aug 3 23:25:17 sentry-docker00.cs.umd.edu systemd-udevd[1371994]: Could not generate persistent MAC address for veth3f2236e: No such file or directory
Aug 3 23:25:17 sentry-docker00.cs.umd.edu systemd-udevd[1371995]: Could not generate persistent MAC address for vethcf16806: No such file or directory
Aug 3 23:25:17 sentry-docker00.cs.umd.edu systemd-udevd[1372020]: Could not generate persistent MAC address for veth470b8a9: No such file or directory
Aug 3 23:25:17 sentry-docker00.cs.umd.edu systemd-udevd[1372021]: Could not generate persistent MAC address for vethf8b05f8: No such file or directory
Aug 3 23:25:17 sentry-docker00.cs.umd.edu systemd-udevd[1372063]: Could not generate persistent MAC address for veth42fd4a2: No such file or directory
Aug 3 23:25:17 sentry-docker00.cs.umd.edu systemd-udevd[1372062]: Could not generate persistent MAC address for veth7600959: No such file or directory
Aug 3 23:45:25 sentry-docker00.cs.umd.edu systemd-udevd[1381691]: Could not generate persistent MAC address for veth0f2f5de: No such file or directory
Aug 3 23:45:25 sentry-docker00.cs.umd.edu systemd-udevd[1381692]: Could not generate persistent MAC address for veth21813d7: No such file or directory
Aug 3 23:45:25 sentry-docker00.cs.umd.edu systemd-udevd[1381695]: Could not generate persistent MAC address for veth21ea7b2: No such file or directory
Aug 3 23:45:25 sentry-docker00.cs.umd.edu systemd-udevd[1381692]: Could not generate persistent MAC address for veth4e5476b: No such file or directory
Aug 3 23:45:25 sentry-docker00.cs.umd.edu systemd-udevd[1381711]: Could not generate persistent MAC address for vethaee3c30: No such file or directory
Aug 3 23:45:25 sentry-docker00.cs.umd.edu systemd-udevd[1381716]: Could not generate persistent MAC address for vethb926952: No such file or directory
... 4 more distinct messages not shown
== strawberry (2 distinct, 8 total) ==
Aug 3 23:09:44 strawberry udisksd[1067]: Error performing housekeeping for drive /org/freedesktop/UDisks2/drives/ST2000DM001_1CH164_W1E8J5KJ: Error updating SMART data: Error sending ATA command CHECK POWER MODE: Unexpected sense data returned:#0120000: 00 00 00 00 00 00 00 00 00 00 00 00 00 00 00 00 ................#0120010: 00 00 00 00 00 00 00 00 00 00 00 00 00 00 00 00 ................#012 (g-io-error-quark, 0) [x6]
Aug 3 23:34:42 strawberry smartd[5314]: Device: /dev/sda [SAT], failed to read SMART Attribute Data [x2]
== talkhosts9 (1 distinct, 2 total) ==
Aug 3 23:07:45 talkhosts9 setroubleshoot[1128853]: SELinux is preventing /usr/bin/lsof from getattr access on the unix_stream_socket unix_stream_socket. For complete SELinux messages run: sealert -l a6df89b3-c497-469c-8232-c4fde0508abf [x2]
== teaching-awards (2 distinct, 2 total) ==
Aug 3 23:39:43 teaching-awards krb5_child[1840073]: Client 'admin(a)UMD.EDU' not found in Kerberos database
Aug 3 23:40:01 teaching-awards sshd-session[1840077]: error: Protocol major versions differ: 2 vs. 1
== wraith (1 distinct, 1 total) ==
Aug 4 00:00:17 wraith (nin-node)[1141114]: munin-node.service: Referenced but unset environment variable evaluates to an empty string: DAEMON_ARGS
1
0