Command: /usr/local/sbin/syslog-digest.py
Time : 0.5263s
Status : exited 0
Output :
Syslog digest — 2026-07-25 03:05 EDT
Processed 4,850 lines, filtered 4,042 (83%). 808 unknown (65 distinct) from 15 host(s).
== abuse (1 distinct, 347 total) ==
Jul 25 02:05:06 abuse rsyslogd[21745]: imjournal: open() failed for path: '/var/lib/rsyslog/imjournal.state.tmp': Input/output error [v8.2404.0 try https://www.rsyslog.com/e/2433 ] [x347]
== alec.cs.umd.edu (3 distinct, 60 total) ==
Jul 25 02:05:30 alec.cs.umd.edu setroubleshoot[2773580]: failed to retrieve rpm info for path '/run/netns/netns-9dfd0347-71eb-5698-085c-c769043aa5c3': [x12]
Jul 25 02:05:31 alec.cs.umd.edu sedispatch[1526]: AVC Message regarding setroubleshoot, ignoring message [x24]
Jul 25 02:05:31 alec.cs.umd.edu setroubleshoot[2773580]: SELinux is preventing /usr/bin/df from getattr access on the file /run/netns/netns-9dfd0347-71eb-5698-085c-c769043aa5c3. For complete SELinux messages run: sealert -l 23f93208-3063-4aac-b78a-bb0fcb40740c [x24]
== b0b02.cs.umd.edu (4 distinct, 4 total) ==
Jul 25 02:37:39 b0b02.cs.umd.edu setroubleshoot[261667]: SELinux is preventing /usr/bin/python3.9 from getattr access on the file /etc/authselect/nsswitch.conf. For complete SELinux messages run: sealert -l 9a1e2952-3fde-4937-a8ab-f7f59791a458
Jul 25 02:37:42 b0b02.cs.umd.edu setroubleshoot[261667]: SELinux is preventing /usr/bin/python3.9 from read access on the file /etc/authselect/nsswitch.conf. For complete SELinux messages run: sealert -l 97d74423-e027-4cd6-8810-ad80944900b5
Jul 25 02:37:45 b0b02.cs.umd.edu setroubleshoot[261667]: SELinux is preventing /usr/bin/python3.9 from open access on the file /etc/authselect/nsswitch.conf. For complete SELinux messages run: sealert -l 4f253f6a-62d6-46dd-8eaf-0b4d29df41c6
Jul 25 02:54:25 b0b02.cs.umd.edu rustdesk[265462]: cannot open display:
== contest (1 distinct, 34 total) ==
Jul 25 02:05:05 contest goferd[1007]: [ERROR][worker-0] gofer.messaging.adapter.connect:33 - connect: proton+amqps://satellite8.cs.umd.edu:5647, failed: Connection amqps://satellite8.cs.umd.edu:5647 disconnected: Condition('proton.pythonio', 'Connection refused to all addresses') [x34]
== csfw00a (1 distinct, 216 total) ==
Jul 25 02:04:41 csfw00a kernel: bnxt_en 0000:09:00.0 eth3: NIC Link is Down [x216]
== idm00 (1 distinct, 1 total) ==
Jul 25 02:51:05 idm00 named[1455]: client @0x7f33041b1a78 10.73.240.42#57096: update '73.10.in-addr.arpa/IN' denied
== idmp0 (1 distinct, 1 total) ==
Jul 25 02:34:56 idmp0 named[5198]: client @0x7f992c014c68 10.73.240.43#53457: update '73.10.in-addr.arpa/IN' denied
== inbound00.cs.umd.edu (1 distinct, 1 total) ==
Jul 25 02:43:10 inbound00.cs.umd.edu krb5_child[3523737]: Client 'admin(a)UMD.EDU' not found in Kerberos database
== itmon02 (1 distinct, 54 total) ==
Jul 25 02:08:14 itmon02 sshd[1834]: error: beginning MaxStartups throttling [x54]
== jaws.cs.umd.edu (4 distinct, 4 total) ==
Jul 25 02:33:46 jaws.cs.umd.edu systemd-coredump[1461417]: Process 1461401 (podman) of user 981 dumped core.#012#012Stack trace of thread 1461401:#012#0 0x000055b45afd846e internal/runtime/syscall/linux.Syscall6 (podman + 0x48b46e)#012#1 0x000055b45b0b80a6 syscall.Syscall (podman + 0x56b0a6)#012#2 0x000055b45b0b8c50 syscall.Syscall.abi0 (podman + 0x56bc50)#012#3 0x000055b45b222c2e github.com/containers/podman/vendor/golang.org/x/sys/unix.OpenTree (podman + 0x6d5c2e)#012#4 0x000055b45b87bf4b github.com/containers/podman/vendor/github.com/cyphar/filepath-securejoin/p… (podman + 0xd2ef4b)#012#5 0x000055b45b87be54 github.com/containers/podman/vendor/github.com/cyphar/filepath-securejoin/p… (podman + 0xd2ee54)#012#6 0x000055b45b06bdcc sync.(*Once).doSlow (podman + 0x51edcc)#012#7 0x000055b45b06bcf9 sync.(*Once).Do (podman + 0x51ecf9)#012#8 0x000055b45b87bd
c5 github.com/containers/podman/vendor/github.com/cyphar/filepath-securejoin/p… (podman + 0xd2edc5)#012#9 0x000055b45b87d3e2 github.com/containers/podman/vendor/github.com/cyphar/filepath-securejoin/p… (podman + 0xd303e2)#012#10 0x000055b45b87d7f3 github.com/containers/podman/vendor/github.com/cyphar/filepath-securejoin/p… (podman + 0xd307f3)#012#11 0x000055b45b87c91c github.com/containers/podman/vendor/github.com/cyphar/filepath-securejoin/p… (podman + 0xd2f91c)#012#12 0x000055b45b87c358 github.com/containers/podman/vendor/github.com/cyphar/filepath-securejoin/p… (podman + 0xd2f358)#012#13 0x000055b45b06bdcc sync.(*Once).doSlow (podman + 0x51edcc)#012#14 0x000055b45b06bcf9 sync.(*Once).D
o (podman + 0x51ecf9)#012#15 0x000055b45b87c2c5 github.com/containers/podman/vendor/github.com/cyphar/filepath-securejoin/p… (podman + 0xd2f2c5)#012#16 0x000055b45b87d79a github.com/containers/podman/vendor/github.com/cyphar/filepath-securejoin/p… (podman + 0xd3079a)#012#17 0x000055b45b88434e github.com/containers/podman/vendor/github.com/opencontainers/selinux/go-se… (podman + 0xd3734e)#012#18 0x000055b45b884838 github.com/containers/podman/vendor/github.com/opencontainers/selinux/go-se… (podman + 0xd37838)#012#19 0x000055b45b8835df github.com/containers/podman/vendor/github.com/opencontainers/selinux/go-se… (podman + 0xd365df)#012#20 0x000055b45b883873 github.com/containers/podman/vendor/github.com/opencontainers/selinux/go-se… (podman + 0xd36873)#012#21 0x000
055b45ba7bf4b github.com/containers/podman/vendor/go.podman.io/common/pkg/config.defaultC… (podman + 0xf2ef4b)#012#22 0x000055b45ba7f912 github.com/containers/podman/vendor/go.podman.io/common/pkg/config.newLocked (podman + 0xf32912)#012#23 0x000055b45ba7f605 github.com/containers/podman/vendor/go.podman.io/common/pkg/config.New (podman + 0xf32605)#012#24 0x000055b45c1f2fd3 github.com/containers/podman/cmd/podman/registry.newPodmanConfig (podman + 0x16a5fd3)#012#25 0x000055b45b06bdcc sync.(*Once).doSlow (podman + 0x51edcc)#012#26 0x000055b45c213c50 github.com/containers/podman/cmd/podman/common.init (podman + 0x16c6c50)#012#27 0x000055b45b031a57 runtime.doInit1 (podman + 0x4e4a57)#012#28 0x000055b45b021f90 runtime.main (podman + 0x4d4f90)#012#29 0x000055b45b061ee1 runtime.goexit.abi0 (podman + 0x514ee1)#012ELF object binary architecture: AMD x86-64
Jul 25 02:33:47 jaws.cs.umd.edu systemd-coredump[1461435]: Process 1461426 (podman) of user 981 dumped core.#012#012Stack trace of thread 1461426:#012#0 0x000056342b58a46e internal/runtime/syscall/linux.Syscall6 (podman + 0x48b46e)#012#1 0x000056342b66a0a6 syscall.Syscall (podman + 0x56b0a6)#012#2 0x000056342b66ac50 syscall.Syscall.abi0 (podman + 0x56bc50)#012#3 0x000056342b7d4c2e github.com/containers/podman/vendor/golang.org/x/sys/unix.OpenTree (podman + 0x6d5c2e)#012#4 0x000056342be2df4b github.com/containers/podman/vendor/github.com/cyphar/filepath-securejoin/p… (podman + 0xd2ef4b)#012#5 0x000056342be2de54 github.com/containers/podman/vendor/github.com/cyphar/filepath-securejoin/p… (podman + 0xd2ee54)#012#6 0x000056342b61ddcc sync.(*Once).doSlow (podman + 0x51edcc)#012#7 0x000056342b61dcf9 sync.(*Once).Do (podman + 0x51ecf9)#012#8 0x000056342be2dd
c5 github.com/containers/podman/vendor/github.com/cyphar/filepath-securejoin/p… (podman + 0xd2edc5)#012#9 0x000056342be2f3e2 github.com/containers/podman/vendor/github.com/cyphar/filepath-securejoin/p… (podman + 0xd303e2)#012#10 0x000056342be2f7f3 github.com/containers/podman/vendor/github.com/cyphar/filepath-securejoin/p… (podman + 0xd307f3)#012#11 0x000056342be2e91c github.com/containers/podman/vendor/github.com/cyphar/filepath-securejoin/p… (podman + 0xd2f91c)#012#12 0x000056342be2e358 github.com/containers/podman/vendor/github.com/cyphar/filepath-securejoin/p… (podman + 0xd2f358)#012#13 0x000056342b61ddcc sync.(*Once).doSlow (podman + 0x51edcc)#012#14 0x000056342b61dcf9 sync.(*Once).D
o (podman + 0x51ecf9)#012#15 0x000056342be2e2c5 github.com/containers/podman/vendor/github.com/cyphar/filepath-securejoin/p… (podman + 0xd2f2c5)#012#16 0x000056342be2f79a github.com/containers/podman/vendor/github.com/cyphar/filepath-securejoin/p… (podman + 0xd3079a)#012#17 0x000056342be3634e github.com/containers/podman/vendor/github.com/opencontainers/selinux/go-se… (podman + 0xd3734e)#012#18 0x000056342be36838 github.com/containers/podman/vendor/github.com/opencontainers/selinux/go-se… (podman + 0xd37838)#012#19 0x000056342be355df github.com/containers/podman/vendor/github.com/opencontainers/selinux/go-se… (podman + 0xd365df)#012#20 0x000056342be35873 github.com/containers/podman/vendor/github.com/opencontainers/selinux/go-se… (podman + 0xd36873)#012#21 0x000
056342c02df4b github.com/containers/podman/vendor/go.podman.io/common/pkg/config.defaultC… (podman + 0xf2ef4b)#012#22 0x000056342c031912 github.com/containers/podman/vendor/go.podman.io/common/pkg/config.newLocked (podman + 0xf32912)#012#23 0x000056342c031605 github.com/containers/podman/vendor/go.podman.io/common/pkg/config.New (podman + 0xf32605)#012#24 0x000056342c7a4fd3 github.com/containers/podman/cmd/podman/registry.newPodmanConfig (podman + 0x16a5fd3)#012#25 0x000056342b61ddcc sync.(*Once).doSlow (podman + 0x51edcc)#012#26 0x000056342c7c5c50 github.com/containers/podman/cmd/podman/common.init (podman + 0x16c6c50)#012#27 0x000056342b5e3a57 runtime.doInit1 (podman + 0x4e4a57)#012#28 0x000056342b5d3f90 runtime.main (podman + 0x4d4f90)#012#29 0x000056342b613ee1 runtime.goexit.abi0 (podman + 0x514ee1)#012ELF object binary architecture: AMD x86-64
Jul 25 02:33:48 jaws.cs.umd.edu systemd-coredump[1461458]: Process 1461451 (podman) of user 981 dumped core.#012#012Stack trace of thread 1461451:#012#0 0x0000556c32c8246e internal/runtime/syscall/linux.Syscall6 (podman + 0x48b46e)#012#1 0x0000556c32d620a6 syscall.Syscall (podman + 0x56b0a6)#012#2 0x0000556c32d62c50 syscall.Syscall.abi0 (podman + 0x56bc50)#012#3 0x0000556c32eccc2e github.com/containers/podman/vendor/golang.org/x/sys/unix.OpenTree (podman + 0x6d5c2e)#012#4 0x0000556c33525f4b github.com/containers/podman/vendor/github.com/cyphar/filepath-securejoin/p… (podman + 0xd2ef4b)#012#5 0x0000556c33525e54 github.com/containers/podman/vendor/github.com/cyphar/filepath-securejoin/p… (podman + 0xd2ee54)#012#6 0x0000556c32d15dcc sync.(*Once).doSlow (podman + 0x51edcc)#012#7 0x0000556c32d15cf9 sync.(*Once).Do (podman + 0x51ecf9)#012#8 0x0000556c33525d
c5 github.com/containers/podman/vendor/github.com/cyphar/filepath-securejoin/p… (podman + 0xd2edc5)#012#9 0x0000556c335273e2 github.com/containers/podman/vendor/github.com/cyphar/filepath-securejoin/p… (podman + 0xd303e2)#012#10 0x0000556c335277f3 github.com/containers/podman/vendor/github.com/cyphar/filepath-securejoin/p… (podman + 0xd307f3)#012#11 0x0000556c3352691c github.com/containers/podman/vendor/github.com/cyphar/filepath-securejoin/p… (podman + 0xd2f91c)#012#12 0x0000556c33526358 github.com/containers/podman/vendor/github.com/cyphar/filepath-securejoin/p… (podman + 0xd2f358)#012#13 0x0000556c32d15dcc sync.(*Once).doSlow (podman + 0x51edcc)#012#14 0x0000556c32d15cf9 sync.(*Once).D
o (podman + 0x51ecf9)#012#15 0x0000556c335262c5 github.com/containers/podman/vendor/github.com/cyphar/filepath-securejoin/p… (podman + 0xd2f2c5)#012#16 0x0000556c3352779a github.com/containers/podman/vendor/github.com/cyphar/filepath-securejoin/p… (podman + 0xd3079a)#012#17 0x0000556c3352e34e github.com/containers/podman/vendor/github.com/opencontainers/selinux/go-se… (podman + 0xd3734e)#012#18 0x0000556c3352e838 github.com/containers/podman/vendor/github.com/opencontainers/selinux/go-se… (podman + 0xd37838)#012#19 0x0000556c3352d5df github.com/containers/podman/vendor/github.com/opencontainers/selinux/go-se… (podman + 0xd365df)#012#20 0x0000556c3352d873 github.com/containers/podman/vendor/github.com/opencontainers/selinux/go-se… (podman + 0xd36873)#012#21 0x000
0556c33725f4b github.com/containers/podman/vendor/go.podman.io/common/pkg/config.defaultC… (podman + 0xf2ef4b)#012#22 0x0000556c33729912 github.com/containers/podman/vendor/go.podman.io/common/pkg/config.newLocked (podman + 0xf32912)#012#23 0x0000556c33729605 github.com/containers/podman/vendor/go.podman.io/common/pkg/config.New (podman + 0xf32605)#012#24 0x0000556c33e9cfd3 github.com/containers/podman/cmd/podman/registry.newPodmanConfig (podman + 0x16a5fd3)#012#25 0x0000556c32d15dcc sync.(*Once).doSlow (podman + 0x51edcc)#012#26 0x0000556c33ebdc50 github.com/containers/podman/cmd/podman/common.init (podman + 0x16c6c50)#012#27 0x0000556c32cdba57 runtime.doInit1 (podman + 0x4e4a57)#012#28 0x0000556c32ccbf90 runtime.main (podman + 0x4d4f90)#012#29 0x0000556c32d0bee1 runtime.goexit.abi0 (podman + 0x514ee1)#012ELF object binary architecture: AMD x86-64
Jul 25 02:33:48 jaws.cs.umd.edu setroubleshoot[1461416]: SELinux is preventing /usr/bin/podman from using the nnp_transition access on a process. For complete SELinux messages run: sealert -l 3c7643bc-dd69-4695-b48c-7d780b62b6cf
== newhonors2 (1 distinct, 24 total) ==
Jul 25 02:13:03 newhonors2 dhcpcd[245344]: dhcpcd is not running [x24]
== outbound00.cs.umd.edu (1 distinct, 6 total) ==
Jul 25 02:09:09 outbound00.cs.umd.edu python3[3497585]: ldapdb [x6]
== outbound01.cs.umd.edu (1 distinct, 6 total) ==
Jul 25 02:13:06 outbound01.cs.umd.edu python3[1526560]: ldapdb [x6]
== sentry-docker00.cs.umd.edu (42 distinct, 42 total) ==
Jul 25 02:07:35 sentry-docker00.cs.umd.edu systemd-udevd[3027680]: link_config: could not get ethtool features for veth3acd9d5
Jul 25 02:07:35 sentry-docker00.cs.umd.edu systemd-udevd[3027680]: Could not set offload features of veth3acd9d5: No such device
Jul 25 02:07:35 sentry-docker00.cs.umd.edu systemd-udevd[3027747]: link_config: could not get ethtool features for veth1fada50
Jul 25 02:07:35 sentry-docker00.cs.umd.edu systemd-udevd[3027747]: Could not set offload features of veth1fada50: No such device
Jul 25 02:07:35 sentry-docker00.cs.umd.edu systemd-udevd[3027774]: Could not generate persistent MAC address for veth39169a0: No such file or directory
Jul 25 02:07:35 sentry-docker00.cs.umd.edu systemd-udevd[3027775]: Could not generate persistent MAC address for veth85f6cb0: No such file or directory
Jul 25 02:07:35 sentry-docker00.cs.umd.edu systemd-udevd[3027778]: Could not generate persistent MAC address for vethe8766c7: No such file or directory
Jul 25 02:07:35 sentry-docker00.cs.umd.edu systemd-udevd[3027779]: Could not generate persistent MAC address for vetha213a8d: No such file or directory
Jul 25 02:07:35 sentry-docker00.cs.umd.edu systemd-udevd[3027791]: Could not generate persistent MAC address for vethae602a0: No such file or directory
Jul 25 02:07:35 sentry-docker00.cs.umd.edu systemd-udevd[3027783]: Could not generate persistent MAC address for veth7741764: No such file or directory
Jul 25 02:07:35 sentry-docker00.cs.umd.edu systemd-udevd[3027795]: Could not generate persistent MAC address for veth54b0143: No such file or directory
Jul 25 02:07:35 sentry-docker00.cs.umd.edu systemd-udevd[3027786]: Could not generate persistent MAC address for veth018bbd8: No such file or directory
Jul 25 02:20:21 sentry-docker00.cs.umd.edu systemd-udevd[3034343]: Could not generate persistent MAC address for vetha300e16: No such file or directory
Jul 25 02:20:21 sentry-docker00.cs.umd.edu systemd-udevd[3034344]: Could not generate persistent MAC address for vethe6d95e7: No such file or directory
Jul 25 02:27:43 sentry-docker00.cs.umd.edu systemd-udevd[3037191]: link_config: could not set ethtool features for veth39169a0
Jul 25 02:27:43 sentry-docker00.cs.umd.edu systemd-udevd[3037191]: Could not set offload features of veth39169a0: Operation not permitted
Jul 25 02:27:43 sentry-docker00.cs.umd.edu systemd-udevd[3037216]: Could not generate persistent MAC address for vethd461fd7: No such file or directory
Jul 25 02:27:43 sentry-docker00.cs.umd.edu systemd-udevd[3037217]: Could not generate persistent MAC address for veth579bdf0: No such file or directory
Jul 25 02:27:43 sentry-docker00.cs.umd.edu systemd-udevd[3037220]: Could not generate persistent MAC address for vethcde9a7e: No such file or directory
Jul 25 02:27:43 sentry-docker00.cs.umd.edu systemd-udevd[3037235]: Could not generate persistent MAC address for vethb90038d: No such file or directory
Jul 25 02:27:43 sentry-docker00.cs.umd.edu systemd-udevd[3037232]: Could not generate persistent MAC address for veth577dc85: No such file or directory
Jul 25 02:27:43 sentry-docker00.cs.umd.edu systemd-udevd[3037229]: Could not generate persistent MAC address for vethc05ab4a: No such file or directory
Jul 25 02:27:43 sentry-docker00.cs.umd.edu systemd-udevd[3037239]: Could not generate persistent MAC address for veth1560ad5: No such file or directory
Jul 25 02:27:43 sentry-docker00.cs.umd.edu systemd-udevd[3037216]: Could not generate persistent MAC address for veth5c18eed: No such file or directory
Jul 25 02:40:29 sentry-docker00.cs.umd.edu systemd-udevd[3044335]: link_config: could not get ethtool features for vetha300e16
Jul 25 02:40:29 sentry-docker00.cs.umd.edu systemd-udevd[3044335]: Could not set offload features of vetha300e16: No such device
Jul 25 02:40:29 sentry-docker00.cs.umd.edu systemd-udevd[3044351]: Could not generate persistent MAC address for veth8343a06: No such file or directory
Jul 25 02:40:29 sentry-docker00.cs.umd.edu systemd-udevd[3044352]: Could not generate persistent MAC address for veth88b3314: No such file or directory
Jul 25 02:47:51 sentry-docker00.cs.umd.edu systemd-udevd[3046972]: link_config: could not get ethtool features for veth1560ad5
Jul 25 02:47:51 sentry-docker00.cs.umd.edu systemd-udevd[3046972]: Could not set offload features of veth1560ad5: No such device
... 12 more distinct messages not shown
== strawberry (2 distinct, 8 total) ==
Jul 25 02:09:44 strawberry udisksd[1067]: Error performing housekeeping for drive /org/freedesktop/UDisks2/drives/ST2000DM001_1CH164_W1E8J5KJ: Error updating SMART data: Error sending ATA command CHECK POWER MODE: Unexpected sense data returned:#0120000: 00 00 00 00 00 00 00 00 00 00 00 00 00 00 00 00 ................#0120010: 00 00 00 00 00 00 00 00 00 00 00 00 00 00 00 00 ................#012 (g-io-error-quark, 0) [x6]
Jul 25 02:34:42 strawberry smartd[5314]: Device: /dev/sda [SAT], failed to read SMART Attribute Data [x2]
1
0
Command: /usr/local/sbin/syslog-digest.py
Time : 0.5691s
Status : exited 0
Output :
Syslog digest — 2026-07-25 02:05 EDT
Processed 6,758 lines, filtered 5,866 (86%). 892 unknown (110 distinct) from 23 host(s).
== abuse (1 distinct, 347 total) ==
Jul 25 01:05:06 abuse rsyslogd[21745]: imjournal: open() failed for path: '/var/lib/rsyslog/imjournal.state.tmp': Input/output error [v8.2404.0 try https://www.rsyslog.com/e/2433 ] [x347]
== alec.cs.umd.edu (3 distinct, 60 total) ==
Jul 25 01:05:21 alec.cs.umd.edu setroubleshoot[2758763]: failed to retrieve rpm info for path '/run/netns/netns-9dfd0347-71eb-5698-085c-c769043aa5c3': [x12]
Jul 25 01:05:22 alec.cs.umd.edu sedispatch[1526]: AVC Message regarding setroubleshoot, ignoring message [x24]
Jul 25 01:05:22 alec.cs.umd.edu setroubleshoot[2758763]: SELinux is preventing /usr/bin/df from getattr access on the file /run/netns/netns-9dfd0347-71eb-5698-085c-c769043aa5c3. For complete SELinux messages run: sealert -l 23f93208-3063-4aac-b78a-bb0fcb40740c [x24]
== b0b02.cs.umd.edu (1 distinct, 1 total) ==
Jul 25 01:54:21 b0b02.cs.umd.edu rustdesk[250407]: cannot open display:
== bac102 (2 distinct, 2 total) ==
Jul 25 01:43:33 bac102 systemd-resolved[895]: Using degraded feature set UDP instead of UDP+EDNS0 for DNS server 10.73.244.10.
Jul 25 01:43:43 bac102 systemd-resolved[895]: Using degraded feature set UDP instead of UDP+EDNS0 for DNS server 10.211.55.1.
== bachata (1 distinct, 2 total) ==
Jul 25 01:20:08 bachata setroubleshoot[1867514]: SELinux is preventing /usr/sbin/smbd from name_bind access on the udp_socket port 712. For complete SELinux messages run: sealert -l 8f7247f1-69a5-4a62-a4f0-88a324bfd75c [x2]
== contest (9 distinct, 41 total) ==
Jul 25 01:06:11 contest goferd[1007]: [ERROR][worker-0] gofer.messaging.adapter.connect:33 - connect: proton+amqps://satellite8.cs.umd.edu:5647, failed: Connection amqps://satellite8.cs.umd.edu:5647 disconnected: Condition('proton.pythonio', 'Connection refused to all addresses') [x33]
Jul 25 01:48:12 contest setroubleshoot[38785]: SELinux is preventing /usr/libexec/platform-python3.6 from create access on the directory libdnf.3nne1q. For complete SELinux messages run: sealert -l cb6b25c6-4765-4cf2-88a0-9b3b508e94e9
Jul 25 01:48:12 contest setroubleshoot[38785]: SELinux is preventing /usr/bin/gpgconf from add_name access on the directory repodata. For complete SELinux messages run: sealert -l 41cf7b1b-0f34-4609-98f2-b66e7825fef7
Jul 25 01:48:12 contest setroubleshoot[38785]: SELinux is preventing /usr/libexec/platform-python3.6 from create access on the file mirrorlist. For complete SELinux messages run: sealert -l fc20ff92-ea83-4f38-a24b-ddfd737a3141
Jul 25 01:48:12 contest setroubleshoot[38785]: SELinux is preventing /usr/libexec/platform-python3.6 from setattr access on the file repomd.xml. For complete SELinux messages run: sealert -l ac675631-fa35-4e93-adc9-b692b18e53e5
Jul 25 01:48:13 contest setroubleshoot[38785]: SELinux is preventing /usr/libexec/platform-python3.6 from read access on the directory libdnf.3nne1q. For complete SELinux messages run: sealert -l 45d103b6-0810-4890-a705-990118577ce8
Jul 25 01:48:17 contest setroubleshoot[38785]: SELinux is preventing /usr/libexec/platform-python3.6 from remove_name access on the directory repomd.xml. For complete SELinux messages run: sealert -l 7e499113-2fd7-4f67-bec6-3521efbe3637
Jul 25 01:48:20 contest setroubleshoot[38785]: SELinux is preventing rhsmcertd-worke from unlink access on the file repomd.xml. For complete SELinux messages run: sealert -l 22835727-7fef-4cfb-b3b5-881f66888317
Jul 25 01:48:33 contest setroubleshoot[38835]: SELinux is preventing /usr/libexec/platform-python3.6 from rmdir access on the directory repodata. For complete SELinux messages run: sealert -l 3928930b-a1ed-448d-950b-0665ac2adef8
== csfw00a (1 distinct, 206 total) ==
Jul 25 01:05:17 csfw00a kernel: bnxt_en 0000:09:00.0 eth3: NIC Link is Down [x206]
== dojo (1 distinct, 1 total) ==
Jul 25 01:13:54 dojo sshd[221787]: error: Protocol major versions differ: 2 vs. 1
== emaar (1 distinct, 1 total) ==
Jul 25 01:25:10 emaar systemd[1]: cgroup compatibility translation between legacy and unified hierarchy settings activated. See cgroup-compat debug messages for details.
== hackerman (1 distinct, 1 total) ==
Jul 25 01:19:01 hackerman gnome-software[2060381]: failed to commit changes to dconf: GDBus.Error:org.gtk.GDBus.UnmappedGError.Quark._g_2dfile_2derror_2dquark.Code2: Failed to create file “/adminhomes/sajith/.config/dconf/user.AQF5S3”: Permission denied
== hazfs.cs.umd.edu (11 distinct, 66 total) ==
Jul 25 01:55:28 hazfs.cs.umd.edu snmpd[1431]: send response: Failure in sendto [x6]
Jul 25 01:55:28 hazfs.cs.umd.edu snmpd[1431]: -- NET-SNMP-EXTEND-MIB::nsExtendStatus."userweb" [x6]
Jul 25 01:55:28 hazfs.cs.umd.edu snmpd[1431]: -- NET-SNMP-EXTEND-MIB::nsExtendStatus."zfslist" [x6]
Jul 25 01:55:28 hazfs.cs.umd.edu snmpd[1431]: -- NET-SNMP-EXTEND-MIB::nsExtendStatus."userhome" [x6]
Jul 25 01:55:28 hazfs.cs.umd.edu snmpd[1431]: -- NET-SNMP-EXTEND-MIB::nsExtendOutput1Line."userweb" [x6]
Jul 25 01:55:28 hazfs.cs.umd.edu snmpd[1431]: -- NET-SNMP-EXTEND-MIB::nsExtendOutput1Line."zfslist" [x6]
Jul 25 01:55:28 hazfs.cs.umd.edu snmpd[1431]: -- NET-SNMP-EXTEND-MIB::nsExtendOutput1Line."userhome" [x6]
Jul 25 01:55:28 hazfs.cs.umd.edu snmpd[1431]: -- NET-SNMP-EXTEND-MIB::nsExtendOutputFull."userweb" [x6]
Jul 25 01:55:28 hazfs.cs.umd.edu snmpd[1431]: -- NET-SNMP-EXTEND-MIB::nsExtendOutputFull."zfslist" [x6]
Jul 25 01:55:28 hazfs.cs.umd.edu snmpd[1431]: -- NET-SNMP-EXTEND-MIB::nsExtendOutputFull."userhome" [x6]
Jul 25 01:55:28 hazfs.cs.umd.edu snmpd[1431]: -- NET-SNMP-EXTEND-MIB::nsExtendOutNumLines."userweb" [x6]
== idm00 (1 distinct, 1 total) ==
Jul 25 01:51:05 idm00 named[1455]: client @0x7f3314ae55e8 10.73.240.42#59359: update '73.10.in-addr.arpa/IN' denied
== idmp0 (2 distinct, 2 total) ==
Jul 25 01:23:59 idmp0 named[5198]: client @0x7f98fc033ea8 10.73.245.12#50777: update '73.10.in-addr.arpa/IN' denied
Jul 25 01:34:56 idmp0 named[5198]: client @0x7f992c0104c8 10.73.240.43#55023: update '73.10.in-addr.arpa/IN' denied
== itmon02 (1 distinct, 38 total) ==
Jul 25 01:08:04 itmon02 sshd[1834]: error: beginning MaxStartups throttling [x38]
== newhonors2 (1 distinct, 24 total) ==
Jul 25 01:13:03 newhonors2 dhcpcd[243482]: dhcpcd is not running [x24]
== outbound00.cs.umd.edu (1 distinct, 6 total) ==
Jul 25 01:09:09 outbound00.cs.umd.edu python3[3483766]: ldapdb [x6]
== outbound01.cs.umd.edu (1 distinct, 6 total) ==
Jul 25 01:13:06 outbound01.cs.umd.edu python3[1512571]: ldapdb [x6]
== sentry-docker00.cs.umd.edu (40 distinct, 40 total) ==
Jul 25 01:07:10 sentry-docker00.cs.umd.edu systemd-udevd[2999136]: link_config: could not get ethtool features for veth80b9956
Jul 25 01:07:10 sentry-docker00.cs.umd.edu systemd-udevd[2999136]: Could not set offload features of veth80b9956: No such device
Jul 25 01:07:10 sentry-docker00.cs.umd.edu systemd-udevd[2999140]: link_config: could not get ethtool features for vethd5ca691
Jul 25 01:07:10 sentry-docker00.cs.umd.edu systemd-udevd[2999140]: Could not set offload features of vethd5ca691: No such device
Jul 25 01:07:10 sentry-docker00.cs.umd.edu systemd-udevd[2999164]: Could not generate persistent MAC address for veth2ee849a: No such file or directory
Jul 25 01:07:10 sentry-docker00.cs.umd.edu systemd-udevd[2999165]: Could not generate persistent MAC address for veth57b95b4: No such file or directory
Jul 25 01:07:10 sentry-docker00.cs.umd.edu systemd-udevd[2999168]: Could not generate persistent MAC address for veth7d2a970: No such file or directory
Jul 25 01:07:10 sentry-docker00.cs.umd.edu systemd-udevd[2999185]: Could not generate persistent MAC address for vetha9ed6e0: No such file or directory
Jul 25 01:07:10 sentry-docker00.cs.umd.edu systemd-udevd[2999165]: Could not generate persistent MAC address for veth49996da: No such file or directory
Jul 25 01:07:10 sentry-docker00.cs.umd.edu systemd-udevd[2999181]: Could not generate persistent MAC address for vethb81665b: No such file or directory
Jul 25 01:07:10 sentry-docker00.cs.umd.edu systemd-udevd[2999177]: Could not generate persistent MAC address for vethfeb94aa: No such file or directory
Jul 25 01:07:10 sentry-docker00.cs.umd.edu systemd-udevd[2999165]: Could not generate persistent MAC address for veth943d8a7: No such file or directory
Jul 25 01:20:00 sentry-docker00.cs.umd.edu systemd-udevd[3005732]: Could not generate persistent MAC address for veth64ceb70: No such file or directory
Jul 25 01:20:00 sentry-docker00.cs.umd.edu systemd-udevd[3005733]: Could not generate persistent MAC address for vethf83297c: No such file or directory
Jul 25 01:27:18 sentry-docker00.cs.umd.edu systemd-udevd[3008720]: link_config: could not get ethtool features for vethb81665b
Jul 25 01:27:18 sentry-docker00.cs.umd.edu systemd-udevd[3008720]: Could not set offload features of vethb81665b: No such device
Jul 25 01:27:18 sentry-docker00.cs.umd.edu systemd-udevd[3008792]: Could not generate persistent MAC address for veth715281d: No such file or directory
Jul 25 01:27:18 sentry-docker00.cs.umd.edu systemd-udevd[3008793]: Could not generate persistent MAC address for vethed49e9d: No such file or directory
Jul 25 01:27:18 sentry-docker00.cs.umd.edu systemd-udevd[3008796]: Could not generate persistent MAC address for veth476e269: No such file or directory
Jul 25 01:27:18 sentry-docker00.cs.umd.edu systemd-udevd[3008797]: Could not generate persistent MAC address for vetha128410: No such file or directory
Jul 25 01:27:18 sentry-docker00.cs.umd.edu systemd-udevd[3008808]: Could not generate persistent MAC address for veth771a6c1: No such file or directory
Jul 25 01:27:18 sentry-docker00.cs.umd.edu systemd-udevd[3008804]: Could not generate persistent MAC address for veth9e6e405: No such file or directory
Jul 25 01:27:18 sentry-docker00.cs.umd.edu systemd-udevd[3008822]: Could not generate persistent MAC address for veth22683e1: No such file or directory
Jul 25 01:27:18 sentry-docker00.cs.umd.edu systemd-udevd[3008823]: Could not generate persistent MAC address for vethbcd080a: No such file or directory
Jul 25 01:40:04 sentry-docker00.cs.umd.edu systemd-udevd[3015376]: Could not generate persistent MAC address for veth59b55a5: No such file or directory
Jul 25 01:40:04 sentry-docker00.cs.umd.edu systemd-udevd[3015377]: Could not generate persistent MAC address for vethedf7db0: No such file or directory
Jul 25 01:47:26 sentry-docker00.cs.umd.edu systemd-udevd[3018170]: link_config: could not get ethtool features for veth715281d
Jul 25 01:47:26 sentry-docker00.cs.umd.edu systemd-udevd[3018170]: Could not set offload features of veth715281d: No such device
Jul 25 01:47:27 sentry-docker00.cs.umd.edu systemd-udevd[3018194]: Could not generate persistent MAC address for vethb85c352: No such file or directory
Jul 25 01:47:27 sentry-docker00.cs.umd.edu systemd-udevd[3018195]: Could not generate persistent MAC address for vethdf61aec: No such file or directory
... 10 more distinct messages not shown
== strawberry (2 distinct, 8 total) ==
Jul 25 01:09:44 strawberry udisksd[1067]: Error performing housekeeping for drive /org/freedesktop/UDisks2/drives/ST2000DM001_1CH164_W1E8J5KJ: Error updating SMART data: Error sending ATA command CHECK POWER MODE: Unexpected sense data returned:#0120000: 00 00 00 00 00 00 00 00 00 00 00 00 00 00 00 00 ................#0120010: 00 00 00 00 00 00 00 00 00 00 00 00 00 00 00 00 ................#012 (g-io-error-quark, 0) [x6]
Jul 25 01:34:42 strawberry smartd[5314]: Device: /dev/sda [SAT], failed to read SMART Attribute Data [x2]
== submit26-b9-2 (10 distinct, 12 total) ==
Jul 25 01:08:06 submit26-b9-2 systemd[1]: user(a)1001.service: Main process exited, code=killed, status=9/KILL [x3]
Jul 25 01:12:48 submit26-b9-2 setroubleshoot[150831]: SELinux is preventing /usr/bin/python3.9 from create access on the directory /(null). For complete SELinux messages run: sealert -l d506243c-d61e-48f3-b42a-4592c913deb0
Jul 25 01:12:48 submit26-b9-2 setroubleshoot[150831]: SELinux is preventing /usr/bin/python3.9 from add_name access on the directory /(null). For complete SELinux messages run: sealert -l 3b4752ac-1b9a-4af9-a05b-32e4c2eb13ab
Jul 25 01:12:48 submit26-b9-2 setroubleshoot[150831]: SELinux is preventing /usr/bin/python3.9 from create access on the file /(null). For complete SELinux messages run: sealert -l 29e5adbd-4381-4467-b40d-a2219101e096
Jul 25 01:12:48 submit26-b9-2 setroubleshoot[150831]: SELinux is preventing /usr/bin/python3.9 from open access on the file /tmp/libdnf.yovXGY/repodata/repomd.xml. For complete SELinux messages run: sealert -l 1b38f2ec-01ce-4343-8059-ba7494ecc5c4
Jul 25 01:12:48 submit26-b9-2 setroubleshoot[150831]: SELinux is preventing /usr/bin/python3.9 from setattr access on the file repomd.xml. For complete SELinux messages run: sealert -l e5f9af40-1f63-4924-b012-27ab2a7b2266
Jul 25 01:12:48 submit26-b9-2 setroubleshoot[150831]: SELinux is preventing /usr/bin/python3.9 from read access on the directory libdnf.yovXGY. For complete SELinux messages run: sealert -l 5c54db87-54a3-4a7c-97b4-b5c48d6c3543
Jul 25 01:12:48 submit26-b9-2 setroubleshoot[150831]: SELinux is preventing /usr/bin/python3.9 from remove_name access on the directory repomd.xml. For complete SELinux messages run: sealert -l 63cd60e1-1e61-4276-afea-dd8526ffe8b2
Jul 25 01:12:48 submit26-b9-2 setroubleshoot[150831]: SELinux is preventing /usr/bin/python3.9 from unlink access on the file repomd.xml. For complete SELinux messages run: sealert -l 81c7e9ec-e023-4c6d-b1ad-c02a242e655e
Jul 25 01:12:48 submit26-b9-2 setroubleshoot[150831]: SELinux is preventing /usr/bin/python3.9 from rmdir access on the directory repodata. For complete SELinux messages run: sealert -l 6ae9a597-e123-4d74-8eec-a8ebe0f5e4d0
== submit26-b9-3 (9 distinct, 9 total) ==
Jul 25 01:20:34 submit26-b9-3 setroubleshoot[572023]: SELinux is preventing /usr/bin/python3.9 from create access on the directory /(null). For complete SELinux messages run: sealert -l 5b912a44-22fd-4560-b201-2a4e289b73f5
Jul 25 01:20:34 submit26-b9-3 setroubleshoot[572023]: SELinux is preventing /usr/bin/python3.9 from add_name access on the directory /(null). For complete SELinux messages run: sealert -l 7f1df1e4-725e-4953-98eb-1079f908f543
Jul 25 01:20:34 submit26-b9-3 setroubleshoot[572023]: SELinux is preventing /usr/bin/python3.9 from create access on the file /(null). For complete SELinux messages run: sealert -l 40b8852a-f77b-44b4-affe-5f11fa33de43
Jul 25 01:20:34 submit26-b9-3 setroubleshoot[572023]: SELinux is preventing /usr/bin/python3.9 from open access on the file /tmp/libdnf.YGm2GL/repodata/repomd.xml. For complete SELinux messages run: sealert -l 45a8019e-f6b5-4baa-92c1-862594b40d46
Jul 25 01:20:34 submit26-b9-3 setroubleshoot[572023]: SELinux is preventing /usr/bin/python3.9 from setattr access on the file repomd.xml. For complete SELinux messages run: sealert -l e9f0bfff-7784-4126-baa4-2bb06da56591
Jul 25 01:20:34 submit26-b9-3 setroubleshoot[572023]: SELinux is preventing /usr/bin/python3.9 from read access on the directory libdnf.YGm2GL. For complete SELinux messages run: sealert -l 0b17cc3d-cdc6-4fe2-a11f-3892e7c41dc7
Jul 25 01:20:34 submit26-b9-3 setroubleshoot[572023]: SELinux is preventing /usr/bin/python3.9 from remove_name access on the directory repomd.xml. For complete SELinux messages run: sealert -l 10e38c64-b65f-4cdd-901e-4375652d9a42
Jul 25 01:20:34 submit26-b9-3 setroubleshoot[572023]: SELinux is preventing /usr/bin/python3.9 from unlink access on the file repomd.xml. For complete SELinux messages run: sealert -l 7fd9cf72-ef38-48e1-b6aa-b571b26a7b22
Jul 25 01:20:34 submit26-b9-3 setroubleshoot[572023]: SELinux is preventing /usr/bin/python3.9 from rmdir access on the directory repodata. For complete SELinux messages run: sealert -l b9b11116-89bd-4a3c-980c-1d422c5dcee4
== submit26-b9-4 (1 distinct, 6 total) ==
Jul 25 01:08:06 submit26-b9-4 systemd[1]: user(a)1001.service: Main process exited, code=killed, status=9/KILL [x6]
== submit26-clnb9 (9 distinct, 12 total) ==
Jul 25 01:31:52 submit26-clnb9 setroubleshoot[1271478]: SELinux is preventing /usr/bin/python3.9 from create access on the directory /(null). For complete SELinux messages run: sealert -l 6783ed2b-5ae4-42b5-975a-4bf50eec4658
Jul 25 01:31:52 submit26-clnb9 setroubleshoot[1271478]: SELinux is preventing /usr/bin/python3.9 from add_name access on the directory /(null). For complete SELinux messages run: sealert -l 9e7fa955-cc30-4804-ac8c-e1779e85946c
Jul 25 01:31:52 submit26-clnb9 setroubleshoot[1271478]: SELinux is preventing /usr/bin/python3.9 from create access on the file /(null). For complete SELinux messages run: sealert -l 69bfa6e3-089c-40ff-9563-fd30787d0774 [x2]
Jul 25 01:31:52 submit26-clnb9 setroubleshoot[1271478]: SELinux is preventing /usr/bin/python3.9 from open access on the file /tmp/libdnf.EYNcim/repodata/repomd.xml. For complete SELinux messages run: sealert -l 001acdb5-31ef-4e52-b10b-90f467a89ddc [x2]
Jul 25 01:31:52 submit26-clnb9 setroubleshoot[1271478]: SELinux is preventing /usr/bin/python3.9 from setattr access on the file repomd.xml. For complete SELinux messages run: sealert -l edacddcf-16ed-4dc3-8d82-7c597d5dee23 [x2]
Jul 25 01:31:52 submit26-clnb9 setroubleshoot[1271478]: SELinux is preventing /usr/bin/python3.9 from read access on the directory libdnf.EYNcim. For complete SELinux messages run: sealert -l 62b3782e-4730-4488-8178-94dafe9b552c
Jul 25 01:31:52 submit26-clnb9 setroubleshoot[1271478]: SELinux is preventing /usr/bin/python3.9 from remove_name access on the directory repomd.xml. For complete SELinux messages run: sealert -l 81cb3698-78f8-440a-8e3c-e5d1041e6b78
Jul 25 01:31:52 submit26-clnb9 setroubleshoot[1271478]: SELinux is preventing /usr/bin/python3.9 from unlink access on the file repomd.xml. For complete SELinux messages run: sealert -l 792b472a-115c-4799-9805-fc7436f916b9
Jul 25 01:31:52 submit26-clnb9 setroubleshoot[1271478]: SELinux is preventing /usr/bin/python3.9 from rmdir access on the directory repodata. For complete SELinux messages run: sealert -l 15c83a86-837b-41e2-b662-b39cd4e361cb
1
0
Command: /usr/local/sbin/syslog-digest.py
Time : 0.5673s
Status : exited 0
Output :
Syslog digest — 2026-07-25 01:05 EDT
Processed 4,966 lines, filtered 4,026 (81%). 940 unknown (147 distinct) from 40 host(s).
== abuse (1 distinct, 348 total) ==
Jul 25 00:05:06 abuse rsyslogd[21745]: imjournal: open() failed for path: '/var/lib/rsyslog/imjournal.state.tmp': Input/output error [v8.2404.0 try https://www.rsyslog.com/e/2433 ] [x348]
== alec.cs.umd.edu (3 distinct, 60 total) ==
Jul 25 00:05:23 alec.cs.umd.edu setroubleshoot[2744105]: failed to retrieve rpm info for path '/run/netns/netns-9dfd0347-71eb-5698-085c-c769043aa5c3': [x12]
Jul 25 00:05:24 alec.cs.umd.edu sedispatch[1526]: AVC Message regarding setroubleshoot, ignoring message [x24]
Jul 25 00:05:24 alec.cs.umd.edu setroubleshoot[2744105]: SELinux is preventing /usr/bin/df from getattr access on the file /run/netns/netns-9dfd0347-71eb-5698-085c-c769043aa5c3. For complete SELinux messages run: sealert -l 23f93208-3063-4aac-b78a-bb0fcb40740c [x24]
== b0b02.cs.umd.edu (1 distinct, 1 total) ==
Jul 25 00:54:19 b0b02.cs.umd.edu rustdesk[235397]: cannot open display:
== bac102 (1 distinct, 1 total) ==
Jul 25 00:49:10 bac102 systemd-resolved[895]: Using degraded feature set UDP instead of UDP+EDNS0 for DNS server 10.73.244.11.
== biggulp.cs.umd.edu (4 distinct, 4 total) ==
Jul 25 01:02:06 biggulp.cs.umd.edu sshd-session[170757]: pam_access(sshd:auth): access denied for user `admin' from `34.62.143.106'
Jul 25 01:02:06 biggulp.cs.umd.edu krb5_child[170759]: Client 'admin(a)UMD.EDU' not found in Kerberos database
Jul 25 01:02:06 biggulp.cs.umd.edu sshd-session[170755]: error: PAM: System error for admin from 34.62.143.106
Jul 25 01:02:17 biggulp.cs.umd.edu sshd-session[170772]: error: Protocol major versions differ: 2 vs. 1
== cheezit.cs.umd.edu (3 distinct, 3 total) ==
Jul 25 00:21:32 cheezit.cs.umd.edu sshd-session[1530397]: pam_access(sshd:auth): access denied for user `admin' from `34.53.136.73'
Jul 25 00:21:32 cheezit.cs.umd.edu krb5_child[1530399]: Client 'admin(a)UMD.EDU' not found in Kerberos database
Jul 25 00:21:32 cheezit.cs.umd.edu sshd-session[1530395]: error: PAM: System error for admin from 34.53.136.73
== cmsc436-0101-redis (2 distinct, 2 total) ==
Jul 25 00:52:01 cmsc436-0101-redis krb5_child[244530]: Client 'admin(a)UMD.EDU' not found in Kerberos database
Jul 25 00:52:03 cmsc436-0101-redis sshd-session[244526]: error: PAM: Authentication failure for admin from 104.199.12.168
== contest (1 distinct, 34 total) ==
Jul 25 00:05:29 contest goferd[1007]: [ERROR][worker-0] gofer.messaging.adapter.connect:33 - connect: proton+amqps://satellite8.cs.umd.edu:5647, failed: Connection amqps://satellite8.cs.umd.edu:5647 disconnected: Condition('proton.pythonio', 'Connection refused to all addresses') [x34]
== csfw00a (1 distinct, 228 total) ==
Jul 25 00:05:12 csfw00a kernel: bnxt_en 0000:09:00.0 eth3: NIC Link is Down [x228]
== cskayako (2 distinct, 3 total) ==
Jul 25 00:46:36 cskayako setroubleshoot[487674]: SELinux is preventing /usr/bin/php from add_name access on the directory /var/www/html/(null). For complete SELinux messages run: sealert -l 5239c113-abc1-4953-a9c0-21d695a0d1bb [x2]
Jul 25 00:46:36 cskayako setroubleshoot[487674]: SELinux is preventing /usr/bin/php from create access on the file /var/www/html/(null). For complete SELinux messages run: sealert -l cacf8f36-45b0-4374-9a33-d15de767aae7
== frabjous (3 distinct, 3 total) ==
Jul 25 01:03:51 frabjous krb5_child[1362950]: Client 'admin(a)UMD.EDU' not found in Kerberos database
Jul 25 01:03:53 frabjous sshd-session[1362946]: error: PAM: Authentication failure for admin from 34.79.59.96
Jul 25 01:05:01 frabjous sshd-session[1363016]: error: Protocol major versions differ: 2 vs. 1
== grades01.cs.umd.edu (3 distinct, 4 total) ==
Jul 25 00:10:13 grades01.cs.umd.edu systemd[1]: New main PID 14825 does not belong to service, and PID file is not owned by root. Refusing. [x2]
Jul 25 00:10:38 grades01.cs.umd.edu systemd[1]: Daemon never wrote its PID file. Failing.
Jul 25 00:10:53 grades01.cs.umd.edu systemd[1]: pmlogger.service: Supervising process 22446 which is not our child. We'll most likely not notice when it exits.
== idm00 (1 distinct, 1 total) ==
Jul 25 00:51:05 idm00 named[1455]: client @0x7f3304b42ca8 10.73.240.42#63894: update '73.10.in-addr.arpa/IN' denied
== idmp0 (1 distinct, 1 total) ==
Jul 25 00:34:56 idmp0 named[5198]: client @0x7f9904040418 10.73.240.43#56103: update '73.10.in-addr.arpa/IN' denied
== irb2156 (5 distinct, 14 total) ==
Jul 25 00:23:53 irb2156 setroubleshoot[692708]: failed to retrieve rpm info for path '/var/lib/sss/pipes/nss': [x4]
Jul 25 00:23:53 irb2156 setroubleshoot[692708]: SELinux is preventing /usr/bin/python3.12 from write access on the sock_file /var/lib/sss/pipes/nss. For complete SELinux messages run: sealert -l abc2274b-d33a-4914-8e4c-19cb26848a77 [x7]
Jul 25 00:24:28 irb2156 setroubleshoot[693463]: failed to retrieve rpm info for path '/var/log/falconctl.log':
Jul 25 00:24:28 irb2156 setroubleshoot[693463]: SELinux is preventing /opt/CrowdStrike/falconctl18708 from append access on the file /var/log/falconctl.log. For complete SELinux messages run: sealert -l 378093ff-b0d9-4ff5-9972-cb081e35f744
Jul 25 00:24:29 irb2156 setroubleshoot[693463]: SELinux is preventing /opt/CrowdStrike/falconctl18708 from write access on the file falconstore. For complete SELinux messages run: sealert -l cf3d4d4a-e5a2-4542-9fc5-dbd87dc3c82b
== itmon00 (3 distinct, 4 total) ==
Jul 25 00:10:13 itmon00 systemd[1]: New main PID 16992 does not belong to service, and PID file is not owned by root. Refusing. [x2]
Jul 25 00:10:34 itmon00 systemd[1]: Daemon never wrote its PID file. Failing.
Jul 25 00:10:47 itmon00 systemd[1]: pmlogger.service: Supervising process 24098 which is not our child. We'll most likely not notice when it exits.
== itmon02 (1 distinct, 40 total) ==
Jul 25 00:08:12 itmon02 sshd[1834]: error: beginning MaxStartups throttling [x40]
== jaws.cs.umd.edu (4 distinct, 5 total) ==
Jul 25 00:33:43 jaws.cs.umd.edu systemd-coredump[1433124]: Process 1433108 (podman) of user 981 dumped core.#012#012Stack trace of thread 1433108:#012#0 0x0000560f4ccf646e internal/runtime/syscall/linux.Syscall6 (podman + 0x48b46e)#012#1 0x0000560f4cdd60a6 syscall.Syscall (podman + 0x56b0a6)#012#2 0x0000560f4cdd6c50 syscall.Syscall.abi0 (podman + 0x56bc50)#012#3 0x0000560f4cf40c2e github.com/containers/podman/vendor/golang.org/x/sys/unix.OpenTree (podman + 0x6d5c2e)#012#4 0x0000560f4d599f4b github.com/containers/podman/vendor/github.com/cyphar/filepath-securejoin/p… (podman + 0xd2ef4b)#012#5 0x0000560f4d599e54 github.com/containers/podman/vendor/github.com/cyphar/filepath-securejoin/p… (podman + 0xd2ee54)#012#6 0x0000560f4cd89dcc sync.(*Once).doSlow (podman + 0x51edcc)#012#7 0x0000560f4cd89cf9 sync.(*Once).Do (podman + 0x51ecf9)#012#8 0x0000560f4d599d
c5 github.com/containers/podman/vendor/github.com/cyphar/filepath-securejoin/p… (podman + 0xd2edc5)#012#9 0x0000560f4d59b3e2 github.com/containers/podman/vendor/github.com/cyphar/filepath-securejoin/p… (podman + 0xd303e2)#012#10 0x0000560f4d59b7f3 github.com/containers/podman/vendor/github.com/cyphar/filepath-securejoin/p… (podman + 0xd307f3)#012#11 0x0000560f4d59a91c github.com/containers/podman/vendor/github.com/cyphar/filepath-securejoin/p… (podman + 0xd2f91c)#012#12 0x0000560f4d59a358 github.com/containers/podman/vendor/github.com/cyphar/filepath-securejoin/p… (podman + 0xd2f358)#012#13 0x0000560f4cd89dcc sync.(*Once).doSlow (podman + 0x51edcc)#012#14 0x0000560f4cd89cf9 sync.(*Once).D
o (podman + 0x51ecf9)#012#15 0x0000560f4d59a2c5 github.com/containers/podman/vendor/github.com/cyphar/filepath-securejoin/p… (podman + 0xd2f2c5)#012#16 0x0000560f4d59b79a github.com/containers/podman/vendor/github.com/cyphar/filepath-securejoin/p… (podman + 0xd3079a)#012#17 0x0000560f4d5a234e github.com/containers/podman/vendor/github.com/opencontainers/selinux/go-se… (podman + 0xd3734e)#012#18 0x0000560f4d5a2838 github.com/containers/podman/vendor/github.com/opencontainers/selinux/go-se… (podman + 0xd37838)#012#19 0x0000560f4d5a15df github.com/containers/podman/vendor/github.com/opencontainers/selinux/go-se… (podman + 0xd365df)#012#20 0x0000560f4d5a1873 github.com/containers/podman/vendor/github.com/opencontainers/selinux/go-se… (podman + 0xd36873)#012#21 0x000
0560f4d799f4b github.com/containers/podman/vendor/go.podman.io/common/pkg/config.defaultC… (podman + 0xf2ef4b)#012#22 0x0000560f4d79d912 github.com/containers/podman/vendor/go.podman.io/common/pkg/config.newLocked (podman + 0xf32912)#012#23 0x0000560f4d79d605 github.com/containers/podman/vendor/go.podman.io/common/pkg/config.New (podman + 0xf32605)#012#24 0x0000560f4df10fd3 github.com/containers/podman/cmd/podman/registry.newPodmanConfig (podman + 0x16a5fd3)#012#25 0x0000560f4cd89dcc sync.(*Once).doSlow (podman + 0x51edcc)#012#26 0x0000560f4df31c50 github.com/containers/podman/cmd/podman/common.init (podman + 0x16c6c50)#012#27 0x0000560f4cd4fa57 runtime.doInit1 (podman + 0x4e4a57)#012#28 0x0000560f4cd3ff90 runtime.main (podman + 0x4d4f90)#012#29 0x0000560f4cd7fee1 runtime.goexit.abi0 (podman + 0x514ee1)#012ELF object binary architecture: AMD x86-64
Jul 25 00:33:45 jaws.cs.umd.edu systemd-coredump[1433150]: Process 1433134 (podman) of user 981 dumped core.#012#012Stack trace of thread 1433134:#012#0 0x000055afa323046e internal/runtime/syscall/linux.Syscall6 (podman + 0x48b46e)#012#1 0x000055afa33100a6 syscall.Syscall (podman + 0x56b0a6)#012#2 0x000055afa3310c50 syscall.Syscall.abi0 (podman + 0x56bc50)#012#3 0x000055afa347ac2e github.com/containers/podman/vendor/golang.org/x/sys/unix.OpenTree (podman + 0x6d5c2e)#012#4 0x000055afa3ad3f4b github.com/containers/podman/vendor/github.com/cyphar/filepath-securejoin/p… (podman + 0xd2ef4b)#012#5 0x000055afa3ad3e54 github.com/containers/podman/vendor/github.com/cyphar/filepath-securejoin/p… (podman + 0xd2ee54)#012#6 0x000055afa32c3dcc sync.(*Once).doSlow (podman + 0x51edcc)#012#7 0x000055afa32c3cf9 sync.(*Once).Do (podman + 0x51ecf9)#012#8 0x000055afa3ad3d
c5 github.com/containers/podman/vendor/github.com/cyphar/filepath-securejoin/p… (podman + 0xd2edc5)#012#9 0x000055afa3ad53e2 github.com/containers/podman/vendor/github.com/cyphar/filepath-securejoin/p… (podman + 0xd303e2)#012#10 0x000055afa3ad57f3 github.com/containers/podman/vendor/github.com/cyphar/filepath-securejoin/p… (podman + 0xd307f3)#012#11 0x000055afa3ad491c github.com/containers/podman/vendor/github.com/cyphar/filepath-securejoin/p… (podman + 0xd2f91c)#012#12 0x000055afa3ad4358 github.com/containers/podman/vendor/github.com/cyphar/filepath-securejoin/p… (podman + 0xd2f358)#012#13 0x000055afa32c3dcc sync.(*Once).doSlow (podman + 0x51edcc)#012#14 0x000055afa32c3cf9 sync.(*Once).D
o (podman + 0x51ecf9)#012#15 0x000055afa3ad42c5 github.com/containers/podman/vendor/github.com/cyphar/filepath-securejoin/p… (podman + 0xd2f2c5)#012#16 0x000055afa3ad579a github.com/containers/podman/vendor/github.com/cyphar/filepath-securejoin/p… (podman + 0xd3079a)#012#17 0x000055afa3adc34e github.com/containers/podman/vendor/github.com/opencontainers/selinux/go-se… (podman + 0xd3734e)#012#18 0x000055afa3adc838 github.com/containers/podman/vendor/github.com/opencontainers/selinux/go-se… (podman + 0xd37838)#012#19 0x000055afa3adb5df github.com/containers/podman/vendor/github.com/opencontainers/selinux/go-se… (podman + 0xd365df)#012#20 0x000055afa3adb873 github.com/containers/podman/vendor/github.com/opencontainers/selinux/go-se… (podman + 0xd36873)#012#21 0x000
055afa3cd3f4b github.com/containers/podman/vendor/go.podman.io/common/pkg/config.defaultC… (podman + 0xf2ef4b)#012#22 0x000055afa3cd7912 github.com/containers/podman/vendor/go.podman.io/common/pkg/config.newLocked (podman + 0xf32912)#012#23 0x000055afa3cd7605 github.com/containers/podman/vendor/go.podman.io/common/pkg/config.New (podman + 0xf32605)#012#24 0x000055afa444afd3 github.com/containers/podman/cmd/podman/registry.newPodmanConfig (podman + 0x16a5fd3)#012#25 0x000055afa32c3dcc sync.(*Once).doSlow (podman + 0x51edcc)#012#26 0x000055afa446bc50 github.com/containers/podman/cmd/podman/common.init (podman + 0x16c6c50)#012#27 0x000055afa3289a57 runtime.doInit1 (podman + 0x4e4a57)#012#28 0x000055afa3279f90 runtime.main (podman + 0x4d4f90)#012#29 0x000055afa32b9ee1 runtime.goexit.abi0 (podman + 0x514ee1)#012ELF object binary architecture: AMD x86-64
Jul 25 00:33:45 jaws.cs.umd.edu setroubleshoot[1433123]: SELinux is preventing /usr/bin/podman from using the nnp_transition access on a process. For complete SELinux messages run: sealert -l 3c7643bc-dd69-4695-b48c-7d780b62b6cf [x2]
Jul 25 00:33:45 jaws.cs.umd.edu systemd-coredump[1433173]: Process 1433166 (podman) of user 981 dumped core.#012#012Stack trace of thread 1433166:#012#0 0x00005578aeb7646e internal/runtime/syscall/linux.Syscall6 (podman + 0x48b46e)#012#1 0x00005578aec560a6 syscall.Syscall (podman + 0x56b0a6)#012#2 0x00005578aec56c50 syscall.Syscall.abi0 (podman + 0x56bc50)#012#3 0x00005578aedc0c2e github.com/containers/podman/vendor/golang.org/x/sys/unix.OpenTree (podman + 0x6d5c2e)#012#4 0x00005578af419f4b github.com/containers/podman/vendor/github.com/cyphar/filepath-securejoin/p… (podman + 0xd2ef4b)#012#5 0x00005578af419e54 github.com/containers/podman/vendor/github.com/cyphar/filepath-securejoin/p… (podman + 0xd2ee54)#012#6 0x00005578aec09dcc sync.(*Once).doSlow (podman + 0x51edcc)#012#7 0x00005578aec09cf9 sync.(*Once).Do (podman + 0x51ecf9)#012#8 0x00005578af419d
c5 github.com/containers/podman/vendor/github.com/cyphar/filepath-securejoin/p… (podman + 0xd2edc5)#012#9 0x00005578af41b3e2 github.com/containers/podman/vendor/github.com/cyphar/filepath-securejoin/p… (podman + 0xd303e2)#012#10 0x00005578af41b7f3 github.com/containers/podman/vendor/github.com/cyphar/filepath-securejoin/p… (podman + 0xd307f3)#012#11 0x00005578af41a91c github.com/containers/podman/vendor/github.com/cyphar/filepath-securejoin/p… (podman + 0xd2f91c)#012#12 0x00005578af41a358 github.com/containers/podman/vendor/github.com/cyphar/filepath-securejoin/p… (podman + 0xd2f358)#012#13 0x00005578aec09dcc sync.(*Once).doSlow (podman + 0x51edcc)#012#14 0x00005578aec09cf9 sync.(*Once).D
o (podman + 0x51ecf9)#012#15 0x00005578af41a2c5 github.com/containers/podman/vendor/github.com/cyphar/filepath-securejoin/p… (podman + 0xd2f2c5)#012#16 0x00005578af41b79a github.com/containers/podman/vendor/github.com/cyphar/filepath-securejoin/p… (podman + 0xd3079a)#012#17 0x00005578af42234e github.com/containers/podman/vendor/github.com/opencontainers/selinux/go-se… (podman + 0xd3734e)#012#18 0x00005578af422838 github.com/containers/podman/vendor/github.com/opencontainers/selinux/go-se… (podman + 0xd37838)#012#19 0x00005578af4215df github.com/containers/podman/vendor/github.com/opencontainers/selinux/go-se… (podman + 0xd365df)#012#20 0x00005578af421873 github.com/containers/podman/vendor/github.com/opencontainers/selinux/go-se… (podman + 0xd36873)#012#21 0x000
05578af619f4b github.com/containers/podman/vendor/go.podman.io/common/pkg/config.defaultC… (podman + 0xf2ef4b)#012#22 0x00005578af61d912 github.com/containers/podman/vendor/go.podman.io/common/pkg/config.newLocked (podman + 0xf32912)#012#23 0x00005578af61d605 github.com/containers/podman/vendor/go.podman.io/common/pkg/config.New (podman + 0xf32605)#012#24 0x00005578afd90fd3 github.com/containers/podman/cmd/podman/registry.newPodmanConfig (podman + 0x16a5fd3)#012#25 0x00005578aec09dcc sync.(*Once).doSlow (podman + 0x51edcc)#012#26 0x00005578afdb1c50 github.com/containers/podman/cmd/podman/common.init (podman + 0x16c6c50)#012#27 0x00005578aebcfa57 runtime.doInit1 (podman + 0x4e4a57)#012#28 0x00005578aebbff90 runtime.main (podman + 0x4d4f90)#012#29 0x00005578aebffee1 runtime.goexit.abi0 (podman + 0x514ee1)#012ELF object binary architecture: AMD x86-64
== jubjub.cs.umd.edu (3 distinct, 4 total) ==
Jul 25 00:10:12 jubjub.cs.umd.edu systemd[1]: New main PID 2802126 does not belong to service, and PID file is not owned by root. Refusing. [x2]
Jul 25 00:10:31 jubjub.cs.umd.edu systemd[1]: Daemon never wrote its PID file. Failing.
Jul 25 00:10:39 jubjub.cs.umd.edu systemd[1]: pmlogger.service: Supervising process 2809663 which is not our child. We'll most likely not notice when it exits.
== matrix (2 distinct, 3 total) ==
Jul 25 00:20:32 matrix krb5_child[1539013]: Client 'admin(a)UMD.EDU' not found in Kerberos database [x2]
Jul 25 00:20:34 matrix sshd[1539007]: error: PAM: Authentication failure for admin from 34.79.59.96
== mcstic (4 distinct, 7 total) ==
Jul 25 00:19:19 mcstic kernel: kauditd_printk_skb: 4 callbacks suppressed
Jul 25 00:47:01 mcstic krb5_child[1611766]: Client 'admin(a)UMD.EDU' not found in Kerberos database [x4]
Jul 25 00:47:06 mcstic sshd[1611761]: error: PAM: Authentication failure for admin from 207.175.139.164
Jul 25 00:47:37 mcstic sshd[1611790]: error: Protocol major versions differ: 2 vs. 1
== mirrors.cs.umd.edu (3 distinct, 4 total) ==
Jul 25 00:10:12 mirrors.cs.umd.edu systemd[1]: New main PID 31414 does not belong to service, and PID file is not owned by root. Refusing. [x2]
Jul 25 00:10:30 mirrors.cs.umd.edu systemd[1]: Daemon never wrote its PID file. Failing.
Jul 25 00:10:43 mirrors.cs.umd.edu systemd[1]: pmlogger.service: Supervising process 6151 which is not our child. We'll most likely not notice when it exits.
== misty.cs.umd.edu (3 distinct, 4 total) ==
Jul 25 00:10:15 misty.cs.umd.edu systemd[1]: New main PID 13963 does not belong to service, and PID file is not owned by root. Refusing. [x2]
Jul 25 00:10:35 misty.cs.umd.edu systemd[1]: Daemon never wrote its PID file. Failing.
Jul 25 00:10:51 misty.cs.umd.edu systemd[1]: pmlogger.service: Supervising process 21790 which is not our child. We'll most likely not notice when it exits.
== munin (1 distinct, 1 total) ==
Jul 25 00:56:03 munin (httpd)[479187]: httpd.service: Referenced but unset environment variable evaluates to an empty string: OPTIONS
== neodontcare.cs.umd.edu (3 distinct, 8 total) ==
Jul 25 00:05:03 neodontcare.cs.umd.edu tracker-extract[3126576]: tracker_module_manager_load_modules: assertion 'initialized == TRUE' failed [x5]
Jul 25 00:05:08 neodontcare.cs.umd.edu tracker-extract[3126576]: Task for 'file:///fs/junkfood/gasarch/sos.pdf' finished with error: Couldn't open PopplerDocument:PDF document is damaged [x2]
Jul 25 00:06:38 neodontcare.cs.umd.edu tracker-miner-f[2945379]: g_hash_table_contains: assertion 'hash_table != NULL' failed
== netman.cs.umd.edu (6 distinct, 9 total) ==
Jul 25 00:29:58 netman.cs.umd.edu setroubleshoot[701316]: SELinux is preventing /usr/bin/gpg from read access on the file gpg.conf. For complete SELinux messages run: sealert -l 019ad1da-a874-4814-8037-3b3e5f413ad2
Jul 25 00:29:58 netman.cs.umd.edu setroubleshoot[701316]: SELinux is preventing /usr/bin/gpg from open access on the file /root/.gnupg/gpg.conf. For complete SELinux messages run: sealert -l cb54177e-d44c-46a1-b246-5c0bbb8343be
Jul 25 00:30:07 netman.cs.umd.edu setroubleshoot[701316]: SELinux is preventing /usr/bin/gpg from getattr access on the file /root/.gnupg/gpg.conf. For complete SELinux messages run: sealert -l fbba2e30-b7ab-491c-9ec6-f553e9ef72af
Jul 25 00:58:33 netman.cs.umd.edu krb5_child[709305]: Client 'admin(a)UMD.EDU' not found in Kerberos database [x4]
Jul 25 00:58:37 netman.cs.umd.edu sshd[709302]: error: PAM: Authentication failure for admin from 104.199.12.168
Jul 25 00:59:27 netman.cs.umd.edu sshd[709338]: error: Protocol major versions differ: 2 vs. 1
== newhonors2 (1 distinct, 24 total) ==
Jul 25 00:13:02 newhonors2 dhcpcd[241638]: dhcpcd is not running [x24]
== openrepo (1 distinct, 1 total) ==
Jul 25 00:41:53 openrepo (nin-node)[4031084]: munin-node.service: Referenced but unset environment variable evaluates to an empty string: DAEMON_ARGS
== outbound00.cs.umd.edu (3 distinct, 8 total) ==
Jul 25 00:09:09 outbound00.cs.umd.edu python3[3469351]: ldapdb [x6]
Jul 25 00:16:58 outbound00.cs.umd.edu krb5_child[3471521]: Client 'admin(a)UMD.EDU' not found in Kerberos database
Jul 25 00:17:19 outbound00.cs.umd.edu sshd-session[3471528]: error: Protocol major versions differ: 2 vs. 1
== outbound01.cs.umd.edu (1 distinct, 6 total) ==
Jul 25 00:13:06 outbound01.cs.umd.edu python3[1498662]: ldapdb [x6]
== sentry-docker00.cs.umd.edu (44 distinct, 44 total) ==
Jul 25 00:06:45 sentry-docker00.cs.umd.edu systemd-udevd[2970804]: link_config: could not get ethtool features for vethd350302
Jul 25 00:06:45 sentry-docker00.cs.umd.edu systemd-udevd[2970804]: Could not set offload features of vethd350302: No such device
Jul 25 00:06:45 sentry-docker00.cs.umd.edu systemd-udevd[2970868]: Could not generate persistent MAC address for veth49bfded: No such file or directory
Jul 25 00:06:45 sentry-docker00.cs.umd.edu systemd-udevd[2970869]: Could not generate persistent MAC address for vethf980a38: No such file or directory
Jul 25 00:06:45 sentry-docker00.cs.umd.edu systemd-udevd[2970872]: Could not generate persistent MAC address for veth9958998: No such file or directory
Jul 25 00:06:45 sentry-docker00.cs.umd.edu systemd-udevd[2970894]: Could not generate persistent MAC address for vethd1fcfe9: No such file or directory
Jul 25 00:06:45 sentry-docker00.cs.umd.edu systemd-udevd[2970882]: Could not generate persistent MAC address for veth8f26ae6: No such file or directory
Jul 25 00:06:45 sentry-docker00.cs.umd.edu systemd-udevd[2970890]: Could not generate persistent MAC address for veth7ffb045: No such file or directory
Jul 25 00:06:45 sentry-docker00.cs.umd.edu systemd-udevd[2970868]: Could not generate persistent MAC address for veth57c35e6: No such file or directory
Jul 25 00:06:45 sentry-docker00.cs.umd.edu systemd-udevd[2970875]: Could not generate persistent MAC address for veth4494545: No such file or directory
Jul 25 00:19:43 sentry-docker00.cs.umd.edu systemd-udevd[2977504]: link_config: could not get ethtool features for vethb66d47c
Jul 25 00:19:43 sentry-docker00.cs.umd.edu systemd-udevd[2977504]: Could not set offload features of vethb66d47c: No such device
Jul 25 00:19:43 sentry-docker00.cs.umd.edu systemd-udevd[2977522]: Could not generate persistent MAC address for veth8c94012: No such file or directory
Jul 25 00:19:43 sentry-docker00.cs.umd.edu systemd-udevd[2977523]: Could not generate persistent MAC address for vethec7f98e: No such file or directory
Jul 25 00:26:53 sentry-docker00.cs.umd.edu systemd-udevd[2980230]: link_config: could not get ethtool features for veth9958998
Jul 25 00:26:53 sentry-docker00.cs.umd.edu systemd-udevd[2980230]: Could not set offload features of veth9958998: No such device
Jul 25 00:26:53 sentry-docker00.cs.umd.edu systemd-udevd[2980301]: Could not generate persistent MAC address for vethc345942: No such file or directory
Jul 25 00:26:53 sentry-docker00.cs.umd.edu systemd-udevd[2980302]: Could not generate persistent MAC address for veth9685b40: No such file or directory
Jul 25 00:26:53 sentry-docker00.cs.umd.edu systemd-udevd[2980305]: Could not generate persistent MAC address for vetheeefed2: No such file or directory
Jul 25 00:26:53 sentry-docker00.cs.umd.edu systemd-udevd[2980313]: Could not generate persistent MAC address for vethaaff081: No such file or directory
Jul 25 00:26:53 sentry-docker00.cs.umd.edu systemd-udevd[2980315]: Could not generate persistent MAC address for veth9a0c2d2: No such file or directory
Jul 25 00:26:53 sentry-docker00.cs.umd.edu systemd-udevd[2980311]: Could not generate persistent MAC address for veth7c98b21: No such file or directory
Jul 25 00:26:53 sentry-docker00.cs.umd.edu systemd-udevd[2980327]: Could not generate persistent MAC address for vethe9a0ed9: No such file or directory
Jul 25 00:26:53 sentry-docker00.cs.umd.edu systemd-udevd[2980326]: Could not generate persistent MAC address for veth9aff236: No such file or directory
Jul 25 00:39:47 sentry-docker00.cs.umd.edu systemd-udevd[2986916]: link_config: could not get ethtool features for veth8c94012
Jul 25 00:39:47 sentry-docker00.cs.umd.edu systemd-udevd[2986916]: Could not set offload features of veth8c94012: No such device
Jul 25 00:39:47 sentry-docker00.cs.umd.edu systemd-udevd[2986932]: Could not generate persistent MAC address for vethd2a5c00: No such file or directory
Jul 25 00:39:47 sentry-docker00.cs.umd.edu systemd-udevd[2986933]: Could not generate persistent MAC address for veth463af71: No such file or directory
Jul 25 00:47:01 sentry-docker00.cs.umd.edu systemd-udevd[2989636]: link_config: could not get ethtool features for veth7c98b21
Jul 25 00:47:01 sentry-docker00.cs.umd.edu systemd-udevd[2989636]: Could not set offload features of veth7c98b21: No such device
... 14 more distinct messages not shown
== strawberry (3 distinct, 9 total) ==
Jul 25 00:09:44 strawberry udisksd[1067]: Error performing housekeeping for drive /org/freedesktop/UDisks2/drives/ST2000DM001_1CH164_W1E8J5KJ: Error updating SMART data: Error sending ATA command CHECK POWER MODE: Unexpected sense data returned:#0120000: 00 00 00 00 00 00 00 00 00 00 00 00 00 00 00 00 ................#0120010: 00 00 00 00 00 00 00 00 00 00 00 00 00 00 00 00 ................#012 (g-io-error-quark, 0) [x6]
Jul 25 00:34:42 strawberry smartd[5314]: Device: /dev/sda [SAT], failed to read SMART Attribute Data [x2]
Jul 25 01:04:42 strawberry smartd[5314]: Device: /dev/sda [SAT], not capable of Offline or Self-Testing.
== submit10-cln25 (3 distinct, 4 total) ==
Jul 25 00:10:12 submit10-cln25 systemd: New main PID 5775 does not belong to service, and PID file is not owned by root. Refusing. [x2]
Jul 25 00:10:31 submit10-cln25 systemd: Daemon never wrote its PID file. Failing.
Jul 25 00:10:37 submit10-cln25 systemd: pmlogger.service: Supervising process 12748 which is not our child. We'll most likely not notice when it exits.
== submit26-b9-2 (1 distinct, 10 total) ==
Jul 25 00:05:23 submit26-b9-2 systemd[1]: user(a)1001.service: Main process exited, code=killed, status=9/KILL [x10]
== submit26-b9-4 (10 distinct, 18 total) ==
Jul 25 00:05:05 submit26-b9-4 systemd[1]: user(a)1001.service: Main process exited, code=killed, status=9/KILL [x9]
Jul 25 00:15:25 submit26-b9-4 setroubleshoot[152154]: SELinux is preventing /usr/bin/python3.9 from create access on the directory /(null). For complete SELinux messages run: sealert -l a4e66030-8621-4da9-bd27-5988bb1bf8ad
Jul 25 00:15:25 submit26-b9-4 setroubleshoot[152154]: SELinux is preventing /usr/bin/python3.9 from add_name access on the directory /(null). For complete SELinux messages run: sealert -l c055e37d-bbf5-4800-9083-d606f792c8c1
Jul 25 00:15:25 submit26-b9-4 setroubleshoot[152154]: SELinux is preventing /usr/bin/python3.9 from create access on the file /(null). For complete SELinux messages run: sealert -l e5bc3a56-6d6f-4776-954f-ddde1579648f
Jul 25 00:15:25 submit26-b9-4 setroubleshoot[152154]: SELinux is preventing /usr/bin/python3.9 from open access on the file /tmp/libdnf.3srYr2/repodata/repomd.xml. For complete SELinux messages run: sealert -l a8ec5e1b-49f9-4fbc-a8ae-22e800f7abf2
Jul 25 00:15:25 submit26-b9-4 setroubleshoot[152154]: SELinux is preventing /usr/bin/python3.9 from setattr access on the file repomd.xml. For complete SELinux messages run: sealert -l 945db714-d0c0-4402-911e-932978b8b036
Jul 25 00:15:25 submit26-b9-4 setroubleshoot[152154]: SELinux is preventing /usr/bin/python3.9 from read access on the directory libdnf.3srYr2. For complete SELinux messages run: sealert -l 463998a0-fb0d-463c-82b1-471135710a14
Jul 25 00:15:25 submit26-b9-4 setroubleshoot[152154]: SELinux is preventing /usr/bin/python3.9 from remove_name access on the directory repomd.xml. For complete SELinux messages run: sealert -l 473d2e21-15d8-407a-a9ee-2b842607fa00
Jul 25 00:15:25 submit26-b9-4 setroubleshoot[152154]: SELinux is preventing /usr/bin/python3.9 from unlink access on the file repomd.xml. For complete SELinux messages run: sealert -l 80c54d4f-bf4b-4501-addb-1627383587d0
Jul 25 00:15:25 submit26-b9-4 setroubleshoot[152154]: SELinux is preventing /usr/bin/python3.9 from rmdir access on the directory repodata. For complete SELinux messages run: sealert -l c63d3890-151e-49a0-83f0-3dfb69d051e5
== tma-0 (3 distinct, 4 total) ==
Jul 25 00:10:13 tma-0 systemd[1]: New main PID 6456 does not belong to service, and PID file is not owned by root. Refusing. [x2]
Jul 25 00:10:30 tma-0 systemd[1]: Daemon never wrote its PID file. Failing.
Jul 25 00:10:38 tma-0 systemd[1]: pmlogger.service: Supervising process 14087 which is not our child. We'll most likely not notice when it exits.
== uffish.cs.umd.edu (3 distinct, 4 total) ==
Jul 25 00:10:13 uffish.cs.umd.edu systemd[1]: New main PID 2322637 does not belong to service, and PID file is not owned by root. Refusing. [x2]
Jul 25 00:10:35 uffish.cs.umd.edu systemd[1]: Daemon never wrote its PID file. Failing.
Jul 25 00:10:52 uffish.cs.umd.edu systemd[1]: pmlogger.service: Supervising process 2330217 which is not our child. We'll most likely not notice when it exits.
== updates00.cs.umd.edu (3 distinct, 4 total) ==
Jul 25 00:10:12 updates00.cs.umd.edu systemd[1]: New main PID 26311 does not belong to service, and PID file is not owned by root. Refusing. [x2]
Jul 25 00:10:30 updates00.cs.umd.edu systemd[1]: Daemon never wrote its PID file. Failing.
Jul 25 00:10:36 updates00.cs.umd.edu systemd[1]: pmlogger.service: Supervising process 809 which is not our child. We'll most likely not notice when it exits.
== vacuum.cs.umd.edu (3 distinct, 4 total) ==
Jul 25 00:10:14 vacuum.cs.umd.edu systemd[1]: New main PID 27148 does not belong to service, and PID file is not owned by root. Refusing. [x2]
Jul 25 00:10:33 vacuum.cs.umd.edu systemd[1]: Daemon never wrote its PID file. Failing.
Jul 25 00:10:44 vacuum.cs.umd.edu systemd[1]: pmlogger.service: Supervising process 2469 which is not our child. We'll most likely not notice when it exits.
== whiffle.cs.umd.edu (3 distinct, 4 total) ==
Jul 25 00:10:13 whiffle.cs.umd.edu systemd[1]: New main PID 2182370 does not belong to service, and PID file is not owned by root. Refusing. [x2]
Jul 25 00:10:32 whiffle.cs.umd.edu systemd[1]: Daemon never wrote its PID file. Failing.
Jul 25 00:10:45 whiffle.cs.umd.edu systemd[1]: pmlogger.service: Supervising process 2189907 which is not our child. We'll most likely not notice when it exits.
1
0
Command: /usr/local/sbin/syslog-digest.py
Time : 0.5307s
Status : exited 0
Output :
Syslog digest — 2026-07-25 00:05 EDT
Processed 4,905 lines, filtered 4,000 (81%). 905 unknown (88 distinct) from 26 host(s).
== abuse (1 distinct, 346 total) ==
Jul 24 23:05:06 abuse rsyslogd[21745]: imjournal: open() failed for path: '/var/lib/rsyslog/imjournal.state.tmp': Input/output error [v8.2404.0 try https://www.rsyslog.com/e/2433 ] [x346]
== alec.cs.umd.edu (3 distinct, 60 total) ==
Jul 24 23:05:17 alec.cs.umd.edu setroubleshoot[2729356]: failed to retrieve rpm info for path '/run/netns/netns-9dfd0347-71eb-5698-085c-c769043aa5c3': [x12]
Jul 24 23:05:18 alec.cs.umd.edu sedispatch[1526]: AVC Message regarding setroubleshoot, ignoring message [x24]
Jul 24 23:05:18 alec.cs.umd.edu setroubleshoot[2729356]: SELinux is preventing /usr/bin/df from getattr access on the file /run/netns/netns-9dfd0347-71eb-5698-085c-c769043aa5c3. For complete SELinux messages run: sealert -l 23f93208-3063-4aac-b78a-bb0fcb40740c [x24]
== b0b02.cs.umd.edu (1 distinct, 1 total) ==
Jul 24 23:54:18 b0b02.cs.umd.edu rustdesk[219372]: cannot open display:
== bac102 (1 distinct, 1 total) ==
Jul 24 23:29:36 bac102 systemd-resolved[895]: Using degraded feature set UDP instead of UDP+EDNS0 for DNS server 10.73.244.10.
== bachata (1 distinct, 1 total) ==
Jul 24 23:19:36 bachata setroubleshoot[1863217]: SELinux is preventing /usr/sbin/smbd from name_bind access on the udp_socket port 712. For complete SELinux messages run: sealert -l 8f7247f1-69a5-4a62-a4f0-88a324bfd75c
== contest (1 distinct, 33 total) ==
Jul 24 23:06:34 contest goferd[1007]: [ERROR][worker-0] gofer.messaging.adapter.connect:33 - connect: proton+amqps://satellite8.cs.umd.edu:5647, failed: Connection amqps://satellite8.cs.umd.edu:5647 disconnected: Condition('proton.pythonio', 'Connection refused to all addresses') [x33]
== csfw00a (1 distinct, 248 total) ==
Jul 24 23:05:44 csfw00a kernel: bnxt_en 0000:09:00.0 eth3: NIC Link is Down [x248]
== hackerman (7 distinct, 12 total) ==
Jul 24 23:19:01 hackerman gnome-software[2060381]: failed to commit changes to dconf: GDBus.Error:org.gtk.GDBus.UnmappedGError.Quark._g_2dfile_2derror_2dquark.Code2: Failed to create file “/adminhomes/sajith/.config/dconf/user.ZQ68S3”: Permission denied
Jul 24 23:20:04 hackerman gnome-software[2060381]: can't reliably fixup error code 4 in domain g-io-error-quark: Not a directory [x4]
Jul 24 23:20:13 hackerman gnome-software[2060381]: Only 0 apps for recent list, hiding
Jul 24 23:20:28 hackerman gnome-software[2060381]: failed to commit changes to dconf: GDBus.Error:org.gtk.GDBus.UnmappedGError.Quark._g_2dfile_2derror_2dquark.Code2: Failed to create file “/adminhomes/sajith/.config/dconf/user.68YWS3”: Permission denied
Jul 24 23:20:29 hackerman packagekitd[300583]: Failed to get cache filename for libreoffice [x2]
Jul 24 23:20:29 hackerman packagekitd[300583]: Failed to get cache filename for kernel [x2]
Jul 24 23:20:39 hackerman packagekitd[300583]: failed to parse public key for /etc/pki/rpm-gpg/RPM-GPG-KEY-PQC-redhat-release
== idm00 (1 distinct, 1 total) ==
Jul 24 23:51:05 idm00 named[1455]: client @0x7f3304b3abb8 10.73.240.42#61572: update '73.10.in-addr.arpa/IN' denied
== idmp0 (1 distinct, 1 total) ==
Jul 24 23:34:55 idmp0 named[5198]: client @0x7f9908000cc8 10.73.240.43#54070: update '73.10.in-addr.arpa/IN' denied
== itmon02 (1 distinct, 40 total) ==
Jul 24 23:08:05 itmon02 sshd[1834]: error: beginning MaxStartups throttling [x40]
== krispykreme.cs.umd.edu (6 distinct, 8 total) ==
Jul 24 23:19:24 krispykreme.cs.umd.edu sshd-session[3201984]: pam_access(sshd:auth): access denied for user `admin' from `34.79.59.96'
Jul 24 23:19:25 krispykreme.cs.umd.edu krb5_child[3201986]: Client 'admin(a)UMD.EDU' not found in Kerberos database [x2]
Jul 24 23:19:25 krispykreme.cs.umd.edu sshd-session[3201982]: error: PAM: System error for admin from 34.79.59.96
Jul 24 23:20:19 krispykreme.cs.umd.edu sshd-session[3202635]: error: Protocol major versions differ: 2 vs. 1 [x2]
Jul 24 23:26:46 krispykreme.cs.umd.edu sshd-session[3204442]: pam_access(sshd:auth): access denied for user `admin' from `35.205.69.77'
Jul 24 23:26:47 krispykreme.cs.umd.edu sshd-session[3204440]: error: PAM: System error for admin from 35.205.69.77
== matrix (1 distinct, 1 total) ==
Jul 25 00:00:13 matrix (nin-node)[1525761]: munin-node.service: Referenced but unset environment variable evaluates to an empty string: DAEMON_ARGS
== mcstic (3 distinct, 8 total) ==
Jul 24 23:08:17 mcstic krb5_child[1608036]: Client 'testuser2(a)UMD.EDU' not found in Kerberos database [x2]
Jul 24 23:13:21 mcstic krb5_child[1608132]: Preauthentication failed [x4]
Jul 24 23:56:07 mcstic krb5_child[1609692]: Client 'admin(a)UMD.EDU' not found in Kerberos database [x2]
== neo-gizmonic (1 distinct, 1 total) ==
Jul 25 00:00:14 neo-gizmonic (nin-node)[3560827]: munin-node.service: Referenced but unset environment variable evaluates to an empty string: DAEMON_ARGS
== neoavion (2 distinct, 2 total) ==
Jul 25 00:00:01 neoavion systemctl[1487486]: Warning: The unit file, source configuration file or drop-ins of munin-node.service changed on disk. Run 'systemctl daemon-reload' to reload units.
Jul 25 00:00:01 neoavion (nin-node)[1487494]: munin-node.service: Referenced but unset environment variable evaluates to an empty string: DAEMON_ARGS
== neodontcare.cs.umd.edu (6 distinct, 32 total) ==
Jul 24 23:44:50 neodontcare.cs.umd.edu tracker-extract[3120529]: tracker_module_manager_load_modules: assertion 'initialized == TRUE' failed [x23]
Jul 24 23:49:12 neodontcare.cs.umd.edu tracker-extract[3121844]: Task for 'file:///fs/junkfood/gasarch/LBonRamtalk.pdf' finished with error: Couldn't open PopplerDocument:PDF document is damaged
Jul 24 23:50:05 neodontcare.cs.umd.edu tracker-miner-f[2945379]: g_hash_table_contains: assertion 'hash_table != NULL' failed [x2]
Jul 24 23:50:05 neodontcare.cs.umd.edu tracker-extract[3122053]: Could not get mimetype, Error when getting information for file “/fs/junkfood/gasarch/4913”: No such file or directory [x2]
Jul 24 23:50:05 neodontcare.cs.umd.edu tracker-extract[3122053]: Task for 'file:///fs/junkfood/gasarch/4913' finished with error: Error when getting information for file “/fs/junkfood/gasarch/4913”: No such file or directory [x2]
Jul 25 00:04:13 neodontcare.cs.umd.edu tracker-extract[3126324]: Task for 'file:///fs/junkfood/gasarch/sos.pdf' finished with error: Couldn't open PopplerDocument:PDF document is damaged [x2]
== newhonors2 (2 distinct, 25 total) ==
Jul 24 23:13:03 newhonors2 dhcpcd[239595]: dhcpcd is not running [x24]
Jul 25 00:00:01 newhonors2 (nin-node)[241112]: munin-node.service: Referenced but unset environment variable evaluates to an empty string: DAEMON_ARGS
== outbound00.cs.umd.edu (1 distinct, 6 total) ==
Jul 24 23:09:09 outbound00.cs.umd.edu python3[3455341]: ldapdb [x6]
== outbound01.cs.umd.edu (1 distinct, 6 total) ==
Jul 24 23:13:06 outbound01.cs.umd.edu python3[1484030]: ldapdb [x6]
== sentry-docker00.cs.umd.edu (40 distinct, 40 total) ==
Jul 24 23:06:20 sentry-docker00.cs.umd.edu systemd-udevd[2942469]: link_config: could not get ethtool features for vethe09a73f
Jul 24 23:06:20 sentry-docker00.cs.umd.edu systemd-udevd[2942469]: Could not set offload features of vethe09a73f: No such device
Jul 24 23:06:20 sentry-docker00.cs.umd.edu systemd-udevd[2942540]: link_config: could not get ethtool features for vethb0bbb78
Jul 24 23:06:20 sentry-docker00.cs.umd.edu systemd-udevd[2942540]: Could not set offload features of vethb0bbb78: No such device
Jul 24 23:06:20 sentry-docker00.cs.umd.edu systemd-udevd[2942558]: Could not generate persistent MAC address for veth8b0071a: No such file or directory
Jul 24 23:06:20 sentry-docker00.cs.umd.edu systemd-udevd[2942559]: Could not generate persistent MAC address for veth25f0edb: No such file or directory
Jul 24 23:06:20 sentry-docker00.cs.umd.edu systemd-udevd[2942562]: Could not generate persistent MAC address for vethe98ed28: No such file or directory
Jul 24 23:06:20 sentry-docker00.cs.umd.edu systemd-udevd[2942563]: Could not generate persistent MAC address for veth51251e2: No such file or directory
Jul 24 23:06:20 sentry-docker00.cs.umd.edu systemd-udevd[2942586]: Could not generate persistent MAC address for veth5314815: No such file or directory
Jul 24 23:06:20 sentry-docker00.cs.umd.edu systemd-udevd[2942587]: Could not generate persistent MAC address for vethf13e139: No such file or directory
Jul 24 23:06:20 sentry-docker00.cs.umd.edu systemd-udevd[2942605]: Could not generate persistent MAC address for veth60aaafe: No such file or directory
Jul 24 23:06:20 sentry-docker00.cs.umd.edu systemd-udevd[2942603]: Could not generate persistent MAC address for veth7374a30: No such file or directory
Jul 24 23:19:26 sentry-docker00.cs.umd.edu systemd-udevd[2949235]: Could not generate persistent MAC address for vethcef0280: No such file or directory
Jul 24 23:19:26 sentry-docker00.cs.umd.edu systemd-udevd[2949236]: Could not generate persistent MAC address for veth0393b77: No such file or directory
Jul 24 23:26:28 sentry-docker00.cs.umd.edu systemd-udevd[2951939]: link_config: could not get ethtool features for vethe98ed28
Jul 24 23:26:28 sentry-docker00.cs.umd.edu systemd-udevd[2951939]: Could not set offload features of vethe98ed28: No such device
Jul 24 23:26:28 sentry-docker00.cs.umd.edu systemd-udevd[2951970]: Could not generate persistent MAC address for veth6a6b1a2: No such file or directory
Jul 24 23:26:28 sentry-docker00.cs.umd.edu systemd-udevd[2951971]: Could not generate persistent MAC address for veth0547b64: No such file or directory
Jul 24 23:26:28 sentry-docker00.cs.umd.edu systemd-udevd[2951974]: Could not generate persistent MAC address for vethe7287ae: No such file or directory
Jul 24 23:26:28 sentry-docker00.cs.umd.edu systemd-udevd[2951975]: Could not generate persistent MAC address for veth2128a42: No such file or directory
Jul 24 23:26:28 sentry-docker00.cs.umd.edu systemd-udevd[2951998]: Could not generate persistent MAC address for vethd0b4ae1: No such file or directory
Jul 24 23:26:28 sentry-docker00.cs.umd.edu systemd-udevd[2951999]: Could not generate persistent MAC address for veth17d462f: No such file or directory
Jul 24 23:26:28 sentry-docker00.cs.umd.edu systemd-udevd[2952017]: Could not generate persistent MAC address for veth9696ade: No such file or directory
Jul 24 23:26:28 sentry-docker00.cs.umd.edu systemd-udevd[2952024]: Could not generate persistent MAC address for veth555857d: No such file or directory
Jul 24 23:39:30 sentry-docker00.cs.umd.edu systemd-udevd[2958615]: link_config: could not get ethtool features for vethcef0280
Jul 24 23:39:30 sentry-docker00.cs.umd.edu systemd-udevd[2958615]: Could not set offload features of vethcef0280: No such device
Jul 24 23:39:31 sentry-docker00.cs.umd.edu systemd-udevd[2958633]: Could not generate persistent MAC address for veth833cd0d: No such file or directory
Jul 24 23:39:31 sentry-docker00.cs.umd.edu systemd-udevd[2958634]: Could not generate persistent MAC address for veth2510d34: No such file or directory
Jul 24 23:46:37 sentry-docker00.cs.umd.edu systemd-udevd[2961413]: Could not generate persistent MAC address for veth277aafb: No such file or directory
Jul 24 23:46:37 sentry-docker00.cs.umd.edu systemd-udevd[2961414]: Could not generate persistent MAC address for vethbf81c75: No such file or directory
... 10 more distinct messages not shown
== strawberry (2 distinct, 8 total) ==
Jul 24 23:09:44 strawberry udisksd[1067]: Error performing housekeeping for drive /org/freedesktop/UDisks2/drives/ST2000DM001_1CH164_W1E8J5KJ: Error updating SMART data: Error sending ATA command CHECK POWER MODE: Unexpected sense data returned:#0120000: 00 00 00 00 00 00 00 00 00 00 00 00 00 00 00 00 ................#0120010: 00 00 00 00 00 00 00 00 00 00 00 00 00 00 00 00 ................#012 (g-io-error-quark, 0) [x6]
Jul 24 23:34:42 strawberry smartd[5314]: Device: /dev/sda [SAT], failed to read SMART Attribute Data [x2]
== submit26-b9-2 (1 distinct, 11 total) ==
Jul 24 23:05:10 submit26-b9-2 systemd[1]: user(a)1001.service: Main process exited, code=killed, status=9/KILL [x11]
== submit26-b9-4 (1 distinct, 11 total) ==
Jul 24 23:05:03 submit26-b9-4 systemd[1]: user(a)1001.service: Main process exited, code=killed, status=9/KILL [x11]
== wraith (1 distinct, 1 total) ==
Jul 25 00:00:04 wraith (nin-node)[492509]: munin-node.service: Referenced but unset environment variable evaluates to an empty string: DAEMON_ARGS
== zwicker-computer (1 distinct, 1 total) ==
Jul 25 00:00:01 zwicker-computer kernel: kauditd_printk_skb: 38 callbacks suppressed
1
0
Command: /usr/local/sbin/syslog-digest.py
Time : 0.5292s
Status : exited 0
Output :
Syslog digest — 2026-07-24 23:05 EDT
Processed 4,408 lines, filtered 3,544 (80%). 864 unknown (78 distinct) from 25 host(s).
== abuse (1 distinct, 346 total) ==
Jul 24 22:05:06 abuse rsyslogd[21745]: imjournal: open() failed for path: '/var/lib/rsyslog/imjournal.state.tmp': Input/output error [v8.2404.0 try https://www.rsyslog.com/e/2433 ] [x346]
== alec.cs.umd.edu (3 distinct, 61 total) ==
Jul 24 22:05:33 alec.cs.umd.edu setroubleshoot[2714421]: failed to retrieve rpm info for path '/run/netns/netns-9dfd0347-71eb-5698-085c-c769043aa5c3': [x12]
Jul 24 22:05:34 alec.cs.umd.edu sedispatch[1526]: AVC Message regarding setroubleshoot, ignoring message [x24]
Jul 24 22:05:34 alec.cs.umd.edu setroubleshoot[2714421]: SELinux is preventing /usr/bin/df from getattr access on the file /run/netns/netns-9dfd0347-71eb-5698-085c-c769043aa5c3. For complete SELinux messages run: sealert -l 23f93208-3063-4aac-b78a-bb0fcb40740c [x25]
== b0b02.cs.umd.edu (1 distinct, 1 total) ==
Jul 24 22:54:16 b0b02.cs.umd.edu rustdesk[204354]: cannot open display:
== bale (1 distinct, 1 total) ==
Jul 24 22:05:40 bale setroubleshoot[1109640]: SELinux is preventing /usr/bin/tar from using the fowner capability. For complete SELinux messages run: sealert -l 8f58859c-1c63-4aee-afff-7c8e1dd95f45
== contest (1 distinct, 34 total) ==
Jul 24 22:05:52 contest goferd[1007]: [ERROR][worker-0] gofer.messaging.adapter.connect:33 - connect: proton+amqps://satellite8.cs.umd.edu:5647, failed: Connection amqps://satellite8.cs.umd.edu:5647 disconnected: Condition('proton.pythonio', 'Connection refused to all addresses') [x34]
== csfw00a (1 distinct, 256 total) ==
Jul 24 22:04:59 csfw00a kernel: bnxt_en 0000:09:00.0 eth3: NIC Link is Down [x256]
== hackerman (6 distinct, 11 total) ==
Jul 24 22:20:04 hackerman gnome-software[2060381]: can't reliably fixup error code 4 in domain g-io-error-quark: Not a directory [x4]
Jul 24 22:20:14 hackerman gnome-software[2060381]: Only 0 apps for recent list, hiding
Jul 24 22:20:29 hackerman gnome-software[2060381]: failed to commit changes to dconf: GDBus.Error:org.gtk.GDBus.UnmappedGError.Quark._g_2dfile_2derror_2dquark.Code2: Failed to create file “/adminhomes/sajith/.config/dconf/user.K0B6S3”: Permission denied
Jul 24 22:20:30 hackerman packagekitd[286913]: Failed to get cache filename for libreoffice [x2]
Jul 24 22:20:30 hackerman packagekitd[286913]: Failed to get cache filename for kernel [x2]
Jul 24 22:20:39 hackerman packagekitd[286913]: failed to parse public key for /etc/pki/rpm-gpg/RPM-GPG-KEY-PQC-redhat-release
== idm00 (1 distinct, 1 total) ==
Jul 24 22:51:05 idm00 named[1455]: client @0x7f330ca42968 10.73.240.42#52044: update '73.10.in-addr.arpa/IN' denied
== idmp0 (1 distinct, 1 total) ==
Jul 24 22:34:55 idmp0 named[5198]: client @0x7f992003c448 10.73.240.43#55162: update '73.10.in-addr.arpa/IN' denied
== itmon02 (1 distinct, 40 total) ==
Jul 24 22:07:59 itmon02 sshd[1834]: error: beginning MaxStartups throttling [x40]
== jaws.cs.umd.edu (4 distinct, 5 total) ==
Jul 24 22:33:41 jaws.cs.umd.edu systemd-coredump[1404817]: Process 1404807 (podman) of user 981 dumped core.#012#012Stack trace of thread 1404807:#012#0 0x000056018452146e internal/runtime/syscall/linux.Syscall6 (podman + 0x48b46e)#012#1 0x00005601846010a6 syscall.Syscall (podman + 0x56b0a6)#012#2 0x0000560184601c50 syscall.Syscall.abi0 (podman + 0x56bc50)#012#3 0x000056018476bc2e github.com/containers/podman/vendor/golang.org/x/sys/unix.OpenTree (podman + 0x6d5c2e)#012#4 0x0000560184dc4f4b github.com/containers/podman/vendor/github.com/cyphar/filepath-securejoin/p… (podman + 0xd2ef4b)#012#5 0x0000560184dc4e54 github.com/containers/podman/vendor/github.com/cyphar/filepath-securejoin/p… (podman + 0xd2ee54)#012#6 0x00005601845b4dcc sync.(*Once).doSlow (podman + 0x51edcc)#012#7 0x00005601845b4cf9 sync.(*Once).Do (podman + 0x51ecf9)#012#8 0x0000560184dc4d
c5 github.com/containers/podman/vendor/github.com/cyphar/filepath-securejoin/p… (podman + 0xd2edc5)#012#9 0x0000560184dc63e2 github.com/containers/podman/vendor/github.com/cyphar/filepath-securejoin/p… (podman + 0xd303e2)#012#10 0x0000560184dc67f3 github.com/containers/podman/vendor/github.com/cyphar/filepath-securejoin/p… (podman + 0xd307f3)#012#11 0x0000560184dc591c github.com/containers/podman/vendor/github.com/cyphar/filepath-securejoin/p… (podman + 0xd2f91c)#012#12 0x0000560184dc5358 github.com/containers/podman/vendor/github.com/cyphar/filepath-securejoin/p… (podman + 0xd2f358)#012#13 0x00005601845b4dcc sync.(*Once).doSlow (podman + 0x51edcc)#012#14 0x00005601845b4cf9 sync.(*Once).D
o (podman + 0x51ecf9)#012#15 0x0000560184dc52c5 github.com/containers/podman/vendor/github.com/cyphar/filepath-securejoin/p… (podman + 0xd2f2c5)#012#16 0x0000560184dc679a github.com/containers/podman/vendor/github.com/cyphar/filepath-securejoin/p… (podman + 0xd3079a)#012#17 0x0000560184dcd34e github.com/containers/podman/vendor/github.com/opencontainers/selinux/go-se… (podman + 0xd3734e)#012#18 0x0000560184dcd838 github.com/containers/podman/vendor/github.com/opencontainers/selinux/go-se… (podman + 0xd37838)#012#19 0x0000560184dcc5df github.com/containers/podman/vendor/github.com/opencontainers/selinux/go-se… (podman + 0xd365df)#012#20 0x0000560184dcc873 github.com/containers/podman/vendor/github.com/opencontainers/selinux/go-se… (podman + 0xd36873)#012#21 0x000
0560184fc4f4b github.com/containers/podman/vendor/go.podman.io/common/pkg/config.defaultC… (podman + 0xf2ef4b)#012#22 0x0000560184fc8912 github.com/containers/podman/vendor/go.podman.io/common/pkg/config.newLocked (podman + 0xf32912)#012#23 0x0000560184fc8605 github.com/containers/podman/vendor/go.podman.io/common/pkg/config.New (podman + 0xf32605)#012#24 0x000056018573bfd3 github.com/containers/podman/cmd/podman/registry.newPodmanConfig (podman + 0x16a5fd3)#012#25 0x00005601845b4dcc sync.(*Once).doSlow (podman + 0x51edcc)#012#26 0x000056018575cc50 github.com/containers/podman/cmd/podman/common.init (podman + 0x16c6c50)#012#27 0x000056018457aa57 runtime.doInit1 (podman + 0x4e4a57)#012#28 0x000056018456af90 runtime.main (podman + 0x4d4f90)#012#29 0x00005601845aaee1 runtime.goexit.abi0 (podman + 0x514ee1)#012ELF object binary architecture: AMD x86-64
Jul 24 22:33:42 jaws.cs.umd.edu systemd-coredump[1404835]: Process 1404827 (podman) of user 981 dumped core.#012#012Stack trace of thread 1404827:#012#0 0x00005648910cb46e internal/runtime/syscall/linux.Syscall6 (podman + 0x48b46e)#012#1 0x00005648911ab0a6 syscall.Syscall (podman + 0x56b0a6)#012#2 0x00005648911abc50 syscall.Syscall.abi0 (podman + 0x56bc50)#012#3 0x0000564891315c2e github.com/containers/podman/vendor/golang.org/x/sys/unix.OpenTree (podman + 0x6d5c2e)#012#4 0x000056489196ef4b github.com/containers/podman/vendor/github.com/cyphar/filepath-securejoin/p… (podman + 0xd2ef4b)#012#5 0x000056489196ee54 github.com/containers/podman/vendor/github.com/cyphar/filepath-securejoin/p… (podman + 0xd2ee54)#012#6 0x000056489115edcc sync.(*Once).doSlow (podman + 0x51edcc)#012#7 0x000056489115ecf9 sync.(*Once).Do (podman + 0x51ecf9)#012#8 0x000056489196ed
c5 github.com/containers/podman/vendor/github.com/cyphar/filepath-securejoin/p… (podman + 0xd2edc5)#012#9 0x00005648919703e2 github.com/containers/podman/vendor/github.com/cyphar/filepath-securejoin/p… (podman + 0xd303e2)#012#10 0x00005648919707f3 github.com/containers/podman/vendor/github.com/cyphar/filepath-securejoin/p… (podman + 0xd307f3)#012#11 0x000056489196f91c github.com/containers/podman/vendor/github.com/cyphar/filepath-securejoin/p… (podman + 0xd2f91c)#012#12 0x000056489196f358 github.com/containers/podman/vendor/github.com/cyphar/filepath-securejoin/p… (podman + 0xd2f358)#012#13 0x000056489115edcc sync.(*Once).doSlow (podman + 0x51edcc)#012#14 0x000056489115ecf9 sync.(*Once).D
o (podman + 0x51ecf9)#012#15 0x000056489196f2c5 github.com/containers/podman/vendor/github.com/cyphar/filepath-securejoin/p… (podman + 0xd2f2c5)#012#16 0x000056489197079a github.com/containers/podman/vendor/github.com/cyphar/filepath-securejoin/p… (podman + 0xd3079a)#012#17 0x000056489197734e github.com/containers/podman/vendor/github.com/opencontainers/selinux/go-se… (podman + 0xd3734e)#012#18 0x0000564891977838 github.com/containers/podman/vendor/github.com/opencontainers/selinux/go-se… (podman + 0xd37838)#012#19 0x00005648919765df github.com/containers/podman/vendor/github.com/opencontainers/selinux/go-se… (podman + 0xd365df)#012#20 0x0000564891976873 github.com/containers/podman/vendor/github.com/opencontainers/selinux/go-se… (podman + 0xd36873)#012#21 0x000
0564891b6ef4b github.com/containers/podman/vendor/go.podman.io/common/pkg/config.defaultC… (podman + 0xf2ef4b)#012#22 0x0000564891b72912 github.com/containers/podman/vendor/go.podman.io/common/pkg/config.newLocked (podman + 0xf32912)#012#23 0x0000564891b72605 github.com/containers/podman/vendor/go.podman.io/common/pkg/config.New (podman + 0xf32605)#012#24 0x00005648922e5fd3 github.com/containers/podman/cmd/podman/registry.newPodmanConfig (podman + 0x16a5fd3)#012#25 0x000056489115edcc sync.(*Once).doSlow (podman + 0x51edcc)#012#26 0x0000564892306c50 github.com/containers/podman/cmd/podman/common.init (podman + 0x16c6c50)#012#27 0x0000564891124a57 runtime.doInit1 (podman + 0x4e4a57)#012#28 0x0000564891114f90 runtime.main (podman + 0x4d4f90)#012#29 0x0000564891154ee1 runtime.goexit.abi0 (podman + 0x514ee1)#012ELF object binary architecture: AMD x86-64
Jul 24 22:33:42 jaws.cs.umd.edu setroubleshoot[1404810]: SELinux is preventing /usr/bin/podman from using the nnp_transition access on a process. For complete SELinux messages run: sealert -l 3c7643bc-dd69-4695-b48c-7d780b62b6cf [x2]
Jul 24 22:33:43 jaws.cs.umd.edu systemd-coredump[1404867]: Process 1404851 (podman) of user 981 dumped core.#012#012Stack trace of thread 1404851:#012#0 0x000055bb077cf46e internal/runtime/syscall/linux.Syscall6 (podman + 0x48b46e)#012#1 0x000055bb078af0a6 syscall.Syscall (podman + 0x56b0a6)#012#2 0x000055bb078afc50 syscall.Syscall.abi0 (podman + 0x56bc50)#012#3 0x000055bb07a19c2e github.com/containers/podman/vendor/golang.org/x/sys/unix.OpenTree (podman + 0x6d5c2e)#012#4 0x000055bb08072f4b github.com/containers/podman/vendor/github.com/cyphar/filepath-securejoin/p… (podman + 0xd2ef4b)#012#5 0x000055bb08072e54 github.com/containers/podman/vendor/github.com/cyphar/filepath-securejoin/p… (podman + 0xd2ee54)#012#6 0x000055bb07862dcc sync.(*Once).doSlow (podman + 0x51edcc)#012#7 0x000055bb07862cf9 sync.(*Once).Do (podman + 0x51ecf9)#012#8 0x000055bb08072d
c5 github.com/containers/podman/vendor/github.com/cyphar/filepath-securejoin/p… (podman + 0xd2edc5)#012#9 0x000055bb080743e2 github.com/containers/podman/vendor/github.com/cyphar/filepath-securejoin/p… (podman + 0xd303e2)#012#10 0x000055bb080747f3 github.com/containers/podman/vendor/github.com/cyphar/filepath-securejoin/p… (podman + 0xd307f3)#012#11 0x000055bb0807391c github.com/containers/podman/vendor/github.com/cyphar/filepath-securejoin/p… (podman + 0xd2f91c)#012#12 0x000055bb08073358 github.com/containers/podman/vendor/github.com/cyphar/filepath-securejoin/p… (podman + 0xd2f358)#012#13 0x000055bb07862dcc sync.(*Once).doSlow (podman + 0x51edcc)#012#14 0x000055bb07862cf9 sync.(*Once).D
o (podman + 0x51ecf9)#012#15 0x000055bb080732c5 github.com/containers/podman/vendor/github.com/cyphar/filepath-securejoin/p… (podman + 0xd2f2c5)#012#16 0x000055bb0807479a github.com/containers/podman/vendor/github.com/cyphar/filepath-securejoin/p… (podman + 0xd3079a)#012#17 0x000055bb0807b34e github.com/containers/podman/vendor/github.com/opencontainers/selinux/go-se… (podman + 0xd3734e)#012#18 0x000055bb0807b838 github.com/containers/podman/vendor/github.com/opencontainers/selinux/go-se… (podman + 0xd37838)#012#19 0x000055bb0807a5df github.com/containers/podman/vendor/github.com/opencontainers/selinux/go-se… (podman + 0xd365df)#012#20 0x000055bb0807a873 github.com/containers/podman/vendor/github.com/opencontainers/selinux/go-se… (podman + 0xd36873)#012#21 0x000
055bb08272f4b github.com/containers/podman/vendor/go.podman.io/common/pkg/config.defaultC… (podman + 0xf2ef4b)#012#22 0x000055bb08276912 github.com/containers/podman/vendor/go.podman.io/common/pkg/config.newLocked (podman + 0xf32912)#012#23 0x000055bb08276605 github.com/containers/podman/vendor/go.podman.io/common/pkg/config.New (podman + 0xf32605)#012#24 0x000055bb089e9fd3 github.com/containers/podman/cmd/podman/registry.newPodmanConfig (podman + 0x16a5fd3)#012#25 0x000055bb07862dcc sync.(*Once).doSlow (podman + 0x51edcc)#012#26 0x000055bb08a0ac50 github.com/containers/podman/cmd/podman/common.init (podman + 0x16c6c50)#012#27 0x000055bb07828a57 runtime.doInit1 (podman + 0x4e4a57)#012#28 0x000055bb07818f90 runtime.main (podman + 0x4d4f90)#012#29 0x000055bb07858ee1 runtime.goexit.abi0 (podman + 0x514ee1)#012ELF object binary architecture: AMD x86-64
== mcstic (1 distinct, 2 total) ==
Jul 24 22:52:22 mcstic krb5_child[1607459]: Preauthentication failed [x2]
== newhonors.cs.umd.edu (3 distinct, 3 total) ==
Jul 24 22:37:09 newhonors.cs.umd.edu sshd[18287]: fatal: Unable to negotiate with 34.62.143.106 port 36118: no matching host key type found. Their offer: ssh-dss [preauth]
Jul 24 22:37:10 newhonors.cs.umd.edu sshd[18293]: fatal: Unable to negotiate with 34.62.143.106 port 36158: no matching host key type found. Their offer: ecdsa-sha2-nistp384 [preauth]
Jul 24 22:37:11 newhonors.cs.umd.edu sshd[18295]: fatal: Unable to negotiate with 34.62.143.106 port 36164: no matching host key type found. Their offer: ecdsa-sha2-nistp521 [preauth]
== newhonors2 (1 distinct, 24 total) ==
Jul 24 22:13:03 newhonors2 dhcpcd[237749]: dhcpcd is not running [x24]
== outbound00.cs.umd.edu (1 distinct, 6 total) ==
Jul 24 22:09:09 outbound00.cs.umd.edu python3[3441379]: ldapdb [x6]
== outbound01.cs.umd.edu (2 distinct, 7 total) ==
Jul 24 22:13:06 outbound01.cs.umd.edu python3[1470204]: ldapdb [x6]
Jul 24 22:44:22 outbound01.cs.umd.edu krb5_child[1477315]: Client 'admin(a)UMD.EDU' not found in Kerberos database
== peach.cs.umd.edu (2 distinct, 2 total) ==
Jul 24 22:52:09 peach.cs.umd.edu setroubleshoot[595548]: SELinux is preventing /usr/bin/qemu-ga from search access on the directory /var/lib/containers/storage/overlay. For complete SELinux messages run: sealert -l ba415951-a2c6-424e-b17d-305c5300b9f3
Jul 24 22:52:09 peach.cs.umd.edu setroubleshoot[595548]: SELinux is preventing /usr/bin/qemu-ga from search access on the directory /var/lib/containers/storage/overlay. For complete SELinux messages run: sealert -l 6aeb0956-fcf2-462a-ae4d-439b912c16d0
== sentry-docker00.cs.umd.edu (36 distinct, 36 total) ==
Jul 24 22:05:55 sentry-docker00.cs.umd.edu systemd-udevd[2914107]: Could not generate persistent MAC address for veth0a721b3: No such file or directory
Jul 24 22:05:55 sentry-docker00.cs.umd.edu systemd-udevd[2914108]: Could not generate persistent MAC address for vethb3db026: No such file or directory
Jul 24 22:05:55 sentry-docker00.cs.umd.edu systemd-udevd[2914137]: Could not generate persistent MAC address for veth33227ff: No such file or directory
Jul 24 22:05:55 sentry-docker00.cs.umd.edu systemd-udevd[2914138]: Could not generate persistent MAC address for veth9d0c525: No such file or directory
Jul 24 22:05:55 sentry-docker00.cs.umd.edu systemd-udevd[2914163]: Could not generate persistent MAC address for veth97b2c54: No such file or directory
Jul 24 22:05:55 sentry-docker00.cs.umd.edu systemd-udevd[2914164]: Could not generate persistent MAC address for vethb2c2327: No such file or directory
Jul 24 22:05:55 sentry-docker00.cs.umd.edu systemd-udevd[2914225]: Could not generate persistent MAC address for veth456e415: No such file or directory
Jul 24 22:05:55 sentry-docker00.cs.umd.edu systemd-udevd[2914220]: Could not generate persistent MAC address for veth3fa60f2: No such file or directory
Jul 24 22:19:10 sentry-docker00.cs.umd.edu systemd-udevd[2920908]: Could not generate persistent MAC address for veth6856cd7: No such file or directory
Jul 24 22:19:10 sentry-docker00.cs.umd.edu systemd-udevd[2920909]: Could not generate persistent MAC address for veth8282e1c: No such file or directory
Jul 24 22:26:03 sentry-docker00.cs.umd.edu systemd-udevd[2923582]: link_config: could not get ethtool features for veth3fa60f2
Jul 24 22:26:03 sentry-docker00.cs.umd.edu systemd-udevd[2923582]: Could not set offload features of veth3fa60f2: No such device
Jul 24 22:26:04 sentry-docker00.cs.umd.edu systemd-udevd[2923612]: Could not generate persistent MAC address for veth6d50d18: No such file or directory
Jul 24 22:26:04 sentry-docker00.cs.umd.edu systemd-udevd[2923613]: Could not generate persistent MAC address for vethcfc49e8: No such file or directory
Jul 24 22:26:04 sentry-docker00.cs.umd.edu systemd-udevd[2923616]: Could not generate persistent MAC address for vethcc31e54: No such file or directory
Jul 24 22:26:04 sentry-docker00.cs.umd.edu systemd-udevd[2923617]: Could not generate persistent MAC address for veth863bd94: No such file or directory
Jul 24 22:26:04 sentry-docker00.cs.umd.edu systemd-udevd[2923628]: Could not generate persistent MAC address for vetha007ce6: No such file or directory
Jul 24 22:26:04 sentry-docker00.cs.umd.edu systemd-udevd[2923633]: Could not generate persistent MAC address for vethe3c1431: No such file or directory
Jul 24 22:26:04 sentry-docker00.cs.umd.edu systemd-udevd[2923628]: Could not generate persistent MAC address for vethe662058: No such file or directory
Jul 24 22:26:04 sentry-docker00.cs.umd.edu systemd-udevd[2923633]: Could not generate persistent MAC address for veth80a7704: No such file or directory
Jul 24 22:39:14 sentry-docker00.cs.umd.edu systemd-udevd[2930325]: Could not generate persistent MAC address for vethde2e853: No such file or directory
Jul 24 22:39:14 sentry-docker00.cs.umd.edu systemd-udevd[2930326]: Could not generate persistent MAC address for veth7eedfe0: No such file or directory
Jul 24 22:46:12 sentry-docker00.cs.umd.edu systemd-udevd[2933047]: link_config: could not get ethtool features for veth6d50d18
Jul 24 22:46:12 sentry-docker00.cs.umd.edu systemd-udevd[2933047]: Could not set offload features of veth6d50d18: No such device
Jul 24 22:46:12 sentry-docker00.cs.umd.edu systemd-udevd[2933065]: Could not generate persistent MAC address for veth7ae7eee: No such file or directory
Jul 24 22:46:12 sentry-docker00.cs.umd.edu systemd-udevd[2933066]: Could not generate persistent MAC address for vethbc420fd: No such file or directory
Jul 24 22:46:12 sentry-docker00.cs.umd.edu systemd-udevd[2933102]: Could not generate persistent MAC address for vethd8d5b31: No such file or directory
Jul 24 22:46:12 sentry-docker00.cs.umd.edu systemd-udevd[2933103]: Could not generate persistent MAC address for veth2e34cdb: No such file or directory
Jul 24 22:46:12 sentry-docker00.cs.umd.edu systemd-udevd[2933106]: Could not generate persistent MAC address for vethe09a73f: No such file or directory
Jul 24 22:46:12 sentry-docker00.cs.umd.edu systemd-udevd[2933130]: Could not generate persistent MAC address for vethdcbfc87: No such file or directory
... 6 more distinct messages not shown
== soul (1 distinct, 1 total) ==
Jul 24 22:28:46 soul krb5_child[1661152]: Client 'admin(a)UMD.EDU' not found in Kerberos database
== strawberry (2 distinct, 8 total) ==
Jul 24 22:09:44 strawberry udisksd[1067]: Error performing housekeeping for drive /org/freedesktop/UDisks2/drives/ST2000DM001_1CH164_W1E8J5KJ: Error updating SMART data: Error sending ATA command CHECK POWER MODE: Unexpected sense data returned:#0120000: 00 00 00 00 00 00 00 00 00 00 00 00 00 00 00 00 ................#0120010: 00 00 00 00 00 00 00 00 00 00 00 00 00 00 00 00 ................#012 (g-io-error-quark, 0) [x6]
Jul 24 22:34:42 strawberry smartd[5314]: Device: /dev/sda [SAT], failed to read SMART Attribute Data [x2]
== submit26-b9-2 (1 distinct, 4 total) ==
Jul 24 22:42:46 submit26-b9-2 systemd[1]: user(a)1001.service: Main process exited, code=killed, status=9/KILL [x4]
== submit26-b9-4 (1 distinct, 7 total) ==
Jul 24 22:18:36 submit26-b9-4 systemd[1]: user(a)1001.service: Main process exited, code=killed, status=9/KILL [x7]
== talkhosts9 (1 distinct, 2 total) ==
Jul 24 23:02:19 talkhosts9 setroubleshoot[3287410]: SELinux is preventing /usr/bin/lsof from getattr access on the unix_stream_socket unix_stream_socket. For complete SELinux messages run: sealert -l a6df89b3-c497-469c-8232-c4fde0508abf [x2]
== teaching-awards (1 distinct, 1 total) ==
Jul 24 22:41:00 teaching-awards krb5_child[1182231]: Client 'admin(a)UMD.EDU' not found in Kerberos database
== vacuum.cs.umd.edu (4 distinct, 4 total) ==
Jul 24 22:11:58 vacuum.cs.umd.edu abrt-hook-ccpp[28830]: Process 24431 (driver) of user 33 killed by SIGABRT - dumping core
Jul 24 22:11:59 vacuum.cs.umd.edu abrt-server[28832]: Package 'amanda-backup_server' isn't signed with proper key
Jul 24 22:11:59 vacuum.cs.umd.edu abrt-server[28832]: 'post-create' on '/var/spool/abrt/ccpp-2026-07-24-22:11:58-24431' exited with 1
Jul 24 22:11:59 vacuum.cs.umd.edu abrt-server[28832]: Deleting problem directory '/var/spool/abrt/ccpp-2026-07-24-22:11:58-24431'
1
0
Command: /usr/local/sbin/syslog-digest.py
Time : 0.5273s
Status : exited 0
Output :
Syslog digest — 2026-07-24 22:05 EDT
Processed 4,409 lines, filtered 3,548 (80%). 861 unknown (114 distinct) from 23 host(s).
== abuse (1 distinct, 347 total) ==
Jul 24 21:05:06 abuse rsyslogd[21745]: imjournal: open() failed for path: '/var/lib/rsyslog/imjournal.state.tmp': Input/output error [v8.2404.0 try https://www.rsyslog.com/e/2433 ] [x347]
== alec.cs.umd.edu (3 distinct, 59 total) ==
Jul 24 21:05:06 alec.cs.umd.edu setroubleshoot[2699677]: failed to retrieve rpm info for path '/run/netns/netns-9dfd0347-71eb-5698-085c-c769043aa5c3': [x12]
Jul 24 21:05:07 alec.cs.umd.edu sedispatch[1526]: AVC Message regarding setroubleshoot, ignoring message [x24]
Jul 24 21:05:07 alec.cs.umd.edu setroubleshoot[2699677]: SELinux is preventing /usr/bin/df from getattr access on the file /run/netns/netns-9dfd0347-71eb-5698-085c-c769043aa5c3. For complete SELinux messages run: sealert -l 23f93208-3063-4aac-b78a-bb0fcb40740c [x23]
== b0b02.cs.umd.edu (1 distinct, 1 total) ==
Jul 24 21:54:14 b0b02.cs.umd.edu rustdesk[189335]: cannot open display:
== bachata (1 distinct, 2 total) ==
Jul 24 21:19:03 bachata setroubleshoot[1858524]: SELinux is preventing /usr/sbin/smbd from name_bind access on the udp_socket port 712. For complete SELinux messages run: sealert -l 8f7247f1-69a5-4a62-a4f0-88a324bfd75c [x2]
== cheezit.cs.umd.edu (1 distinct, 1 total) ==
Jul 24 21:59:08 cheezit.cs.umd.edu sshd-session[1495039]: error: send_error: write: Connection reset by peer
== contest (10 distinct, 44 total) ==
Jul 24 21:05:10 contest goferd[1007]: [ERROR][worker-0] gofer.messaging.adapter.connect:33 - connect: proton+amqps://satellite8.cs.umd.edu:5647, failed: Connection amqps://satellite8.cs.umd.edu:5647 disconnected: Condition('proton.pythonio', 'Connection refused to all addresses') [x34]
Jul 24 21:48:13 contest setroubleshoot[29605]: SELinux is preventing /usr/libexec/platform-python3.6 from create access on the directory libdnf.3QpeV5. For complete SELinux messages run: sealert -l cb6b25c6-4765-4cf2-88a0-9b3b508e94e9
Jul 24 21:48:13 contest setroubleshoot[29605]: SELinux is preventing /usr/bin/gpgconf from add_name access on the directory repodata. For complete SELinux messages run: sealert -l 41cf7b1b-0f34-4609-98f2-b66e7825fef7
Jul 24 21:48:13 contest setroubleshoot[29605]: SELinux is preventing /usr/libexec/platform-python3.6 from create access on the file mirrorlist. For complete SELinux messages run: sealert -l fc20ff92-ea83-4f38-a24b-ddfd737a3141
Jul 24 21:48:13 contest setroubleshoot[29605]: SELinux is preventing /usr/libexec/platform-python3.6 from setattr access on the file repomd.xml. For complete SELinux messages run: sealert -l ac675631-fa35-4e93-adc9-b692b18e53e5
Jul 24 21:48:13 contest setroubleshoot[29605]: SELinux is preventing /usr/bin/gpgconf from add_name access on the directory repomd.xml.asc. For complete SELinux messages run: sealert -l 41cf7b1b-0f34-4609-98f2-b66e7825fef7
Jul 24 21:48:13 contest setroubleshoot[29605]: SELinux is preventing /usr/libexec/platform-python3.6 from read access on the directory libdnf.3QpeV5. For complete SELinux messages run: sealert -l 45d103b6-0810-4890-a705-990118577ce8
Jul 24 21:48:13 contest setroubleshoot[29605]: SELinux is preventing /usr/libexec/platform-python3.6 from remove_name access on the directory repomd.xml. For complete SELinux messages run: sealert -l 7e499113-2fd7-4f67-bec6-3521efbe3637 [x2]
Jul 24 21:48:13 contest setroubleshoot[29605]: SELinux is preventing /usr/libexec/platform-python3.6 from rmdir access on the directory repodata. For complete SELinux messages run: sealert -l 3928930b-a1ed-448d-950b-0665ac2adef8
Jul 24 21:48:15 contest setroubleshoot[29605]: SELinux is preventing /usr/libexec/platform-python3.6 from create access on the directory libdnf.Pl96RZ. For complete SELinux messages run: sealert -l cb6b25c6-4765-4cf2-88a0-9b3b508e94e9
== csfw00a (1 distinct, 212 total) ==
Jul 24 21:05:05 csfw00a kernel: bnxt_en 0000:09:00.0 eth3: NIC Link is Down [x212]
== hackerman (7 distinct, 12 total) ==
Jul 24 21:19:01 hackerman gnome-software[2060381]: failed to commit changes to dconf: GDBus.Error:org.gtk.GDBus.UnmappedGError.Quark._g_2dfile_2derror_2dquark.Code2: Failed to create file “/adminhomes/sajith/.config/dconf/user.TJQ5S3”: Permission denied
Jul 24 21:20:04 hackerman gnome-software[2060381]: can't reliably fixup error code 4 in domain g-io-error-quark: Not a directory [x4]
Jul 24 21:20:12 hackerman gnome-software[2060381]: Only 0 apps for recent list, hiding
Jul 24 21:20:28 hackerman gnome-software[2060381]: failed to commit changes to dconf: GDBus.Error:org.gtk.GDBus.UnmappedGError.Quark._g_2dfile_2derror_2dquark.Code2: Failed to create file “/adminhomes/sajith/.config/dconf/user.GB6BT3”: Permission denied
Jul 24 21:20:29 hackerman packagekitd[273147]: Failed to get cache filename for libreoffice [x2]
Jul 24 21:20:29 hackerman packagekitd[273147]: Failed to get cache filename for kernel [x2]
Jul 24 21:20:39 hackerman packagekitd[273147]: failed to parse public key for /etc/pki/rpm-gpg/RPM-GPG-KEY-PQC-redhat-release
== idm00 (1 distinct, 1 total) ==
Jul 24 21:51:05 idm00 named[1455]: client @0x7f3315455458 10.73.240.42#52046: update '73.10.in-addr.arpa/IN' denied
== idmp0 (1 distinct, 1 total) ==
Jul 24 21:34:55 idmp0 named[5198]: client @0x7f9918006dc8 10.73.240.43#60119: update '73.10.in-addr.arpa/IN' denied
== itmon02 (1 distinct, 40 total) ==
Jul 24 21:08:11 itmon02 sshd[1834]: error: beginning MaxStartups throttling [x40]
== neodontcare.cs.umd.edu (2 distinct, 11 total) ==
Jul 24 21:08:36 neodontcare.cs.umd.edu tracker-extract[3080175]: tracker_module_manager_load_modules: assertion 'initialized == TRUE' failed [x10]
Jul 24 21:58:52 neodontcare.cs.umd.edu tracker-extract[3093328]: Task for 'file:///fs/junkfood/gasarch/LBonRamtalk.pdf' finished with error: Couldn't open PopplerDocument:PDF document is damaged
== newhonors2 (1 distinct, 24 total) ==
Jul 24 21:13:03 newhonors2 dhcpcd[235925]: dhcpcd is not running [x24]
== outbound00.cs.umd.edu (1 distinct, 6 total) ==
Jul 24 21:09:09 outbound00.cs.umd.edu python3[3427551]: ldapdb [x6]
== outbound01.cs.umd.edu (1 distinct, 6 total) ==
Jul 24 21:13:06 outbound01.cs.umd.edu python3[1456204]: ldapdb [x6]
== peach.cs.umd.edu (2 distinct, 2 total) ==
Jul 24 21:42:09 peach.cs.umd.edu setroubleshoot[585912]: SELinux is preventing /usr/bin/qemu-ga from search access on the directory /var/lib/containers/storage/overlay. For complete SELinux messages run: sealert -l ba415951-a2c6-424e-b17d-305c5300b9f3
Jul 24 21:42:09 peach.cs.umd.edu setroubleshoot[585912]: SELinux is preventing /usr/bin/qemu-ga from search access on the directory /var/lib/containers/storage/overlay. For complete SELinux messages run: sealert -l 6aeb0956-fcf2-462a-ae4d-439b912c16d0
== sebatinsky.cs.umd.edu (2 distinct, 4 total) ==
Jul 24 21:50:22 sebatinsky.cs.umd.edu setroubleshoot[3339230]: failed to retrieve rpm info for /var/lib/rpm/.dbenv.lock [x2]
Jul 24 21:50:26 sebatinsky.cs.umd.edu setroubleshoot[3339230]: SELinux is preventing /usr/libexec/platform-python3.6 from add_name access on the directory /var/lib/rpm/.dbenv.lock. For complete SELinux messages run: sealert -l 26d5bc02-bfff-4827-a9f2-b991fef962b5 [x2]
== sentry-docker00.cs.umd.edu (44 distinct, 44 total) ==
Jul 24 21:05:30 sentry-docker00.cs.umd.edu systemd-udevd[2885379]: link_config: could not get ethtool features for vethbc5c2d6
Jul 24 21:05:30 sentry-docker00.cs.umd.edu systemd-udevd[2885379]: Could not set offload features of vethbc5c2d6: No such device
Jul 24 21:05:30 sentry-docker00.cs.umd.edu systemd-udevd[2885439]: Could not generate persistent MAC address for vethe6c88ad: No such file or directory
Jul 24 21:05:30 sentry-docker00.cs.umd.edu systemd-udevd[2885440]: Could not generate persistent MAC address for veth4b6991d: No such file or directory
Jul 24 21:05:30 sentry-docker00.cs.umd.edu systemd-udevd[2885443]: Could not generate persistent MAC address for veth5e9c910: No such file or directory
Jul 24 21:05:30 sentry-docker00.cs.umd.edu systemd-udevd[2885444]: Could not generate persistent MAC address for vethbfc9d1b: No such file or directory
Jul 24 21:05:30 sentry-docker00.cs.umd.edu systemd-udevd[2885467]: Could not generate persistent MAC address for veth10d6ee7: No such file or directory
Jul 24 21:05:30 sentry-docker00.cs.umd.edu systemd-udevd[2885469]: Could not generate persistent MAC address for veth5d84558: No such file or directory
Jul 24 21:05:30 sentry-docker00.cs.umd.edu systemd-udevd[2885486]: Could not generate persistent MAC address for vethd9f8ed1: No such file or directory
Jul 24 21:05:30 sentry-docker00.cs.umd.edu systemd-udevd[2885493]: Could not generate persistent MAC address for vethb9fa302: No such file or directory
Jul 24 21:18:53 sentry-docker00.cs.umd.edu systemd-udevd[2892252]: link_config: could not get ethtool features for vethaeb91e6
Jul 24 21:18:53 sentry-docker00.cs.umd.edu systemd-udevd[2892252]: Could not set offload features of vethaeb91e6: No such device
Jul 24 21:18:53 sentry-docker00.cs.umd.edu systemd-udevd[2892269]: Could not generate persistent MAC address for veth6996b35: No such file or directory
Jul 24 21:18:53 sentry-docker00.cs.umd.edu systemd-udevd[2892270]: Could not generate persistent MAC address for veth96a1678: No such file or directory
Jul 24 21:25:38 sentry-docker00.cs.umd.edu systemd-udevd[2895048]: link_config: could not get ethtool features for vethe6c88ad
Jul 24 21:25:38 sentry-docker00.cs.umd.edu systemd-udevd[2895048]: Could not set offload features of vethe6c88ad: No such device
Jul 24 21:25:38 sentry-docker00.cs.umd.edu systemd-udevd[2895124]: link_config: could not get ethtool features for vethd9f8ed1
Jul 24 21:25:38 sentry-docker00.cs.umd.edu systemd-udevd[2895124]: Could not set offload features of vethd9f8ed1: No such device
Jul 24 21:25:38 sentry-docker00.cs.umd.edu systemd-udevd[2895140]: Could not generate persistent MAC address for veth0e326cb: No such file or directory
Jul 24 21:25:38 sentry-docker00.cs.umd.edu systemd-udevd[2895139]: Could not generate persistent MAC address for vethed39ca8: No such file or directory
Jul 24 21:25:38 sentry-docker00.cs.umd.edu systemd-udevd[2895165]: Could not generate persistent MAC address for veth008838d: No such file or directory
Jul 24 21:25:38 sentry-docker00.cs.umd.edu systemd-udevd[2895166]: Could not generate persistent MAC address for vetha89df71: No such file or directory
Jul 24 21:25:38 sentry-docker00.cs.umd.edu systemd-udevd[2895191]: Could not generate persistent MAC address for veth2843085: No such file or directory
Jul 24 21:25:38 sentry-docker00.cs.umd.edu systemd-udevd[2895192]: Could not generate persistent MAC address for vethdaa4f32: No such file or directory
Jul 24 21:25:38 sentry-docker00.cs.umd.edu systemd-udevd[2895236]: Could not generate persistent MAC address for veth04c1250: No such file or directory
Jul 24 21:25:38 sentry-docker00.cs.umd.edu systemd-udevd[2895240]: Could not generate persistent MAC address for veth1f11cc4: No such file or directory
Jul 24 21:39:01 sentry-docker00.cs.umd.edu systemd-udevd[2901921]: link_config: could not get ethtool features for veth6996b35
Jul 24 21:39:01 sentry-docker00.cs.umd.edu systemd-udevd[2901921]: Could not set offload features of veth6996b35: No such device
Jul 24 21:39:01 sentry-docker00.cs.umd.edu systemd-udevd[2901939]: Could not generate persistent MAC address for veth205a47e: No such file or directory
Jul 24 21:39:01 sentry-docker00.cs.umd.edu systemd-udevd[2901940]: Could not generate persistent MAC address for vethab4707e: No such file or directory
... 14 more distinct messages not shown
== strawberry (2 distinct, 8 total) ==
Jul 24 21:09:44 strawberry udisksd[1067]: Error performing housekeeping for drive /org/freedesktop/UDisks2/drives/ST2000DM001_1CH164_W1E8J5KJ: Error updating SMART data: Error sending ATA command CHECK POWER MODE: Unexpected sense data returned:#0120000: 00 00 00 00 00 00 00 00 00 00 00 00 00 00 00 00 ................#0120010: 00 00 00 00 00 00 00 00 00 00 00 00 00 00 00 00 ................#012 (g-io-error-quark, 0) [x6]
Jul 24 21:34:42 strawberry smartd[5314]: Device: /dev/sda [SAT], failed to read SMART Attribute Data [x2]
== submit26-b9-2 (12 distinct, 14 total) ==
Jul 24 21:08:06 submit26-b9-2 systemd[1]: user(a)1001.service: Main process exited, code=killed, status=9/KILL [x3]
Jul 24 21:12:48 submit26-b9-2 setroubleshoot[133916]: SELinux is preventing /usr/bin/python3.9 from create access on the directory /(null). For complete SELinux messages run: sealert -l d506243c-d61e-48f3-b42a-4592c913deb0
Jul 24 21:12:48 submit26-b9-2 setroubleshoot[133916]: SELinux is preventing /usr/bin/python3.9 from add_name access on the directory /(null). For complete SELinux messages run: sealert -l 3b4752ac-1b9a-4af9-a05b-32e4c2eb13ab
Jul 24 21:12:48 submit26-b9-2 setroubleshoot[133916]: SELinux is preventing /usr/bin/python3.9 from create access on the file /(null). For complete SELinux messages run: sealert -l 29e5adbd-4381-4467-b40d-a2219101e096
Jul 24 21:12:48 submit26-b9-2 setroubleshoot[133916]: SELinux is preventing /usr/bin/python3.9 from open access on the file /tmp/libdnf.fvZOWn/repodata/repomd.xml. For complete SELinux messages run: sealert -l 1b38f2ec-01ce-4343-8059-ba7494ecc5c4
Jul 24 21:12:48 submit26-b9-2 setroubleshoot[133916]: SELinux is preventing /usr/bin/python3.9 from setattr access on the file repomd.xml. For complete SELinux messages run: sealert -l e5f9af40-1f63-4924-b012-27ab2a7b2266
Jul 24 21:12:48 submit26-b9-2 setroubleshoot[133916]: SELinux is preventing /usr/bin/python3.9 from read access on the directory libdnf.fvZOWn. For complete SELinux messages run: sealert -l 5c54db87-54a3-4a7c-97b4-b5c48d6c3543
Jul 24 21:12:48 submit26-b9-2 setroubleshoot[133916]: SELinux is preventing /usr/bin/python3.9 from remove_name access on the directory repomd.xml. For complete SELinux messages run: sealert -l 63cd60e1-1e61-4276-afea-dd8526ffe8b2
Jul 24 21:12:48 submit26-b9-2 setroubleshoot[133916]: SELinux is preventing /usr/bin/python3.9 from unlink access on the file repomd.xml. For complete SELinux messages run: sealert -l 81c7e9ec-e023-4c6d-b1ad-c02a242e655e
Jul 24 21:12:48 submit26-b9-2 setroubleshoot[133916]: SELinux is preventing /usr/bin/python3.9 from rmdir access on the directory repodata. For complete SELinux messages run: sealert -l 6ae9a597-e123-4d74-8eec-a8ebe0f5e4d0
Jul 24 21:23:08 submit26-b9-2 systemd-coredump[134372]: Process 134369 (shell_jr) of user 1001 dumped core.#012#012Stack trace of thread 134369:#012#0 0x00007f30532db613 __execvpe_common (libc.so.6 + 0xdb613)#012#1 0x0000000000401402 main (shell_jr + 0x1402)#012#2 0x00007f305322a610 __libc_start_call_main (libc.so.6 + 0x2a610)#012#3 0x00007f305322a6c0 __libc_start_main@@GLIBC_2.34 (libc.so.6 + 0x2a6c0)#012#4 0x0000000000401105 _start (shell_jr + 0x1105)#012ELF object binary architecture: AMD x86-64
Jul 24 21:23:08 submit26-b9-2 systemd-coredump[134402]: Process 134399 (shell_jr) of user 1001 dumped core.#012#012Stack trace of thread 134399:#012#0 0x00007f03ee6db613 __execvpe_common (libc.so.6 + 0xdb613)#012#1 0x0000000000401402 main (shell_jr + 0x1402)#012#2 0x00007f03ee62a610 __libc_start_call_main (libc.so.6 + 0x2a610)#012#3 0x00007f03ee62a6c0 __libc_start_main@@GLIBC_2.34 (libc.so.6 + 0x2a6c0)#012#4 0x0000000000401105 _start (shell_jr + 0x1105)#012ELF object binary architecture: AMD x86-64
== submit26-b9-3 (9 distinct, 9 total) ==
Jul 24 21:20:34 submit26-b9-3 setroubleshoot[567923]: SELinux is preventing /usr/bin/python3.9 from create access on the directory /(null). For complete SELinux messages run: sealert -l 5b912a44-22fd-4560-b201-2a4e289b73f5
Jul 24 21:20:34 submit26-b9-3 setroubleshoot[567923]: SELinux is preventing /usr/bin/python3.9 from add_name access on the directory /(null). For complete SELinux messages run: sealert -l 7f1df1e4-725e-4953-98eb-1079f908f543
Jul 24 21:20:34 submit26-b9-3 setroubleshoot[567923]: SELinux is preventing /usr/bin/python3.9 from create access on the file /(null). For complete SELinux messages run: sealert -l 40b8852a-f77b-44b4-affe-5f11fa33de43
Jul 24 21:20:34 submit26-b9-3 setroubleshoot[567923]: SELinux is preventing /usr/bin/python3.9 from open access on the file /tmp/libdnf.rGkDQb/repodata/repomd.xml. For complete SELinux messages run: sealert -l 45a8019e-f6b5-4baa-92c1-862594b40d46
Jul 24 21:20:34 submit26-b9-3 setroubleshoot[567923]: SELinux is preventing /usr/bin/python3.9 from setattr access on the file repomd.xml. For complete SELinux messages run: sealert -l e9f0bfff-7784-4126-baa4-2bb06da56591
Jul 24 21:20:34 submit26-b9-3 setroubleshoot[567923]: SELinux is preventing /usr/bin/python3.9 from read access on the directory libdnf.rGkDQb. For complete SELinux messages run: sealert -l 0b17cc3d-cdc6-4fe2-a11f-3892e7c41dc7
Jul 24 21:20:34 submit26-b9-3 setroubleshoot[567923]: SELinux is preventing /usr/bin/python3.9 from remove_name access on the directory repomd.xml. For complete SELinux messages run: sealert -l 10e38c64-b65f-4cdd-901e-4375652d9a42
Jul 24 21:20:34 submit26-b9-3 setroubleshoot[567923]: SELinux is preventing /usr/bin/python3.9 from unlink access on the file repomd.xml. For complete SELinux messages run: sealert -l 7fd9cf72-ef38-48e1-b6aa-b571b26a7b22
Jul 24 21:20:34 submit26-b9-3 setroubleshoot[567923]: SELinux is preventing /usr/bin/python3.9 from rmdir access on the directory repodata. For complete SELinux messages run: sealert -l b9b11116-89bd-4a3c-980c-1d422c5dcee4
== submit26-b9-4 (1 distinct, 2 total) ==
Jul 24 21:08:05 submit26-b9-4 systemd[1]: user(a)1001.service: Main process exited, code=killed, status=9/KILL [x2]
== submit26-clnb9 (9 distinct, 11 total) ==
Jul 24 21:31:52 submit26-clnb9 setroubleshoot[1263320]: SELinux is preventing /usr/bin/python3.9 from create access on the directory /(null). For complete SELinux messages run: sealert -l 6783ed2b-5ae4-42b5-975a-4bf50eec4658 [x2]
Jul 24 21:31:52 submit26-clnb9 setroubleshoot[1263320]: SELinux is preventing /usr/bin/python3.9 from add_name access on the directory /(null). For complete SELinux messages run: sealert -l 9e7fa955-cc30-4804-ac8c-e1779e85946c [x2]
Jul 24 21:31:52 submit26-clnb9 setroubleshoot[1263320]: SELinux is preventing /usr/bin/python3.9 from create access on the file /(null). For complete SELinux messages run: sealert -l 69bfa6e3-089c-40ff-9563-fd30787d0774
Jul 24 21:31:52 submit26-clnb9 setroubleshoot[1263320]: SELinux is preventing /usr/bin/python3.9 from open access on the file /tmp/libdnf.c6tbPO/repodata/repomd.xml. For complete SELinux messages run: sealert -l 001acdb5-31ef-4e52-b10b-90f467a89ddc
Jul 24 21:31:52 submit26-clnb9 setroubleshoot[1263320]: SELinux is preventing /usr/bin/python3.9 from setattr access on the file repomd.xml. For complete SELinux messages run: sealert -l edacddcf-16ed-4dc3-8d82-7c597d5dee23
Jul 24 21:31:52 submit26-clnb9 setroubleshoot[1263320]: SELinux is preventing /usr/bin/python3.9 from read access on the directory libdnf.c6tbPO. For complete SELinux messages run: sealert -l 62b3782e-4730-4488-8178-94dafe9b552c
Jul 24 21:31:52 submit26-clnb9 setroubleshoot[1263320]: SELinux is preventing /usr/bin/python3.9 from remove_name access on the directory repomd.xml. For complete SELinux messages run: sealert -l 81cb3698-78f8-440a-8e3c-e5d1041e6b78
Jul 24 21:31:52 submit26-clnb9 setroubleshoot[1263320]: SELinux is preventing /usr/bin/python3.9 from unlink access on the file repomd.xml. For complete SELinux messages run: sealert -l 792b472a-115c-4799-9805-fc7436f916b9
Jul 24 21:31:52 submit26-clnb9 setroubleshoot[1263320]: SELinux is preventing /usr/bin/python3.9 from rmdir access on the directory repodata. For complete SELinux messages run: sealert -l 15c83a86-837b-41e2-b662-b39cd4e361cb
1
0
Command: /usr/local/sbin/syslog-digest.py
Time : 0.5466s
Status : exited 0
Output :
Syslog digest — 2026-07-24 21:05 EDT
Processed 4,843 lines, filtered 3,961 (81%). 882 unknown (87 distinct) from 20 host(s).
== abuse (1 distinct, 347 total) ==
Jul 24 20:05:06 abuse rsyslogd[21745]: imjournal: open() failed for path: '/var/lib/rsyslog/imjournal.state.tmp': Input/output error [v8.2404.0 try https://www.rsyslog.com/e/2433 ] [x347]
== alec.cs.umd.edu (3 distinct, 60 total) ==
Jul 24 20:05:06 alec.cs.umd.edu setroubleshoot[2684975]: failed to retrieve rpm info for path '/run/netns/netns-9dfd0347-71eb-5698-085c-c769043aa5c3': [x12]
Jul 24 20:05:07 alec.cs.umd.edu sedispatch[1526]: AVC Message regarding setroubleshoot, ignoring message [x24]
Jul 24 20:05:07 alec.cs.umd.edu setroubleshoot[2684975]: SELinux is preventing /usr/bin/df from getattr access on the file /run/netns/netns-9dfd0347-71eb-5698-085c-c769043aa5c3. For complete SELinux messages run: sealert -l 23f93208-3063-4aac-b78a-bb0fcb40740c [x24]
== b0b02.cs.umd.edu (1 distinct, 1 total) ==
Jul 24 20:54:13 b0b02.cs.umd.edu rustdesk[174276]: cannot open display:
== contest (1 distinct, 33 total) ==
Jul 24 20:06:15 contest goferd[1007]: [ERROR][worker-0] gofer.messaging.adapter.connect:33 - connect: proton+amqps://satellite8.cs.umd.edu:5647, failed: Connection amqps://satellite8.cs.umd.edu:5647 disconnected: Condition('proton.pythonio', 'Connection refused to all addresses') [x33]
== csfw00a (1 distinct, 260 total) ==
Jul 24 20:04:52 csfw00a kernel: bnxt_en 0000:09:00.0 eth3: NIC Link is Down [x260]
== hackerman (6 distinct, 11 total) ==
Jul 24 20:20:04 hackerman gnome-software[2060381]: can't reliably fixup error code 4 in domain g-io-error-quark: Not a directory [x4]
Jul 24 20:20:14 hackerman gnome-software[2060381]: Only 0 apps for recent list, hiding
Jul 24 20:20:29 hackerman gnome-software[2060381]: failed to commit changes to dconf: GDBus.Error:org.gtk.GDBus.UnmappedGError.Quark._g_2dfile_2derror_2dquark.Code2: Failed to create file “/adminhomes/sajith/.config/dconf/user.K70VS3”: Permission denied
Jul 24 20:20:29 hackerman packagekitd[259525]: Failed to get cache filename for libreoffice [x2]
Jul 24 20:20:29 hackerman packagekitd[259525]: Failed to get cache filename for kernel [x2]
Jul 24 20:20:39 hackerman packagekitd[259525]: failed to parse public key for /etc/pki/rpm-gpg/RPM-GPG-KEY-PQC-redhat-release
== idm00 (1 distinct, 1 total) ==
Jul 24 20:51:05 idm00 named[1455]: client @0x7f3310373c58 10.73.240.42#57515: update '73.10.in-addr.arpa/IN' denied
== idmp0 (1 distinct, 1 total) ==
Jul 24 20:34:55 idmp0 named[5198]: client @0x7f990c04e038 10.73.240.43#52169: update '73.10.in-addr.arpa/IN' denied
== itmon02 (1 distinct, 45 total) ==
Jul 24 20:08:12 itmon02 sshd[1834]: error: beginning MaxStartups throttling [x45]
== jaws.cs.umd.edu (4 distinct, 5 total) ==
Jul 24 20:33:38 jaws.cs.umd.edu systemd-coredump[1376776]: Process 1376759 (podman) of user 981 dumped core.#012#012Stack trace of thread 1376759:#012#0 0x0000564a78f3046e internal/runtime/syscall/linux.Syscall6 (podman + 0x48b46e)#012#1 0x0000564a790100a6 syscall.Syscall (podman + 0x56b0a6)#012#2 0x0000564a79010c50 syscall.Syscall.abi0 (podman + 0x56bc50)#012#3 0x0000564a7917ac2e github.com/containers/podman/vendor/golang.org/x/sys/unix.OpenTree (podman + 0x6d5c2e)#012#4 0x0000564a797d3f4b github.com/containers/podman/vendor/github.com/cyphar/filepath-securejoin/p… (podman + 0xd2ef4b)#012#5 0x0000564a797d3e54 github.com/containers/podman/vendor/github.com/cyphar/filepath-securejoin/p… (podman + 0xd2ee54)#012#6 0x0000564a78fc3dcc sync.(*Once).doSlow (podman + 0x51edcc)#012#7 0x0000564a78fc3cf9 sync.(*Once).Do (podman + 0x51ecf9)#012#8 0x0000564a797d3d
c5 github.com/containers/podman/vendor/github.com/cyphar/filepath-securejoin/p… (podman + 0xd2edc5)#012#9 0x0000564a797d53e2 github.com/containers/podman/vendor/github.com/cyphar/filepath-securejoin/p… (podman + 0xd303e2)#012#10 0x0000564a797d57f3 github.com/containers/podman/vendor/github.com/cyphar/filepath-securejoin/p… (podman + 0xd307f3)#012#11 0x0000564a797d491c github.com/containers/podman/vendor/github.com/cyphar/filepath-securejoin/p… (podman + 0xd2f91c)#012#12 0x0000564a797d4358 github.com/containers/podman/vendor/github.com/cyphar/filepath-securejoin/p… (podman + 0xd2f358)#012#13 0x0000564a78fc3dcc sync.(*Once).doSlow (podman + 0x51edcc)#012#14 0x0000564a78fc3cf9 sync.(*Once).D
o (podman + 0x51ecf9)#012#15 0x0000564a797d42c5 github.com/containers/podman/vendor/github.com/cyphar/filepath-securejoin/p… (podman + 0xd2f2c5)#012#16 0x0000564a797d579a github.com/containers/podman/vendor/github.com/cyphar/filepath-securejoin/p… (podman + 0xd3079a)#012#17 0x0000564a797dc34e github.com/containers/podman/vendor/github.com/opencontainers/selinux/go-se… (podman + 0xd3734e)#012#18 0x0000564a797dc838 github.com/containers/podman/vendor/github.com/opencontainers/selinux/go-se… (podman + 0xd37838)#012#19 0x0000564a797db5df github.com/containers/podman/vendor/github.com/opencontainers/selinux/go-se… (podman + 0xd365df)#012#20 0x0000564a797db873 github.com/containers/podman/vendor/github.com/opencontainers/selinux/go-se… (podman + 0xd36873)#012#21 0x000
0564a799d3f4b github.com/containers/podman/vendor/go.podman.io/common/pkg/config.defaultC… (podman + 0xf2ef4b)#012#22 0x0000564a799d7912 github.com/containers/podman/vendor/go.podman.io/common/pkg/config.newLocked (podman + 0xf32912)#012#23 0x0000564a799d7605 github.com/containers/podman/vendor/go.podman.io/common/pkg/config.New (podman + 0xf32605)#012#24 0x0000564a7a14afd3 github.com/containers/podman/cmd/podman/registry.newPodmanConfig (podman + 0x16a5fd3)#012#25 0x0000564a78fc3dcc sync.(*Once).doSlow (podman + 0x51edcc)#012#26 0x0000564a7a16bc50 github.com/containers/podman/cmd/podman/common.init (podman + 0x16c6c50)#012#27 0x0000564a78f89a57 runtime.doInit1 (podman + 0x4e4a57)#012#28 0x0000564a78f79f90 runtime.main (podman + 0x4d4f90)#012#29 0x0000564a78fb9ee1 runtime.goexit.abi0 (podman + 0x514ee1)#012ELF object binary architecture: AMD x86-64
Jul 24 20:33:39 jaws.cs.umd.edu systemd-coredump[1376794]: Process 1376786 (podman) of user 981 dumped core.#012#012Stack trace of thread 1376786:#012#0 0x00005612de1cc46e internal/runtime/syscall/linux.Syscall6 (podman + 0x48b46e)#012#1 0x00005612de2ac0a6 syscall.Syscall (podman + 0x56b0a6)#012#2 0x00005612de2acc50 syscall.Syscall.abi0 (podman + 0x56bc50)#012#3 0x00005612de416c2e github.com/containers/podman/vendor/golang.org/x/sys/unix.OpenTree (podman + 0x6d5c2e)#012#4 0x00005612dea6ff4b github.com/containers/podman/vendor/github.com/cyphar/filepath-securejoin/p… (podman + 0xd2ef4b)#012#5 0x00005612dea6fe54 github.com/containers/podman/vendor/github.com/cyphar/filepath-securejoin/p… (podman + 0xd2ee54)#012#6 0x00005612de25fdcc sync.(*Once).doSlow (podman + 0x51edcc)#012#7 0x00005612de25fcf9 sync.(*Once).Do (podman + 0x51ecf9)#012#8 0x00005612dea6fd
c5 github.com/containers/podman/vendor/github.com/cyphar/filepath-securejoin/p… (podman + 0xd2edc5)#012#9 0x00005612dea713e2 github.com/containers/podman/vendor/github.com/cyphar/filepath-securejoin/p… (podman + 0xd303e2)#012#10 0x00005612dea717f3 github.com/containers/podman/vendor/github.com/cyphar/filepath-securejoin/p… (podman + 0xd307f3)#012#11 0x00005612dea7091c github.com/containers/podman/vendor/github.com/cyphar/filepath-securejoin/p… (podman + 0xd2f91c)#012#12 0x00005612dea70358 github.com/containers/podman/vendor/github.com/cyphar/filepath-securejoin/p… (podman + 0xd2f358)#012#13 0x00005612de25fdcc sync.(*Once).doSlow (podman + 0x51edcc)#012#14 0x00005612de25fcf9 sync.(*Once).D
o (podman + 0x51ecf9)#012#15 0x00005612dea702c5 github.com/containers/podman/vendor/github.com/cyphar/filepath-securejoin/p… (podman + 0xd2f2c5)#012#16 0x00005612dea7179a github.com/containers/podman/vendor/github.com/cyphar/filepath-securejoin/p… (podman + 0xd3079a)#012#17 0x00005612dea7834e github.com/containers/podman/vendor/github.com/opencontainers/selinux/go-se… (podman + 0xd3734e)#012#18 0x00005612dea78838 github.com/containers/podman/vendor/github.com/opencontainers/selinux/go-se… (podman + 0xd37838)#012#19 0x00005612dea775df github.com/containers/podman/vendor/github.com/opencontainers/selinux/go-se… (podman + 0xd365df)#012#20 0x00005612dea77873 github.com/containers/podman/vendor/github.com/opencontainers/selinux/go-se… (podman + 0xd36873)#012#21 0x000
05612dec6ff4b github.com/containers/podman/vendor/go.podman.io/common/pkg/config.defaultC… (podman + 0xf2ef4b)#012#22 0x00005612dec73912 github.com/containers/podman/vendor/go.podman.io/common/pkg/config.newLocked (podman + 0xf32912)#012#23 0x00005612dec73605 github.com/containers/podman/vendor/go.podman.io/common/pkg/config.New (podman + 0xf32605)#012#24 0x00005612df3e6fd3 github.com/containers/podman/cmd/podman/registry.newPodmanConfig (podman + 0x16a5fd3)#012#25 0x00005612de25fdcc sync.(*Once).doSlow (podman + 0x51edcc)#012#26 0x00005612df407c50 github.com/containers/podman/cmd/podman/common.init (podman + 0x16c6c50)#012#27 0x00005612de225a57 runtime.doInit1 (podman + 0x4e4a57)#012#28 0x00005612de215f90 runtime.main (podman + 0x4d4f90)#012#29 0x00005612de255ee1 runtime.goexit.abi0 (podman + 0x514ee1)#012ELF object binary architecture: AMD x86-64
Jul 24 20:33:40 jaws.cs.umd.edu systemd-coredump[1376809]: Process 1376799 (podman) of user 981 dumped core.#012#012Stack trace of thread 1376799:#012#0 0x00005576aeecf46e internal/runtime/syscall/linux.Syscall6 (podman + 0x48b46e)#012#1 0x00005576aefaf0a6 syscall.Syscall (podman + 0x56b0a6)#012#2 0x00005576aefafc50 syscall.Syscall.abi0 (podman + 0x56bc50)#012#3 0x00005576af119c2e github.com/containers/podman/vendor/golang.org/x/sys/unix.OpenTree (podman + 0x6d5c2e)#012#4 0x00005576af772f4b github.com/containers/podman/vendor/github.com/cyphar/filepath-securejoin/p… (podman + 0xd2ef4b)#012#5 0x00005576af772e54 github.com/containers/podman/vendor/github.com/cyphar/filepath-securejoin/p… (podman + 0xd2ee54)#012#6 0x00005576aef62dcc sync.(*Once).doSlow (podman + 0x51edcc)#012#7 0x00005576aef62cf9 sync.(*Once).Do (podman + 0x51ecf9)#012#8 0x00005576af772d
c5 github.com/containers/podman/vendor/github.com/cyphar/filepath-securejoin/p… (podman + 0xd2edc5)#012#9 0x00005576af7743e2 github.com/containers/podman/vendor/github.com/cyphar/filepath-securejoin/p… (podman + 0xd303e2)#012#10 0x00005576af7747f3 github.com/containers/podman/vendor/github.com/cyphar/filepath-securejoin/p… (podman + 0xd307f3)#012#11 0x00005576af77391c github.com/containers/podman/vendor/github.com/cyphar/filepath-securejoin/p… (podman + 0xd2f91c)#012#12 0x00005576af773358 github.com/containers/podman/vendor/github.com/cyphar/filepath-securejoin/p… (podman + 0xd2f358)#012#13 0x00005576aef62dcc sync.(*Once).doSlow (podman + 0x51edcc)#012#14 0x00005576aef62cf9 sync.(*Once).D
o (podman + 0x51ecf9)#012#15 0x00005576af7732c5 github.com/containers/podman/vendor/github.com/cyphar/filepath-securejoin/p… (podman + 0xd2f2c5)#012#16 0x00005576af77479a github.com/containers/podman/vendor/github.com/cyphar/filepath-securejoin/p… (podman + 0xd3079a)#012#17 0x00005576af77b34e github.com/containers/podman/vendor/github.com/opencontainers/selinux/go-se… (podman + 0xd3734e)#012#18 0x00005576af77b838 github.com/containers/podman/vendor/github.com/opencontainers/selinux/go-se… (podman + 0xd37838)#012#19 0x00005576af77a5df github.com/containers/podman/vendor/github.com/opencontainers/selinux/go-se… (podman + 0xd365df)#012#20 0x00005576af77a873 github.com/containers/podman/vendor/github.com/opencontainers/selinux/go-se… (podman + 0xd36873)#012#21 0x000
05576af972f4b github.com/containers/podman/vendor/go.podman.io/common/pkg/config.defaultC… (podman + 0xf2ef4b)#012#22 0x00005576af976912 github.com/containers/podman/vendor/go.podman.io/common/pkg/config.newLocked (podman + 0xf32912)#012#23 0x00005576af976605 github.com/containers/podman/vendor/go.podman.io/common/pkg/config.New (podman + 0xf32605)#012#24 0x00005576b00e9fd3 github.com/containers/podman/cmd/podman/registry.newPodmanConfig (podman + 0x16a5fd3)#012#25 0x00005576aef62dcc sync.(*Once).doSlow (podman + 0x51edcc)#012#26 0x00005576b010ac50 github.com/containers/podman/cmd/podman/common.init (podman + 0x16c6c50)#012#27 0x00005576aef28a57 runtime.doInit1 (podman + 0x4e4a57)#012#28 0x00005576aef18f90 runtime.main (podman + 0x4d4f90)#012#29 0x00005576aef58ee1 runtime.goexit.abi0 (podman + 0x514ee1)#012ELF object binary architecture: AMD x86-64
Jul 24 20:33:41 jaws.cs.umd.edu setroubleshoot[1376775]: SELinux is preventing /usr/bin/podman from using the nnp_transition access on a process. For complete SELinux messages run: sealert -l 3c7643bc-dd69-4695-b48c-7d780b62b6cf [x2]
== krispykreme.cs.umd.edu (4 distinct, 4 total) ==
Jul 24 20:11:04 krispykreme.cs.umd.edu sshd-session[3152087]: error: kex_protocol_error: type 20 seq 2 [preauth]
Jul 24 20:11:04 krispykreme.cs.umd.edu sshd-session[3152087]: error: kex_protocol_error: type 30 seq 3 [preauth]
Jul 24 20:11:06 krispykreme.cs.umd.edu sshd-session[3152087]: error: kex_protocol_error: type 20 seq 4 [preauth]
Jul 24 20:11:06 krispykreme.cs.umd.edu sshd-session[3152087]: error: kex_protocol_error: type 30 seq 5 [preauth]
== netman.cs.umd.edu (3 distinct, 3 total) ==
Jul 24 20:29:56 netman.cs.umd.edu setroubleshoot[634681]: SELinux is preventing /usr/bin/gpg from read access on the file gpg.conf. For complete SELinux messages run: sealert -l 019ad1da-a874-4814-8037-3b3e5f413ad2
Jul 24 20:29:57 netman.cs.umd.edu setroubleshoot[634681]: SELinux is preventing /usr/bin/gpg from open access on the file /root/.gnupg/gpg.conf. For complete SELinux messages run: sealert -l cb54177e-d44c-46a1-b246-5c0bbb8343be
Jul 24 20:30:06 netman.cs.umd.edu setroubleshoot[634681]: SELinux is preventing /usr/bin/gpg from getattr access on the file /root/.gnupg/gpg.conf. For complete SELinux messages run: sealert -l fbba2e30-b7ab-491c-9ec6-f553e9ef72af
== newhonors2 (1 distinct, 24 total) ==
Jul 24 20:13:02 newhonors2 dhcpcd[234033]: dhcpcd is not running [x24]
== outbound00.cs.umd.edu (1 distinct, 6 total) ==
Jul 24 20:09:09 outbound00.cs.umd.edu python3[3413757]: ldapdb [x6]
== outbound01.cs.umd.edu (1 distinct, 6 total) ==
Jul 24 20:13:06 outbound01.cs.umd.edu python3[1442408]: ldapdb [x6]
== peach.cs.umd.edu (2 distinct, 2 total) ==
Jul 24 20:12:09 peach.cs.umd.edu setroubleshoot[573660]: SELinux is preventing /usr/bin/qemu-ga from search access on the directory /var/lib/containers/storage/overlay. For complete SELinux messages run: sealert -l ba415951-a2c6-424e-b17d-305c5300b9f3
Jul 24 20:12:09 peach.cs.umd.edu setroubleshoot[573660]: SELinux is preventing /usr/bin/qemu-ga from search access on the directory /var/lib/containers/storage/overlay. For complete SELinux messages run: sealert -l 6aeb0956-fcf2-462a-ae4d-439b912c16d0
== sentry-docker00.cs.umd.edu (38 distinct, 38 total) ==
Jul 24 20:05:05 sentry-docker00.cs.umd.edu systemd-udevd[2856673]: link_config: could not get ethtool features for vethf91134d
Jul 24 20:05:05 sentry-docker00.cs.umd.edu systemd-udevd[2856673]: Could not set offload features of vethf91134d: No such device
Jul 24 20:05:05 sentry-docker00.cs.umd.edu systemd-udevd[2856733]: Could not generate persistent MAC address for veth87e5a99: No such file or directory
Jul 24 20:05:05 sentry-docker00.cs.umd.edu systemd-udevd[2856734]: Could not generate persistent MAC address for veth36f324b: No such file or directory
Jul 24 20:05:05 sentry-docker00.cs.umd.edu systemd-udevd[2856737]: Could not generate persistent MAC address for vethcff5772: No such file or directory
Jul 24 20:05:05 sentry-docker00.cs.umd.edu systemd-udevd[2856738]: Could not generate persistent MAC address for veth7dd30da: No such file or directory
Jul 24 20:05:05 sentry-docker00.cs.umd.edu systemd-udevd[2856761]: Could not generate persistent MAC address for veth106fba6: No such file or directory
Jul 24 20:05:05 sentry-docker00.cs.umd.edu systemd-udevd[2856762]: Could not generate persistent MAC address for veth159a2ca: No such file or directory
Jul 24 20:05:05 sentry-docker00.cs.umd.edu systemd-udevd[2856787]: Could not generate persistent MAC address for vethfd28925: No such file or directory
Jul 24 20:05:05 sentry-docker00.cs.umd.edu systemd-udevd[2856788]: Could not generate persistent MAC address for veth110a520: No such file or directory
Jul 24 20:18:32 sentry-docker00.cs.umd.edu systemd-udevd[2863852]: Could not generate persistent MAC address for veth90e1a1a: No such file or directory
Jul 24 20:18:32 sentry-docker00.cs.umd.edu systemd-udevd[2863853]: Could not generate persistent MAC address for veth633bcf5: No such file or directory
Jul 24 20:25:13 sentry-docker00.cs.umd.edu systemd-udevd[2866445]: link_config: could not get ethtool features for vethfd28925
Jul 24 20:25:13 sentry-docker00.cs.umd.edu systemd-udevd[2866445]: Could not set offload features of vethfd28925: No such device
Jul 24 20:25:14 sentry-docker00.cs.umd.edu systemd-udevd[2866483]: Could not generate persistent MAC address for vethdbf7007: No such file or directory
Jul 24 20:25:14 sentry-docker00.cs.umd.edu systemd-udevd[2866482]: Could not generate persistent MAC address for veth11710fe: No such file or directory
Jul 24 20:25:14 sentry-docker00.cs.umd.edu systemd-udevd[2866514]: Could not generate persistent MAC address for vethd0a1322: No such file or directory
Jul 24 20:25:14 sentry-docker00.cs.umd.edu systemd-udevd[2866516]: Could not generate persistent MAC address for vethb0ee1a8: No such file or directory
Jul 24 20:25:14 sentry-docker00.cs.umd.edu systemd-udevd[2866536]: Could not generate persistent MAC address for vethcc7727e: No such file or directory
Jul 24 20:25:14 sentry-docker00.cs.umd.edu systemd-udevd[2866514]: Could not generate persistent MAC address for veth3f778fc: No such file or directory
Jul 24 20:25:14 sentry-docker00.cs.umd.edu systemd-udevd[2866550]: Could not generate persistent MAC address for vethde08fc3: No such file or directory
Jul 24 20:25:14 sentry-docker00.cs.umd.edu systemd-udevd[2866551]: Could not generate persistent MAC address for veth8cbc9da: No such file or directory
Jul 24 20:38:40 sentry-docker00.cs.umd.edu systemd-udevd[2873344]: link_config: could not get ethtool features for veth90e1a1a
Jul 24 20:38:40 sentry-docker00.cs.umd.edu systemd-udevd[2873344]: Could not set offload features of veth90e1a1a: No such device
Jul 24 20:38:40 sentry-docker00.cs.umd.edu systemd-udevd[2873362]: Could not generate persistent MAC address for veth7bdff9f: No such file or directory
Jul 24 20:38:40 sentry-docker00.cs.umd.edu systemd-udevd[2873363]: Could not generate persistent MAC address for veth2c201f2: No such file or directory
Jul 24 20:45:22 sentry-docker00.cs.umd.edu systemd-udevd[2875968]: link_config: could not get ethtool features for vethd0a1322
Jul 24 20:45:22 sentry-docker00.cs.umd.edu systemd-udevd[2875968]: Could not set offload features of vethd0a1322: No such device
Jul 24 20:45:22 sentry-docker00.cs.umd.edu systemd-udevd[2875997]: Could not generate persistent MAC address for vethbc5c2d6: No such file or directory
Jul 24 20:45:22 sentry-docker00.cs.umd.edu systemd-udevd[2875998]: Could not generate persistent MAC address for veth325c3f0: No such file or directory
... 8 more distinct messages not shown
== strawberry (2 distinct, 8 total) ==
Jul 24 20:09:44 strawberry udisksd[1067]: Error performing housekeeping for drive /org/freedesktop/UDisks2/drives/ST2000DM001_1CH164_W1E8J5KJ: Error updating SMART data: Error sending ATA command CHECK POWER MODE: Unexpected sense data returned:#0120000: 00 00 00 00 00 00 00 00 00 00 00 00 00 00 00 00 ................#0120010: 00 00 00 00 00 00 00 00 00 00 00 00 00 00 00 00 ................#012 (g-io-error-quark, 0) [x6]
Jul 24 20:34:42 strawberry smartd[5314]: Device: /dev/sda [SAT], failed to read SMART Attribute Data [x2]
== submit26-b9-2 (3 distinct, 7 total) ==
Jul 24 20:10:05 submit26-b9-2 systemd[1]: user(a)1001.service: Main process exited, code=killed, status=9/KILL [x5]
Jul 24 21:03:07 submit26-b9-2 systemd-coredump[133243]: Process 133240 (shell_jr) of user 1001 dumped core.#012#012Stack trace of thread 133240:#012#0 0x00007f0b8a2db613 __execvpe_common (libc.so.6 + 0xdb613)#012#1 0x0000000000401402 main (shell_jr + 0x1402)#012#2 0x00007f0b8a22a610 __libc_start_call_main (libc.so.6 + 0x2a610)#012#3 0x00007f0b8a22a6c0 __libc_start_main@@GLIBC_2.34 (libc.so.6 + 0x2a6c0)#012#4 0x0000000000401105 _start (shell_jr + 0x1105)#012ELF object binary architecture: AMD x86-64
Jul 24 21:03:08 submit26-b9-2 systemd-coredump[133275]: Process 133271 (shell_jr) of user 1001 dumped core.#012#012Stack trace of thread 133271:#012#0 0x00007f0fa8edb613 __execvpe_common (libc.so.6 + 0xdb613)#012#1 0x0000000000401402 main (shell_jr + 0x1402)#012#2 0x00007f0fa8e2a610 __libc_start_call_main (libc.so.6 + 0x2a610)#012#3 0x00007f0fa8e2a6c0 __libc_start_main@@GLIBC_2.34 (libc.so.6 + 0x2a6c0)#012#4 0x0000000000401105 _start (shell_jr + 0x1105)#012ELF object binary architecture: AMD x86-64
== submit26-b9-4 (12 distinct, 20 total) ==
Jul 24 20:14:21 submit26-b9-4 systemd[1]: user(a)1001.service: Main process exited, code=killed, status=9/KILL [x9]
Jul 24 20:15:24 submit26-b9-4 setroubleshoot[136066]: SELinux is preventing /usr/bin/python3.9 from create access on the directory /(null). For complete SELinux messages run: sealert -l a4e66030-8621-4da9-bd27-5988bb1bf8ad
Jul 24 20:15:24 submit26-b9-4 setroubleshoot[136066]: SELinux is preventing /usr/bin/python3.9 from add_name access on the directory /(null). For complete SELinux messages run: sealert -l c055e37d-bbf5-4800-9083-d606f792c8c1
Jul 24 20:15:25 submit26-b9-4 setroubleshoot[136066]: SELinux is preventing /usr/bin/python3.9 from create access on the file /(null). For complete SELinux messages run: sealert -l e5bc3a56-6d6f-4776-954f-ddde1579648f
Jul 24 20:15:25 submit26-b9-4 setroubleshoot[136066]: SELinux is preventing /usr/bin/python3.9 from open access on the file /tmp/libdnf.yB2saQ/repodata/repomd.xml. For complete SELinux messages run: sealert -l a8ec5e1b-49f9-4fbc-a8ae-22e800f7abf2
Jul 24 20:15:25 submit26-b9-4 setroubleshoot[136066]: SELinux is preventing /usr/bin/python3.9 from setattr access on the file repomd.xml. For complete SELinux messages run: sealert -l 945db714-d0c0-4402-911e-932978b8b036
Jul 24 20:15:25 submit26-b9-4 setroubleshoot[136066]: SELinux is preventing /usr/bin/python3.9 from read access on the directory libdnf.yB2saQ. For complete SELinux messages run: sealert -l 463998a0-fb0d-463c-82b1-471135710a14
Jul 24 20:15:25 submit26-b9-4 setroubleshoot[136066]: SELinux is preventing /usr/bin/python3.9 from remove_name access on the directory repomd.xml. For complete SELinux messages run: sealert -l 473d2e21-15d8-407a-a9ee-2b842607fa00
Jul 24 20:15:25 submit26-b9-4 setroubleshoot[136066]: SELinux is preventing /usr/bin/python3.9 from unlink access on the file repomd.xml. For complete SELinux messages run: sealert -l 80c54d4f-bf4b-4501-addb-1627383587d0
Jul 24 20:15:25 submit26-b9-4 setroubleshoot[136066]: SELinux is preventing /usr/bin/python3.9 from rmdir access on the directory repodata. For complete SELinux messages run: sealert -l c63d3890-151e-49a0-83f0-3dfb69d051e5
Jul 24 20:40:53 submit26-b9-4 systemd-coredump[137425]: Process 137422 (shell_jr) of user 1001 dumped core.#012#012Stack trace of thread 137422:#012#0 0x00007fa29aedb613 __execvpe_common (libc.so.6 + 0xdb613)#012#1 0x0000000000401402 main (shell_jr + 0x1402)#012#2 0x00007fa29ae2a610 __libc_start_call_main (libc.so.6 + 0x2a610)#012#3 0x00007fa29ae2a6c0 __libc_start_main@@GLIBC_2.34 (libc.so.6 + 0x2a6c0)#012#4 0x0000000000401105 _start (shell_jr + 0x1105)#012ELF object binary architecture: AMD x86-64
Jul 24 20:40:53 submit26-b9-4 systemd-coredump[137455]: Process 137452 (shell_jr) of user 1001 dumped core.#012#012Stack trace of thread 137452:#012#0 0x00007f41f52db613 __execvpe_common (libc.so.6 + 0xdb613)#012#1 0x0000000000401402 main (shell_jr + 0x1402)#012#2 0x00007f41f522a610 __libc_start_call_main (libc.so.6 + 0x2a610)#012#3 0x00007f41f522a6c0 __libc_start_main@@GLIBC_2.34 (libc.so.6 + 0x2a6c0)#012#4 0x0000000000401105 _start (shell_jr + 0x1105)#012ELF object binary architecture: AMD x86-64
1
0
Command: /usr/local/sbin/syslog-digest.py
Time : 0.5123s
Status : exited 0
Output :
Syslog digest — 2026-07-24 20:05 EDT
Processed 4,287 lines, filtered 3,414 (79%). 873 unknown (73 distinct) from 21 host(s).
== abuse (1 distinct, 348 total) ==
Jul 24 19:05:06 abuse rsyslogd[21745]: imjournal: open() failed for path: '/var/lib/rsyslog/imjournal.state.tmp': Input/output error [v8.2404.0 try https://www.rsyslog.com/e/2433 ] [x348]
== alec.cs.umd.edu (3 distinct, 60 total) ==
Jul 24 19:05:06 alec.cs.umd.edu setroubleshoot[2670163]: failed to retrieve rpm info for path '/run/netns/netns-9dfd0347-71eb-5698-085c-c769043aa5c3': [x12]
Jul 24 19:05:06 alec.cs.umd.edu sedispatch[1526]: AVC Message regarding setroubleshoot, ignoring message [x24]
Jul 24 19:05:06 alec.cs.umd.edu setroubleshoot[2670163]: SELinux is preventing /usr/bin/df from getattr access on the file /run/netns/netns-9dfd0347-71eb-5698-085c-c769043aa5c3. For complete SELinux messages run: sealert -l 23f93208-3063-4aac-b78a-bb0fcb40740c [x24]
== b0b02.cs.umd.edu (1 distinct, 1 total) ==
Jul 24 19:54:12 b0b02.cs.umd.edu rustdesk[159084]: cannot open display:
== contest (1 distinct, 34 total) ==
Jul 24 19:05:34 contest goferd[1007]: [ERROR][worker-0] gofer.messaging.adapter.connect:33 - connect: proton+amqps://satellite8.cs.umd.edu:5647, failed: Connection amqps://satellite8.cs.umd.edu:5647 disconnected: Condition('proton.pythonio', 'Connection refused to all addresses') [x34]
== csfw00a (2 distinct, 216 total) ==
Jul 24 19:05:15 csfw00a kernel: bnxt_en 0000:09:00.0 eth3: NIC Link is Down [x204]
Jul 24 19:11:01 csfw00a ospf6d[1477]: [EC 100663307] Could not send entire message [x12]
== grades01.cs.umd.edu (1 distinct, 1 total) ==
Jul 24 19:40:14 grades01.cs.umd.edu kernel: perf: interrupt took too long (12075 > 9753), lowering kernel.perf_event_max_sample_rate to 16000
== hackerman (7 distinct, 12 total) ==
Jul 24 19:19:01 hackerman gnome-software[2060381]: failed to commit changes to dconf: GDBus.Error:org.gtk.GDBus.UnmappedGError.Quark._g_2dfile_2derror_2dquark.Code2: Failed to create file “/adminhomes/sajith/.config/dconf/user.IZSET3”: Permission denied
Jul 24 19:20:04 hackerman gnome-software[2060381]: can't reliably fixup error code 4 in domain g-io-error-quark: Not a directory [x4]
Jul 24 19:20:13 hackerman gnome-software[2060381]: Only 0 apps for recent list, hiding
Jul 24 19:20:29 hackerman gnome-software[2060381]: failed to commit changes to dconf: GDBus.Error:org.gtk.GDBus.UnmappedGError.Quark._g_2dfile_2derror_2dquark.Code2: Failed to create file “/adminhomes/sajith/.config/dconf/user.X865S3”: Permission denied
Jul 24 19:20:30 hackerman packagekitd[245958]: Failed to get cache filename for libreoffice [x2]
Jul 24 19:20:30 hackerman packagekitd[245958]: Failed to get cache filename for kernel [x2]
Jul 24 19:20:39 hackerman packagekitd[245958]: failed to parse public key for /etc/pki/rpm-gpg/RPM-GPG-KEY-PQC-redhat-release
== hazfs.cs.umd.edu (11 distinct, 66 total) ==
Jul 24 19:46:08 hazfs.cs.umd.edu snmpd[1431]: send response: Failure in sendto [x6]
Jul 24 19:46:08 hazfs.cs.umd.edu snmpd[1431]: -- NET-SNMP-EXTEND-MIB::nsExtendStatus."userweb" [x6]
Jul 24 19:46:08 hazfs.cs.umd.edu snmpd[1431]: -- NET-SNMP-EXTEND-MIB::nsExtendStatus."zfslist" [x6]
Jul 24 19:46:08 hazfs.cs.umd.edu snmpd[1431]: -- NET-SNMP-EXTEND-MIB::nsExtendStatus."userhome" [x6]
Jul 24 19:46:08 hazfs.cs.umd.edu snmpd[1431]: -- NET-SNMP-EXTEND-MIB::nsExtendOutput1Line."userweb" [x6]
Jul 24 19:46:08 hazfs.cs.umd.edu snmpd[1431]: -- NET-SNMP-EXTEND-MIB::nsExtendOutput1Line."zfslist" [x6]
Jul 24 19:46:08 hazfs.cs.umd.edu snmpd[1431]: -- NET-SNMP-EXTEND-MIB::nsExtendOutput1Line."userhome" [x6]
Jul 24 19:46:08 hazfs.cs.umd.edu snmpd[1431]: -- NET-SNMP-EXTEND-MIB::nsExtendOutputFull."userweb" [x6]
Jul 24 19:46:08 hazfs.cs.umd.edu snmpd[1431]: -- NET-SNMP-EXTEND-MIB::nsExtendOutputFull."zfslist" [x6]
Jul 24 19:46:08 hazfs.cs.umd.edu snmpd[1431]: -- NET-SNMP-EXTEND-MIB::nsExtendOutputFull."userhome" [x6]
Jul 24 19:46:08 hazfs.cs.umd.edu snmpd[1431]: -- NET-SNMP-EXTEND-MIB::nsExtendOutNumLines."userweb" [x6]
== idm00 (1 distinct, 1 total) ==
Jul 24 19:51:05 idm00 named[1455]: client @0x7f331017ba28 10.73.240.42#62305: update '73.10.in-addr.arpa/IN' denied
== idmp0 (1 distinct, 1 total) ==
Jul 24 19:34:55 idmp0 named[5198]: client @0x7f98f4005288 10.73.240.43#56334: update '73.10.in-addr.arpa/IN' denied
== inbound01.cs.umd.edu (2 distinct, 3 total) ==
Jul 24 19:06:56 inbound01.cs.umd.edu krb5_child[1436602]: Client 'admin(a)UMD.EDU' not found in Kerberos database [x2]
Jul 24 19:48:04 inbound01.cs.umd.edu krb5_child[1445956]: Preauthentication failed
== itmon02 (1 distinct, 40 total) ==
Jul 24 19:08:09 itmon02 sshd[1834]: error: beginning MaxStartups throttling [x40]
== newhonors2 (1 distinct, 24 total) ==
Jul 24 19:13:03 newhonors2 dhcpcd[232093]: dhcpcd is not running [x24]
== outbound00.cs.umd.edu (1 distinct, 6 total) ==
Jul 24 19:09:09 outbound00.cs.umd.edu python3[3399953]: ldapdb [x6]
== outbound01.cs.umd.edu (2 distinct, 7 total) ==
Jul 24 19:13:06 outbound01.cs.umd.edu python3[1428550]: ldapdb [x6]
Jul 24 19:51:07 outbound01.cs.umd.edu krb5_child[1437077]: Client 'admin(a)UMD.EDU' not found in Kerberos database
== peach.cs.umd.edu (2 distinct, 2 total) ==
Jul 24 19:52:08 peach.cs.umd.edu setroubleshoot[570799]: SELinux is preventing /usr/bin/qemu-ga from search access on the directory /var/lib/containers/storage/overlay. For complete SELinux messages run: sealert -l ba415951-a2c6-424e-b17d-305c5300b9f3
Jul 24 19:52:08 peach.cs.umd.edu setroubleshoot[570799]: SELinux is preventing /usr/bin/qemu-ga from search access on the directory /var/lib/containers/storage/overlay. For complete SELinux messages run: sealert -l 6aeb0956-fcf2-462a-ae4d-439b912c16d0
== sebatinsky.cs.umd.edu (1 distinct, 1 total) ==
Jul 24 19:09:39 sebatinsky.cs.umd.edu setroubleshoot[3314909]: SELinux is preventing /usr/sbin/pdns_server from name_bind access on the udp_socket port 10200. For complete SELinux messages run: sealert -l 1d6d2e11-bd08-481b-b245-8ea9b76b7ba1
== sentry-docker00.cs.umd.edu (30 distinct, 30 total) ==
Jul 24 19:18:11 sentry-docker00.cs.umd.edu systemd-udevd[2835479]: Could not generate persistent MAC address for veth79c2678: No such file or directory
Jul 24 19:18:11 sentry-docker00.cs.umd.edu systemd-udevd[2835480]: Could not generate persistent MAC address for veth125e0e9: No such file or directory
Jul 24 19:24:48 sentry-docker00.cs.umd.edu systemd-udevd[2837844]: link_config: could not get ethtool features for vetha85325f
Jul 24 19:24:48 sentry-docker00.cs.umd.edu systemd-udevd[2837844]: Could not set offload features of vetha85325f: No such device
Jul 24 19:24:49 sentry-docker00.cs.umd.edu systemd-udevd[2837869]: Could not generate persistent MAC address for vethcfa21fe: No such file or directory
Jul 24 19:24:49 sentry-docker00.cs.umd.edu systemd-udevd[2837870]: Could not generate persistent MAC address for vethd515afb: No such file or directory
Jul 24 19:24:49 sentry-docker00.cs.umd.edu systemd-udevd[2837873]: Could not generate persistent MAC address for vetha229450: No such file or directory
Jul 24 19:24:49 sentry-docker00.cs.umd.edu systemd-udevd[2837874]: Could not generate persistent MAC address for veth3008e39: No such file or directory
Jul 24 19:24:49 sentry-docker00.cs.umd.edu systemd-udevd[2837896]: Could not generate persistent MAC address for vethd89f3c8: No such file or directory
Jul 24 19:24:49 sentry-docker00.cs.umd.edu systemd-udevd[2837873]: Could not generate persistent MAC address for veth4470af8: No such file or directory
Jul 24 19:24:49 sentry-docker00.cs.umd.edu systemd-udevd[2837878]: Could not generate persistent MAC address for veth0dfdb1e: No such file or directory
Jul 24 19:24:49 sentry-docker00.cs.umd.edu systemd-udevd[2837896]: Could not generate persistent MAC address for vethd955310: No such file or directory
Jul 24 19:38:15 sentry-docker00.cs.umd.edu systemd-udevd[2844881]: link_config: could not get ethtool features for veth79c2678
Jul 24 19:38:15 sentry-docker00.cs.umd.edu systemd-udevd[2844881]: Could not set offload features of veth79c2678: No such device
Jul 24 19:38:15 sentry-docker00.cs.umd.edu systemd-udevd[2844901]: Could not generate persistent MAC address for vethf3164cd: No such file or directory
Jul 24 19:38:15 sentry-docker00.cs.umd.edu systemd-udevd[2844902]: Could not generate persistent MAC address for veth62d7789: No such file or directory
Jul 24 19:44:57 sentry-docker00.cs.umd.edu systemd-udevd[2847247]: link_config: could not get ethtool features for vethd89f3c8
Jul 24 19:44:57 sentry-docker00.cs.umd.edu systemd-udevd[2847247]: Could not set offload features of vethd89f3c8: No such device
Jul 24 19:44:57 sentry-docker00.cs.umd.edu systemd-udevd[2847275]: Could not generate persistent MAC address for veth2effe4f: No such file or directory
Jul 24 19:44:57 sentry-docker00.cs.umd.edu systemd-udevd[2847276]: Could not generate persistent MAC address for vetha6375a6: No such file or directory
Jul 24 19:44:57 sentry-docker00.cs.umd.edu systemd-udevd[2847279]: Could not generate persistent MAC address for vethf91134d: No such file or directory
Jul 24 19:44:57 sentry-docker00.cs.umd.edu systemd-udevd[2847280]: Could not generate persistent MAC address for veth20506b7: No such file or directory
Jul 24 19:44:57 sentry-docker00.cs.umd.edu systemd-udevd[2847295]: Could not generate persistent MAC address for veth728ca0b: No such file or directory
Jul 24 19:44:57 sentry-docker00.cs.umd.edu systemd-udevd[2847299]: Could not generate persistent MAC address for veth82052e3: No such file or directory
Jul 24 19:44:57 sentry-docker00.cs.umd.edu systemd-udevd[2847295]: Could not generate persistent MAC address for vethfc2cc40: No such file or directory
Jul 24 19:44:57 sentry-docker00.cs.umd.edu systemd-udevd[2847299]: Could not generate persistent MAC address for veth8b7799f: No such file or directory
Jul 24 19:58:23 sentry-docker00.cs.umd.edu systemd-udevd[2854305]: link_config: could not get ethtool features for vethf3164cd
Jul 24 19:58:23 sentry-docker00.cs.umd.edu systemd-udevd[2854305]: Could not set offload features of vethf3164cd: No such device
Jul 24 19:58:24 sentry-docker00.cs.umd.edu systemd-udevd[2854323]: Could not generate persistent MAC address for veth420d9d6: No such file or directory
Jul 24 19:58:24 sentry-docker00.cs.umd.edu systemd-udevd[2854324]: Could not generate persistent MAC address for veth1bb2705: No such file or directory
== strawberry (2 distinct, 8 total) ==
Jul 24 19:09:44 strawberry udisksd[1067]: Error performing housekeeping for drive /org/freedesktop/UDisks2/drives/ST2000DM001_1CH164_W1E8J5KJ: Error updating SMART data: Error sending ATA command CHECK POWER MODE: Unexpected sense data returned:#0120000: 00 00 00 00 00 00 00 00 00 00 00 00 00 00 00 00 ................#0120010: 00 00 00 00 00 00 00 00 00 00 00 00 00 00 00 00 ................#012 (g-io-error-quark, 0) [x6]
Jul 24 19:34:42 strawberry smartd[5314]: Device: /dev/sda [SAT], failed to read SMART Attribute Data [x2]
== submit26-b9-2 (1 distinct, 5 total) ==
Jul 24 19:23:06 submit26-b9-2 systemd[1]: user(a)1001.service: Main process exited, code=killed, status=9/KILL [x5]
== submit26-b9-4 (1 distinct, 7 total) ==
Jul 24 19:13:05 submit26-b9-4 systemd[1]: user(a)1001.service: Main process exited, code=killed, status=9/KILL [x7]
1
0
Command: /usr/local/sbin/syslog-digest.py
Time : 0.5241s
Status : exited 0
Output :
Syslog digest — 2026-07-24 19:05 EDT
Processed 4,222 lines, filtered 3,355 (79%). 867 unknown (160 distinct) from 59 host(s).
== abadi-computer (2 distinct, 2 total) ==
Jul 24 18:16:18 abadi-computer falcon-sensor-bpf[529]: CrowdStrike(4): Could not retrieve DisableProxy value: c0000225
Jul 24 18:16:18 abadi-computer falcon-sensor-bpf[529]: CrowdStrike(4): ConnectWithProxy: Unable to get application proxy host from CsConfig: c0000225
== abuse (1 distinct, 346 total) ==
Jul 24 18:05:06 abuse rsyslogd[21745]: imjournal: open() failed for path: '/var/lib/rsyslog/imjournal.state.tmp': Input/output error [v8.2404.0 try https://www.rsyslog.com/e/2433 ] [x346]
== ai-course (2 distinct, 2 total) ==
Jul 24 18:15:57 ai-course falcon-sensor-bpf[663]: CrowdStrike(4): Could not retrieve DisableProxy value: c0000225
Jul 24 18:15:57 ai-course falcon-sensor-bpf[663]: CrowdStrike(4): ConnectWithProxy: Unable to get application proxy host from CsConfig: c0000225
== alec.cs.umd.edu (3 distinct, 60 total) ==
Jul 24 18:05:27 alec.cs.umd.edu setroubleshoot[2655342]: failed to retrieve rpm info for path '/run/netns/netns-9dfd0347-71eb-5698-085c-c769043aa5c3': [x12]
Jul 24 18:05:28 alec.cs.umd.edu sedispatch[1526]: AVC Message regarding setroubleshoot, ignoring message [x24]
Jul 24 18:05:28 alec.cs.umd.edu setroubleshoot[2655342]: SELinux is preventing /usr/bin/df from getattr access on the file /run/netns/netns-9dfd0347-71eb-5698-085c-c769043aa5c3. For complete SELinux messages run: sealert -l 23f93208-3063-4aac-b78a-bb0fcb40740c [x24]
== b0b02.cs.umd.edu (1 distinct, 1 total) ==
Jul 24 18:54:10 b0b02.cs.umd.edu rustdesk[144066]: cannot open display:
== bachata (11 distinct, 11 total) ==
Jul 24 18:16:19 bachata kernel: clocksource: timekeeping watchdog on CPU0: kvm-clock retried 1 times before success
Jul 24 18:56:52 bachata smbd[1834845]: [2026/07/24 18:56:52.343308, 0] ../../source3/smbd/smb2_service.c:117(chdir_current_service)
Jul 24 18:56:52 bachata smbd[1834845]: chdir_current_service: vfs_ChDir(/fs/junkfood/nelson) failed: Permission denied. Current token: uid=20608, gid=20608, 20 groups: 20608 319050000 25274 319000009 25057 30872 25195 30043 25038 15228 31006 15294 15206 15248 25025 30742 25200 319100011 30871 30736
Jul 24 18:56:52 bachata smbd[1834845]: [2026/07/24 18:56:52.343854, 0] ../../source3/smbd/smbXsrv_tcon.c:914(smbXsrv_tcon_disconnect)
Jul 24 18:56:52 bachata smbd[1834845]: smbXsrv_tcon_disconnect: disconnect(0x5374331c, 'nelson'): chdir_current_service() failed: NT_STATUS_INTERNAL_ERROR
Jul 24 18:56:52 bachata smbd[1834845]: [2026/07/24 18:56:52.604222, 0] ../../source3/smbd/smbXsrv_tcon.c:1028(smbXsrv_tcon_disconnect_all)
Jul 24 18:56:52 bachata smbd[1834845]: smbXsrv_tcon_disconnect_all: count[3] errors[1] first[NT_STATUS_INTERNAL_ERROR]
Jul 24 18:56:52 bachata smbd[1834845]: [2026/07/24 18:56:52.604323, 0] ../../source3/smbd/smbXsrv_session.c:1900(smbXsrv_session_logoff)
Jul 24 18:56:52 bachata smbd[1834845]: smbXsrv_session_logoff: smbXsrv_session_logoff(0xc7743325): smb2srv_tcon_disconnect_all() failed: NT_STATUS_INTERNAL_ERROR
Jul 24 18:56:52 bachata smbd[1834845]: [2026/07/24 18:56:52.604365, 0] ../../source3/smbd/smbXsrv_session.c:1728(smbXsrv_session_remove_channel_done)
Jul 24 18:56:52 bachata smbd[1834845]: smbXsrv_session_remove_channel_done: smbXsrv_session_logoff(3346281253) failed: NT_STATUS_INTERNAL_ERROR
== biggulp.cs.umd.edu (2 distinct, 2 total) ==
Jul 24 18:16:32 biggulp.cs.umd.edu falcon-sensor-bpf[834]: CrowdStrike(4): Could not retrieve DisableProxy value: c0000225
Jul 24 18:16:32 biggulp.cs.umd.edu falcon-sensor-bpf[834]: CrowdStrike(4): ConnectWithProxy: Unable to get application proxy host from CsConfig: c0000225
== bigtuna (2 distinct, 2 total) ==
Jul 24 18:10:01 bigtuna falcon-sensor-bpf[874]: CrowdStrike(4): Could not retrieve DisableProxy value: c0000225
Jul 24 18:10:01 bigtuna falcon-sensor-bpf[874]: CrowdStrike(4): ConnectWithProxy: Unable to get application proxy host from CsConfig: c0000225
== borealis (2 distinct, 2 total) ==
Jul 24 18:13:19 borealis falcon-sensor-bpf[921]: CrowdStrike(4): Could not retrieve DisableProxy value: c0000225
Jul 24 18:13:19 borealis falcon-sensor-bpf[921]: CrowdStrike(4): ConnectWithProxy: Unable to get application proxy host from CsConfig: c0000225
== borogove.cs.umd.edu (2 distinct, 2 total) ==
Jul 24 18:14:02 borogove.cs.umd.edu falcon-sensor-bpf[1394]: CrowdStrike(4): Could not retrieve DisableProxy value: c0000225
Jul 24 18:14:02 borogove.cs.umd.edu falcon-sensor-bpf[1394]: CrowdStrike(4): ConnectWithProxy: Unable to get application proxy host from CsConfig: c0000225
== cheezit.cs.umd.edu (2 distinct, 2 total) ==
Jul 24 18:09:40 cheezit.cs.umd.edu falcon-sensor-bpf[1347]: CrowdStrike(4): Could not retrieve DisableProxy value: c0000225
Jul 24 18:09:40 cheezit.cs.umd.edu falcon-sensor-bpf[1347]: CrowdStrike(4): ConnectWithProxy: Unable to get application proxy host from CsConfig: c0000225
== contest (1 distinct, 33 total) ==
Jul 24 18:06:39 contest goferd[1007]: [ERROR][worker-0] gofer.messaging.adapter.connect:33 - connect: proton+amqps://satellite8.cs.umd.edu:5647, failed: Connection amqps://satellite8.cs.umd.edu:5647 disconnected: Condition('proton.pythonio', 'Connection refused to all addresses') [x33]
== csfw00a (1 distinct, 178 total) ==
Jul 24 18:04:36 csfw00a kernel: bnxt_en 0000:09:00.0 eth3: NIC Link is Down [x178]
== cskayako (2 distinct, 2 total) ==
Jul 24 18:14:34 cskayako falcon-sensor-bpf[746]: CrowdStrike(4): Could not retrieve DisableProxy value: c0000225
Jul 24 18:14:34 cskayako falcon-sensor-bpf[746]: CrowdStrike(4): ConnectWithProxy: Unable to get application proxy host from CsConfig: c0000225
== defer (2 distinct, 2 total) ==
Jul 24 18:16:18 defer falcon-sensor-bpf[811]: CrowdStrike(4): Could not retrieve DisableProxy value: c0000225
Jul 24 18:16:18 defer falcon-sensor-bpf[811]: CrowdStrike(4): ConnectWithProxy: Unable to get application proxy host from CsConfig: c0000225
== dojo (2 distinct, 2 total) ==
Jul 24 18:09:22 dojo falcon-sensor-bpf[2284]: CrowdStrike(4): Could not retrieve DisableProxy value: c0000225
Jul 24 18:09:22 dojo falcon-sensor-bpf[2284]: CrowdStrike(4): ConnectWithProxy: Unable to get application proxy host from CsConfig: c0000225
== emaar (2 distinct, 2 total) ==
Jul 24 18:14:17 emaar falcon-sensor-bpf[971]: CrowdStrike(4): Could not retrieve DisableProxy value: c0000225
Jul 24 18:14:17 emaar falcon-sensor-bpf[971]: CrowdStrike(4): ConnectWithProxy: Unable to get application proxy host from CsConfig: c0000225
== frabjous (2 distinct, 2 total) ==
Jul 24 18:16:14 frabjous falcon-sensor-bpf[1357]: CrowdStrike(4): Could not retrieve DisableProxy value: c0000225
Jul 24 18:16:14 frabjous falcon-sensor-bpf[1357]: CrowdStrike(4): ConnectWithProxy: Unable to get application proxy host from CsConfig: c0000225
== frozone (2 distinct, 2 total) ==
Jul 24 18:10:05 frozone falcon-sensor-bpf[1052]: CrowdStrike(4): Could not retrieve DisableProxy value: c0000225
Jul 24 18:10:05 frozone falcon-sensor-bpf[1052]: CrowdStrike(4): ConnectWithProxy: Unable to get application proxy host from CsConfig: c0000225
== galahad.cs.umd.edu (2 distinct, 2 total) ==
Jul 24 18:14:48 galahad.cs.umd.edu falcon-sensor-bpf[970]: CrowdStrike(4): Could not retrieve DisableProxy value: c0000225
Jul 24 18:14:48 galahad.cs.umd.edu falcon-sensor-bpf[970]: CrowdStrike(4): ConnectWithProxy: Unable to get application proxy host from CsConfig: c0000225
== gle-omnibus00.cs.umd.edu (2 distinct, 2 total) ==
Jul 24 18:12:05 gle-omnibus00.cs.umd.edu falcon-sensor-bpf[974]: CrowdStrike(4): Could not retrieve DisableProxy value: c0000225
Jul 24 18:12:05 gle-omnibus00.cs.umd.edu falcon-sensor-bpf[974]: CrowdStrike(4): ConnectWithProxy: Unable to get application proxy host from CsConfig: c0000225
== grosh (2 distinct, 2 total) ==
Jul 24 18:14:34 grosh falcon-sensor-bpf[110450]: CrowdStrike(4): Could not retrieve DisableProxy value: c0000225
Jul 24 18:14:34 grosh falcon-sensor-bpf[110450]: CrowdStrike(4): ConnectWithProxy: Unable to get application proxy host from CsConfig: c0000225
== hackerman (8 distinct, 13 total) ==
Jul 24 18:14:22 hackerman falcon-sensor-bpf[896]: CrowdStrike(4): Could not retrieve DisableProxy value: c0000225
Jul 24 18:14:22 hackerman falcon-sensor-bpf[896]: CrowdStrike(4): ConnectWithProxy: Unable to get application proxy host from CsConfig: c0000225
Jul 24 18:20:04 hackerman gnome-software[2060381]: can't reliably fixup error code 4 in domain g-io-error-quark: Not a directory [x4]
Jul 24 18:20:13 hackerman gnome-software[2060381]: Only 0 apps for recent list, hiding
Jul 24 18:20:30 hackerman gnome-software[2060381]: failed to commit changes to dconf: GDBus.Error:org.gtk.GDBus.UnmappedGError.Quark._g_2dfile_2derror_2dquark.Code2: Failed to create file “/adminhomes/sajith/.config/dconf/user.WUKFT3”: Permission denied
Jul 24 18:20:30 hackerman packagekitd[232326]: Failed to get cache filename for libreoffice [x2]
Jul 24 18:20:30 hackerman packagekitd[232326]: Failed to get cache filename for kernel [x2]
Jul 24 18:20:39 hackerman packagekitd[232326]: failed to parse public key for /etc/pki/rpm-gpg/RPM-GPG-KEY-PQC-redhat-release
== haproxy02.cs.umd.edu (2 distinct, 2 total) ==
Jul 24 18:15:38 haproxy02.cs.umd.edu falcon-sensor-bpf[990]: CrowdStrike(4): Could not retrieve DisableProxy value: c0000225
Jul 24 18:15:38 haproxy02.cs.umd.edu falcon-sensor-bpf[990]: CrowdStrike(4): ConnectWithProxy: Unable to get application proxy host from CsConfig: c0000225
== haproxy03.cs.umd.edu (2 distinct, 2 total) ==
Jul 24 18:15:39 haproxy03.cs.umd.edu falcon-sensor-bpf[1401]: CrowdStrike(4): Could not retrieve DisableProxy value: c0000225
Jul 24 18:15:39 haproxy03.cs.umd.edu falcon-sensor-bpf[1401]: CrowdStrike(4): ConnectWithProxy: Unable to get application proxy host from CsConfig: c0000225
== hasaraumd (2 distinct, 2 total) ==
Jul 24 18:16:05 hasaraumd falcon-sensor-bpf[730]: CrowdStrike(4): Could not retrieve DisableProxy value: c0000225
Jul 24 18:16:05 hasaraumd falcon-sensor-bpf[730]: CrowdStrike(4): ConnectWithProxy: Unable to get application proxy host from CsConfig: c0000225
== hspc (2 distinct, 2 total) ==
Jul 24 18:14:29 hspc falcon-sensor-bpf[1008]: CrowdStrike(4): Could not retrieve DisableProxy value: c0000225
Jul 24 18:14:29 hspc falcon-sensor-bpf[1008]: CrowdStrike(4): ConnectWithProxy: Unable to get application proxy host from CsConfig: c0000225
== idm00 (1 distinct, 1 total) ==
Jul 24 18:51:04 idm00 named[1455]: client @0x7f3304b3abb8 10.73.240.42#54144: update '73.10.in-addr.arpa/IN' denied
== idmp0 (1 distinct, 1 total) ==
Jul 24 18:34:55 idmp0 named[5198]: client @0x7f9904001258 10.73.240.43#50335: update '73.10.in-addr.arpa/IN' denied
== inbound01.cs.umd.edu (3 distinct, 4 total) ==
Jul 24 18:29:50 inbound01.cs.umd.edu krb5_child[1427887]: Client 'admin(a)UMD.EDU' not found in Kerberos database [x2]
Jul 24 18:38:53 inbound01.cs.umd.edu krb5_child[1429824]: Preauthentication failed
Jul 24 18:39:44 inbound01.cs.umd.edu krb5_child[1429939]: Client 'gitlab(a)UMD.EDU' not found in Kerberos database
== irb2156 (2 distinct, 2 total) ==
Jul 24 18:15:04 irb2156 falcon-sensor-bpf[3825]: CrowdStrike(4): Could not retrieve DisableProxy value: c0000225
Jul 24 18:15:04 irb2156 falcon-sensor-bpf[3825]: CrowdStrike(4): ConnectWithProxy: Unable to get application proxy host from CsConfig: c0000225
== itmon02 (1 distinct, 47 total) ==
Jul 24 18:08:04 itmon02 sshd[1834]: error: beginning MaxStartups throttling [x47]
== jaws.cs.umd.edu (6 distinct, 7 total) ==
Jul 24 18:13:41 jaws.cs.umd.edu falcon-sensor-bpf[1195]: CrowdStrike(4): Could not retrieve DisableProxy value: c0000225
Jul 24 18:13:41 jaws.cs.umd.edu falcon-sensor-bpf[1195]: CrowdStrike(4): ConnectWithProxy: Unable to get application proxy host from CsConfig: c0000225
Jul 24 18:33:36 jaws.cs.umd.edu systemd-coredump[1348428]: Process 1348412 (podman) of user 981 dumped core.#012#012Stack trace of thread 1348412:#012#0 0x000055cd20a6546e internal/runtime/syscall/linux.Syscall6 (podman + 0x48b46e)#012#1 0x000055cd20b450a6 syscall.Syscall (podman + 0x56b0a6)#012#2 0x000055cd20b45c50 syscall.Syscall.abi0 (podman + 0x56bc50)#012#3 0x000055cd20cafc2e github.com/containers/podman/vendor/golang.org/x/sys/unix.OpenTree (podman + 0x6d5c2e)#012#4 0x000055cd21308f4b github.com/containers/podman/vendor/github.com/cyphar/filepath-securejoin/p… (podman + 0xd2ef4b)#012#5 0x000055cd21308e54 github.com/containers/podman/vendor/github.com/cyphar/filepath-securejoin/p… (podman + 0xd2ee54)#012#6 0x000055cd20af8dcc sync.(*Once).doSlow (podman + 0x51edcc)#012#7 0x000055cd20af8cf9 sync.(*Once).Do (podman + 0x51ecf9)#012#8 0x000055cd21308d
c5 github.com/containers/podman/vendor/github.com/cyphar/filepath-securejoin/p… (podman + 0xd2edc5)#012#9 0x000055cd2130a3e2 github.com/containers/podman/vendor/github.com/cyphar/filepath-securejoin/p… (podman + 0xd303e2)#012#10 0x000055cd2130a7f3 github.com/containers/podman/vendor/github.com/cyphar/filepath-securejoin/p… (podman + 0xd307f3)#012#11 0x000055cd2130991c github.com/containers/podman/vendor/github.com/cyphar/filepath-securejoin/p… (podman + 0xd2f91c)#012#12 0x000055cd21309358 github.com/containers/podman/vendor/github.com/cyphar/filepath-securejoin/p… (podman + 0xd2f358)#012#13 0x000055cd20af8dcc sync.(*Once).doSlow (podman + 0x51edcc)#012#14 0x000055cd20af8cf9 sync.(*Once).D
o (podman + 0x51ecf9)#012#15 0x000055cd213092c5 github.com/containers/podman/vendor/github.com/cyphar/filepath-securejoin/p… (podman + 0xd2f2c5)#012#16 0x000055cd2130a79a github.com/containers/podman/vendor/github.com/cyphar/filepath-securejoin/p… (podman + 0xd3079a)#012#17 0x000055cd2131134e github.com/containers/podman/vendor/github.com/opencontainers/selinux/go-se… (podman + 0xd3734e)#012#18 0x000055cd21311838 github.com/containers/podman/vendor/github.com/opencontainers/selinux/go-se… (podman + 0xd37838)#012#19 0x000055cd213105df github.com/containers/podman/vendor/github.com/opencontainers/selinux/go-se… (podman + 0xd365df)#012#20 0x000055cd21310873 github.com/containers/podman/vendor/github.com/opencontainers/selinux/go-se… (podman + 0xd36873)#012#21 0x000
055cd21508f4b github.com/containers/podman/vendor/go.podman.io/common/pkg/config.defaultC… (podman + 0xf2ef4b)#012#22 0x000055cd2150c912 github.com/containers/podman/vendor/go.podman.io/common/pkg/config.newLocked (podman + 0xf32912)#012#23 0x000055cd2150c605 github.com/containers/podman/vendor/go.podman.io/common/pkg/config.New (podman + 0xf32605)#012#24 0x000055cd21c7ffd3 github.com/containers/podman/cmd/podman/registry.newPodmanConfig (podman + 0x16a5fd3)#012#25 0x000055cd20af8dcc sync.(*Once).doSlow (podman + 0x51edcc)#012#26 0x000055cd21ca0c50 github.com/containers/podman/cmd/podman/common.init (podman + 0x16c6c50)#012#27 0x000055cd20abea57 runtime.doInit1 (podman + 0x4e4a57)#012#28 0x000055cd20aaef90 runtime.main (podman + 0x4d4f90)#012#29 0x000055cd20aeeee1 runtime.goexit.abi0 (podman + 0x514ee1)#012ELF object binary architecture: AMD x86-64
Jul 24 18:33:37 jaws.cs.umd.edu systemd-coredump[1348460]: Process 1348437 (podman) of user 981 dumped core.#012#012Stack trace of thread 1348437:#012#0 0x0000564b4263846e internal/runtime/syscall/linux.Syscall6 (podman + 0x48b46e)#012#1 0x0000564b427180a6 syscall.Syscall (podman + 0x56b0a6)#012#2 0x0000564b42718c50 syscall.Syscall.abi0 (podman + 0x56bc50)#012#3 0x0000564b42882c2e github.com/containers/podman/vendor/golang.org/x/sys/unix.OpenTree (podman + 0x6d5c2e)#012#4 0x0000564b42edbf4b github.com/containers/podman/vendor/github.com/cyphar/filepath-securejoin/p… (podman + 0xd2ef4b)#012#5 0x0000564b42edbe54 github.com/containers/podman/vendor/github.com/cyphar/filepath-securejoin/p… (podman + 0xd2ee54)#012#6 0x0000564b426cbdcc sync.(*Once).doSlow (podman + 0x51edcc)#012#7 0x0000564b426cbcf9 sync.(*Once).Do (podman + 0x51ecf9)#012#8 0x0000564b42edbd
c5 github.com/containers/podman/vendor/github.com/cyphar/filepath-securejoin/p… (podman + 0xd2edc5)#012#9 0x0000564b42edd3e2 github.com/containers/podman/vendor/github.com/cyphar/filepath-securejoin/p… (podman + 0xd303e2)#012#10 0x0000564b42edd7f3 github.com/containers/podman/vendor/github.com/cyphar/filepath-securejoin/p… (podman + 0xd307f3)#012#11 0x0000564b42edc91c github.com/containers/podman/vendor/github.com/cyphar/filepath-securejoin/p… (podman + 0xd2f91c)#012#12 0x0000564b42edc358 github.com/containers/podman/vendor/github.com/cyphar/filepath-securejoin/p… (podman + 0xd2f358)#012#13 0x0000564b426cbdcc sync.(*Once).doSlow (podman + 0x51edcc)#012#14 0x0000564b426cbcf9 sync.(*Once).D
o (podman + 0x51ecf9)#012#15 0x0000564b42edc2c5 github.com/containers/podman/vendor/github.com/cyphar/filepath-securejoin/p… (podman + 0xd2f2c5)#012#16 0x0000564b42edd79a github.com/containers/podman/vendor/github.com/cyphar/filepath-securejoin/p… (podman + 0xd3079a)#012#17 0x0000564b42ee434e github.com/containers/podman/vendor/github.com/opencontainers/selinux/go-se… (podman + 0xd3734e)#012#18 0x0000564b42ee4838 github.com/containers/podman/vendor/github.com/opencontainers/selinux/go-se… (podman + 0xd37838)#012#19 0x0000564b42ee35df github.com/containers/podman/vendor/github.com/opencontainers/selinux/go-se… (podman + 0xd365df)#012#20 0x0000564b42ee3873 github.com/containers/podman/vendor/github.com/opencontainers/selinux/go-se… (podman + 0xd36873)#012#21 0x000
0564b430dbf4b github.com/containers/podman/vendor/go.podman.io/common/pkg/config.defaultC… (podman + 0xf2ef4b)#012#22 0x0000564b430df912 github.com/containers/podman/vendor/go.podman.io/common/pkg/config.newLocked (podman + 0xf32912)#012#23 0x0000564b430df605 github.com/containers/podman/vendor/go.podman.io/common/pkg/config.New (podman + 0xf32605)#012#24 0x0000564b43852fd3 github.com/containers/podman/cmd/podman/registry.newPodmanConfig (podman + 0x16a5fd3)#012#25 0x0000564b426cbdcc sync.(*Once).doSlow (podman + 0x51edcc)#012#26 0x0000564b43873c50 github.com/containers/podman/cmd/podman/common.init (podman + 0x16c6c50)#012#27 0x0000564b42691a57 runtime.doInit1 (podman + 0x4e4a57)#012#28 0x0000564b42681f90 runtime.main (podman + 0x4d4f90)#012#29 0x0000564b426c1ee1 runtime.goexit.abi0 (podman + 0x514ee1)#012ELF object binary architecture: AMD x86-64
Jul 24 18:33:38 jaws.cs.umd.edu systemd-coredump[1348486]: Process 1348467 (podman) of user 981 dumped core.#012#012Stack trace of thread 1348467:#012#0 0x0000557d6b26546e internal/runtime/syscall/linux.Syscall6 (podman + 0x48b46e)#012#1 0x0000557d6b3450a6 syscall.Syscall (podman + 0x56b0a6)#012#2 0x0000557d6b345c50 syscall.Syscall.abi0 (podman + 0x56bc50)#012#3 0x0000557d6b4afc2e github.com/containers/podman/vendor/golang.org/x/sys/unix.OpenTree (podman + 0x6d5c2e)#012#4 0x0000557d6bb08f4b github.com/containers/podman/vendor/github.com/cyphar/filepath-securejoin/p… (podman + 0xd2ef4b)#012#5 0x0000557d6bb08e54 github.com/containers/podman/vendor/github.com/cyphar/filepath-securejoin/p… (podman + 0xd2ee54)#012#6 0x0000557d6b2f8dcc sync.(*Once).doSlow (podman + 0x51edcc)#012#7 0x0000557d6b2f8cf9 sync.(*Once).Do (podman + 0x51ecf9)#012#8 0x0000557d6bb08d
c5 github.com/containers/podman/vendor/github.com/cyphar/filepath-securejoin/p… (podman + 0xd2edc5)#012#9 0x0000557d6bb0a3e2 github.com/containers/podman/vendor/github.com/cyphar/filepath-securejoin/p… (podman + 0xd303e2)#012#10 0x0000557d6bb0a7f3 github.com/containers/podman/vendor/github.com/cyphar/filepath-securejoin/p… (podman + 0xd307f3)#012#11 0x0000557d6bb0991c github.com/containers/podman/vendor/github.com/cyphar/filepath-securejoin/p… (podman + 0xd2f91c)#012#12 0x0000557d6bb09358 github.com/containers/podman/vendor/github.com/cyphar/filepath-securejoin/p… (podman + 0xd2f358)#012#13 0x0000557d6b2f8dcc sync.(*Once).doSlow (podman + 0x51edcc)#012#14 0x0000557d6b2f8cf9 sync.(*Once).D
o (podman + 0x51ecf9)#012#15 0x0000557d6bb092c5 github.com/containers/podman/vendor/github.com/cyphar/filepath-securejoin/p… (podman + 0xd2f2c5)#012#16 0x0000557d6bb0a79a github.com/containers/podman/vendor/github.com/cyphar/filepath-securejoin/p… (podman + 0xd3079a)#012#17 0x0000557d6bb1134e github.com/containers/podman/vendor/github.com/opencontainers/selinux/go-se… (podman + 0xd3734e)#012#18 0x0000557d6bb11838 github.com/containers/podman/vendor/github.com/opencontainers/selinux/go-se… (podman + 0xd37838)#012#19 0x0000557d6bb105df github.com/containers/podman/vendor/github.com/opencontainers/selinux/go-se… (podman + 0xd365df)#012#20 0x0000557d6bb10873 github.com/containers/podman/vendor/github.com/opencontainers/selinux/go-se… (podman + 0xd36873)#012#21 0x000
0557d6bd08f4b github.com/containers/podman/vendor/go.podman.io/common/pkg/config.defaultC… (podman + 0xf2ef4b)#012#22 0x0000557d6bd0c912 github.com/containers/podman/vendor/go.podman.io/common/pkg/config.newLocked (podman + 0xf32912)#012#23 0x0000557d6bd0c605 github.com/containers/podman/vendor/go.podman.io/common/pkg/config.New (podman + 0xf32605)#012#24 0x0000557d6c47ffd3 github.com/containers/podman/cmd/podman/registry.newPodmanConfig (podman + 0x16a5fd3)#012#25 0x0000557d6b2f8dcc sync.(*Once).doSlow (podman + 0x51edcc)#012#26 0x0000557d6c4a0c50 github.com/containers/podman/cmd/podman/common.init (podman + 0x16c6c50)#012#27 0x0000557d6b2bea57 runtime.doInit1 (podman + 0x4e4a57)#012#28 0x0000557d6b2aef90 runtime.main (podman + 0x4d4f90)#012#29 0x0000557d6b2eeee1 runtime.goexit.abi0 (podman + 0x514ee1)#012ELF object binary architecture: AMD x86-64
Jul 24 18:33:39 jaws.cs.umd.edu setroubleshoot[1348427]: SELinux is preventing /usr/bin/podman from using the nnp_transition access on a process. For complete SELinux messages run: sealert -l 3c7643bc-dd69-4695-b48c-7d780b62b6cf [x2]
== kadath.cs.umd.edu (2 distinct, 2 total) ==
Jul 24 18:15:05 kadath.cs.umd.edu falcon-sensor-bpf[938]: CrowdStrike(4): Could not retrieve DisableProxy value: c0000225
Jul 24 18:15:05 kadath.cs.umd.edu falcon-sensor-bpf[938]: CrowdStrike(4): ConnectWithProxy: Unable to get application proxy host from CsConfig: c0000225
== krispykreme.cs.umd.edu (2 distinct, 2 total) ==
Jul 24 18:17:57 krispykreme.cs.umd.edu falcon-sensor-bpf[1296]: CrowdStrike(4): Could not retrieve DisableProxy value: c0000225
Jul 24 18:17:57 krispykreme.cs.umd.edu falcon-sensor-bpf[1296]: CrowdStrike(4): ConnectWithProxy: Unable to get application proxy host from CsConfig: c0000225
== mashie (2 distinct, 2 total) ==
Jul 24 18:14:00 mashie falcon-sensor-bpf[786]: CrowdStrike(4): Could not retrieve DisableProxy value: c0000225
Jul 24 18:14:00 mashie falcon-sensor-bpf[786]: CrowdStrike(4): ConnectWithProxy: Unable to get application proxy host from CsConfig: c0000225
== neodontcare.cs.umd.edu (2 distinct, 2 total) ==
Jul 24 18:14:14 neodontcare.cs.umd.edu falcon-sensor-bpf[950]: CrowdStrike(4): Could not retrieve DisableProxy value: c0000225
Jul 24 18:14:14 neodontcare.cs.umd.edu falcon-sensor-bpf[950]: CrowdStrike(4): ConnectWithProxy: Unable to get application proxy host from CsConfig: c0000225
== neograd (2 distinct, 2 total) ==
Jul 24 18:12:22 neograd falcon-sensor-bpf[697]: CrowdStrike(4): Could not retrieve DisableProxy value: c0000225
Jul 24 18:12:22 neograd falcon-sensor-bpf[697]: CrowdStrike(4): ConnectWithProxy: Unable to get application proxy host from CsConfig: c0000225
== netman.cs.umd.edu (2 distinct, 2 total) ==
Jul 24 18:11:48 netman.cs.umd.edu falcon-sensor-bpf[1129]: CrowdStrike(4): Could not retrieve DisableProxy value: c0000225
Jul 24 18:11:48 netman.cs.umd.edu falcon-sensor-bpf[1129]: CrowdStrike(4): ConnectWithProxy: Unable to get application proxy host from CsConfig: c0000225
== newhonors2 (1 distinct, 24 total) ==
Jul 24 18:13:03 newhonors2 dhcpcd[230274]: dhcpcd is not running [x24]
== nightingale (2 distinct, 2 total) ==
Jul 24 18:14:53 nightingale falcon-sensor-bpf[909]: CrowdStrike(4): Could not retrieve DisableProxy value: c0000225
Jul 24 18:14:53 nightingale falcon-sensor-bpf[909]: CrowdStrike(4): ConnectWithProxy: Unable to get application proxy host from CsConfig: c0000225
== orchids (2 distinct, 2 total) ==
Jul 24 18:14:57 orchids falcon-sensor-bpf[1099]: CrowdStrike(4): Could not retrieve DisableProxy value: c0000225
Jul 24 18:14:57 orchids falcon-sensor-bpf[1099]: CrowdStrike(4): ConnectWithProxy: Unable to get application proxy host from CsConfig: c0000225
== outbound00.cs.umd.edu (1 distinct, 6 total) ==
Jul 24 18:09:09 outbound00.cs.umd.edu python3[3385989]: ldapdb [x6]
== outbound01.cs.umd.edu (2 distinct, 7 total) ==
Jul 24 18:13:06 outbound01.cs.umd.edu python3[1414700]: ldapdb [x6]
Jul 24 18:39:48 outbound01.cs.umd.edu krb5_child[1420727]: Client 'gitlab(a)UMD.EDU' not found in Kerberos database
== quiss (2 distinct, 2 total) ==
Jul 24 18:14:26 quiss falcon-sensor-bpf[1564085]: CrowdStrike(4): Could not retrieve DisableProxy value: c0000225
Jul 24 18:14:26 quiss falcon-sensor-bpf[1564085]: CrowdStrike(4): ConnectWithProxy: Unable to get application proxy host from CsConfig: c0000225
== sebatinsky.cs.umd.edu (2 distinct, 2 total) ==
Jul 24 18:32:42 sebatinsky.cs.umd.edu kernel: hpet1: lost 1 rtc interrupts
Jul 24 18:32:43 sebatinsky.cs.umd.edu kernel: hpet1: lost 2 rtc interrupts
== sentry-docker00.cs.umd.edu (34 distinct, 34 total) ==
Jul 24 18:17:54 sentry-docker00.cs.umd.edu systemd-udevd[2806212]: Could not generate persistent MAC address for veth0ea6c2b: No such file or directory
Jul 24 18:17:54 sentry-docker00.cs.umd.edu systemd-udevd[2806213]: Could not generate persistent MAC address for veth84815ea: No such file or directory
Jul 24 18:24:24 sentry-docker00.cs.umd.edu systemd-udevd[2809554]: Could not generate persistent MAC address for vethe8e3065: No such file or directory
Jul 24 18:24:24 sentry-docker00.cs.umd.edu systemd-udevd[2809555]: Could not generate persistent MAC address for veth76fd34c: No such file or directory
Jul 24 18:24:24 sentry-docker00.cs.umd.edu systemd-udevd[2809558]: Could not generate persistent MAC address for veth517cc8f: No such file or directory
Jul 24 18:24:24 sentry-docker00.cs.umd.edu systemd-udevd[2809559]: Could not generate persistent MAC address for veth1aed710: No such file or directory
Jul 24 18:24:24 sentry-docker00.cs.umd.edu systemd-udevd[2809563]: Could not generate persistent MAC address for vethd01adbd: No such file or directory
Jul 24 18:24:24 sentry-docker00.cs.umd.edu systemd-udevd[2809568]: Could not generate persistent MAC address for vethd57917a: No such file or directory
Jul 24 18:24:24 sentry-docker00.cs.umd.edu systemd-udevd[2809584]: Could not generate persistent MAC address for vethaa368b4: No such file or directory
Jul 24 18:24:24 sentry-docker00.cs.umd.edu systemd-udevd[2809585]: Could not generate persistent MAC address for veth4fa9369: No such file or directory
Jul 24 18:37:59 sentry-docker00.cs.umd.edu systemd-udevd[2815638]: Could not generate persistent MAC address for vethd9b7fa3: No such file or directory
Jul 24 18:37:59 sentry-docker00.cs.umd.edu systemd-udevd[2815639]: Could not generate persistent MAC address for vetheef73ba: No such file or directory
Jul 24 18:44:32 sentry-docker00.cs.umd.edu systemd-udevd[2819013]: Could not generate persistent MAC address for vethc5af1b4: No such file or directory
Jul 24 18:44:32 sentry-docker00.cs.umd.edu systemd-udevd[2819014]: Could not generate persistent MAC address for veth2742310: No such file or directory
Jul 24 18:44:32 sentry-docker00.cs.umd.edu systemd-udevd[2819017]: Could not generate persistent MAC address for veth98d7c29: No such file or directory
Jul 24 18:44:32 sentry-docker00.cs.umd.edu systemd-udevd[2819039]: Could not generate persistent MAC address for veth35e29e3: No such file or directory
Jul 24 18:44:32 sentry-docker00.cs.umd.edu systemd-udevd[2819036]: Could not generate persistent MAC address for veth3dcf655: No such file or directory
Jul 24 18:44:32 sentry-docker00.cs.umd.edu systemd-udevd[2819032]: Could not generate persistent MAC address for veth3538c01: No such file or directory
Jul 24 18:44:32 sentry-docker00.cs.umd.edu systemd-udevd[2819013]: Could not generate persistent MAC address for veth85692fc: No such file or directory
Jul 24 18:44:32 sentry-docker00.cs.umd.edu systemd-udevd[2819036]: Could not generate persistent MAC address for veth155f892: No such file or directory
Jul 24 18:58:03 sentry-docker00.cs.umd.edu systemd-udevd[2825014]: link_config: could not get ethtool features for vethd9b7fa3
Jul 24 18:58:03 sentry-docker00.cs.umd.edu systemd-udevd[2825014]: Could not set offload features of vethd9b7fa3: No such device
Jul 24 18:58:03 sentry-docker00.cs.umd.edu systemd-udevd[2825031]: Could not generate persistent MAC address for veth92d6f3f: No such file or directory
Jul 24 18:58:03 sentry-docker00.cs.umd.edu systemd-udevd[2825030]: Could not generate persistent MAC address for veth1bc0eff: No such file or directory
Jul 24 19:04:40 sentry-docker00.cs.umd.edu systemd-udevd[2828423]: link_config: could not get ethtool features for veth3538c01
Jul 24 19:04:40 sentry-docker00.cs.umd.edu systemd-udevd[2828423]: Could not set offload features of veth3538c01: No such device
Jul 24 19:04:40 sentry-docker00.cs.umd.edu systemd-udevd[2828443]: Could not generate persistent MAC address for vetheb2febc: No such file or directory
Jul 24 19:04:40 sentry-docker00.cs.umd.edu systemd-udevd[2828444]: Could not generate persistent MAC address for veth35ecfe7: No such file or directory
Jul 24 19:04:40 sentry-docker00.cs.umd.edu systemd-udevd[2828471]: Could not generate persistent MAC address for vetha3c3049: No such file or directory
Jul 24 19:04:40 sentry-docker00.cs.umd.edu systemd-udevd[2828469]: Could not generate persistent MAC address for veth67e06d9: No such file or directory
... 4 more distinct messages not shown
== soul (1 distinct, 1 total) ==
Jul 24 18:38:43 soul krb5_child[1632585]: Preauthentication failed
== strawberry (4 distinct, 10 total) ==
Jul 24 18:09:44 strawberry udisksd[1067]: Error performing housekeeping for drive /org/freedesktop/UDisks2/drives/ST2000DM001_1CH164_W1E8J5KJ: Error updating SMART data: Error sending ATA command CHECK POWER MODE: Unexpected sense data returned:#0120000: 00 00 00 00 00 00 00 00 00 00 00 00 00 00 00 00 ................#0120010: 00 00 00 00 00 00 00 00 00 00 00 00 00 00 00 00 ................#012 (g-io-error-quark, 0) [x6]
Jul 24 18:16:15 strawberry falcon-sensor-bpf[808]: CrowdStrike(4): Could not retrieve DisableProxy value: c0000225
Jul 24 18:16:15 strawberry falcon-sensor-bpf[808]: CrowdStrike(4): ConnectWithProxy: Unable to get application proxy host from CsConfig: c0000225
Jul 24 18:34:42 strawberry smartd[5314]: Device: /dev/sda [SAT], failed to read SMART Attribute Data [x2]
== stuckeys (2 distinct, 2 total) ==
Jul 24 18:14:19 stuckeys falcon-sensor-bpf[824199]: CrowdStrike(4): Could not retrieve DisableProxy value: c0000225
Jul 24 18:14:19 stuckeys falcon-sensor-bpf[824199]: CrowdStrike(4): ConnectWithProxy: Unable to get application proxy host from CsConfig: c0000225
== submit26-b9-2 (1 distinct, 1 total) ==
Jul 24 19:00:14 submit26-b9-2 systemd[1]: user(a)1001.service: Main process exited, code=killed, status=9/KILL
== submit26-b9-4 (1 distinct, 5 total) ==
Jul 24 18:18:05 submit26-b9-4 systemd[1]: user(a)1001.service: Main process exited, code=killed, status=9/KILL [x5]
== talkhosts9 (2 distinct, 2 total) ==
Jul 24 18:13:30 talkhosts9 falcon-sensor-bpf[714]: CrowdStrike(4): Could not retrieve DisableProxy value: c0000225
Jul 24 18:13:30 talkhosts9 falcon-sensor-bpf[714]: CrowdStrike(4): ConnectWithProxy: Unable to get application proxy host from CsConfig: c0000225
== teaching-awards (2 distinct, 2 total) ==
Jul 24 18:17:34 teaching-awards falcon-sensor-bpf[782]: CrowdStrike(4): Could not retrieve DisableProxy value: c0000225
Jul 24 18:17:34 teaching-awards falcon-sensor-bpf[782]: CrowdStrike(4): ConnectWithProxy: Unable to get application proxy host from CsConfig: c0000225
== tulgey.cs.umd.edu (2 distinct, 2 total) ==
Jul 24 18:15:39 tulgey.cs.umd.edu falcon-sensor-bpf[1526]: CrowdStrike(4): Could not retrieve DisableProxy value: c0000225
Jul 24 18:15:39 tulgey.cs.umd.edu falcon-sensor-bpf[1526]: CrowdStrike(4): ConnectWithProxy: Unable to get application proxy host from CsConfig: c0000225
== tumtum.cs.umd.edu (2 distinct, 2 total) ==
Jul 24 18:16:16 tumtum.cs.umd.edu falcon-sensor-bpf[1360]: CrowdStrike(4): Could not retrieve DisableProxy value: c0000225
Jul 24 18:16:16 tumtum.cs.umd.edu falcon-sensor-bpf[1360]: CrowdStrike(4): ConnectWithProxy: Unable to get application proxy host from CsConfig: c0000225
== unknown (1 distinct, 1 total) ==
using-explainable-ai
== wraith (2 distinct, 2 total) ==
Jul 24 18:13:16 wraith falcon-sensor[917]: CrowdStrike(4): Could not retrieve DisableProxy value: c0000225
Jul 24 18:13:16 wraith falcon-sensor[917]: CrowdStrike(4): ConnectWithProxy: Unable to get application proxy host from CsConfig: c0000225
== zwicker-computer (2 distinct, 2 total) ==
Jul 24 18:16:16 zwicker-computer falcon-sensor-bpf[718]: CrowdStrike(4): Could not retrieve DisableProxy value: c0000225
Jul 24 18:16:16 zwicker-computer falcon-sensor-bpf[718]: CrowdStrike(4): ConnectWithProxy: Unable to get application proxy host from CsConfig: c0000225
1
0
Command: /usr/local/sbin/syslog-digest.py
Time : 0.5093s
Status : exited 0
Output :
Syslog digest — 2026-07-24 18:05 EDT
Processed 4,367 lines, filtered 3,464 (79%). 903 unknown (108 distinct) from 24 host(s).
== abuse (1 distinct, 346 total) ==
Jul 24 17:05:06 abuse rsyslogd[21745]: imjournal: open() failed for path: '/var/lib/rsyslog/imjournal.state.tmp': Input/output error [v8.2404.0 try https://www.rsyslog.com/e/2433 ] [x346]
== alec.cs.umd.edu (3 distinct, 60 total) ==
Jul 24 17:05:05 alec.cs.umd.edu setroubleshoot[2640622]: failed to retrieve rpm info for path '/run/netns/netns-9dfd0347-71eb-5698-085c-c769043aa5c3': [x12]
Jul 24 17:05:06 alec.cs.umd.edu sedispatch[1526]: AVC Message regarding setroubleshoot, ignoring message [x24]
Jul 24 17:05:06 alec.cs.umd.edu setroubleshoot[2640622]: SELinux is preventing /usr/bin/df from getattr access on the file /run/netns/netns-9dfd0347-71eb-5698-085c-c769043aa5c3. For complete SELinux messages run: sealert -l 23f93208-3063-4aac-b78a-bb0fcb40740c [x24]
== b0b02.cs.umd.edu (1 distinct, 1 total) ==
Jul 24 17:54:08 b0b02.cs.umd.edu rustdesk[129061]: cannot open display:
== contest (9 distinct, 44 total) ==
Jul 24 17:05:57 contest goferd[1007]: [ERROR][worker-0] gofer.messaging.adapter.connect:33 - connect: proton+amqps://satellite8.cs.umd.edu:5647, failed: Connection amqps://satellite8.cs.umd.edu:5647 disconnected: Condition('proton.pythonio', 'Connection refused to all addresses') [x34]
Jul 24 17:48:12 contest setroubleshoot[20429]: SELinux is preventing /usr/libexec/platform-python3.6 from create access on the directory libdnf.PdKsQ8. For complete SELinux messages run: sealert -l cb6b25c6-4765-4cf2-88a0-9b3b508e94e9
Jul 24 17:48:12 contest setroubleshoot[20429]: SELinux is preventing /usr/bin/gpgconf from add_name access on the directory repodata. For complete SELinux messages run: sealert -l 41cf7b1b-0f34-4609-98f2-b66e7825fef7
Jul 24 17:48:12 contest setroubleshoot[20429]: SELinux is preventing /usr/libexec/platform-python3.6 from create access on the file mirrorlist. For complete SELinux messages run: sealert -l fc20ff92-ea83-4f38-a24b-ddfd737a3141
Jul 24 17:48:12 contest setroubleshoot[20429]: SELinux is preventing /usr/libexec/platform-python3.6 from setattr access on the file repomd.xml. For complete SELinux messages run: sealert -l ac675631-fa35-4e93-adc9-b692b18e53e5 [x2]
Jul 24 17:48:13 contest setroubleshoot[20429]: SELinux is preventing /usr/libexec/platform-python3.6 from create access on the file repomd.xml.asc. For complete SELinux messages run: sealert -l fc20ff92-ea83-4f38-a24b-ddfd737a3141
Jul 24 17:48:13 contest setroubleshoot[20429]: SELinux is preventing /usr/libexec/platform-python3.6 from read access on the directory libdnf.PdKsQ8. For complete SELinux messages run: sealert -l 45d103b6-0810-4890-a705-990118577ce8
Jul 24 17:48:13 contest setroubleshoot[20429]: SELinux is preventing /usr/libexec/platform-python3.6 from remove_name access on the directory repomd.xml. For complete SELinux messages run: sealert -l 7e499113-2fd7-4f67-bec6-3521efbe3637 [x2]
Jul 24 17:48:13 contest setroubleshoot[20429]: SELinux is preventing /usr/libexec/platform-python3.6 from rmdir access on the directory repodata. For complete SELinux messages run: sealert -l 3928930b-a1ed-448d-950b-0665ac2adef8
== csfw00a (1 distinct, 258 total) ==
Jul 24 17:05:07 csfw00a kernel: bnxt_en 0000:09:00.0 eth3: NIC Link is Down [x258]
== frozone (1 distinct, 1 total) ==
Jul 24 17:34:41 frozone systemd-tmpfiles[273503]: Failed to remove "/var/tmp/test.log", ignoring: Operation not permitted
== grafana (2 distinct, 2 total) ==
Jul 24 17:14:50 grafana SetroubleshootPrivileged.py[2314 failed to retrieve rpm info for path '/var/lib/selinux/targeted/active/modules/200/grafana':
Jul 24 17:14:50 grafana setroubleshoot[231404]: SELinux is preventing /usr/sbin/grafana from name_connect access on the tcp_socket port 636. For complete SELinux messages run: sealert -l 04b7a852-a8e2-466a-9560-d51f3f685e71
== hackerman (7 distinct, 12 total) ==
Jul 24 17:19:01 hackerman gnome-software[2060381]: failed to commit changes to dconf: GDBus.Error:org.gtk.GDBus.UnmappedGError.Quark._g_2dfile_2derror_2dquark.Code2: Failed to create file “/adminhomes/sajith/.config/dconf/user.0GICT3”: Permission denied
Jul 24 17:20:04 hackerman gnome-software[2060381]: can't reliably fixup error code 4 in domain g-io-error-quark: Not a directory [x4]
Jul 24 17:20:13 hackerman gnome-software[2060381]: Only 0 apps for recent list, hiding
Jul 24 17:20:29 hackerman gnome-software[2060381]: failed to commit changes to dconf: GDBus.Error:org.gtk.GDBus.UnmappedGError.Quark._g_2dfile_2derror_2dquark.Code2: Failed to create file “/adminhomes/sajith/.config/dconf/user.EQVFT3”: Permission denied
Jul 24 17:20:30 hackerman packagekitd[218522]: Failed to get cache filename for libreoffice [x2]
Jul 24 17:20:30 hackerman packagekitd[218522]: Failed to get cache filename for kernel [x2]
Jul 24 17:20:40 hackerman packagekitd[218522]: failed to parse public key for /etc/pki/rpm-gpg/RPM-GPG-KEY-PQC-redhat-release
== idm00 (1 distinct, 1 total) ==
Jul 24 17:51:04 idm00 named[1455]: client @0x7f33155207f8 10.73.240.42#58277: update '73.10.in-addr.arpa/IN' denied
== idmp0 (1 distinct, 1 total) ==
Jul 24 17:34:55 idmp0 named[5198]: client @0x7f98f400b838 10.73.240.43#50856: update '73.10.in-addr.arpa/IN' denied
== irb2156 (2 distinct, 4 total) ==
Jul 24 17:32:47 irb2156 gcr-prompter[646921]: cannot open display: :1 [x2]
Jul 24 17:32:47 irb2156 gnome-keyring-d[165848]: couldn't create system prompt: GDBus.Error:org.freedesktop.DBus.Error.NameHasNoOwner: Could not activate remote peer 'org.gnome.keyring.SystemPrompter': unit failed [x2]
== itmon01 (2 distinct, 3 total) ==
Jul 24 17:25:51 itmon01 sshd[22993]: error: AuthorizedKeysCommand /usr/bin/sss_ssh_authorizedkeys root failed, status 1 [x2]
Jul 24 17:25:51 itmon01 sshd[22993]: error: key_cert_check_authority: invalid certificate
== itmon02 (1 distinct, 53 total) ==
Jul 24 17:08:04 itmon02 sshd[1834]: error: beginning MaxStartups throttling [x53]
== netman.cs.umd.edu (2 distinct, 2 total) ==
Jul 24 17:36:27 netman.cs.umd.edu falcon-sensor-bpf[1129]: CrowdStrike(4): Could not retrieve DisableProxy value: c0000225
Jul 24 17:36:27 netman.cs.umd.edu falcon-sensor-bpf[1129]: CrowdStrike(4): ConnectWithProxy: Unable to get application proxy host from CsConfig: c0000225
== newhonors2 (1 distinct, 24 total) ==
Jul 24 17:13:02 newhonors2 dhcpcd[228412]: dhcpcd is not running [x24]
== outbound00.cs.umd.edu (1 distinct, 6 total) ==
Jul 24 17:09:08 outbound00.cs.umd.edu python3[3372225]: ldapdb [x6]
== outbound01.cs.umd.edu (2 distinct, 7 total) ==
Jul 24 17:13:06 outbound01.cs.umd.edu python3[1400621]: ldapdb [x6]
Jul 24 17:57:49 outbound01.cs.umd.edu krb5_child[1411354]: Client 'gitlab(a)UMD.EDU' not found in Kerberos database
== peach.cs.umd.edu (2 distinct, 2 total) ==
Jul 24 17:12:08 peach.cs.umd.edu setroubleshoot[548915]: SELinux is preventing /usr/bin/qemu-ga from search access on the directory /var/lib/containers/storage/overlay. For complete SELinux messages run: sealert -l ba415951-a2c6-424e-b17d-305c5300b9f3
Jul 24 17:12:08 peach.cs.umd.edu setroubleshoot[548915]: SELinux is preventing /usr/bin/qemu-ga from search access on the directory /var/lib/containers/storage/overlay. For complete SELinux messages run: sealert -l 6aeb0956-fcf2-462a-ae4d-439b912c16d0
== sentry-docker00.cs.umd.edu (38 distinct, 38 total) ==
Jul 24 17:17:33 sentry-docker00.cs.umd.edu systemd-udevd[2777844]: link_config: could not get ethtool features for veth1e989fc
Jul 24 17:17:33 sentry-docker00.cs.umd.edu systemd-udevd[2777844]: Could not set offload features of veth1e989fc: No such device
Jul 24 17:17:34 sentry-docker00.cs.umd.edu systemd-udevd[2777854]: Could not generate persistent MAC address for veth663eff1: No such file or directory
Jul 24 17:17:34 sentry-docker00.cs.umd.edu systemd-udevd[2777855]: Could not generate persistent MAC address for vethe269c0b: No such file or directory
Jul 24 17:23:58 sentry-docker00.cs.umd.edu systemd-udevd[2781311]: link_config: could not get ethtool features for veth5631256
Jul 24 17:23:58 sentry-docker00.cs.umd.edu systemd-udevd[2781311]: Could not set offload features of veth5631256: No such device
Jul 24 17:23:59 sentry-docker00.cs.umd.edu systemd-udevd[2781336]: Could not generate persistent MAC address for vethbc54125: No such file or directory
Jul 24 17:23:59 sentry-docker00.cs.umd.edu systemd-udevd[2781337]: Could not generate persistent MAC address for veth97c19e2: No such file or directory
Jul 24 17:23:59 sentry-docker00.cs.umd.edu systemd-udevd[2781362]: Could not generate persistent MAC address for veth6fcfa07: No such file or directory
Jul 24 17:23:59 sentry-docker00.cs.umd.edu systemd-udevd[2781363]: Could not generate persistent MAC address for veth981b3fa: No such file or directory
Jul 24 17:23:59 sentry-docker00.cs.umd.edu systemd-udevd[2781377]: Could not generate persistent MAC address for vethc1fc26c: No such file or directory
Jul 24 17:23:59 sentry-docker00.cs.umd.edu systemd-udevd[2781376]: Could not generate persistent MAC address for veth8e88bca: No such file or directory
Jul 24 17:23:59 sentry-docker00.cs.umd.edu systemd-udevd[2781374]: Could not generate persistent MAC address for veth195e9c4: No such file or directory
Jul 24 17:23:59 sentry-docker00.cs.umd.edu systemd-udevd[2781368]: Could not generate persistent MAC address for veth7d2a000: No such file or directory
Jul 24 17:37:42 sentry-docker00.cs.umd.edu systemd-udevd[2787432]: Could not generate persistent MAC address for veth00190df: No such file or directory
Jul 24 17:37:42 sentry-docker00.cs.umd.edu systemd-udevd[2787433]: Could not generate persistent MAC address for vetha383964: No such file or directory
Jul 24 17:44:07 sentry-docker00.cs.umd.edu systemd-udevd[2790680]: link_config: could not get ethtool features for vethbc54125
Jul 24 17:44:07 sentry-docker00.cs.umd.edu systemd-udevd[2790680]: Could not set offload features of vethbc54125: No such device
Jul 24 17:44:07 sentry-docker00.cs.umd.edu systemd-udevd[2790741]: Could not generate persistent MAC address for vethd692847: No such file or directory
Jul 24 17:44:07 sentry-docker00.cs.umd.edu systemd-udevd[2790742]: Could not generate persistent MAC address for veth288b275: No such file or directory
Jul 24 17:44:07 sentry-docker00.cs.umd.edu systemd-udevd[2790745]: Could not generate persistent MAC address for veth57a9a16: No such file or directory
Jul 24 17:44:07 sentry-docker00.cs.umd.edu systemd-udevd[2790747]: Could not generate persistent MAC address for vethb557eaf: No such file or directory
Jul 24 17:44:07 sentry-docker00.cs.umd.edu systemd-udevd[2790769]: Could not generate persistent MAC address for veth7a72927: No such file or directory
Jul 24 17:44:07 sentry-docker00.cs.umd.edu systemd-udevd[2790770]: Could not generate persistent MAC address for vethf995d4b: No such file or directory
Jul 24 17:44:07 sentry-docker00.cs.umd.edu systemd-udevd[2790773]: Could not generate persistent MAC address for vetha1d10ef: No such file or directory
Jul 24 17:44:07 sentry-docker00.cs.umd.edu systemd-udevd[2790777]: Could not generate persistent MAC address for veth8e766a9: No such file or directory
Jul 24 17:57:46 sentry-docker00.cs.umd.edu systemd-udevd[2796798]: Could not generate persistent MAC address for vethbb43d5d: No such file or directory
Jul 24 17:57:46 sentry-docker00.cs.umd.edu systemd-udevd[2796799]: Could not generate persistent MAC address for vetha9015fc: No such file or directory
Jul 24 18:04:15 sentry-docker00.cs.umd.edu systemd-udevd[2800126]: link_config: could not get ethtool features for vetha1d10ef
Jul 24 18:04:15 sentry-docker00.cs.umd.edu systemd-udevd[2800126]: Could not set offload features of vetha1d10ef: No such device
... 8 more distinct messages not shown
== strawberry (2 distinct, 8 total) ==
Jul 24 17:09:44 strawberry udisksd[1067]: Error performing housekeeping for drive /org/freedesktop/UDisks2/drives/ST2000DM001_1CH164_W1E8J5KJ: Error updating SMART data: Error sending ATA command CHECK POWER MODE: Unexpected sense data returned:#0120000: 00 00 00 00 00 00 00 00 00 00 00 00 00 00 00 00 ................#0120010: 00 00 00 00 00 00 00 00 00 00 00 00 00 00 00 00 ................#012 (g-io-error-quark, 0) [x6]
Jul 24 17:34:42 strawberry smartd[5314]: Device: /dev/sda [SAT], failed to read SMART Attribute Data [x2]
== submit26-b9-2 (9 distinct, 9 total) ==
Jul 24 17:12:48 submit26-b9-2 setroubleshoot[122582]: SELinux is preventing /usr/bin/python3.9 from create access on the directory /(null). For complete SELinux messages run: sealert -l d506243c-d61e-48f3-b42a-4592c913deb0
Jul 24 17:12:48 submit26-b9-2 setroubleshoot[122582]: SELinux is preventing /usr/bin/python3.9 from add_name access on the directory /(null). For complete SELinux messages run: sealert -l 3b4752ac-1b9a-4af9-a05b-32e4c2eb13ab
Jul 24 17:12:48 submit26-b9-2 setroubleshoot[122582]: SELinux is preventing /usr/bin/python3.9 from create access on the file /(null). For complete SELinux messages run: sealert -l 29e5adbd-4381-4467-b40d-a2219101e096
Jul 24 17:12:48 submit26-b9-2 setroubleshoot[122582]: SELinux is preventing /usr/bin/python3.9 from open access on the file /tmp/libdnf.4337gm/repodata/repomd.xml. For complete SELinux messages run: sealert -l 1b38f2ec-01ce-4343-8059-ba7494ecc5c4
Jul 24 17:12:48 submit26-b9-2 setroubleshoot[122582]: SELinux is preventing /usr/bin/python3.9 from setattr access on the file repomd.xml. For complete SELinux messages run: sealert -l e5f9af40-1f63-4924-b012-27ab2a7b2266
Jul 24 17:12:48 submit26-b9-2 setroubleshoot[122582]: SELinux is preventing /usr/bin/python3.9 from read access on the directory libdnf.4337gm. For complete SELinux messages run: sealert -l 5c54db87-54a3-4a7c-97b4-b5c48d6c3543
Jul 24 17:12:48 submit26-b9-2 setroubleshoot[122582]: SELinux is preventing /usr/bin/python3.9 from remove_name access on the directory repomd.xml. For complete SELinux messages run: sealert -l 63cd60e1-1e61-4276-afea-dd8526ffe8b2
Jul 24 17:12:48 submit26-b9-2 setroubleshoot[122582]: SELinux is preventing /usr/bin/python3.9 from unlink access on the file repomd.xml. For complete SELinux messages run: sealert -l 81c7e9ec-e023-4c6d-b1ad-c02a242e655e
Jul 24 17:12:48 submit26-b9-2 setroubleshoot[122582]: SELinux is preventing /usr/bin/python3.9 from rmdir access on the directory repodata. For complete SELinux messages run: sealert -l 6ae9a597-e123-4d74-8eec-a8ebe0f5e4d0
== submit26-b9-3 (9 distinct, 9 total) ==
Jul 24 17:20:34 submit26-b9-3 setroubleshoot[563833]: SELinux is preventing /usr/bin/python3.9 from create access on the directory /(null). For complete SELinux messages run: sealert -l 5b912a44-22fd-4560-b201-2a4e289b73f5
Jul 24 17:20:34 submit26-b9-3 setroubleshoot[563833]: SELinux is preventing /usr/bin/python3.9 from add_name access on the directory /(null). For complete SELinux messages run: sealert -l 7f1df1e4-725e-4953-98eb-1079f908f543
Jul 24 17:20:34 submit26-b9-3 setroubleshoot[563833]: SELinux is preventing /usr/bin/python3.9 from create access on the file /(null). For complete SELinux messages run: sealert -l 40b8852a-f77b-44b4-affe-5f11fa33de43
Jul 24 17:20:34 submit26-b9-3 setroubleshoot[563833]: SELinux is preventing /usr/bin/python3.9 from open access on the file /tmp/libdnf.1HAWMe/repodata/repomd.xml. For complete SELinux messages run: sealert -l 45a8019e-f6b5-4baa-92c1-862594b40d46
Jul 24 17:20:34 submit26-b9-3 setroubleshoot[563833]: SELinux is preventing /usr/bin/python3.9 from setattr access on the file repomd.xml. For complete SELinux messages run: sealert -l e9f0bfff-7784-4126-baa4-2bb06da56591
Jul 24 17:20:34 submit26-b9-3 setroubleshoot[563833]: SELinux is preventing /usr/bin/python3.9 from read access on the directory libdnf.1HAWMe. For complete SELinux messages run: sealert -l 0b17cc3d-cdc6-4fe2-a11f-3892e7c41dc7
Jul 24 17:20:34 submit26-b9-3 setroubleshoot[563833]: SELinux is preventing /usr/bin/python3.9 from remove_name access on the directory repomd.xml. For complete SELinux messages run: sealert -l 10e38c64-b65f-4cdd-901e-4375652d9a42
Jul 24 17:20:34 submit26-b9-3 setroubleshoot[563833]: SELinux is preventing /usr/bin/python3.9 from unlink access on the file repomd.xml. For complete SELinux messages run: sealert -l 7fd9cf72-ef38-48e1-b6aa-b571b26a7b22
Jul 24 17:20:34 submit26-b9-3 setroubleshoot[563833]: SELinux is preventing /usr/bin/python3.9 from rmdir access on the directory repodata. For complete SELinux messages run: sealert -l b9b11116-89bd-4a3c-980c-1d422c5dcee4
== submit26-b9-4 (1 distinct, 1 total) ==
Jul 24 17:55:44 submit26-b9-4 systemd[1]: user(a)1001.service: Main process exited, code=killed, status=9/KILL
== submit26-clnb9 (9 distinct, 11 total) ==
Jul 24 17:31:52 submit26-clnb9 setroubleshoot[1255157]: SELinux is preventing /usr/bin/python3.9 from create access on the directory /(null). For complete SELinux messages run: sealert -l 6783ed2b-5ae4-42b5-975a-4bf50eec4658 [x2]
Jul 24 17:31:52 submit26-clnb9 setroubleshoot[1255157]: SELinux is preventing /usr/bin/python3.9 from add_name access on the directory /(null). For complete SELinux messages run: sealert -l 9e7fa955-cc30-4804-ac8c-e1779e85946c [x2]
Jul 24 17:31:52 submit26-clnb9 setroubleshoot[1255157]: SELinux is preventing /usr/bin/python3.9 from create access on the file /(null). For complete SELinux messages run: sealert -l 69bfa6e3-089c-40ff-9563-fd30787d0774
Jul 24 17:31:52 submit26-clnb9 setroubleshoot[1255157]: SELinux is preventing /usr/bin/python3.9 from open access on the file /tmp/libdnf.mW0M9n/repodata/repomd.xml. For complete SELinux messages run: sealert -l 001acdb5-31ef-4e52-b10b-90f467a89ddc
Jul 24 17:31:52 submit26-clnb9 setroubleshoot[1255157]: SELinux is preventing /usr/bin/python3.9 from setattr access on the file repomd.xml. For complete SELinux messages run: sealert -l edacddcf-16ed-4dc3-8d82-7c597d5dee23
Jul 24 17:31:52 submit26-clnb9 setroubleshoot[1255157]: SELinux is preventing /usr/bin/python3.9 from read access on the directory libdnf.mW0M9n. For complete SELinux messages run: sealert -l 62b3782e-4730-4488-8178-94dafe9b552c
Jul 24 17:31:52 submit26-clnb9 setroubleshoot[1255157]: SELinux is preventing /usr/bin/python3.9 from remove_name access on the directory repomd.xml. For complete SELinux messages run: sealert -l 81cb3698-78f8-440a-8e3c-e5d1041e6b78
Jul 24 17:31:52 submit26-clnb9 setroubleshoot[1255157]: SELinux is preventing /usr/bin/python3.9 from unlink access on the file repomd.xml. For complete SELinux messages run: sealert -l 792b472a-115c-4799-9805-fc7436f916b9
Jul 24 17:31:52 submit26-clnb9 setroubleshoot[1255157]: SELinux is preventing /usr/bin/python3.9 from rmdir access on the directory repodata. For complete SELinux messages run: sealert -l 15c83a86-837b-41e2-b662-b39cd4e361cb
1
0