Command: /usr/local/sbin/syslog-digest.py
Time : 0.5319s
Status : exited 0
Output :
Syslog digest — 2026-07-24 07:05 EDT
Processed 4,401 lines, filtered 3,627 (82%). 774 unknown (254 distinct) from 57 host(s).
== abadi-computer (6 distinct, 6 total) ==
Jul 24 06:15:00 abadi-computer nologin[3289172]: Attempted login by UNKNOWN (UID: 65534) on UNKNOWN
Jul 24 06:15:00 abadi-computer pipewire[3289170]: mod.jackdbus-detect: Failed to receive jackdbus reply: org.freedesktop.DBus.Error.ServiceUnknown: The name org.jackaudio.service was not provided by any .service files
Jul 24 06:25:56 abadi-computer rsyslogd[3292517]: imjournal: filecreatemode is not set, using default 0644 [v8.2312.0 try https://www.rsyslog.com/e/2186 ]
Jul 24 07:02:24 abadi-computer falcon-sensor-bpf[529]: CrowdStrike(4): SSLSocket Disconnected from Cloud.
Jul 24 07:02:56 abadi-computer falcon-sensor-bpf[529]: CrowdStrike(4): Could not retrieve DisableProxy value: c0000225
Jul 24 07:02:56 abadi-computer falcon-sensor-bpf[529]: CrowdStrike(4): ConnectWithProxy: Unable to get application proxy host from CsConfig: c0000225
== abuse (1 distinct, 346 total) ==
Jul 24 06:05:06 abuse rsyslogd[21745]: imjournal: open() failed for path: '/var/lib/rsyslog/imjournal.state.tmp': Input/output error [v8.2404.0 try https://www.rsyslog.com/e/2433 ] [x346]
== ai-course (4 distinct, 4 total) ==
Jul 24 06:25:59 ai-course rsyslogd[1617690]: imjournal: filecreatemode is not set, using default 0644 [v8.2312.0 try https://www.rsyslog.com/e/2186 ]
Jul 24 07:00:02 ai-course falcon-sensor-bpf[663]: CrowdStrike(4): SSLSocket Disconnected from Cloud.
Jul 24 07:00:34 ai-course falcon-sensor-bpf[663]: CrowdStrike(4): Could not retrieve DisableProxy value: c0000225
Jul 24 07:00:34 ai-course falcon-sensor-bpf[663]: CrowdStrike(4): ConnectWithProxy: Unable to get application proxy host from CsConfig: c0000225
== alec.cs.umd.edu (3 distinct, 60 total) ==
Jul 24 06:05:06 alec.cs.umd.edu setroubleshoot[2476241]: failed to retrieve rpm info for path '/run/netns/netns-a2b2cc2d-7532-4db7-6a36-b1dd3d5f51db': [x12]
Jul 24 06:05:07 alec.cs.umd.edu sedispatch[1526]: AVC Message regarding setroubleshoot, ignoring message [x24]
Jul 24 06:05:07 alec.cs.umd.edu setroubleshoot[2476241]: SELinux is preventing /usr/bin/df from getattr access on the file /run/netns/netns-a2b2cc2d-7532-4db7-6a36-b1dd3d5f51db. For complete SELinux messages run: sealert -l 23f93208-3063-4aac-b78a-bb0fcb40740c [x24]
== biggulp.cs.umd.edu (3 distinct, 3 total) ==
Jul 24 07:02:21 biggulp.cs.umd.edu falcon-sensor-bpf[834]: CrowdStrike(4): SSLSocket Disconnected from Cloud.
Jul 24 07:02:53 biggulp.cs.umd.edu falcon-sensor-bpf[834]: CrowdStrike(4): Could not retrieve DisableProxy value: c0000225
Jul 24 07:02:53 biggulp.cs.umd.edu falcon-sensor-bpf[834]: CrowdStrike(4): ConnectWithProxy: Unable to get application proxy host from CsConfig: c0000225
== bigtuna (3 distinct, 3 total) ==
Jul 24 07:00:54 bigtuna falcon-sensor-bpf[874]: CrowdStrike(4): SSLSocket Disconnected from Cloud.
Jul 24 07:01:26 bigtuna falcon-sensor-bpf[874]: CrowdStrike(4): Could not retrieve DisableProxy value: c0000225
Jul 24 07:01:26 bigtuna falcon-sensor-bpf[874]: CrowdStrike(4): ConnectWithProxy: Unable to get application proxy host from CsConfig: c0000225
== borealis (3 distinct, 3 total) ==
Jul 24 07:00:09 borealis falcon-sensor-bpf[921]: CrowdStrike(4): SSLSocket Disconnected from Cloud.
Jul 24 07:00:41 borealis falcon-sensor-bpf[921]: CrowdStrike(4): Could not retrieve DisableProxy value: c0000225
Jul 24 07:00:41 borealis falcon-sensor-bpf[921]: CrowdStrike(4): ConnectWithProxy: Unable to get application proxy host from CsConfig: c0000225
== borogove.cs.umd.edu (3 distinct, 3 total) ==
Jul 24 07:00:25 borogove.cs.umd.edu falcon-sensor-bpf[1394]: CrowdStrike(4): SSLSocket Disconnected from Cloud.
Jul 24 07:00:57 borogove.cs.umd.edu falcon-sensor-bpf[1394]: CrowdStrike(4): Could not retrieve DisableProxy value: c0000225
Jul 24 07:00:57 borogove.cs.umd.edu falcon-sensor-bpf[1394]: CrowdStrike(4): ConnectWithProxy: Unable to get application proxy host from CsConfig: c0000225
== cheezit.cs.umd.edu (3 distinct, 3 total) ==
Jul 24 07:02:14 cheezit.cs.umd.edu falcon-sensor-bpf[1347]: CrowdStrike(4): SSLSocket Disconnected from Cloud.
Jul 24 07:02:46 cheezit.cs.umd.edu falcon-sensor-bpf[1347]: CrowdStrike(4): Could not retrieve DisableProxy value: c0000225
Jul 24 07:02:46 cheezit.cs.umd.edu falcon-sensor-bpf[1347]: CrowdStrike(4): ConnectWithProxy: Unable to get application proxy host from CsConfig: c0000225
== csfw00a (1 distinct, 12 total) ==
Jul 24 06:05:19 csfw00a kernel: bnxt_en 0000:09:00.0 eth3: NIC Link is Down [x12]
== cskayako (3 distinct, 3 total) ==
Jul 24 07:00:13 cskayako falcon-sensor-bpf[746]: CrowdStrike(4): SSLSocket Disconnected from Cloud.
Jul 24 07:00:45 cskayako falcon-sensor-bpf[746]: CrowdStrike(4): Could not retrieve DisableProxy value: c0000225
Jul 24 07:00:45 cskayako falcon-sensor-bpf[746]: CrowdStrike(4): ConnectWithProxy: Unable to get application proxy host from CsConfig: c0000225
== defer (3 distinct, 3 total) ==
Jul 24 07:02:26 defer falcon-sensor-bpf[811]: CrowdStrike(4): SSLSocket Disconnected from Cloud.
Jul 24 07:02:58 defer falcon-sensor-bpf[811]: CrowdStrike(4): Could not retrieve DisableProxy value: c0000225
Jul 24 07:02:58 defer falcon-sensor-bpf[811]: CrowdStrike(4): ConnectWithProxy: Unable to get application proxy host from CsConfig: c0000225
== dojo (5 distinct, 10 total) ==
Jul 24 06:26:43 dojo rsyslogd[152071]: imjournal: filecreatemode is not set, using default 0644 [v8.2312.0 try https://www.rsyslog.com/e/2186 ]
Jul 24 06:26:55 dojo systemd-machined[2390]: Failed to drop reference to machine scope, ignoring: Transport endpoint is not connected [x6]
Jul 24 07:03:18 dojo falcon-sensor-bpf[2284]: CrowdStrike(4): SSLSocket Disconnected from Cloud.
Jul 24 07:03:50 dojo falcon-sensor-bpf[2284]: CrowdStrike(4): Could not retrieve DisableProxy value: c0000225
Jul 24 07:03:50 dojo falcon-sensor-bpf[2284]: CrowdStrike(4): ConnectWithProxy: Unable to get application proxy host from CsConfig: c0000225
== emaar (4 distinct, 4 total) ==
Jul 24 06:30:29 emaar systemd[1]: insights-client.service: Start request repeated too quickly.
Jul 24 07:00:50 emaar falcon-sensor-bpf[971]: CrowdStrike(4): SSLSocket Disconnected from Cloud.
Jul 24 07:01:22 emaar falcon-sensor-bpf[971]: CrowdStrike(4): Could not retrieve DisableProxy value: c0000225
Jul 24 07:01:22 emaar falcon-sensor-bpf[971]: CrowdStrike(4): ConnectWithProxy: Unable to get application proxy host from CsConfig: c0000225
== frabjous (3 distinct, 3 total) ==
Jul 24 07:02:31 frabjous falcon-sensor-bpf[1357]: CrowdStrike(4): SSLSocket Disconnected from Cloud.
Jul 24 07:03:03 frabjous falcon-sensor-bpf[1357]: CrowdStrike(4): Could not retrieve DisableProxy value: c0000225
Jul 24 07:03:03 frabjous falcon-sensor-bpf[1357]: CrowdStrike(4): ConnectWithProxy: Unable to get application proxy host from CsConfig: c0000225
== frozone (3 distinct, 3 total) ==
Jul 24 07:00:44 frozone falcon-sensor-bpf[1052]: CrowdStrike(4): SSLSocket Disconnected from Cloud.
Jul 24 07:01:16 frozone falcon-sensor-bpf[1052]: CrowdStrike(4): Could not retrieve DisableProxy value: c0000225
Jul 24 07:01:16 frozone falcon-sensor-bpf[1052]: CrowdStrike(4): ConnectWithProxy: Unable to get application proxy host from CsConfig: c0000225
== galahad.cs.umd.edu (3 distinct, 3 total) ==
Jul 24 07:02:40 galahad.cs.umd.edu falcon-sensor-bpf[970]: CrowdStrike(4): SSLSocket Disconnected from Cloud.
Jul 24 07:03:12 galahad.cs.umd.edu falcon-sensor-bpf[970]: CrowdStrike(4): Could not retrieve DisableProxy value: c0000225
Jul 24 07:03:12 galahad.cs.umd.edu falcon-sensor-bpf[970]: CrowdStrike(4): ConnectWithProxy: Unable to get application proxy host from CsConfig: c0000225
== grosh (3 distinct, 3 total) ==
Jul 24 07:01:01 grosh falcon-sensor-bpf[110450]: CrowdStrike(4): SSLSocket Disconnected from Cloud.
Jul 24 07:01:33 grosh falcon-sensor-bpf[110450]: CrowdStrike(4): Could not retrieve DisableProxy value: c0000225
Jul 24 07:01:33 grosh falcon-sensor-bpf[110450]: CrowdStrike(4): ConnectWithProxy: Unable to get application proxy host from CsConfig: c0000225
== hackerman (12 distinct, 17 total) ==
Jul 24 06:20:04 hackerman gnome-software[2060381]: can't reliably fixup error code 4 in domain g-io-error-quark: Not a directory [x4]
Jul 24 06:20:12 hackerman gnome-software[2060381]: Only 0 apps for recent list, hiding
Jul 24 06:20:34 hackerman packagekitd[68617]: Failed to get cache filename for ImageMagick
Jul 24 06:20:34 hackerman packagekitd[68617]: Failed to get cache filename for ImageMagick-libs
Jul 24 06:20:34 hackerman packagekitd[68617]: Failed to get cache filename for libreoffice [x2]
Jul 24 06:20:34 hackerman packagekitd[68617]: Failed to get cache filename for kernel [x2]
Jul 24 06:20:39 hackerman gnome-software[2060381]: failed to commit changes to dconf: GDBus.Error:org.gtk.GDBus.UnmappedGError.Quark._g_2dfile_2derror_2dquark.Code2: Failed to create file “/adminhomes/sajith/.config/dconf/user.W76WS3”: Permission denied
Jul 24 06:20:42 hackerman packagekitd[68617]: failed to parse public key for /etc/pki/rpm-gpg/RPM-GPG-KEY-PQC-redhat-release
Jul 24 07:00:12 hackerman falcon-sensor-bpf[896]: CrowdStrike(4): SSLSocket Disconnected from Cloud.
Jul 24 07:00:44 hackerman falcon-sensor-bpf[896]: CrowdStrike(4): Could not retrieve DisableProxy value: c0000225
Jul 24 07:00:44 hackerman falcon-sensor-bpf[896]: CrowdStrike(4): ConnectWithProxy: Unable to get application proxy host from CsConfig: c0000225
Jul 24 07:03:18 hackerman systemd[1]: insights-client.service: Start request repeated too quickly.
== haproxy02.cs.umd.edu (3 distinct, 3 total) ==
Jul 24 07:02:33 haproxy02.cs.umd.edu falcon-sensor-bpf[990]: CrowdStrike(4): SSLSocket Disconnected from Cloud.
Jul 24 07:03:05 haproxy02.cs.umd.edu falcon-sensor-bpf[990]: CrowdStrike(4): Could not retrieve DisableProxy value: c0000225
Jul 24 07:03:05 haproxy02.cs.umd.edu falcon-sensor-bpf[990]: CrowdStrike(4): ConnectWithProxy: Unable to get application proxy host from CsConfig: c0000225
== haproxy03.cs.umd.edu (3 distinct, 3 total) ==
Jul 24 07:02:03 haproxy03.cs.umd.edu falcon-sensor-bpf[1401]: CrowdStrike(4): SSLSocket Disconnected from Cloud.
Jul 24 07:02:35 haproxy03.cs.umd.edu falcon-sensor-bpf[1401]: CrowdStrike(4): Could not retrieve DisableProxy value: c0000225
Jul 24 07:02:35 haproxy03.cs.umd.edu falcon-sensor-bpf[1401]: CrowdStrike(4): ConnectWithProxy: Unable to get application proxy host from CsConfig: c0000225
== hasaraumd (1 distinct, 1 total) ==
Jul 24 07:04:57 hasaraumd falcon-sensor-bpf[730]: CrowdStrike(4): SSLSocket Disconnected from Cloud.
== hspc (4 distinct, 4 total) ==
Jul 24 06:36:57 hspc rsyslogd[2352962]: imjournal: filecreatemode is not set, using default 0644 [v8.2312.0 try https://www.rsyslog.com/e/2186 ]
Jul 24 07:00:34 hspc falcon-sensor-bpf[1008]: CrowdStrike(4): SSLSocket Disconnected from Cloud.
Jul 24 07:01:06 hspc falcon-sensor-bpf[1008]: CrowdStrike(4): Could not retrieve DisableProxy value: c0000225
Jul 24 07:01:06 hspc falcon-sensor-bpf[1008]: CrowdStrike(4): ConnectWithProxy: Unable to get application proxy host from CsConfig: c0000225
== idm00 (1 distinct, 1 total) ==
Jul 24 06:51:05 idm00 named[1455]: client @0x7f330c44b1c8 10.73.240.42#49605: update '73.10.in-addr.arpa/IN' denied
== idmp0 (1 distinct, 1 total) ==
Jul 24 06:34:56 idmp0 named[5198]: client @0x7f990c000cc8 10.73.240.43#54857: update '73.10.in-addr.arpa/IN' denied
== inbound00.cs.umd.edu (1 distinct, 1 total) ==
Jul 24 06:06:58 inbound00.cs.umd.edu systemd[1]: Configuration file /usr/lib/systemd/system/authentication_milter.service is marked executable. Please remove executable permission bits. Proceeding anyway.
== inbound01.cs.umd.edu (1 distinct, 1 total) ==
Jul 24 06:17:57 inbound01.cs.umd.edu systemd[1]: Configuration file /usr/lib/systemd/system/authentication_milter.service is marked executable. Please remove executable permission bits. Proceeding anyway.
== irb2156 (3 distinct, 3 total) ==
Jul 24 07:01:02 irb2156 falcon-sensor-bpf[3825]: CrowdStrike(4): SSLSocket Disconnected from Cloud.
Jul 24 07:01:34 irb2156 falcon-sensor-bpf[3825]: CrowdStrike(4): Could not retrieve DisableProxy value: c0000225
Jul 24 07:01:34 irb2156 falcon-sensor-bpf[3825]: CrowdStrike(4): ConnectWithProxy: Unable to get application proxy host from CsConfig: c0000225
== itmon02 (8 distinct, 51 total) ==
Jul 24 06:08:09 itmon02 sshd[1834]: error: beginning MaxStartups throttling [x42]
Jul 24 06:54:55 itmon02 systemd-sysv-generator[1066834]: SysV service '/etc/rc.d/init.d/thruk' lacks a native systemd unit file, automatically generating a unit file for compatibility.
Jul 24 06:54:55 itmon02 systemd-sysv-generator[1066834]: Please update package to include a native systemd unit file. [x2]
Jul 24 06:54:55 itmon02 systemd-sysv-generator[1066834]: ! This compatibility logic is deprecated, expect removal soon. ! [x2]
Jul 24 06:54:55 itmon02 systemd-sysv-generator[1066834]: SysV service '/etc/rc.d/init.d/pnp_gearman_worker' lacks a native systemd unit file, automatically generating a unit file for compatibility.
Jul 24 06:54:55 itmon02 puppet-agent[1065091]: Could not enable influxdb:
Jul 24 06:54:55 itmon02 puppet-agent[1065091]: (/Stage[main]/Profile::Influxdb/Service[influxdb]/enable) change from 'false' to 'true' failed: Could not enable influxdb: (corrective)
Jul 24 06:54:55 itmon02 puppet-agent[1065091]: (/Stage[main]/Profile::Influxdb/Exec[influxdb-setup]) Skipping because of failed dependencies
== jaws.cs.umd.edu (7 distinct, 8 total) ==
Jul 24 06:33:20 jaws.cs.umd.edu systemd-coredump[1187349]: Process 1187332 (podman) of user 981 dumped core.#012#012Stack trace of thread 1187332:#012#0 0x0000556170ee246e internal/runtime/syscall/linux.Syscall6 (podman + 0x48b46e)#012#1 0x0000556170fc20a6 syscall.Syscall (podman + 0x56b0a6)#012#2 0x0000556170fc2c50 syscall.Syscall.abi0 (podman + 0x56bc50)#012#3 0x000055617112cc2e github.com/containers/podman/vendor/golang.org/x/sys/unix.OpenTree (podman + 0x6d5c2e)#012#4 0x0000556171785f4b github.com/containers/podman/vendor/github.com/cyphar/filepath-securejoin/p… (podman + 0xd2ef4b)#012#5 0x0000556171785e54 github.com/containers/podman/vendor/github.com/cyphar/filepath-securejoin/p… (podman + 0xd2ee54)#012#6 0x0000556170f75dcc sync.(*Once).doSlow (podman + 0x51edcc)#012#7 0x0000556170f75cf9 sync.(*Once).Do (podman + 0x51ecf9)#012#8 0x0000556171785d
c5 github.com/containers/podman/vendor/github.com/cyphar/filepath-securejoin/p… (podman + 0xd2edc5)#012#9 0x00005561717873e2 github.com/containers/podman/vendor/github.com/cyphar/filepath-securejoin/p… (podman + 0xd303e2)#012#10 0x00005561717877f3 github.com/containers/podman/vendor/github.com/cyphar/filepath-securejoin/p… (podman + 0xd307f3)#012#11 0x000055617178691c github.com/containers/podman/vendor/github.com/cyphar/filepath-securejoin/p… (podman + 0xd2f91c)#012#12 0x0000556171786358 github.com/containers/podman/vendor/github.com/cyphar/filepath-securejoin/p… (podman + 0xd2f358)#012#13 0x0000556170f75dcc sync.(*Once).doSlow (podman + 0x51edcc)#012#14 0x0000556170f75cf9 sync.(*Once).D
o (podman + 0x51ecf9)#012#15 0x00005561717862c5 github.com/containers/podman/vendor/github.com/cyphar/filepath-securejoin/p… (podman + 0xd2f2c5)#012#16 0x000055617178779a github.com/containers/podman/vendor/github.com/cyphar/filepath-securejoin/p… (podman + 0xd3079a)#012#17 0x000055617178e34e github.com/containers/podman/vendor/github.com/opencontainers/selinux/go-se… (podman + 0xd3734e)#012#18 0x000055617178e838 github.com/containers/podman/vendor/github.com/opencontainers/selinux/go-se… (podman + 0xd37838)#012#19 0x000055617178d5df github.com/containers/podman/vendor/github.com/opencontainers/selinux/go-se… (podman + 0xd365df)#012#20 0x000055617178d873 github.com/containers/podman/vendor/github.com/opencontainers/selinux/go-se… (podman + 0xd36873)#012#21 0x000
0556171985f4b github.com/containers/podman/vendor/go.podman.io/common/pkg/config.defaultC… (podman + 0xf2ef4b)#012#22 0x0000556171989912 github.com/containers/podman/vendor/go.podman.io/common/pkg/config.newLocked (podman + 0xf32912)#012#23 0x0000556171989605 github.com/containers/podman/vendor/go.podman.io/common/pkg/config.New (podman + 0xf32605)#012#24 0x00005561720fcfd3 github.com/containers/podman/cmd/podman/registry.newPodmanConfig (podman + 0x16a5fd3)#012#25 0x0000556170f75dcc sync.(*Once).doSlow (podman + 0x51edcc)#012#26 0x000055617211dc50 github.com/containers/podman/cmd/podman/common.init (podman + 0x16c6c50)#012#27 0x0000556170f3ba57 runtime.doInit1 (podman + 0x4e4a57)#012#28 0x0000556170f2bf90 runtime.main (podman + 0x4d4f90)#012#29 0x0000556170f6bee1 runtime.goexit.abi0 (podman + 0x514ee1)#012ELF object binary architecture: AMD x86-64
Jul 24 06:33:22 jaws.cs.umd.edu systemd-coredump[1187374]: Process 1187358 (podman) of user 981 dumped core.#012#012Stack trace of thread 1187358:#012#0 0x0000564e58b2a46e internal/runtime/syscall/linux.Syscall6 (podman + 0x48b46e)#012#1 0x0000564e58c0a0a6 syscall.Syscall (podman + 0x56b0a6)#012#2 0x0000564e58c0ac50 syscall.Syscall.abi0 (podman + 0x56bc50)#012#3 0x0000564e58d74c2e github.com/containers/podman/vendor/golang.org/x/sys/unix.OpenTree (podman + 0x6d5c2e)#012#4 0x0000564e593cdf4b github.com/containers/podman/vendor/github.com/cyphar/filepath-securejoin/p… (podman + 0xd2ef4b)#012#5 0x0000564e593cde54 github.com/containers/podman/vendor/github.com/cyphar/filepath-securejoin/p… (podman + 0xd2ee54)#012#6 0x0000564e58bbddcc sync.(*Once).doSlow (podman + 0x51edcc)#012#7 0x0000564e58bbdcf9 sync.(*Once).Do (podman + 0x51ecf9)#012#8 0x0000564e593cdd
c5 github.com/containers/podman/vendor/github.com/cyphar/filepath-securejoin/p… (podman + 0xd2edc5)#012#9 0x0000564e593cf3e2 github.com/containers/podman/vendor/github.com/cyphar/filepath-securejoin/p… (podman + 0xd303e2)#012#10 0x0000564e593cf7f3 github.com/containers/podman/vendor/github.com/cyphar/filepath-securejoin/p… (podman + 0xd307f3)#012#11 0x0000564e593ce91c github.com/containers/podman/vendor/github.com/cyphar/filepath-securejoin/p… (podman + 0xd2f91c)#012#12 0x0000564e593ce358 github.com/containers/podman/vendor/github.com/cyphar/filepath-securejoin/p… (podman + 0xd2f358)#012#13 0x0000564e58bbddcc sync.(*Once).doSlow (podman + 0x51edcc)#012#14 0x0000564e58bbdcf9 sync.(*Once).D
o (podman + 0x51ecf9)#012#15 0x0000564e593ce2c5 github.com/containers/podman/vendor/github.com/cyphar/filepath-securejoin/p… (podman + 0xd2f2c5)#012#16 0x0000564e593cf79a github.com/containers/podman/vendor/github.com/cyphar/filepath-securejoin/p… (podman + 0xd3079a)#012#17 0x0000564e593d634e github.com/containers/podman/vendor/github.com/opencontainers/selinux/go-se… (podman + 0xd3734e)#012#18 0x0000564e593d6838 github.com/containers/podman/vendor/github.com/opencontainers/selinux/go-se… (podman + 0xd37838)#012#19 0x0000564e593d55df github.com/containers/podman/vendor/github.com/opencontainers/selinux/go-se… (podman + 0xd365df)#012#20 0x0000564e593d5873 github.com/containers/podman/vendor/github.com/opencontainers/selinux/go-se… (podman + 0xd36873)#012#21 0x000
0564e595cdf4b github.com/containers/podman/vendor/go.podman.io/common/pkg/config.defaultC… (podman + 0xf2ef4b)#012#22 0x0000564e595d1912 github.com/containers/podman/vendor/go.podman.io/common/pkg/config.newLocked (podman + 0xf32912)#012#23 0x0000564e595d1605 github.com/containers/podman/vendor/go.podman.io/common/pkg/config.New (podman + 0xf32605)#012#24 0x0000564e59d44fd3 github.com/containers/podman/cmd/podman/registry.newPodmanConfig (podman + 0x16a5fd3)#012#25 0x0000564e58bbddcc sync.(*Once).doSlow (podman + 0x51edcc)#012#26 0x0000564e59d65c50 github.com/containers/podman/cmd/podman/common.init (podman + 0x16c6c50)#012#27 0x0000564e58b83a57 runtime.doInit1 (podman + 0x4e4a57)#012#28 0x0000564e58b73f90 runtime.main (podman + 0x4d4f90)#012#29 0x0000564e58bb3ee1 runtime.goexit.abi0 (podman + 0x514ee1)#012ELF object binary architecture: AMD x86-64
Jul 24 06:33:22 jaws.cs.umd.edu setroubleshoot[1187348]: SELinux is preventing /usr/bin/podman from using the nnp_transition access on a process. For complete SELinux messages run: sealert -l 3c7643bc-dd69-4695-b48c-7d780b62b6cf [x2]
Jul 24 06:33:23 jaws.cs.umd.edu systemd-coredump[1187407]: Process 1187390 (podman) of user 981 dumped core.#012#012Stack trace of thread 1187390:#012#0 0x0000561976d1b46e internal/runtime/syscall/linux.Syscall6 (podman + 0x48b46e)#012#1 0x0000561976dfb0a6 syscall.Syscall (podman + 0x56b0a6)#012#2 0x0000561976dfbc50 syscall.Syscall.abi0 (podman + 0x56bc50)#012#3 0x0000561976f65c2e github.com/containers/podman/vendor/golang.org/x/sys/unix.OpenTree (podman + 0x6d5c2e)#012#4 0x00005619775bef4b github.com/containers/podman/vendor/github.com/cyphar/filepath-securejoin/p… (podman + 0xd2ef4b)#012#5 0x00005619775bee54 github.com/containers/podman/vendor/github.com/cyphar/filepath-securejoin/p… (podman + 0xd2ee54)#012#6 0x0000561976daedcc sync.(*Once).doSlow (podman + 0x51edcc)#012#7 0x0000561976daecf9 sync.(*Once).Do (podman + 0x51ecf9)#012#8 0x00005619775bed
c5 github.com/containers/podman/vendor/github.com/cyphar/filepath-securejoin/p… (podman + 0xd2edc5)#012#9 0x00005619775c03e2 github.com/containers/podman/vendor/github.com/cyphar/filepath-securejoin/p… (podman + 0xd303e2)#012#10 0x00005619775c07f3 github.com/containers/podman/vendor/github.com/cyphar/filepath-securejoin/p… (podman + 0xd307f3)#012#11 0x00005619775bf91c github.com/containers/podman/vendor/github.com/cyphar/filepath-securejoin/p… (podman + 0xd2f91c)#012#12 0x00005619775bf358 github.com/containers/podman/vendor/github.com/cyphar/filepath-securejoin/p… (podman + 0xd2f358)#012#13 0x0000561976daedcc sync.(*Once).doSlow (podman + 0x51edcc)#012#14 0x0000561976daecf9 sync.(*Once).D
o (podman + 0x51ecf9)#012#15 0x00005619775bf2c5 github.com/containers/podman/vendor/github.com/cyphar/filepath-securejoin/p… (podman + 0xd2f2c5)#012#16 0x00005619775c079a github.com/containers/podman/vendor/github.com/cyphar/filepath-securejoin/p… (podman + 0xd3079a)#012#17 0x00005619775c734e github.com/containers/podman/vendor/github.com/opencontainers/selinux/go-se… (podman + 0xd3734e)#012#18 0x00005619775c7838 github.com/containers/podman/vendor/github.com/opencontainers/selinux/go-se… (podman + 0xd37838)#012#19 0x00005619775c65df github.com/containers/podman/vendor/github.com/opencontainers/selinux/go-se… (podman + 0xd365df)#012#20 0x00005619775c6873 github.com/containers/podman/vendor/github.com/opencontainers/selinux/go-se… (podman + 0xd36873)#012#21 0x000
05619777bef4b github.com/containers/podman/vendor/go.podman.io/common/pkg/config.defaultC… (podman + 0xf2ef4b)#012#22 0x00005619777c2912 github.com/containers/podman/vendor/go.podman.io/common/pkg/config.newLocked (podman + 0xf32912)#012#23 0x00005619777c2605 github.com/containers/podman/vendor/go.podman.io/common/pkg/config.New (podman + 0xf32605)#012#24 0x0000561977f35fd3 github.com/containers/podman/cmd/podman/registry.newPodmanConfig (podman + 0x16a5fd3)#012#25 0x0000561976daedcc sync.(*Once).doSlow (podman + 0x51edcc)#012#26 0x0000561977f56c50 github.com/containers/podman/cmd/podman/common.init (podman + 0x16c6c50)#012#27 0x0000561976d74a57 runtime.doInit1 (podman + 0x4e4a57)#012#28 0x0000561976d64f90 runtime.main (podman + 0x4d4f90)#012#29 0x0000561976da4ee1 runtime.goexit.abi0 (podman + 0x514ee1)#012ELF object binary architecture: AMD x86-64
Jul 24 07:00:31 jaws.cs.umd.edu falcon-sensor-bpf[1195]: CrowdStrike(4): SSLSocket Disconnected from Cloud.
Jul 24 07:01:03 jaws.cs.umd.edu falcon-sensor-bpf[1195]: CrowdStrike(4): Could not retrieve DisableProxy value: c0000225
Jul 24 07:01:03 jaws.cs.umd.edu falcon-sensor-bpf[1195]: CrowdStrike(4): ConnectWithProxy: Unable to get application proxy host from CsConfig: c0000225
== kadath.cs.umd.edu (3 distinct, 3 total) ==
Jul 24 07:00:13 kadath.cs.umd.edu falcon-sensor-bpf[938]: CrowdStrike(4): SSLSocket Disconnected from Cloud.
Jul 24 07:00:45 kadath.cs.umd.edu falcon-sensor-bpf[938]: CrowdStrike(4): Could not retrieve DisableProxy value: c0000225
Jul 24 07:00:45 kadath.cs.umd.edu falcon-sensor-bpf[938]: CrowdStrike(4): ConnectWithProxy: Unable to get application proxy host from CsConfig: c0000225
== krispykreme.cs.umd.edu (3 distinct, 3 total) ==
Jul 24 07:02:14 krispykreme.cs.umd.edu falcon-sensor-bpf[1296]: CrowdStrike(4): SSLSocket Disconnected from Cloud.
Jul 24 07:02:46 krispykreme.cs.umd.edu falcon-sensor-bpf[1296]: CrowdStrike(4): Could not retrieve DisableProxy value: c0000225
Jul 24 07:02:46 krispykreme.cs.umd.edu falcon-sensor-bpf[1296]: CrowdStrike(4): ConnectWithProxy: Unable to get application proxy host from CsConfig: c0000225
== mashie (3 distinct, 3 total) ==
Jul 24 07:00:33 mashie falcon-sensor-bpf[786]: CrowdStrike(4): SSLSocket Disconnected from Cloud.
Jul 24 07:01:05 mashie falcon-sensor-bpf[786]: CrowdStrike(4): Could not retrieve DisableProxy value: c0000225
Jul 24 07:01:05 mashie falcon-sensor-bpf[786]: CrowdStrike(4): ConnectWithProxy: Unable to get application proxy host from CsConfig: c0000225
== matrix (2 distinct, 2 total) ==
Jul 24 06:38:00 matrix xinetd[744]: Exiting...
Jul 24 06:38:10 matrix kernel: kauditd_printk_skb: 5 callbacks suppressed
== mcstic (2 distinct, 2 total) ==
Jul 24 06:22:21 mcstic kernel: kauditd_printk_skb: 5 callbacks suppressed
Jul 24 06:22:21 mcstic rsyslogd[1575743]: imjournal: filecreatemode is not set, using default 0644 [v8.2312.0 try https://www.rsyslog.com/e/2186 ]
== neo-gizmonic (1 distinct, 1 total) ==
Jul 24 06:55:46 neo-gizmonic rsyslogd[3479892]: imjournal: filecreatemode is not set, using default 0644 [v8.2312.0 try https://www.rsyslog.com/e/2186 ]
== neoavion (1 distinct, 1 total) ==
Jul 24 06:33:16 neoavion rsyslogd[1354308]: imjournal: filecreatemode is not set, using default 0644 [v8.2312.0 try https://www.rsyslog.com/e/2186 ]
== neodontcare.cs.umd.edu (7 distinct, 7 total) ==
Jul 24 06:13:30 neodontcare.cs.umd.edu gnome-software[7556]: Only 0 apps for recent list, hiding
Jul 24 06:13:33 neodontcare.cs.umd.edu packagekitd[2836604]: Failed to get cache filename for gnu-free-mono-fonts
Jul 24 06:13:33 neodontcare.cs.umd.edu packagekitd[2836604]: Failed to get cache filename for gnu-free-serif-fonts
Jul 24 06:13:37 neodontcare.cs.umd.edu packagekitd[2836604]: failed to parse public key for /etc/pki/rpm-gpg/RPM-GPG-KEY-PQC-redhat-release
Jul 24 07:00:53 neodontcare.cs.umd.edu falcon-sensor-bpf[950]: CrowdStrike(4): SSLSocket Disconnected from Cloud.
Jul 24 07:01:25 neodontcare.cs.umd.edu falcon-sensor-bpf[950]: CrowdStrike(4): Could not retrieve DisableProxy value: c0000225
Jul 24 07:01:25 neodontcare.cs.umd.edu falcon-sensor-bpf[950]: CrowdStrike(4): ConnectWithProxy: Unable to get application proxy host from CsConfig: c0000225
== neograd (3 distinct, 3 total) ==
Jul 24 07:02:38 neograd falcon-sensor-bpf[697]: CrowdStrike(4): SSLSocket Disconnected from Cloud.
Jul 24 07:03:10 neograd falcon-sensor-bpf[697]: CrowdStrike(4): Could not retrieve DisableProxy value: c0000225
Jul 24 07:03:10 neograd falcon-sensor-bpf[697]: CrowdStrike(4): ConnectWithProxy: Unable to get application proxy host from CsConfig: c0000225
== netman.cs.umd.edu (3 distinct, 3 total) ==
Jul 24 07:02:16 netman.cs.umd.edu falcon-sensor-bpf[1129]: CrowdStrike(4): SSLSocket Disconnected from Cloud.
Jul 24 07:02:48 netman.cs.umd.edu falcon-sensor-bpf[1129]: CrowdStrike(4): Could not retrieve DisableProxy value: c0000225
Jul 24 07:02:48 netman.cs.umd.edu falcon-sensor-bpf[1129]: CrowdStrike(4): ConnectWithProxy: Unable to get application proxy host from CsConfig: c0000225
== newhonors2 (38 distinct, 65 total) ==
Jul 24 06:13:02 newhonors2 dhcpcd[207036]: dhcpcd is not running [x28]
Jul 24 06:48:07 newhonors2 puppet-agent[208313]: Could not update: Execution of '/usr/bin/apt-get -q -y -o DPkg::Options::=--force-confold --force-yes install openvox-agent=8.27.0-1+ubuntu24.04' returned 100: Reading package lists...
Jul 24 06:48:07 newhonors2 puppet-agent[208313]: Building dependency tree...
Jul 24 06:48:07 newhonors2 puppet-agent[208313]: Reading state information...
Jul 24 06:48:07 newhonors2 puppet-agent[208313]: Package openvox-agent is not available, but is referred to by another package.
Jul 24 06:48:07 newhonors2 puppet-agent[208313]: This may mean that the package is missing, has been obsoleted, or
Jul 24 06:48:07 newhonors2 puppet-agent[208313]: is only available from another source
Jul 24 06:48:07 newhonors2 puppet-agent[208313]:
Jul 24 06:48:07 newhonors2 puppet-agent[208313]: W: --force-yes is deprecated, use one of the options starting with --allow instead.
Jul 24 06:48:07 newhonors2 puppet-agent[208313]: E: Version '8.27.0-1+ubuntu24.04' for 'openvox-agent' was not found
Jul 24 06:48:07 newhonors2 puppet-agent[208313]: (/Stage[main]/Puppet::Agent::Install/Package[openvox-agent]/ensure) change from '7.37.2-1+ubuntu24.04' to '8.27.0-1+ubuntu24.04' failed: Could not update: Execution of '/usr/bin/apt-get -q -y -o DPkg::Options::=--force-confold --force-yes install openvox-agent=8.27.0-1+ubuntu24.04' returned 100: Reading package lists...
Jul 24 06:48:07 newhonors2 puppet-agent[208313]: (/Stage[main]/Puppet::Agent::Install/Package[openvox-agent]/ensure) Building dependency tree...
Jul 24 06:48:07 newhonors2 puppet-agent[208313]: (/Stage[main]/Puppet::Agent::Install/Package[openvox-agent]/ensure) Reading state information...
Jul 24 06:48:07 newhonors2 puppet-agent[208313]: (/Stage[main]/Puppet::Agent::Install/Package[openvox-agent]/ensure) Package openvox-agent is not available, but is referred to by another package.
Jul 24 06:48:07 newhonors2 puppet-agent[208313]: (/Stage[main]/Puppet::Agent::Install/Package[openvox-agent]/ensure) This may mean that the package is missing, has been obsoleted, or
Jul 24 06:48:07 newhonors2 puppet-agent[208313]: (/Stage[main]/Puppet::Agent::Install/Package[openvox-agent]/ensure) is only available from another source
Jul 24 06:48:07 newhonors2 puppet-agent[208313]: (/Stage[main]/Puppet::Agent::Install/Package[openvox-agent]/ensure)
Jul 24 06:48:07 newhonors2 puppet-agent[208313]: (/Stage[main]/Puppet::Agent::Install/Package[openvox-agent]/ensure) W: --force-yes is deprecated, use one of the options starting with --allow instead.
Jul 24 06:48:07 newhonors2 puppet-agent[208313]: (/Stage[main]/Puppet::Agent::Install/Package[openvox-agent]/ensure) E: Version '8.27.0-1+ubuntu24.04' for 'openvox-agent' was not found
Jul 24 06:48:31 newhonors2 puppet-agent[208313]: (/Stage[main]/Puppet::Agent::Config/Puppet::Config::Agent[classfile]/Puppet::Config::Entry[agent_classfile]/Concat::Fragment[puppet.conf_agent]/Concat_fragment[puppet.conf_agent]) Skipping because of failed dependencies
Jul 24 06:48:31 newhonors2 puppet-agent[208313]: (/Stage[main]/Puppet::Agent::Config/Puppet::Config::Agent[classfile]/Puppet::Config::Entry[agent_classfile]/Concat::Fragment[puppet.conf_agent_end]/Concat_fragment[puppet.conf_agent_end]) Skipping because of failed dependencies
Jul 24 06:48:31 newhonors2 puppet-agent[208313]: (/Stage[main]/Puppet::Agent::Config/Puppet::Config::Agent[classfile]/Puppet::Config::Entry[agent_classfile]/Concat::Fragment[puppet.conf_agent_classfile]/Concat_fragment[puppet.conf_agent_classfile]) Skipping because of failed dependencies
Jul 24 06:48:31 newhonors2 puppet-agent[208313]: (/Stage[main]/Puppet::Agent::Config/Puppet::Config::Agent[default_schedules]/Puppet::Config::Entry[agent_default_schedules]/Concat::Fragment[puppet.conf_agent_default_schedules]/Concat_fragment[puppet.conf_agent_default_schedules]) Skipping because of failed dependencies
Jul 24 06:48:31 newhonors2 puppet-agent[208313]: (/Stage[main]/Puppet::Agent::Config/Puppet::Config::Agent[report]/Puppet::Config::Entry[agent_report]/Concat::Fragment[puppet.conf_agent_report]/Concat_fragment[puppet.conf_agent_report]) Skipping because of failed dependencies
Jul 24 06:48:31 newhonors2 puppet-agent[208313]: (/Stage[main]/Puppet::Agent::Config/Puppet::Config::Agent[masterport]/Puppet::Config::Entry[agent_masterport]/Concat::Fragment[puppet.conf_agent_masterport]/Concat_fragment[puppet.conf_agent_masterport]) Skipping because of failed dependencies
Jul 24 06:48:31 newhonors2 puppet-agent[208313]: (/Stage[main]/Puppet::Agent::Config/Puppet::Config::Agent[splay]/Puppet::Config::Entry[agent_splay]/Concat::Fragment[puppet.conf_agent_splay]/Concat_fragment[puppet.conf_agent_splay]) Skipping because of failed dependencies
Jul 24 06:48:31 newhonors2 puppet-agent[208313]: (/Stage[main]/Puppet::Agent::Config/Puppet::Config::Agent[splaylimit]/Puppet::Config::Entry[agent_splaylimit]/Concat::Fragment[puppet.conf_agent_splaylimit]/Concat_fragment[puppet.conf_agent_splaylimit]) Skipping because of failed dependencies
Jul 24 06:48:31 newhonors2 puppet-agent[208313]: (/Stage[main]/Puppet::Agent::Config/Puppet::Config::Agent[runinterval]/Puppet::Config::Entry[agent_runinterval]/Concat::Fragment[puppet.conf_agent_runinterval]/Concat_fragment[puppet.conf_agent_runinterval]) Skipping because of failed dependencies
Jul 24 06:48:31 newhonors2 puppet-agent[208313]: (/Stage[main]/Puppet::Agent::Config/Puppet::Config::Agent[noop]/Puppet::Config::Entry[agent_noop]/Concat::Fragment[puppet.conf_agent_noop]/Concat_fragment[puppet.conf_agent_noop]) Skipping because of failed dependencies
Jul 24 06:48:31 newhonors2 puppet-agent[208313]: (/Stage[main]/Puppet::Agent::Config/Puppet::Config::Agent[usecacheonfailure]/Puppet::Config::Entry[agent_usecacheonfailure]/Concat::Fragment[puppet.conf_agent_usecacheonfailure]/Concat_fragment[puppet.conf_agent_usecacheonfailure]) Skipping because of failed dependencies
... 8 more distinct messages not shown
== nightingale (3 distinct, 3 total) ==
Jul 24 07:01:02 nightingale falcon-sensor-bpf[909]: CrowdStrike(4): SSLSocket Disconnected from Cloud.
Jul 24 07:01:34 nightingale falcon-sensor-bpf[909]: CrowdStrike(4): Could not retrieve DisableProxy value: c0000225
Jul 24 07:01:34 nightingale falcon-sensor-bpf[909]: CrowdStrike(4): ConnectWithProxy: Unable to get application proxy host from CsConfig: c0000225
== orchids (3 distinct, 3 total) ==
Jul 24 07:01:01 orchids falcon-sensor-bpf[1099]: CrowdStrike(4): SSLSocket Disconnected from Cloud.
Jul 24 07:01:33 orchids falcon-sensor-bpf[1099]: CrowdStrike(4): Could not retrieve DisableProxy value: c0000225
Jul 24 07:01:33 orchids falcon-sensor-bpf[1099]: CrowdStrike(4): ConnectWithProxy: Unable to get application proxy host from CsConfig: c0000225
== outbound00.cs.umd.edu (2 distinct, 7 total) ==
Jul 24 06:09:09 outbound00.cs.umd.edu python3[3219163]: ldapdb [x6]
Jul 24 07:00:41 outbound00.cs.umd.edu sshd-session[3231456]: fatal: userauth_pubkey: parse publickey packet: incomplete message [preauth]
== outbound01.cs.umd.edu (1 distinct, 6 total) ==
Jul 24 06:13:07 outbound01.cs.umd.edu python3[1247408]: ldapdb [x6]
== quiss (3 distinct, 3 total) ==
Jul 24 07:00:35 quiss falcon-sensor-bpf[1564085]: CrowdStrike(4): SSLSocket Disconnected from Cloud.
Jul 24 07:01:07 quiss falcon-sensor-bpf[1564085]: CrowdStrike(4): Could not retrieve DisableProxy value: c0000225
Jul 24 07:01:07 quiss falcon-sensor-bpf[1564085]: CrowdStrike(4): ConnectWithProxy: Unable to get application proxy host from CsConfig: c0000225
== sentry-docker00.cs.umd.edu (34 distinct, 34 total) ==
Jul 24 06:13:03 sentry-docker00.cs.umd.edu systemd-udevd[2386195]: Could not generate persistent MAC address for vethfb0e793: No such file or directory
Jul 24 06:13:03 sentry-docker00.cs.umd.edu systemd-udevd[2386196]: Could not generate persistent MAC address for vetha566124: No such file or directory
Jul 24 06:19:24 sentry-docker00.cs.umd.edu systemd-udevd[2389584]: link_config: could not get ethtool features for vethf3dbef5
Jul 24 06:19:24 sentry-docker00.cs.umd.edu systemd-udevd[2389584]: Could not set offload features of vethf3dbef5: No such device
Jul 24 06:19:24 sentry-docker00.cs.umd.edu systemd-udevd[2389606]: Could not generate persistent MAC address for vethd0f85ac: No such file or directory
Jul 24 06:19:24 sentry-docker00.cs.umd.edu systemd-udevd[2389607]: Could not generate persistent MAC address for veth03fe642: No such file or directory
Jul 24 06:19:24 sentry-docker00.cs.umd.edu systemd-udevd[2389632]: Could not generate persistent MAC address for veth6c90d1a: No such file or directory
Jul 24 06:19:24 sentry-docker00.cs.umd.edu systemd-udevd[2389633]: Could not generate persistent MAC address for vethf5396f9: No such file or directory
Jul 24 06:19:24 sentry-docker00.cs.umd.edu systemd-udevd[2389652]: Could not generate persistent MAC address for vethb3083cb: No such file or directory
Jul 24 06:19:24 sentry-docker00.cs.umd.edu systemd-udevd[2389650]: Could not generate persistent MAC address for veth0642e53: No such file or directory
Jul 24 06:19:24 sentry-docker00.cs.umd.edu systemd-udevd[2389652]: Could not generate persistent MAC address for vethe44e719: No such file or directory
Jul 24 06:19:24 sentry-docker00.cs.umd.edu systemd-udevd[2389650]: Could not generate persistent MAC address for vethab1e40c: No such file or directory
Jul 24 06:33:11 sentry-docker00.cs.umd.edu systemd-udevd[2395695]: Could not generate persistent MAC address for vethc97a9ef: No such file or directory
Jul 24 06:33:11 sentry-docker00.cs.umd.edu systemd-udevd[2395696]: Could not generate persistent MAC address for vethbed648c: No such file or directory
Jul 24 06:39:32 sentry-docker00.cs.umd.edu systemd-udevd[2399049]: Could not generate persistent MAC address for vethe577ccb: No such file or directory
Jul 24 06:39:32 sentry-docker00.cs.umd.edu systemd-udevd[2399050]: Could not generate persistent MAC address for veth1110aa7: No such file or directory
Jul 24 06:39:32 sentry-docker00.cs.umd.edu systemd-udevd[2399053]: Could not generate persistent MAC address for veth108c854: No such file or directory
Jul 24 06:39:32 sentry-docker00.cs.umd.edu systemd-udevd[2399054]: Could not generate persistent MAC address for vetha753847: No such file or directory
Jul 24 06:39:32 sentry-docker00.cs.umd.edu systemd-udevd[2399076]: Could not generate persistent MAC address for veth0a56f99: No such file or directory
Jul 24 06:39:32 sentry-docker00.cs.umd.edu systemd-udevd[2399060]: Could not generate persistent MAC address for vethc5cee66: No such file or directory
Jul 24 06:39:32 sentry-docker00.cs.umd.edu systemd-udevd[2399065]: Could not generate persistent MAC address for vethb90711d: No such file or directory
Jul 24 06:39:32 sentry-docker00.cs.umd.edu systemd-udevd[2399054]: Could not generate persistent MAC address for veth1052a34: No such file or directory
Jul 24 06:53:20 sentry-docker00.cs.umd.edu systemd-udevd[2405130]: Could not generate persistent MAC address for veth0780ee5: No such file or directory
Jul 24 06:53:20 sentry-docker00.cs.umd.edu systemd-udevd[2405131]: Could not generate persistent MAC address for veth25affaf: No such file or directory
Jul 24 06:59:40 sentry-docker00.cs.umd.edu systemd-udevd[2408399]: link_config: could not get ethtool features for vethc5cee66
Jul 24 06:59:40 sentry-docker00.cs.umd.edu systemd-udevd[2408399]: Could not set offload features of vethc5cee66: No such device
Jul 24 06:59:41 sentry-docker00.cs.umd.edu systemd-udevd[2408465]: Could not generate persistent MAC address for veth36adb3a: No such file or directory
Jul 24 06:59:41 sentry-docker00.cs.umd.edu systemd-udevd[2408466]: Could not generate persistent MAC address for vethcf60b2c: No such file or directory
Jul 24 06:59:41 sentry-docker00.cs.umd.edu systemd-udevd[2408469]: Could not generate persistent MAC address for vethdc62650: No such file or directory
Jul 24 06:59:41 sentry-docker00.cs.umd.edu systemd-udevd[2408477]: Could not generate persistent MAC address for veth7fdadc7: No such file or directory
... 4 more distinct messages not shown
== strawberry (7 distinct, 13 total) ==
Jul 24 06:09:44 strawberry udisksd[1067]: Error performing housekeeping for drive /org/freedesktop/UDisks2/drives/ST2000DM001_1CH164_W1E8J5KJ: Error updating SMART data: Error sending ATA command CHECK POWER MODE: Unexpected sense data returned:#0120000: 00 00 00 00 00 00 00 00 00 00 00 00 00 00 00 00 ................#0120010: 00 00 00 00 00 00 00 00 00 00 00 00 00 00 00 00 ................#012 (g-io-error-quark, 0) [x6]
Jul 24 06:31:04 strawberry nologin[2626712]: Attempted login by UNKNOWN (UID: 65534) on UNKNOWN
Jul 24 06:31:04 strawberry pipewire[2626711]: mod.jackdbus-detect: Failed to receive jackdbus reply: org.freedesktop.DBus.Error.ServiceUnknown: The name org.jackaudio.service was not provided by any .service files
Jul 24 06:34:42 strawberry smartd[5314]: Device: /dev/sda [SAT], failed to read SMART Attribute Data [x2]
Jul 24 07:00:47 strawberry falcon-sensor-bpf[808]: CrowdStrike(4): SSLSocket Disconnected from Cloud.
Jul 24 07:01:19 strawberry falcon-sensor-bpf[808]: CrowdStrike(4): Could not retrieve DisableProxy value: c0000225
Jul 24 07:01:19 strawberry falcon-sensor-bpf[808]: CrowdStrike(4): ConnectWithProxy: Unable to get application proxy host from CsConfig: c0000225
== stuckeys (3 distinct, 3 total) ==
Jul 24 07:00:26 stuckeys falcon-sensor-bpf[824199]: CrowdStrike(4): SSLSocket Disconnected from Cloud.
Jul 24 07:00:58 stuckeys falcon-sensor-bpf[824199]: CrowdStrike(4): Could not retrieve DisableProxy value: c0000225
Jul 24 07:00:58 stuckeys falcon-sensor-bpf[824199]: CrowdStrike(4): ConnectWithProxy: Unable to get application proxy host from CsConfig: c0000225
== talkhosts9 (3 distinct, 3 total) ==
Jul 24 07:00:14 talkhosts9 falcon-sensor-bpf[714]: CrowdStrike(4): SSLSocket Disconnected from Cloud.
Jul 24 07:00:46 talkhosts9 falcon-sensor-bpf[714]: CrowdStrike(4): Could not retrieve DisableProxy value: c0000225
Jul 24 07:00:46 talkhosts9 falcon-sensor-bpf[714]: CrowdStrike(4): ConnectWithProxy: Unable to get application proxy host from CsConfig: c0000225
== teaching-awards (4 distinct, 4 total) ==
Jul 24 06:44:32 teaching-awards krb5_child[1135889]: Client 'admin(a)UMD.EDU' not found in Kerberos database
Jul 24 07:00:14 teaching-awards falcon-sensor-bpf[782]: CrowdStrike(4): SSLSocket Disconnected from Cloud.
Jul 24 07:00:46 teaching-awards falcon-sensor-bpf[782]: CrowdStrike(4): Could not retrieve DisableProxy value: c0000225
Jul 24 07:00:46 teaching-awards falcon-sensor-bpf[782]: CrowdStrike(4): ConnectWithProxy: Unable to get application proxy host from CsConfig: c0000225
== tlsrpt (1 distinct, 1 total) ==
Jul 24 06:38:03 tlsrpt (httpd)[129033]: httpd.service: Referenced but unset environment variable evaluates to an empty string: OPTIONS
== tulgey.cs.umd.edu (3 distinct, 3 total) ==
Jul 24 07:00:01 tulgey.cs.umd.edu falcon-sensor-bpf[1526]: CrowdStrike(4): SSLSocket Disconnected from Cloud.
Jul 24 07:00:33 tulgey.cs.umd.edu falcon-sensor-bpf[1526]: CrowdStrike(4): Could not retrieve DisableProxy value: c0000225
Jul 24 07:00:33 tulgey.cs.umd.edu falcon-sensor-bpf[1526]: CrowdStrike(4): ConnectWithProxy: Unable to get application proxy host from CsConfig: c0000225
== tumtum.cs.umd.edu (3 distinct, 3 total) ==
Jul 24 07:00:18 tumtum.cs.umd.edu falcon-sensor-bpf[1360]: CrowdStrike(4): SSLSocket Disconnected from Cloud.
Jul 24 07:00:50 tumtum.cs.umd.edu falcon-sensor-bpf[1360]: CrowdStrike(4): Could not retrieve DisableProxy value: c0000225
Jul 24 07:00:50 tumtum.cs.umd.edu falcon-sensor-bpf[1360]: CrowdStrike(4): ConnectWithProxy: Unable to get application proxy host from CsConfig: c0000225
== wraith (3 distinct, 3 total) ==
Jul 24 07:04:28 wraith falcon-sensor[917]: CrowdStrike(4): SSLSocket Disconnected from Cloud.
Jul 24 07:05:00 wraith falcon-sensor[917]: CrowdStrike(4): Could not retrieve DisableProxy value: c0000225
Jul 24 07:05:00 wraith falcon-sensor[917]: CrowdStrike(4): ConnectWithProxy: Unable to get application proxy host from CsConfig: c0000225
== yogurt (3 distinct, 3 total) ==
Jul 24 07:00:37 yogurt falcon-sensor-bpf[950]: CrowdStrike(4): SSLSocket Disconnected from Cloud.
Jul 24 07:01:09 yogurt falcon-sensor-bpf[950]: CrowdStrike(4): Could not retrieve DisableProxy value: c0000225
Jul 24 07:01:09 yogurt falcon-sensor-bpf[950]: CrowdStrike(4): ConnectWithProxy: Unable to get application proxy host from CsConfig: c0000225
== zwicker-computer (10 distinct, 20 total) ==
Jul 24 06:10:13 zwicker-computer kernel: NVRM: API mismatch: the client 'nvidia-ctk' (pid 116229)#012NVRM: has the version 580.173.02, but this kernel module has#012NVRM: the version 580.159.03. Please make sure that this#012NVRM: kernel module and all NVIDIA driver components#012NVRM: have the same version. [x3]
Jul 24 06:10:15 zwicker-computer kernel: NVRM: API mismatch: the client 'nvidia-ctk' (pid 116675)#012NVRM: has the version 580.173.02, but this kernel module has#012NVRM: the version 580.159.03. Please make sure that this#012NVRM: kernel module and all NVIDIA driver components#012NVRM: have the same version. [x3]
Jul 24 06:10:16 zwicker-computer kernel: NVRM: API mismatch: the client 'nvidia-ctk' (pid 117220)#012NVRM: has the version 580.173.02, but this kernel module has#012NVRM: the version 580.159.03. Please make sure that this#012NVRM: kernel module and all NVIDIA driver components#012NVRM: have the same version. [x3]
Jul 24 06:10:17 zwicker-computer kernel: NVRM: API mismatch: the client 'nvidia-ctk' (pid 117950)#012NVRM: has the version 580.173.02, but this kernel module has#012NVRM: the version 580.159.03. Please make sure that this#012NVRM: kernel module and all NVIDIA driver components#012NVRM: have the same version. [x3]
Jul 24 06:10:18 zwicker-computer kernel: NVRM: API mismatch: the client 'nvidia-ctk' (pid 118401)#012NVRM: has the version 580.173.02, but this kernel module has#012NVRM: the version 580.159.03. Please make sure that this#012NVRM: kernel module and all NVIDIA driver components#012NVRM: have the same version. [x3]
Jul 24 06:10:19 zwicker-computer systemd[1]: nvidia-cdi-refresh.service: Start request repeated too quickly.
Jul 24 06:11:51 zwicker-computer rsyslogd[133521]: imjournal: filecreatemode is not set, using default 0644 [v8.2312.0 try https://www.rsyslog.com/e/2186 ]
Jul 24 07:00:08 zwicker-computer falcon-sensor-bpf[718]: CrowdStrike(4): SSLSocket Disconnected from Cloud.
Jul 24 07:00:40 zwicker-computer falcon-sensor-bpf[718]: CrowdStrike(4): Could not retrieve DisableProxy value: c0000225
Jul 24 07:00:40 zwicker-computer falcon-sensor-bpf[718]: CrowdStrike(4): ConnectWithProxy: Unable to get application proxy host from CsConfig: c0000225
1
0
Command: /usr/local/sbin/syslog-digest.py
Time : 0.4857s
Status : exited 0
Output :
Syslog digest — 2026-07-24 06:05 EDT
Processed 4,742 lines, filtered 4,124 (86%). 618 unknown (107 distinct) from 23 host(s).
== abadi-computer (2 distinct, 2 total) ==
Jul 24 05:54:16 abadi-computer kernel: kauditd_printk_skb: 31 callbacks suppressed
Jul 24 06:00:37 abadi-computer kernel: kauditd_printk_skb: 20 callbacks suppressed
== abuse (1 distinct, 346 total) ==
Jul 24 05:05:06 abuse rsyslogd[21745]: imjournal: open() failed for path: '/var/lib/rsyslog/imjournal.state.tmp': Input/output error [v8.2404.0 try https://www.rsyslog.com/e/2433 ] [x346]
== alec.cs.umd.edu (3 distinct, 60 total) ==
Jul 24 05:05:30 alec.cs.umd.edu setroubleshoot[2461267]: failed to retrieve rpm info for path '/run/netns/netns-a2b2cc2d-7532-4db7-6a36-b1dd3d5f51db': [x12]
Jul 24 05:05:30 alec.cs.umd.edu sedispatch[1526]: AVC Message regarding setroubleshoot, ignoring message [x24]
Jul 24 05:05:30 alec.cs.umd.edu setroubleshoot[2461267]: SELinux is preventing /usr/bin/df from getattr access on the file /run/netns/netns-a2b2cc2d-7532-4db7-6a36-b1dd3d5f51db. For complete SELinux messages run: sealert -l 23f93208-3063-4aac-b78a-bb0fcb40740c [x24]
== atif01.cs.umd.edu (3 distinct, 5 total) ==
Jul 24 05:12:25 atif01.cs.umd.edu kernel: net_ratelimit: 9 callbacks suppressed
Jul 24 05:12:25 atif01.cs.umd.edu kernel: nfsd: peername failed (err 107)! [x3]
Jul 24 05:12:30 atif01.cs.umd.edu kernel: net_ratelimit: 5 callbacks suppressed
== csfw00a (1 distinct, 6 total) ==
Jul 24 05:24:37 csfw00a kernel: bnxt_en 0000:09:00.0 eth3: NIC Link is Down [x6]
== grades01.cs.umd.edu (1 distinct, 1 total) ==
Jul 24 05:50:22 grades01.cs.umd.edu puppet-agent[25308]: The directory '/srv/grades' contains 2471 entries, which exceeds the default soft limit 1000 and may cause excessive resource consumption and degraded performance. To remove this warning set a value for `max_files` parameter or consider using an alternate method to manage large directory trees
== hackerman (1 distinct, 1 total) ==
Jul 24 05:19:01 hackerman gnome-software[2060381]: failed to commit changes to dconf: GDBus.Error:org.gtk.GDBus.UnmappedGError.Quark._g_2dfile_2derror_2dquark.Code2: Failed to create file “/adminhomes/sajith/.config/dconf/user.O0SDT3”: Permission denied
== idm00 (1 distinct, 1 total) ==
Jul 24 05:51:05 idm00 named[1455]: client @0x7f3304d076b8 10.73.240.42#58225: update '73.10.in-addr.arpa/IN' denied
== idmp0 (1 distinct, 1 total) ==
Jul 24 05:34:56 idmp0 named[5198]: client @0x7f990400e5f8 10.73.240.43#58416: update '73.10.in-addr.arpa/IN' denied
== itmon02 (1 distinct, 60 total) ==
Jul 24 05:07:58 itmon02 sshd[1834]: error: beginning MaxStartups throttling [x60]
== krispykreme.cs.umd.edu (3 distinct, 4 total) ==
Jul 24 05:14:56 krispykreme.cs.umd.edu sshd-session[2906441]: pam_access(sshd:auth): access denied for user `admin' from `98.203.110.23' [x2]
Jul 24 05:14:57 krispykreme.cs.umd.edu krb5_child[2906443]: Client 'admin(a)UMD.EDU' not found in Kerberos database
Jul 24 05:14:57 krispykreme.cs.umd.edu sshd-session[2906439]: error: PAM: System error for admin from 98.203.110.23
== matrix (11 distinct, 13 total) ==
Jul 24 05:52:59 matrix systemd[1]: networkd-dispatcher.service: Got notification message from PID 900370, but reception only permitted for main PID 720
Jul 24 05:52:59 matrix systemd[1]: networkd-dispatcher.service: Got notification message from PID 900384, but reception only permitted for main PID 720
Jul 24 05:53:07 matrix systemd[1]: networkd-dispatcher.service: Got notification message from PID 900459, but reception only permitted for main PID 720
Jul 24 05:53:07 matrix systemd[1]: networkd-dispatcher.service: Got notification message from PID 900465, but reception only permitted for main PID 720
Jul 24 05:53:07 matrix networkctl[900476]: Interface "veth3380a70" not found.
Jul 24 05:53:07 matrix systemd[1]: networkd-dispatcher.service: Got notification message from PID 900476, but reception only permitted for main PID 720 [x2]
Jul 24 05:53:07 matrix systemd[1]: networkd-dispatcher.service: Got notification message from PID 900536, but reception only permitted for main PID 720
Jul 24 05:53:07 matrix systemd[1]: networkd-dispatcher.service: Got notification message from PID 900544, but reception only permitted for main PID 720
Jul 24 05:53:17 matrix systemd[1]: networkd-dispatcher.service: Got notification message from PID 900663, but reception only permitted for main PID 720
Jul 24 05:53:17 matrix networkctl[900674]: Interface "veth8971337" not found.
Jul 24 05:53:17 matrix systemd[1]: networkd-dispatcher.service: Got notification message from PID 900674, but reception only permitted for main PID 720 [x2]
== netman.cs.umd.edu (1 distinct, 1 total) ==
Jul 24 05:56:20 netman.cs.umd.edu sshd[394044]: error: PAM: Authentication failure for postgres from 122.160.103.228
== newhonors2 (1 distinct, 24 total) ==
Jul 24 05:13:03 newhonors2 dhcpcd[205209]: dhcpcd is not running [x24]
== outbound00.cs.umd.edu (1 distinct, 6 total) ==
Jul 24 05:09:08 outbound00.cs.umd.edu python3[3204923]: ldapdb [x6]
== outbound01.cs.umd.edu (2 distinct, 8 total) ==
Jul 24 05:08:22 outbound01.cs.umd.edu python3[1231241]: ldapdb [x7]
Jul 24 05:09:27 outbound01.cs.umd.edu systemd[1]: Configuration file /usr/lib/systemd/system/authentication_milter.service is marked executable. Please remove executable permission bits. Proceeding anyway.
== sebatinsky.cs.umd.edu (1 distinct, 1 total) ==
Jul 24 05:23:27 sebatinsky.cs.umd.edu setroubleshoot[3188191]: SELinux is preventing /usr/sbin/pdns_server from name_bind access on the udp_socket port 10082. For complete SELinux messages run: sealert -l af222830-ab0f-4bc8-91ab-730551076ae5
== sentry-docker00.cs.umd.edu (40 distinct, 40 total) ==
Jul 24 05:12:42 sentry-docker00.cs.umd.edu systemd-udevd[2357928]: link_config: could not get ethtool features for veth7ced978
Jul 24 05:12:42 sentry-docker00.cs.umd.edu systemd-udevd[2357928]: Could not set offload features of veth7ced978: No such device
Jul 24 05:12:42 sentry-docker00.cs.umd.edu systemd-udevd[2357937]: Could not generate persistent MAC address for vethd51f59f: No such file or directory
Jul 24 05:12:42 sentry-docker00.cs.umd.edu systemd-udevd[2357938]: Could not generate persistent MAC address for veth654c016: No such file or directory
Jul 24 05:18:59 sentry-docker00.cs.umd.edu systemd-udevd[2361185]: link_config: could not get ethtool features for veth3cac076
Jul 24 05:18:59 sentry-docker00.cs.umd.edu systemd-udevd[2361185]: Could not set offload features of veth3cac076: No such device
Jul 24 05:18:59 sentry-docker00.cs.umd.edu systemd-udevd[2361236]: Could not generate persistent MAC address for vethb5414e3: No such file or directory
Jul 24 05:18:59 sentry-docker00.cs.umd.edu systemd-udevd[2361237]: Could not generate persistent MAC address for veth34e4573: No such file or directory
Jul 24 05:18:59 sentry-docker00.cs.umd.edu systemd-udevd[2361240]: Could not generate persistent MAC address for veth6106b1b: No such file or directory
Jul 24 05:18:59 sentry-docker00.cs.umd.edu systemd-udevd[2361241]: Could not generate persistent MAC address for vethf5cfc3c: No such file or directory
Jul 24 05:18:59 sentry-docker00.cs.umd.edu systemd-udevd[2361253]: Could not generate persistent MAC address for veth240a3ea: No such file or directory
Jul 24 05:18:59 sentry-docker00.cs.umd.edu systemd-udevd[2361254]: Could not generate persistent MAC address for veth63e59d0: No such file or directory
Jul 24 05:18:59 sentry-docker00.cs.umd.edu systemd-udevd[2361293]: Could not generate persistent MAC address for veth81df93b: No such file or directory
Jul 24 05:18:59 sentry-docker00.cs.umd.edu systemd-udevd[2361305]: Could not generate persistent MAC address for veth6db3735: No such file or directory
Jul 24 05:32:46 sentry-docker00.cs.umd.edu systemd-udevd[2367362]: Could not generate persistent MAC address for vethb575850: No such file or directory
Jul 24 05:32:46 sentry-docker00.cs.umd.edu systemd-udevd[2367363]: Could not generate persistent MAC address for vethc9fa846: No such file or directory
Jul 24 05:39:07 sentry-docker00.cs.umd.edu systemd-udevd[2370580]: link_config: could not get ethtool features for vethb5414e3
Jul 24 05:39:07 sentry-docker00.cs.umd.edu systemd-udevd[2370580]: Could not set offload features of vethb5414e3: No such device
Jul 24 05:39:07 sentry-docker00.cs.umd.edu systemd-udevd[2370647]: Could not generate persistent MAC address for vetha318c57: No such file or directory
Jul 24 05:39:07 sentry-docker00.cs.umd.edu systemd-udevd[2370648]: Could not generate persistent MAC address for veth21e638b: No such file or directory
Jul 24 05:39:07 sentry-docker00.cs.umd.edu systemd-udevd[2370651]: Could not generate persistent MAC address for veth58c506e: No such file or directory
Jul 24 05:39:07 sentry-docker00.cs.umd.edu systemd-udevd[2370652]: Could not generate persistent MAC address for veth139d1b9: No such file or directory
Jul 24 05:39:07 sentry-docker00.cs.umd.edu systemd-udevd[2370663]: Could not generate persistent MAC address for vethcedd409: No such file or directory
Jul 24 05:39:07 sentry-docker00.cs.umd.edu systemd-udevd[2370667]: Could not generate persistent MAC address for veth73a3f4f: No such file or directory
Jul 24 05:39:07 sentry-docker00.cs.umd.edu systemd-udevd[2370664]: Could not generate persistent MAC address for veth2fe4ef3: No such file or directory
Jul 24 05:39:07 sentry-docker00.cs.umd.edu systemd-udevd[2370667]: Could not generate persistent MAC address for vethf7a4dd2: No such file or directory
Jul 24 05:52:55 sentry-docker00.cs.umd.edu systemd-udevd[2376769]: link_config: could not get ethtool features for vethb575850
Jul 24 05:52:55 sentry-docker00.cs.umd.edu systemd-udevd[2376769]: Could not set offload features of vethb575850: No such device
Jul 24 05:52:55 sentry-docker00.cs.umd.edu systemd-udevd[2376779]: Could not generate persistent MAC address for vethbc0db9f: No such file or directory
Jul 24 05:52:55 sentry-docker00.cs.umd.edu systemd-udevd[2376780]: Could not generate persistent MAC address for veth20cf9d6: No such file or directory
... 10 more distinct messages not shown
== strawberry (2 distinct, 8 total) ==
Jul 24 05:09:44 strawberry udisksd[1067]: Error performing housekeeping for drive /org/freedesktop/UDisks2/drives/ST2000DM001_1CH164_W1E8J5KJ: Error updating SMART data: Error sending ATA command CHECK POWER MODE: Unexpected sense data returned:#0120000: 00 00 00 00 00 00 00 00 00 00 00 00 00 00 00 00 ................#0120010: 00 00 00 00 00 00 00 00 00 00 00 00 00 00 00 00 ................#012 (g-io-error-quark, 0) [x6]
Jul 24 05:34:42 strawberry smartd[5314]: Device: /dev/sda [SAT], failed to read SMART Attribute Data [x2]
== submit26-b9-2 (9 distinct, 9 total) ==
Jul 24 05:12:48 submit26-b9-2 setroubleshoot[86098]: SELinux is preventing /usr/bin/python3.9 from create access on the directory /(null). For complete SELinux messages run: sealert -l d506243c-d61e-48f3-b42a-4592c913deb0
Jul 24 05:12:48 submit26-b9-2 setroubleshoot[86098]: SELinux is preventing /usr/bin/python3.9 from add_name access on the directory /(null). For complete SELinux messages run: sealert -l 3b4752ac-1b9a-4af9-a05b-32e4c2eb13ab
Jul 24 05:12:48 submit26-b9-2 setroubleshoot[86098]: SELinux is preventing /usr/bin/python3.9 from create access on the file /(null). For complete SELinux messages run: sealert -l 29e5adbd-4381-4467-b40d-a2219101e096
Jul 24 05:12:48 submit26-b9-2 setroubleshoot[86098]: SELinux is preventing /usr/bin/python3.9 from open access on the file /tmp/libdnf.CngLuh/repodata/repomd.xml. For complete SELinux messages run: sealert -l 1b38f2ec-01ce-4343-8059-ba7494ecc5c4
Jul 24 05:12:48 submit26-b9-2 setroubleshoot[86098]: SELinux is preventing /usr/bin/python3.9 from setattr access on the file repomd.xml. For complete SELinux messages run: sealert -l e5f9af40-1f63-4924-b012-27ab2a7b2266
Jul 24 05:12:48 submit26-b9-2 setroubleshoot[86098]: SELinux is preventing /usr/bin/python3.9 from read access on the directory libdnf.CngLuh. For complete SELinux messages run: sealert -l 5c54db87-54a3-4a7c-97b4-b5c48d6c3543
Jul 24 05:12:48 submit26-b9-2 setroubleshoot[86098]: SELinux is preventing /usr/bin/python3.9 from remove_name access on the directory repomd.xml. For complete SELinux messages run: sealert -l 63cd60e1-1e61-4276-afea-dd8526ffe8b2
Jul 24 05:12:48 submit26-b9-2 setroubleshoot[86098]: SELinux is preventing /usr/bin/python3.9 from unlink access on the file repomd.xml. For complete SELinux messages run: sealert -l 81c7e9ec-e023-4c6d-b1ad-c02a242e655e
Jul 24 05:12:48 submit26-b9-2 setroubleshoot[86098]: SELinux is preventing /usr/bin/python3.9 from rmdir access on the directory repodata. For complete SELinux messages run: sealert -l 6ae9a597-e123-4d74-8eec-a8ebe0f5e4d0
== submit26-b9-3 (9 distinct, 9 total) ==
Jul 24 05:20:34 submit26-b9-3 setroubleshoot[551585]: SELinux is preventing /usr/bin/python3.9 from create access on the directory /(null). For complete SELinux messages run: sealert -l 5b912a44-22fd-4560-b201-2a4e289b73f5
Jul 24 05:20:34 submit26-b9-3 setroubleshoot[551585]: SELinux is preventing /usr/bin/python3.9 from add_name access on the directory /(null). For complete SELinux messages run: sealert -l 7f1df1e4-725e-4953-98eb-1079f908f543
Jul 24 05:20:34 submit26-b9-3 setroubleshoot[551585]: SELinux is preventing /usr/bin/python3.9 from create access on the file /(null). For complete SELinux messages run: sealert -l 40b8852a-f77b-44b4-affe-5f11fa33de43
Jul 24 05:20:34 submit26-b9-3 setroubleshoot[551585]: SELinux is preventing /usr/bin/python3.9 from open access on the file /tmp/libdnf.Uk2TaJ/repodata/repomd.xml. For complete SELinux messages run: sealert -l 45a8019e-f6b5-4baa-92c1-862594b40d46
Jul 24 05:20:34 submit26-b9-3 setroubleshoot[551585]: SELinux is preventing /usr/bin/python3.9 from setattr access on the file repomd.xml. For complete SELinux messages run: sealert -l e9f0bfff-7784-4126-baa4-2bb06da56591
Jul 24 05:20:34 submit26-b9-3 setroubleshoot[551585]: SELinux is preventing /usr/bin/python3.9 from read access on the directory libdnf.Uk2TaJ. For complete SELinux messages run: sealert -l 0b17cc3d-cdc6-4fe2-a11f-3892e7c41dc7
Jul 24 05:20:34 submit26-b9-3 setroubleshoot[551585]: SELinux is preventing /usr/bin/python3.9 from remove_name access on the directory repomd.xml. For complete SELinux messages run: sealert -l 10e38c64-b65f-4cdd-901e-4375652d9a42
Jul 24 05:20:34 submit26-b9-3 setroubleshoot[551585]: SELinux is preventing /usr/bin/python3.9 from unlink access on the file repomd.xml. For complete SELinux messages run: sealert -l 7fd9cf72-ef38-48e1-b6aa-b571b26a7b22
Jul 24 05:20:34 submit26-b9-3 setroubleshoot[551585]: SELinux is preventing /usr/bin/python3.9 from rmdir access on the directory repodata. For complete SELinux messages run: sealert -l b9b11116-89bd-4a3c-980c-1d422c5dcee4
== submit26-clnb9 (9 distinct, 9 total) ==
Jul 24 05:31:52 submit26-clnb9 setroubleshoot[1230774]: SELinux is preventing /usr/bin/python3.9 from create access on the directory /(null). For complete SELinux messages run: sealert -l 6783ed2b-5ae4-42b5-975a-4bf50eec4658
Jul 24 05:31:52 submit26-clnb9 setroubleshoot[1230774]: SELinux is preventing /usr/bin/python3.9 from add_name access on the directory /(null). For complete SELinux messages run: sealert -l 9e7fa955-cc30-4804-ac8c-e1779e85946c
Jul 24 05:31:52 submit26-clnb9 setroubleshoot[1230774]: SELinux is preventing /usr/bin/python3.9 from create access on the file /(null). For complete SELinux messages run: sealert -l 69bfa6e3-089c-40ff-9563-fd30787d0774
Jul 24 05:31:52 submit26-clnb9 setroubleshoot[1230774]: SELinux is preventing /usr/bin/python3.9 from open access on the file /tmp/libdnf.pZoYuZ/repodata/repomd.xml. For complete SELinux messages run: sealert -l 001acdb5-31ef-4e52-b10b-90f467a89ddc
Jul 24 05:31:52 submit26-clnb9 setroubleshoot[1230774]: SELinux is preventing /usr/bin/python3.9 from setattr access on the file repomd.xml. For complete SELinux messages run: sealert -l edacddcf-16ed-4dc3-8d82-7c597d5dee23
Jul 24 05:31:52 submit26-clnb9 setroubleshoot[1230774]: SELinux is preventing /usr/bin/python3.9 from read access on the directory libdnf.pZoYuZ. For complete SELinux messages run: sealert -l 62b3782e-4730-4488-8178-94dafe9b552c
Jul 24 05:31:52 submit26-clnb9 setroubleshoot[1230774]: SELinux is preventing /usr/bin/python3.9 from remove_name access on the directory repomd.xml. For complete SELinux messages run: sealert -l 81cb3698-78f8-440a-8e3c-e5d1041e6b78
Jul 24 05:31:52 submit26-clnb9 setroubleshoot[1230774]: SELinux is preventing /usr/bin/python3.9 from unlink access on the file repomd.xml. For complete SELinux messages run: sealert -l 792b472a-115c-4799-9805-fc7436f916b9
Jul 24 05:31:52 submit26-clnb9 setroubleshoot[1230774]: SELinux is preventing /usr/bin/python3.9 from rmdir access on the directory repodata. For complete SELinux messages run: sealert -l 15c83a86-837b-41e2-b662-b39cd4e361cb
== updates00.cs.umd.edu (3 distinct, 3 total) ==
Jul 24 05:18:25 updates00.cs.umd.edu puppet-agent[1586]: Could not retrieve catalog from remote server: Error 500 on SERVER: Server Error: Function lookup() did not find a value for the name 'vault::kerberos' on node updates00.cs.umd.edu
Jul 24 05:18:25 updates00.cs.umd.edu puppet-agent[1586]: Not using cache on failed catalog
Jul 24 05:18:25 updates00.cs.umd.edu puppet-agent[1586]: Could not retrieve catalog; skipping run
1
0
Command: /usr/local/sbin/syslog-digest.py
Time : 0.4919s
Status : exited 0
Output :
Syslog digest — 2026-07-24 05:05 EDT
Processed 4,558 lines, filtered 3,979 (87%). 579 unknown (85 distinct) from 24 host(s).
== abadi-computer (2 distinct, 2 total) ==
Jul 24 04:15:00 abadi-computer nologin[3272777]: Attempted login by UNKNOWN (UID: 65534) on UNKNOWN
Jul 24 04:15:00 abadi-computer pipewire[3272774]: mod.jackdbus-detect: Failed to receive jackdbus reply: org.freedesktop.DBus.Error.ServiceUnknown: The name org.jackaudio.service was not provided by any .service files
== abuse (1 distinct, 346 total) ==
Jul 24 04:05:06 abuse rsyslogd[21745]: imjournal: open() failed for path: '/var/lib/rsyslog/imjournal.state.tmp': Input/output error [v8.2404.0 try https://www.rsyslog.com/e/2433 ] [x346]
== alec.cs.umd.edu (3 distinct, 61 total) ==
Jul 24 04:05:16 alec.cs.umd.edu setroubleshoot[2445710]: failed to retrieve rpm info for path '/run/netns/netns-a2b2cc2d-7532-4db7-6a36-b1dd3d5f51db': [x12]
Jul 24 04:05:17 alec.cs.umd.edu sedispatch[1526]: AVC Message regarding setroubleshoot, ignoring message [x24]
Jul 24 04:05:17 alec.cs.umd.edu setroubleshoot[2445710]: SELinux is preventing /usr/bin/df from getattr access on the file /run/netns/netns-a2b2cc2d-7532-4db7-6a36-b1dd3d5f51db. For complete SELinux messages run: sealert -l 23f93208-3063-4aac-b78a-bb0fcb40740c [x25]
== atif01.cs.umd.edu (3 distinct, 3 total) ==
Jul 24 04:39:45 atif01.cs.umd.edu kernel: net_ratelimit: 2 callbacks suppressed
Jul 24 04:57:45 atif01.cs.umd.edu kernel: net_ratelimit: 13 callbacks suppressed
Jul 24 04:57:51 atif01.cs.umd.edu kernel: net_ratelimit: 15 callbacks suppressed
== csfw00a (1 distinct, 8 total) ==
Jul 24 04:08:25 csfw00a kernel: bnxt_en 0000:09:00.0 eth3: NIC Link is Down [x8]
== dojo (1 distinct, 1 total) ==
Jul 24 04:15:24 dojo nologin[142856]: Attempted login by UNKNOWN (UID: 65534) on UNKNOWN
== forge00 (1 distinct, 1 total) ==
Jul 24 04:09:03 forge00 (httpd)[199090]: httpd.service: Referenced but unset environment variable evaluates to an empty string: OPTIONS
== idm00 (1 distinct, 1 total) ==
Jul 24 04:51:04 idm00 named[1455]: client @0x7f33157ed278 10.73.240.42#54837: update '73.10.in-addr.arpa/IN' denied
== idmp0 (1 distinct, 1 total) ==
Jul 24 04:34:56 idmp0 named[5198]: client @0x7f990c04e038 10.73.240.43#52553: update '73.10.in-addr.arpa/IN' denied
== inbound00.cs.umd.edu (1 distinct, 5 total) ==
Jul 24 04:09:18 inbound00.cs.umd.edu cockpit-ws[3205381]: /usr/share/cockpit/static/login.js/favicon.ico: Failed to open file “/usr/share/cockpit/static/login.js/favicon.ico”: open() failed: Not a directory [x5]
== inbound01.cs.umd.edu (1 distinct, 2 total) ==
Jul 24 04:20:55 inbound01.cs.umd.edu cockpit-ws[1227278]: /usr/share/cockpit/static/login.js/favicon.ico: Failed to open file “/usr/share/cockpit/static/login.js/favicon.ico”: open() failed: Not a directory [x2]
== itmon02 (1 distinct, 39 total) ==
Jul 24 04:08:10 itmon02 sshd[1834]: error: beginning MaxStartups throttling [x39]
== jaws.cs.umd.edu (4 distinct, 5 total) ==
Jul 24 04:33:17 jaws.cs.umd.edu systemd-coredump[1161185]: Process 1161167 (podman) of user 981 dumped core.#012#012Stack trace of thread 1161167:#012#0 0x0000562dfdfab46e internal/runtime/syscall/linux.Syscall6 (podman + 0x48b46e)#012#1 0x0000562dfe08b0a6 syscall.Syscall (podman + 0x56b0a6)#012#2 0x0000562dfe08bc50 syscall.Syscall.abi0 (podman + 0x56bc50)#012#3 0x0000562dfe1f5c2e github.com/containers/podman/vendor/golang.org/x/sys/unix.OpenTree (podman + 0x6d5c2e)#012#4 0x0000562dfe84ef4b github.com/containers/podman/vendor/github.com/cyphar/filepath-securejoin/p… (podman + 0xd2ef4b)#012#5 0x0000562dfe84ee54 github.com/containers/podman/vendor/github.com/cyphar/filepath-securejoin/p… (podman + 0xd2ee54)#012#6 0x0000562dfe03edcc sync.(*Once).doSlow (podman + 0x51edcc)#012#7 0x0000562dfe03ecf9 sync.(*Once).Do (podman + 0x51ecf9)#012#8 0x0000562dfe84ed
c5 github.com/containers/podman/vendor/github.com/cyphar/filepath-securejoin/p… (podman + 0xd2edc5)#012#9 0x0000562dfe8503e2 github.com/containers/podman/vendor/github.com/cyphar/filepath-securejoin/p… (podman + 0xd303e2)#012#10 0x0000562dfe8507f3 github.com/containers/podman/vendor/github.com/cyphar/filepath-securejoin/p… (podman + 0xd307f3)#012#11 0x0000562dfe84f91c github.com/containers/podman/vendor/github.com/cyphar/filepath-securejoin/p… (podman + 0xd2f91c)#012#12 0x0000562dfe84f358 github.com/containers/podman/vendor/github.com/cyphar/filepath-securejoin/p… (podman + 0xd2f358)#012#13 0x0000562dfe03edcc sync.(*Once).doSlow (podman + 0x51edcc)#012#14 0x0000562dfe03ecf9 sync.(*Once).D
o (podman + 0x51ecf9)#012#15 0x0000562dfe84f2c5 github.com/containers/podman/vendor/github.com/cyphar/filepath-securejoin/p… (podman + 0xd2f2c5)#012#16 0x0000562dfe85079a github.com/containers/podman/vendor/github.com/cyphar/filepath-securejoin/p… (podman + 0xd3079a)#012#17 0x0000562dfe85734e github.com/containers/podman/vendor/github.com/opencontainers/selinux/go-se… (podman + 0xd3734e)#012#18 0x0000562dfe857838 github.com/containers/podman/vendor/github.com/opencontainers/selinux/go-se… (podman + 0xd37838)#012#19 0x0000562dfe8565df github.com/containers/podman/vendor/github.com/opencontainers/selinux/go-se… (podman + 0xd365df)#012#20 0x0000562dfe856873 github.com/containers/podman/vendor/github.com/opencontainers/selinux/go-se… (podman + 0xd36873)#012#21 0x000
0562dfea4ef4b github.com/containers/podman/vendor/go.podman.io/common/pkg/config.defaultC… (podman + 0xf2ef4b)#012#22 0x0000562dfea52912 github.com/containers/podman/vendor/go.podman.io/common/pkg/config.newLocked (podman + 0xf32912)#012#23 0x0000562dfea52605 github.com/containers/podman/vendor/go.podman.io/common/pkg/config.New (podman + 0xf32605)#012#24 0x0000562dff1c5fd3 github.com/containers/podman/cmd/podman/registry.newPodmanConfig (podman + 0x16a5fd3)#012#25 0x0000562dfe03edcc sync.(*Once).doSlow (podman + 0x51edcc)#012#26 0x0000562dff1e6c50 github.com/containers/podman/cmd/podman/common.init (podman + 0x16c6c50)#012#27 0x0000562dfe004a57 runtime.doInit1 (podman + 0x4e4a57)#012#28 0x0000562dfdff4f90 runtime.main (podman + 0x4d4f90)#012#29 0x0000562dfe034ee1 runtime.goexit.abi0 (podman + 0x514ee1)#012ELF object binary architecture: AMD x86-64
Jul 24 04:33:18 jaws.cs.umd.edu systemd-coredump[1161203]: Process 1161194 (podman) of user 981 dumped core.#012#012Stack trace of thread 1161194:#012#0 0x000055c061cbf46e internal/runtime/syscall/linux.Syscall6 (podman + 0x48b46e)#012#1 0x000055c061d9f0a6 syscall.Syscall (podman + 0x56b0a6)#012#2 0x000055c061d9fc50 syscall.Syscall.abi0 (podman + 0x56bc50)#012#3 0x000055c061f09c2e github.com/containers/podman/vendor/golang.org/x/sys/unix.OpenTree (podman + 0x6d5c2e)#012#4 0x000055c062562f4b github.com/containers/podman/vendor/github.com/cyphar/filepath-securejoin/p… (podman + 0xd2ef4b)#012#5 0x000055c062562e54 github.com/containers/podman/vendor/github.com/cyphar/filepath-securejoin/p… (podman + 0xd2ee54)#012#6 0x000055c061d52dcc sync.(*Once).doSlow (podman + 0x51edcc)#012#7 0x000055c061d52cf9 sync.(*Once).Do (podman + 0x51ecf9)#012#8 0x000055c062562d
c5 github.com/containers/podman/vendor/github.com/cyphar/filepath-securejoin/p… (podman + 0xd2edc5)#012#9 0x000055c0625643e2 github.com/containers/podman/vendor/github.com/cyphar/filepath-securejoin/p… (podman + 0xd303e2)#012#10 0x000055c0625647f3 github.com/containers/podman/vendor/github.com/cyphar/filepath-securejoin/p… (podman + 0xd307f3)#012#11 0x000055c06256391c github.com/containers/podman/vendor/github.com/cyphar/filepath-securejoin/p… (podman + 0xd2f91c)#012#12 0x000055c062563358 github.com/containers/podman/vendor/github.com/cyphar/filepath-securejoin/p… (podman + 0xd2f358)#012#13 0x000055c061d52dcc sync.(*Once).doSlow (podman + 0x51edcc)#012#14 0x000055c061d52cf9 sync.(*Once).D
o (podman + 0x51ecf9)#012#15 0x000055c0625632c5 github.com/containers/podman/vendor/github.com/cyphar/filepath-securejoin/p… (podman + 0xd2f2c5)#012#16 0x000055c06256479a github.com/containers/podman/vendor/github.com/cyphar/filepath-securejoin/p… (podman + 0xd3079a)#012#17 0x000055c06256b34e github.com/containers/podman/vendor/github.com/opencontainers/selinux/go-se… (podman + 0xd3734e)#012#18 0x000055c06256b838 github.com/containers/podman/vendor/github.com/opencontainers/selinux/go-se… (podman + 0xd37838)#012#19 0x000055c06256a5df github.com/containers/podman/vendor/github.com/opencontainers/selinux/go-se… (podman + 0xd365df)#012#20 0x000055c06256a873 github.com/containers/podman/vendor/github.com/opencontainers/selinux/go-se… (podman + 0xd36873)#012#21 0x000
055c062762f4b github.com/containers/podman/vendor/go.podman.io/common/pkg/config.defaultC… (podman + 0xf2ef4b)#012#22 0x000055c062766912 github.com/containers/podman/vendor/go.podman.io/common/pkg/config.newLocked (podman + 0xf32912)#012#23 0x000055c062766605 github.com/containers/podman/vendor/go.podman.io/common/pkg/config.New (podman + 0xf32605)#012#24 0x000055c062ed9fd3 github.com/containers/podman/cmd/podman/registry.newPodmanConfig (podman + 0x16a5fd3)#012#25 0x000055c061d52dcc sync.(*Once).doSlow (podman + 0x51edcc)#012#26 0x000055c062efac50 github.com/containers/podman/cmd/podman/common.init (podman + 0x16c6c50)#012#27 0x000055c061d18a57 runtime.doInit1 (podman + 0x4e4a57)#012#28 0x000055c061d08f90 runtime.main (podman + 0x4d4f90)#012#29 0x000055c061d48ee1 runtime.goexit.abi0 (podman + 0x514ee1)#012ELF object binary architecture: AMD x86-64
Jul 24 04:33:18 jaws.cs.umd.edu systemd-coredump[1161215]: Process 1161208 (podman) of user 981 dumped core.#012#012Stack trace of thread 1161208:#012#0 0x000056289c3f646e internal/runtime/syscall/linux.Syscall6 (podman + 0x48b46e)#012#1 0x000056289c4d60a6 syscall.Syscall (podman + 0x56b0a6)#012#2 0x000056289c4d6c50 syscall.Syscall.abi0 (podman + 0x56bc50)#012#3 0x000056289c640c2e github.com/containers/podman/vendor/golang.org/x/sys/unix.OpenTree (podman + 0x6d5c2e)#012#4 0x000056289cc99f4b github.com/containers/podman/vendor/github.com/cyphar/filepath-securejoin/p… (podman + 0xd2ef4b)#012#5 0x000056289cc99e54 github.com/containers/podman/vendor/github.com/cyphar/filepath-securejoin/p… (podman + 0xd2ee54)#012#6 0x000056289c489dcc sync.(*Once).doSlow (podman + 0x51edcc)#012#7 0x000056289c489cf9 sync.(*Once).Do (podman + 0x51ecf9)#012#8 0x000056289cc99d
c5 github.com/containers/podman/vendor/github.com/cyphar/filepath-securejoin/p… (podman + 0xd2edc5)#012#9 0x000056289cc9b3e2 github.com/containers/podman/vendor/github.com/cyphar/filepath-securejoin/p… (podman + 0xd303e2)#012#10 0x000056289cc9b7f3 github.com/containers/podman/vendor/github.com/cyphar/filepath-securejoin/p… (podman + 0xd307f3)#012#11 0x000056289cc9a91c github.com/containers/podman/vendor/github.com/cyphar/filepath-securejoin/p… (podman + 0xd2f91c)#012#12 0x000056289cc9a358 github.com/containers/podman/vendor/github.com/cyphar/filepath-securejoin/p… (podman + 0xd2f358)#012#13 0x000056289c489dcc sync.(*Once).doSlow (podman + 0x51edcc)#012#14 0x000056289c489cf9 sync.(*Once).D
o (podman + 0x51ecf9)#012#15 0x000056289cc9a2c5 github.com/containers/podman/vendor/github.com/cyphar/filepath-securejoin/p… (podman + 0xd2f2c5)#012#16 0x000056289cc9b79a github.com/containers/podman/vendor/github.com/cyphar/filepath-securejoin/p… (podman + 0xd3079a)#012#17 0x000056289cca234e github.com/containers/podman/vendor/github.com/opencontainers/selinux/go-se… (podman + 0xd3734e)#012#18 0x000056289cca2838 github.com/containers/podman/vendor/github.com/opencontainers/selinux/go-se… (podman + 0xd37838)#012#19 0x000056289cca15df github.com/containers/podman/vendor/github.com/opencontainers/selinux/go-se… (podman + 0xd365df)#012#20 0x000056289cca1873 github.com/containers/podman/vendor/github.com/opencontainers/selinux/go-se… (podman + 0xd36873)#012#21 0x000
056289ce99f4b github.com/containers/podman/vendor/go.podman.io/common/pkg/config.defaultC… (podman + 0xf2ef4b)#012#22 0x000056289ce9d912 github.com/containers/podman/vendor/go.podman.io/common/pkg/config.newLocked (podman + 0xf32912)#012#23 0x000056289ce9d605 github.com/containers/podman/vendor/go.podman.io/common/pkg/config.New (podman + 0xf32605)#012#24 0x000056289d610fd3 github.com/containers/podman/cmd/podman/registry.newPodmanConfig (podman + 0x16a5fd3)#012#25 0x000056289c489dcc sync.(*Once).doSlow (podman + 0x51edcc)#012#26 0x000056289d631c50 github.com/containers/podman/cmd/podman/common.init (podman + 0x16c6c50)#012#27 0x000056289c44fa57 runtime.doInit1 (podman + 0x4e4a57)#012#28 0x000056289c43ff90 runtime.main (podman + 0x4d4f90)#012#29 0x000056289c47fee1 runtime.goexit.abi0 (podman + 0x514ee1)#012ELF object binary architecture: AMD x86-64
Jul 24 04:33:20 jaws.cs.umd.edu setroubleshoot[1161184]: SELinux is preventing /usr/bin/podman from using the nnp_transition access on a process. For complete SELinux messages run: sealert -l 3c7643bc-dd69-4695-b48c-7d780b62b6cf [x2]
== krispykreme.cs.umd.edu (2 distinct, 2 total) ==
Jul 24 04:33:45 krispykreme.cs.umd.edu sshd-session[2895775]: pam_access(sshd:auth): access denied for user `nau' from `64.47.120.124'
Jul 24 04:34:55 krispykreme.cs.umd.edu sshd-session[2895775]: Failed Duo login for 'nau' from 64.47.120.124
== netman.cs.umd.edu (3 distinct, 3 total) ==
Jul 24 04:29:56 netman.cs.umd.edu setroubleshoot[370255]: SELinux is preventing /usr/bin/gpg from read access on the file gpg.conf. For complete SELinux messages run: sealert -l 019ad1da-a874-4814-8037-3b3e5f413ad2
Jul 24 04:29:57 netman.cs.umd.edu setroubleshoot[370255]: SELinux is preventing /usr/bin/gpg from open access on the file /root/.gnupg/gpg.conf. For complete SELinux messages run: sealert -l cb54177e-d44c-46a1-b246-5c0bbb8343be
Jul 24 04:30:06 netman.cs.umd.edu setroubleshoot[370255]: SELinux is preventing /usr/bin/gpg from getattr access on the file /root/.gnupg/gpg.conf. For complete SELinux messages run: sealert -l fbba2e30-b7ab-491c-9ec6-f553e9ef72af
== newhonors2 (1 distinct, 24 total) ==
Jul 24 04:13:03 newhonors2 dhcpcd[203334]: dhcpcd is not running [x24]
== outbound00.cs.umd.edu (1 distinct, 6 total) ==
Jul 24 04:09:09 outbound00.cs.umd.edu python3[3190312]: ldapdb [x6]
== outbound01.cs.umd.edu (1 distinct, 6 total) ==
Jul 24 04:13:06 outbound01.cs.umd.edu python3[1217649]: ldapdb [x6]
== sentry-docker00.cs.umd.edu (38 distinct, 38 total) ==
Jul 24 04:12:21 sentry-docker00.cs.umd.edu systemd-udevd[2329569]: link_config: could not get ethtool features for vethd2fd627
Jul 24 04:12:21 sentry-docker00.cs.umd.edu systemd-udevd[2329569]: Could not set offload features of vethd2fd627: No such device
Jul 24 04:12:21 sentry-docker00.cs.umd.edu systemd-udevd[2329585]: Could not generate persistent MAC address for vethe3cc8fe: No such file or directory
Jul 24 04:12:21 sentry-docker00.cs.umd.edu systemd-udevd[2329586]: Could not generate persistent MAC address for veth7496a63: No such file or directory
Jul 24 04:18:34 sentry-docker00.cs.umd.edu systemd-udevd[2332927]: link_config: could not get ethtool features for vethb3ba79f
Jul 24 04:18:34 sentry-docker00.cs.umd.edu systemd-udevd[2332927]: Could not set offload features of vethb3ba79f: No such device
Jul 24 04:18:34 sentry-docker00.cs.umd.edu systemd-udevd[2332990]: Could not generate persistent MAC address for veth09beefa: No such file or directory
Jul 24 04:18:34 sentry-docker00.cs.umd.edu systemd-udevd[2332991]: Could not generate persistent MAC address for veth381e391: No such file or directory
Jul 24 04:18:34 sentry-docker00.cs.umd.edu systemd-udevd[2332994]: Could not generate persistent MAC address for vethbcdd4df: No such file or directory
Jul 24 04:18:34 sentry-docker00.cs.umd.edu systemd-udevd[2332995]: Could not generate persistent MAC address for veth1979606: No such file or directory
Jul 24 04:18:34 sentry-docker00.cs.umd.edu systemd-udevd[2333007]: Could not generate persistent MAC address for vethf6b2329: No such file or directory
Jul 24 04:18:34 sentry-docker00.cs.umd.edu systemd-udevd[2332994]: Could not generate persistent MAC address for veth6876c0d: No such file or directory
Jul 24 04:18:34 sentry-docker00.cs.umd.edu systemd-udevd[2333020]: Could not generate persistent MAC address for veth1abd1ec: No such file or directory
Jul 24 04:18:34 sentry-docker00.cs.umd.edu systemd-udevd[2333021]: Could not generate persistent MAC address for veth970678c: No such file or directory
Jul 24 04:32:26 sentry-docker00.cs.umd.edu systemd-udevd[2339099]: Could not generate persistent MAC address for veth0366c70: No such file or directory
Jul 24 04:32:26 sentry-docker00.cs.umd.edu systemd-udevd[2339100]: Could not generate persistent MAC address for vethb1a914c: No such file or directory
Jul 24 04:38:42 sentry-docker00.cs.umd.edu systemd-udevd[2342349]: link_config: could not set ethtool features for veth09beefa
Jul 24 04:38:42 sentry-docker00.cs.umd.edu systemd-udevd[2342349]: Could not set offload features of veth09beefa: Operation not permitted
Jul 24 04:38:42 sentry-docker00.cs.umd.edu systemd-udevd[2342373]: Could not generate persistent MAC address for veth85eb08d: No such file or directory
Jul 24 04:38:42 sentry-docker00.cs.umd.edu systemd-udevd[2342374]: Could not generate persistent MAC address for vethf2ff848: No such file or directory
Jul 24 04:38:42 sentry-docker00.cs.umd.edu systemd-udevd[2342377]: Could not generate persistent MAC address for vethe31bdf8: No such file or directory
Jul 24 04:38:42 sentry-docker00.cs.umd.edu systemd-udevd[2342387]: Could not generate persistent MAC address for veth5a88a5d: No such file or directory
Jul 24 04:38:42 sentry-docker00.cs.umd.edu systemd-udevd[2342378]: Could not generate persistent MAC address for veth703fea1: No such file or directory
Jul 24 04:38:42 sentry-docker00.cs.umd.edu systemd-udevd[2342393]: Could not generate persistent MAC address for veth579cc65: No such file or directory
Jul 24 04:38:43 sentry-docker00.cs.umd.edu systemd-udevd[2342387]: Could not generate persistent MAC address for veth6446ea2: No such file or directory
Jul 24 04:38:43 sentry-docker00.cs.umd.edu systemd-udevd[2342399]: Could not generate persistent MAC address for veth869c734: No such file or directory
Jul 24 04:52:34 sentry-docker00.cs.umd.edu systemd-udevd[2348520]: Could not generate persistent MAC address for veth7ced978: No such file or directory
Jul 24 04:52:34 sentry-docker00.cs.umd.edu systemd-udevd[2348521]: Could not generate persistent MAC address for veth54889c7: No such file or directory
Jul 24 04:58:51 sentry-docker00.cs.umd.edu systemd-udevd[2351801]: link_config: could not get ethtool features for vethe31bdf8
Jul 24 04:58:51 sentry-docker00.cs.umd.edu systemd-udevd[2351801]: Could not set offload features of vethe31bdf8: No such device
... 8 more distinct messages not shown
== strawberry (4 distinct, 10 total) ==
Jul 24 04:09:44 strawberry udisksd[1067]: Error performing housekeeping for drive /org/freedesktop/UDisks2/drives/ST2000DM001_1CH164_W1E8J5KJ: Error updating SMART data: Error sending ATA command CHECK POWER MODE: Unexpected sense data returned:#0120000: 00 00 00 00 00 00 00 00 00 00 00 00 00 00 00 00 ................#0120010: 00 00 00 00 00 00 00 00 00 00 00 00 00 00 00 00 ................#012 (g-io-error-quark, 0) [x6]
Jul 24 04:15:01 strawberry nologin[2620791]: Attempted login by UNKNOWN (UID: 65534) on UNKNOWN
Jul 24 04:15:01 strawberry pipewire[2620790]: mod.jackdbus-detect: Failed to receive jackdbus reply: org.freedesktop.DBus.Error.ServiceUnknown: The name org.jackaudio.service was not provided by any .service files
Jul 24 04:34:42 strawberry smartd[5314]: Device: /dev/sda [SAT], failed to read SMART Attribute Data [x2]
== submit26-b9-4 (9 distinct, 9 total) ==
Jul 24 04:16:11 submit26-b9-4 setroubleshoot[81360]: SELinux is preventing /usr/bin/python3.9 from create access on the directory /(null). For complete SELinux messages run: sealert -l a4e66030-8621-4da9-bd27-5988bb1bf8ad
Jul 24 04:16:11 submit26-b9-4 setroubleshoot[81360]: SELinux is preventing /usr/bin/python3.9 from add_name access on the directory /(null). For complete SELinux messages run: sealert -l c055e37d-bbf5-4800-9083-d606f792c8c1
Jul 24 04:16:11 submit26-b9-4 setroubleshoot[81360]: SELinux is preventing /usr/bin/python3.9 from create access on the file /(null). For complete SELinux messages run: sealert -l e5bc3a56-6d6f-4776-954f-ddde1579648f
Jul 24 04:16:11 submit26-b9-4 setroubleshoot[81360]: SELinux is preventing /usr/bin/python3.9 from open access on the file /tmp/libdnf.s3XIOl/repodata/repomd.xml. For complete SELinux messages run: sealert -l a8ec5e1b-49f9-4fbc-a8ae-22e800f7abf2
Jul 24 04:16:11 submit26-b9-4 setroubleshoot[81360]: SELinux is preventing /usr/bin/python3.9 from setattr access on the file repomd.xml. For complete SELinux messages run: sealert -l 945db714-d0c0-4402-911e-932978b8b036
Jul 24 04:16:11 submit26-b9-4 setroubleshoot[81360]: SELinux is preventing /usr/bin/python3.9 from read access on the directory libdnf.s3XIOl. For complete SELinux messages run: sealert -l 463998a0-fb0d-463c-82b1-471135710a14
Jul 24 04:16:11 submit26-b9-4 setroubleshoot[81360]: SELinux is preventing /usr/bin/python3.9 from remove_name access on the directory repomd.xml. For complete SELinux messages run: sealert -l 473d2e21-15d8-407a-a9ee-2b842607fa00
Jul 24 04:16:11 submit26-b9-4 setroubleshoot[81360]: SELinux is preventing /usr/bin/python3.9 from unlink access on the file repomd.xml. For complete SELinux messages run: sealert -l 80c54d4f-bf4b-4501-addb-1627383587d0
Jul 24 04:16:11 submit26-b9-4 setroubleshoot[81360]: SELinux is preventing /usr/bin/python3.9 from rmdir access on the directory repodata. For complete SELinux messages run: sealert -l c63d3890-151e-49a0-83f0-3dfb69d051e5
== talkhosts9 (1 distinct, 2 total) ==
Jul 24 05:01:50 talkhosts9 setroubleshoot[3129638]: SELinux is preventing /usr/bin/lsof from getattr access on the unix_stream_socket unix_stream_socket. For complete SELinux messages run: sealert -l a6df89b3-c497-469c-8232-c4fde0508abf [x2]
== teaching-awards (1 distinct, 1 total) ==
Jul 24 04:51:50 teaching-awards krb5_child[1129917]: Client 'admin(a)UMD.EDU' not found in Kerberos database
== wraith (3 distinct, 3 total) ==
Jul 24 04:15:01 wraith kernel: nvme 10000:e1:00.0: PCIe Bus Error: severity=Correctable, type=Physical Layer, (Receiver ID)
Jul 24 04:15:01 wraith kernel: nvme 10000:e1:00.0: device [15b7:5015] error status/mask=00000001/0000e000
Jul 24 04:15:01 wraith kernel: nvme 10000:e1:00.0: [ 0] RxErr (First)
1
0
Command: /usr/local/sbin/syslog-digest.py
Time : 0.4811s
Status : exited 0
Output :
Syslog digest — 2026-07-24 04:05 EDT
Processed 4,350 lines, filtered 3,767 (86%). 583 unknown (74 distinct) from 17 host(s).
== abuse (1 distinct, 346 total) ==
Jul 24 03:05:06 abuse rsyslogd[21745]: imjournal: open() failed for path: '/var/lib/rsyslog/imjournal.state.tmp': Input/output error [v8.2404.0 try https://www.rsyslog.com/e/2433 ] [x346]
== alec.cs.umd.edu (3 distinct, 60 total) ==
Jul 24 03:05:16 alec.cs.umd.edu setroubleshoot[2430713]: failed to retrieve rpm info for path '/run/netns/netns-a2b2cc2d-7532-4db7-6a36-b1dd3d5f51db': [x12]
Jul 24 03:05:17 alec.cs.umd.edu sedispatch[1526]: AVC Message regarding setroubleshoot, ignoring message [x24]
Jul 24 03:05:17 alec.cs.umd.edu setroubleshoot[2430713]: SELinux is preventing /usr/bin/df from getattr access on the file /run/netns/netns-a2b2cc2d-7532-4db7-6a36-b1dd3d5f51db. For complete SELinux messages run: sealert -l 23f93208-3063-4aac-b78a-bb0fcb40740c [x24]
== cheezit.cs.umd.edu (11 distinct, 15 total) ==
Jul 24 03:08:34 cheezit.cs.umd.edu setroubleshoot[1219567]: failed to retrieve rpm info for path '/var/lib/sss/pipes/nss': [x3]
Jul 24 03:08:35 cheezit.cs.umd.edu setroubleshoot[1219567]: SELinux is preventing /usr/bin/lsof from write access on the sock_file /var/lib/sss/pipes/nss. For complete SELinux messages run: sealert -l f570494d-54d2-4dac-97e2-28395659abf1 [x3]
Jul 24 03:08:49 cheezit.cs.umd.edu setroubleshoot[1220184]: failed to retrieve rpm info for path '/var/log/falconctl.log':
Jul 24 03:08:50 cheezit.cs.umd.edu setroubleshoot[1220184]: SELinux is preventing /opt/CrowdStrike/falconctl18708 from append access on the file /var/log/falconctl.log. For complete SELinux messages run: sealert -l 63f66d53-fcfc-44da-a79e-c789b1ce2ce8
Jul 24 03:08:52 cheezit.cs.umd.edu setroubleshoot[1220184]: SELinux is preventing /opt/CrowdStrike/falconctl18708 from write access on the file falconstore. For complete SELinux messages run: sealert -l 386506af-597f-4357-89de-bc382f369a6e
Jul 24 03:09:05 cheezit.cs.umd.edu setroubleshoot[1220556]: SELinux is preventing /usr/bin/lsof from write access on the sock_file socket. For complete SELinux messages run: sealert -l 9ff2383b-9e1d-44ff-b8ae-af91637450ae
Jul 24 03:09:45 cheezit.cs.umd.edu setroubleshoot[1221035]: SELinux is preventing /usr/bin/python3.9 from read access on the file /etc/selinux/targeted/contexts/files/file_contexts.subs_dist. For complete SELinux messages run: sealert -l 679eb260-cf5d-4783-99f4-ce308edb3295
Jul 24 03:09:45 cheezit.cs.umd.edu setroubleshoot[1221035]: SELinux is preventing /usr/bin/python3.9 from open access on the file /etc/selinux/targeted/contexts/files/file_contexts.subs_dist. For complete SELinux messages run: sealert -l 77caba8a-5cd0-4e18-b188-6e35c461772d
Jul 24 03:09:45 cheezit.cs.umd.edu setroubleshoot[1221035]: SELinux is preventing /usr/bin/python3.9 from read access on the file /etc/selinux/targeted/contexts/files/file_contexts.subs. For complete SELinux messages run: sealert -l d9c6dd0d-0a34-4430-a5ff-e985c55cb064
Jul 24 03:09:45 cheezit.cs.umd.edu setroubleshoot[1221035]: SELinux is preventing /usr/bin/python3.9 from open access on the file /etc/selinux/targeted/contexts/files/file_contexts.subs. For complete SELinux messages run: sealert -l 8edbce57-8212-4ac8-af50-3fe403231eda
Jul 24 03:09:45 cheezit.cs.umd.edu setroubleshoot[1221035]: SELinux is preventing /usr/bin/python3.9 from map access on the file /etc/selinux/targeted/contexts/files/file_contexts.bin. For complete SELinux messages run: sealert -l 4a0cbe3b-6f49-4c7e-95c6-380f7aef806e
== csfw00a (1 distinct, 14 total) ==
Jul 24 03:14:37 csfw00a kernel: bnxt_en 0000:09:00.0 eth3: NIC Link is Down [x14]
== grafana (2 distinct, 2 total) ==
Jul 24 03:59:24 grafana systemd-resolved[787]: Using degraded feature set UDP instead of UDP+EDNS0 for DNS server 10.73.244.100.
Jul 24 03:59:39 grafana systemd-resolved[787]: Using degraded feature set TCP instead of UDP for DNS server 10.73.244.100.
== hackerman (1 distinct, 1 total) ==
Jul 24 03:19:01 hackerman gnome-software[2060381]: failed to commit changes to dconf: GDBus.Error:org.gtk.GDBus.UnmappedGError.Quark._g_2dfile_2derror_2dquark.Code2: Failed to create file “/adminhomes/sajith/.config/dconf/user.LGWYS3”: Permission denied
== idm00 (1 distinct, 1 total) ==
Jul 24 03:51:04 idm00 named[1455]: client @0x7f330400b988 10.73.240.42#59630: update '73.10.in-addr.arpa/IN' denied
== idmp0 (1 distinct, 1 total) ==
Jul 24 03:34:56 idmp0 named[5198]: client @0x7f99145a70c8 10.73.240.43#62532: update '73.10.in-addr.arpa/IN' denied
== itmon02 (2 distinct, 45 total) ==
Jul 24 03:07:47 itmon02 sshd[1834]: error: beginning MaxStartups throttling [x44]
Jul 24 03:15:04 itmon02 (httpd)[814970]: httpd.service: Referenced but unset environment variable evaluates to an empty string: OPTIONS
== kadath.cs.umd.edu (1 distinct, 1 total) ==
Jul 24 03:47:30 kadath.cs.umd.edu puppet-agent[3412536]: (Facter) invalid or malformed lldp data: MalformedDataError: no lldp interface data found
== netbox (1 distinct, 1 total) ==
Jul 24 03:08:02 netbox (httpd)[74497]: httpd.service: Referenced but unset environment variable evaluates to an empty string: OPTIONS
== newhonors2 (1 distinct, 24 total) ==
Jul 24 03:13:03 newhonors2 dhcpcd[201492]: dhcpcd is not running [x24]
== outbound00.cs.umd.edu (3 distinct, 13 total) ==
Jul 24 03:09:09 outbound00.cs.umd.edu python3[3175089]: ldapdb [x7]
Jul 24 03:24:15 outbound00.cs.umd.edu systemd[1]: Configuration file /usr/lib/systemd/system/authentication_milter.service is marked executable. Please remove executable permission bits. Proceeding anyway.
Jul 24 03:38:01 outbound00.cs.umd.edu cockpit-ws[3182521]: /usr/share/cockpit/static/login.js/favicon.ico: Failed to open file “/usr/share/cockpit/static/login.js/favicon.ico”: open() failed: Not a directory [x5]
== outbound01.cs.umd.edu (4 distinct, 12 total) ==
Jul 24 03:13:06 outbound01.cs.umd.edu python3[1203287]: ldapdb [x6]
Jul 24 03:37:58 outbound01.cs.umd.edu cockpit-ws[1209083]: /usr/share/cockpit/static/login.js/favicon.ico: Failed to open file “/usr/share/cockpit/static/login.js/favicon.ico”: open() failed: Not a directory [x4]
Jul 24 03:37:59 outbound01.cs.umd.edu krb5_child[1209271]: Client 'admin(a)UMD.EDU' not found in Kerberos database
Jul 24 03:40:11 outbound01.cs.umd.edu sshd-session[1210129]: error: Protocol major versions differ: 2 vs. 1
== sentry-docker00.cs.umd.edu (36 distinct, 36 total) ==
Jul 24 03:12:05 sentry-docker00.cs.umd.edu systemd-udevd[2301330]: Could not generate persistent MAC address for vetha9c07e6: No such file or directory
Jul 24 03:12:05 sentry-docker00.cs.umd.edu systemd-udevd[2301331]: Could not generate persistent MAC address for veth6b4e1f8: No such file or directory
Jul 24 03:18:09 sentry-docker00.cs.umd.edu systemd-udevd[2304402]: link_config: could not get ethtool features for veth78dd4e3
Jul 24 03:18:09 sentry-docker00.cs.umd.edu systemd-udevd[2304402]: Could not set offload features of veth78dd4e3: No such device
Jul 24 03:18:09 sentry-docker00.cs.umd.edu systemd-udevd[2304486]: Could not generate persistent MAC address for veth7dc4ace: No such file or directory
Jul 24 03:18:09 sentry-docker00.cs.umd.edu systemd-udevd[2304487]: Could not generate persistent MAC address for vethedc8f79: No such file or directory
Jul 24 03:18:09 sentry-docker00.cs.umd.edu systemd-udevd[2304514]: Could not generate persistent MAC address for veth173c05b: No such file or directory
Jul 24 03:18:09 sentry-docker00.cs.umd.edu systemd-udevd[2304515]: Could not generate persistent MAC address for veth4dbc124: No such file or directory
Jul 24 03:18:09 sentry-docker00.cs.umd.edu systemd-udevd[2304518]: Could not generate persistent MAC address for veth6067ea8: No such file or directory
Jul 24 03:18:09 sentry-docker00.cs.umd.edu systemd-udevd[2304540]: Could not generate persistent MAC address for veth57e1570: No such file or directory
Jul 24 03:18:09 sentry-docker00.cs.umd.edu systemd-udevd[2304519]: Could not generate persistent MAC address for vethf20f552: No such file or directory
Jul 24 03:18:09 sentry-docker00.cs.umd.edu systemd-udevd[2304530]: Could not generate persistent MAC address for vethf82a074: No such file or directory
Jul 24 03:32:13 sentry-docker00.cs.umd.edu systemd-udevd[2310752]: Could not generate persistent MAC address for veth47eb152: No such file or directory
Jul 24 03:32:13 sentry-docker00.cs.umd.edu systemd-udevd[2310753]: Could not generate persistent MAC address for veth6616a3c: No such file or directory
Jul 24 03:38:17 sentry-docker00.cs.umd.edu systemd-udevd[2313962]: link_config: could not get ethtool features for veth7dc4ace
Jul 24 03:38:17 sentry-docker00.cs.umd.edu systemd-udevd[2313962]: Could not set offload features of veth7dc4ace: No such device
Jul 24 03:38:18 sentry-docker00.cs.umd.edu systemd-udevd[2313991]: Could not generate persistent MAC address for vethefd5350: No such file or directory
Jul 24 03:38:18 sentry-docker00.cs.umd.edu systemd-udevd[2313992]: Could not generate persistent MAC address for veth3f993d6: No such file or directory
Jul 24 03:38:18 sentry-docker00.cs.umd.edu systemd-udevd[2313995]: Could not generate persistent MAC address for veth210fcd6: No such file or directory
Jul 24 03:38:18 sentry-docker00.cs.umd.edu systemd-udevd[2314017]: Could not generate persistent MAC address for vethae90455: No such file or directory
Jul 24 03:38:18 sentry-docker00.cs.umd.edu systemd-udevd[2314005]: Could not generate persistent MAC address for veth7ed897d: No such file or directory
Jul 24 03:38:18 sentry-docker00.cs.umd.edu systemd-udevd[2314012]: Could not generate persistent MAC address for vethe95bb23: No such file or directory
Jul 24 03:38:18 sentry-docker00.cs.umd.edu systemd-udevd[2314009]: Could not generate persistent MAC address for veth6b171bd: No such file or directory
Jul 24 03:38:18 sentry-docker00.cs.umd.edu systemd-udevd[2314012]: Could not generate persistent MAC address for vethfeaf169: No such file or directory
Jul 24 03:52:17 sentry-docker00.cs.umd.edu systemd-udevd[2320165]: Could not generate persistent MAC address for vethd2fd627: No such file or directory
Jul 24 03:52:17 sentry-docker00.cs.umd.edu systemd-udevd[2320166]: Could not generate persistent MAC address for veth9e830ca: No such file or directory
Jul 24 03:58:26 sentry-docker00.cs.umd.edu systemd-udevd[2323341]: link_config: could not get ethtool features for veth7ed897d
Jul 24 03:58:26 sentry-docker00.cs.umd.edu systemd-udevd[2323341]: Could not set offload features of veth7ed897d: No such device
Jul 24 03:58:26 sentry-docker00.cs.umd.edu systemd-udevd[2323367]: Could not generate persistent MAC address for vethf4914ed: No such file or directory
Jul 24 03:58:26 sentry-docker00.cs.umd.edu systemd-udevd[2323368]: Could not generate persistent MAC address for vethb4be1ed: No such file or directory
... 6 more distinct messages not shown
== strawberry (2 distinct, 8 total) ==
Jul 24 03:09:44 strawberry udisksd[1067]: Error performing housekeeping for drive /org/freedesktop/UDisks2/drives/ST2000DM001_1CH164_W1E8J5KJ: Error updating SMART data: Error sending ATA command CHECK POWER MODE: Unexpected sense data returned:#0120000: 00 00 00 00 00 00 00 00 00 00 00 00 00 00 00 00 ................#0120010: 00 00 00 00 00 00 00 00 00 00 00 00 00 00 00 00 ................#012 (g-io-error-quark, 0) [x6]
Jul 24 03:34:42 strawberry smartd[5314]: Device: /dev/sda [SAT], failed to read SMART Attribute Data [x2]
== submit26-b9-2 (3 distinct, 3 total) ==
Jul 24 03:05:06 submit26-b9-2 systemd[1]: user(a)1001.service: Main process exited, code=killed, status=9/KILL
Jul 24 03:05:08 submit26-b9-2 systemd-coredump[80879]: Process 80876 (simavr) of user 1001 dumped core.
Jul 24 03:05:09 submit26-b9-2 systemd-coredump[80920]: Process 80917 (simavr) of user 1001 dumped core.
1
0
Command: /usr/local/sbin/syslog-digest.py
Time : 0.4960s
Status : exited 0
Output :
Syslog digest — 2026-07-24 03:05 EDT
Processed 4,529 lines, filtered 3,939 (86%). 590 unknown (76 distinct) from 17 host(s).
== abuse (1 distinct, 346 total) ==
Jul 24 02:05:06 abuse rsyslogd[21745]: imjournal: open() failed for path: '/var/lib/rsyslog/imjournal.state.tmp': Input/output error [v8.2404.0 try https://www.rsyslog.com/e/2433 ] [x346]
== alec.cs.umd.edu (3 distinct, 62 total) ==
Jul 24 02:05:19 alec.cs.umd.edu setroubleshoot[2415801]: failed to retrieve rpm info for path '/run/netns/netns-a2b2cc2d-7532-4db7-6a36-b1dd3d5f51db': [x12]
Jul 24 02:05:20 alec.cs.umd.edu sedispatch[1526]: AVC Message regarding setroubleshoot, ignoring message [x24]
Jul 24 02:05:20 alec.cs.umd.edu setroubleshoot[2415801]: SELinux is preventing /usr/bin/df from getattr access on the file /run/netns/netns-a2b2cc2d-7532-4db7-6a36-b1dd3d5f51db. For complete SELinux messages run: sealert -l 23f93208-3063-4aac-b78a-bb0fcb40740c [x26]
== csfw00a (1 distinct, 20 total) ==
Jul 24 02:04:47 csfw00a kernel: bnxt_en 0000:09:00.0 eth3: NIC Link is Down [x20]
== idm00 (1 distinct, 1 total) ==
Jul 24 02:51:04 idm00 named[1455]: client @0x7f330c3fe848 10.73.240.42#55088: update '73.10.in-addr.arpa/IN' denied
== idmp0 (1 distinct, 1 total) ==
Jul 24 02:34:56 idmp0 named[5198]: client @0x7f99180928f8 10.73.240.43#62993: update '73.10.in-addr.arpa/IN' denied
== inbound01.cs.umd.edu (2 distinct, 2 total) ==
Jul 24 02:15:28 inbound01.cs.umd.edu krb5_child[1198179]: Client 'admin(a)UMD.EDU' not found in Kerberos database
Jul 24 02:15:59 inbound01.cs.umd.edu sshd-session[1198269]: error: Protocol major versions differ: 2 vs. 1
== itmon02 (1 distinct, 45 total) ==
Jul 24 02:08:10 itmon02 sshd[1834]: error: beginning MaxStartups throttling [x45]
== jaws.cs.umd.edu (4 distinct, 5 total) ==
Jul 24 02:33:14 jaws.cs.umd.edu systemd-coredump[1134676]: Process 1134658 (podman) of user 981 dumped core.#012#012Stack trace of thread 1134658:#012#0 0x000055faa8b6146e internal/runtime/syscall/linux.Syscall6 (podman + 0x48b46e)#012#1 0x000055faa8c410a6 syscall.Syscall (podman + 0x56b0a6)#012#2 0x000055faa8c41c50 syscall.Syscall.abi0 (podman + 0x56bc50)#012#3 0x000055faa8dabc2e github.com/containers/podman/vendor/golang.org/x/sys/unix.OpenTree (podman + 0x6d5c2e)#012#4 0x000055faa9404f4b github.com/containers/podman/vendor/github.com/cyphar/filepath-securejoin/p… (podman + 0xd2ef4b)#012#5 0x000055faa9404e54 github.com/containers/podman/vendor/github.com/cyphar/filepath-securejoin/p… (podman + 0xd2ee54)#012#6 0x000055faa8bf4dcc sync.(*Once).doSlow (podman + 0x51edcc)#012#7 0x000055faa8bf4cf9 sync.(*Once).Do (podman + 0x51ecf9)#012#8 0x000055faa9404d
c5 github.com/containers/podman/vendor/github.com/cyphar/filepath-securejoin/p… (podman + 0xd2edc5)#012#9 0x000055faa94063e2 github.com/containers/podman/vendor/github.com/cyphar/filepath-securejoin/p… (podman + 0xd303e2)#012#10 0x000055faa94067f3 github.com/containers/podman/vendor/github.com/cyphar/filepath-securejoin/p… (podman + 0xd307f3)#012#11 0x000055faa940591c github.com/containers/podman/vendor/github.com/cyphar/filepath-securejoin/p… (podman + 0xd2f91c)#012#12 0x000055faa9405358 github.com/containers/podman/vendor/github.com/cyphar/filepath-securejoin/p… (podman + 0xd2f358)#012#13 0x000055faa8bf4dcc sync.(*Once).doSlow (podman + 0x51edcc)#012#14 0x000055faa8bf4cf9 sync.(*Once).D
o (podman + 0x51ecf9)#012#15 0x000055faa94052c5 github.com/containers/podman/vendor/github.com/cyphar/filepath-securejoin/p… (podman + 0xd2f2c5)#012#16 0x000055faa940679a github.com/containers/podman/vendor/github.com/cyphar/filepath-securejoin/p… (podman + 0xd3079a)#012#17 0x000055faa940d34e github.com/containers/podman/vendor/github.com/opencontainers/selinux/go-se… (podman + 0xd3734e)#012#18 0x000055faa940d838 github.com/containers/podman/vendor/github.com/opencontainers/selinux/go-se… (podman + 0xd37838)#012#19 0x000055faa940c5df github.com/containers/podman/vendor/github.com/opencontainers/selinux/go-se… (podman + 0xd365df)#012#20 0x000055faa940c873 github.com/containers/podman/vendor/github.com/opencontainers/selinux/go-se… (podman + 0xd36873)#012#21 0x000
055faa9604f4b github.com/containers/podman/vendor/go.podman.io/common/pkg/config.defaultC… (podman + 0xf2ef4b)#012#22 0x000055faa9608912 github.com/containers/podman/vendor/go.podman.io/common/pkg/config.newLocked (podman + 0xf32912)#012#23 0x000055faa9608605 github.com/containers/podman/vendor/go.podman.io/common/pkg/config.New (podman + 0xf32605)#012#24 0x000055faa9d7bfd3 github.com/containers/podman/cmd/podman/registry.newPodmanConfig (podman + 0x16a5fd3)#012#25 0x000055faa8bf4dcc sync.(*Once).doSlow (podman + 0x51edcc)#012#26 0x000055faa9d9cc50 github.com/containers/podman/cmd/podman/common.init (podman + 0x16c6c50)#012#27 0x000055faa8bbaa57 runtime.doInit1 (podman + 0x4e4a57)#012#28 0x000055faa8baaf90 runtime.main (podman + 0x4d4f90)#012#29 0x000055faa8beaee1 runtime.goexit.abi0 (podman + 0x514ee1)#012ELF object binary architecture: AMD x86-64
Jul 24 02:33:15 jaws.cs.umd.edu systemd-coredump[1134694]: Process 1134685 (podman) of user 981 dumped core.#012#012Stack trace of thread 1134685:#012#0 0x00005583fb64846e internal/runtime/syscall/linux.Syscall6 (podman + 0x48b46e)#012#1 0x00005583fb7280a6 syscall.Syscall (podman + 0x56b0a6)#012#2 0x00005583fb728c50 syscall.Syscall.abi0 (podman + 0x56bc50)#012#3 0x00005583fb892c2e github.com/containers/podman/vendor/golang.org/x/sys/unix.OpenTree (podman + 0x6d5c2e)#012#4 0x00005583fbeebf4b github.com/containers/podman/vendor/github.com/cyphar/filepath-securejoin/p… (podman + 0xd2ef4b)#012#5 0x00005583fbeebe54 github.com/containers/podman/vendor/github.com/cyphar/filepath-securejoin/p… (podman + 0xd2ee54)#012#6 0x00005583fb6dbdcc sync.(*Once).doSlow (podman + 0x51edcc)#012#7 0x00005583fb6dbcf9 sync.(*Once).Do (podman + 0x51ecf9)#012#8 0x00005583fbeebd
c5 github.com/containers/podman/vendor/github.com/cyphar/filepath-securejoin/p… (podman + 0xd2edc5)#012#9 0x00005583fbeed3e2 github.com/containers/podman/vendor/github.com/cyphar/filepath-securejoin/p… (podman + 0xd303e2)#012#10 0x00005583fbeed7f3 github.com/containers/podman/vendor/github.com/cyphar/filepath-securejoin/p… (podman + 0xd307f3)#012#11 0x00005583fbeec91c github.com/containers/podman/vendor/github.com/cyphar/filepath-securejoin/p… (podman + 0xd2f91c)#012#12 0x00005583fbeec358 github.com/containers/podman/vendor/github.com/cyphar/filepath-securejoin/p… (podman + 0xd2f358)#012#13 0x00005583fb6dbdcc sync.(*Once).doSlow (podman + 0x51edcc)#012#14 0x00005583fb6dbcf9 sync.(*Once).D
o (podman + 0x51ecf9)#012#15 0x00005583fbeec2c5 github.com/containers/podman/vendor/github.com/cyphar/filepath-securejoin/p… (podman + 0xd2f2c5)#012#16 0x00005583fbeed79a github.com/containers/podman/vendor/github.com/cyphar/filepath-securejoin/p… (podman + 0xd3079a)#012#17 0x00005583fbef434e github.com/containers/podman/vendor/github.com/opencontainers/selinux/go-se… (podman + 0xd3734e)#012#18 0x00005583fbef4838 github.com/containers/podman/vendor/github.com/opencontainers/selinux/go-se… (podman + 0xd37838)#012#19 0x00005583fbef35df github.com/containers/podman/vendor/github.com/opencontainers/selinux/go-se… (podman + 0xd365df)#012#20 0x00005583fbef3873 github.com/containers/podman/vendor/github.com/opencontainers/selinux/go-se… (podman + 0xd36873)#012#21 0x000
05583fc0ebf4b github.com/containers/podman/vendor/go.podman.io/common/pkg/config.defaultC… (podman + 0xf2ef4b)#012#22 0x00005583fc0ef912 github.com/containers/podman/vendor/go.podman.io/common/pkg/config.newLocked (podman + 0xf32912)#012#23 0x00005583fc0ef605 github.com/containers/podman/vendor/go.podman.io/common/pkg/config.New (podman + 0xf32605)#012#24 0x00005583fc862fd3 github.com/containers/podman/cmd/podman/registry.newPodmanConfig (podman + 0x16a5fd3)#012#25 0x00005583fb6dbdcc sync.(*Once).doSlow (podman + 0x51edcc)#012#26 0x00005583fc883c50 github.com/containers/podman/cmd/podman/common.init (podman + 0x16c6c50)#012#27 0x00005583fb6a1a57 runtime.doInit1 (podman + 0x4e4a57)#012#28 0x00005583fb691f90 runtime.main (podman + 0x4d4f90)#012#29 0x00005583fb6d1ee1 runtime.goexit.abi0 (podman + 0x514ee1)#012ELF object binary architecture: AMD x86-64
Jul 24 02:33:17 jaws.cs.umd.edu systemd-coredump[1134723]: Process 1134708 (podman) of user 981 dumped core.#012#012Stack trace of thread 1134708:#012#0 0x000056112388746e internal/runtime/syscall/linux.Syscall6 (podman + 0x48b46e)#012#1 0x00005611239670a6 syscall.Syscall (podman + 0x56b0a6)#012#2 0x0000561123967c50 syscall.Syscall.abi0 (podman + 0x56bc50)#012#3 0x0000561123ad1c2e github.com/containers/podman/vendor/golang.org/x/sys/unix.OpenTree (podman + 0x6d5c2e)#012#4 0x000056112412af4b github.com/containers/podman/vendor/github.com/cyphar/filepath-securejoin/p… (podman + 0xd2ef4b)#012#5 0x000056112412ae54 github.com/containers/podman/vendor/github.com/cyphar/filepath-securejoin/p… (podman + 0xd2ee54)#012#6 0x000056112391adcc sync.(*Once).doSlow (podman + 0x51edcc)#012#7 0x000056112391acf9 sync.(*Once).Do (podman + 0x51ecf9)#012#8 0x000056112412ad
c5 github.com/containers/podman/vendor/github.com/cyphar/filepath-securejoin/p… (podman + 0xd2edc5)#012#9 0x000056112412c3e2 github.com/containers/podman/vendor/github.com/cyphar/filepath-securejoin/p… (podman + 0xd303e2)#012#10 0x000056112412c7f3 github.com/containers/podman/vendor/github.com/cyphar/filepath-securejoin/p… (podman + 0xd307f3)#012#11 0x000056112412b91c github.com/containers/podman/vendor/github.com/cyphar/filepath-securejoin/p… (podman + 0xd2f91c)#012#12 0x000056112412b358 github.com/containers/podman/vendor/github.com/cyphar/filepath-securejoin/p… (podman + 0xd2f358)#012#13 0x000056112391adcc sync.(*Once).doSlow (podman + 0x51edcc)#012#14 0x000056112391acf9 sync.(*Once).D
o (podman + 0x51ecf9)#012#15 0x000056112412b2c5 github.com/containers/podman/vendor/github.com/cyphar/filepath-securejoin/p… (podman + 0xd2f2c5)#012#16 0x000056112412c79a github.com/containers/podman/vendor/github.com/cyphar/filepath-securejoin/p… (podman + 0xd3079a)#012#17 0x000056112413334e github.com/containers/podman/vendor/github.com/opencontainers/selinux/go-se… (podman + 0xd3734e)#012#18 0x0000561124133838 github.com/containers/podman/vendor/github.com/opencontainers/selinux/go-se… (podman + 0xd37838)#012#19 0x00005611241325df github.com/containers/podman/vendor/github.com/opencontainers/selinux/go-se… (podman + 0xd365df)#012#20 0x0000561124132873 github.com/containers/podman/vendor/github.com/opencontainers/selinux/go-se… (podman + 0xd36873)#012#21 0x000
056112432af4b github.com/containers/podman/vendor/go.podman.io/common/pkg/config.defaultC… (podman + 0xf2ef4b)#012#22 0x000056112432e912 github.com/containers/podman/vendor/go.podman.io/common/pkg/config.newLocked (podman + 0xf32912)#012#23 0x000056112432e605 github.com/containers/podman/vendor/go.podman.io/common/pkg/config.New (podman + 0xf32605)#012#24 0x0000561124aa1fd3 github.com/containers/podman/cmd/podman/registry.newPodmanConfig (podman + 0x16a5fd3)#012#25 0x000056112391adcc sync.(*Once).doSlow (podman + 0x51edcc)#012#26 0x0000561124ac2c50 github.com/containers/podman/cmd/podman/common.init (podman + 0x16c6c50)#012#27 0x00005611238e0a57 runtime.doInit1 (podman + 0x4e4a57)#012#28 0x00005611238d0f90 runtime.main (podman + 0x4d4f90)#012#29 0x0000561123910ee1 runtime.goexit.abi0 (podman + 0x514ee1)#012ELF object binary architecture: AMD x86-64
Jul 24 02:33:17 jaws.cs.umd.edu setroubleshoot[1134675]: SELinux is preventing /usr/bin/podman from using the nnp_transition access on a process. For complete SELinux messages run: sealert -l 3c7643bc-dd69-4695-b48c-7d780b62b6cf [x2]
== matrix (3 distinct, 4 total) ==
Jul 24 02:12:46 matrix krb5_child[772856]: Client 'admin(a)UMD.EDU' not found in Kerberos database [x2]
Jul 24 02:12:49 matrix sshd[772829]: error: PAM: Authentication failure for admin from 34.53.140.231
Jul 24 02:13:03 matrix sshd[772942]: error: Protocol major versions differ: 2 vs. 1
== mcstic (3 distinct, 6 total) ==
Jul 24 02:38:51 mcstic krb5_child[1567065]: Client 'admin(a)UMD.EDU' not found in Kerberos database [x4]
Jul 24 02:38:55 mcstic sshd[1567060]: error: PAM: Authentication failure for admin from 34.78.100.66
Jul 24 02:40:13 mcstic sshd[1567090]: error: Protocol major versions differ: 2 vs. 1
== networkvm01.cs.umd.edu (10 distinct, 12 total) ==
Jul 24 02:32:05 networkvm01.cs.umd.edu setroubleshoot[2096539]: SELinux is preventing /usr/bin/gpg from write access on the directory /(null). For complete SELinux messages run: sealert -l 8ead1354-ae8a-4a17-bb3f-146ebf6c892c
Jul 24 02:32:05 networkvm01.cs.umd.edu setroubleshoot[2096539]: SELinux is preventing /usr/bin/gpg from add_name access on the directory /(null). For complete SELinux messages run: sealert -l f9b51e91-5dbc-455f-88c2-f0746a2f0f4c
Jul 24 02:32:05 networkvm01.cs.umd.edu setroubleshoot[2096539]: SELinux is preventing /usr/bin/gpg from create access on the file /(null). For complete SELinux messages run: sealert -l af0a60e6-c449-4bdd-bfb8-c69b58472884 [x2]
Jul 24 02:32:05 networkvm01.cs.umd.edu setroubleshoot[2096539]: SELinux is preventing /usr/bin/gpg from link access on the file /(null). For complete SELinux messages run: sealert -l 3df452f6-4d9e-4e38-946b-ea8e1edd356c [x2]
Jul 24 02:32:05 networkvm01.cs.umd.edu setroubleshoot[2096539]: SELinux is preventing /usr/bin/gpg from remove_name access on the directory .#lk0x0000561ff8ee5ed0.networkvm01.cs.umd.edu.2096538x. For complete SELinux messages run: sealert -l fcac71c9-c7c0-45a9-9dc2-a8dcbeccfc75
Jul 24 02:32:05 networkvm01.cs.umd.edu setroubleshoot[2096539]: SELinux is preventing /usr/bin/gpg from unlink access on the file .#lk0x0000561ff8ee5ed0.networkvm01.cs.umd.edu.2096538x. For complete SELinux messages run: sealert -l a672ebb7-fa69-419c-b1f0-fb386b8b48a6
Jul 24 02:32:05 networkvm01.cs.umd.edu setroubleshoot[2096539]: SELinux is preventing /usr/bin/gpg from write access on the directory /(null). For complete SELinux messages run: sealert -l fec9104e-d27a-4fd4-9872-6b17088c2951
Jul 24 02:32:05 networkvm01.cs.umd.edu setroubleshoot[2096539]: SELinux is preventing /usr/bin/gpg from add_name access on the directory /(null). For complete SELinux messages run: sealert -l 26718b2a-493d-457d-818c-244bd8d4ec9d
Jul 24 02:32:05 networkvm01.cs.umd.edu setroubleshoot[2096539]: SELinux is preventing /usr/bin/gpg from remove_name access on the directory .#lk0x0000561eeac0dee0.networkvm01.cs.umd.edu.2096556x. For complete SELinux messages run: sealert -l 80e6efe4-93f3-4219-8132-b2b52db1f517
Jul 24 02:32:05 networkvm01.cs.umd.edu setroubleshoot[2096539]: SELinux is preventing /usr/bin/gpg from unlink access on the file .#lk0x0000561eeac0dee0.networkvm01.cs.umd.edu.2096556x. For complete SELinux messages run: sealert -l a672ebb7-fa69-419c-b1f0-fb386b8b48a6
== newhonors2 (1 distinct, 24 total) ==
Jul 24 02:13:02 newhonors2 dhcpcd[199644]: dhcpcd is not running [x24]
== outbound00.cs.umd.edu (1 distinct, 6 total) ==
Jul 24 02:09:09 outbound00.cs.umd.edu python3[3161103]: ldapdb [x6]
== outbound01.cs.umd.edu (1 distinct, 6 total) ==
Jul 24 02:13:06 outbound01.cs.umd.edu python3[1189480]: ldapdb [x6]
== sentry-docker00.cs.umd.edu (36 distinct, 36 total) ==
Jul 24 02:11:39 sentry-docker00.cs.umd.edu systemd-udevd[2272523]: link_config: could not get ethtool features for vethaa28940
Jul 24 02:11:39 sentry-docker00.cs.umd.edu systemd-udevd[2272523]: Could not set offload features of vethaa28940: No such device
Jul 24 02:11:40 sentry-docker00.cs.umd.edu systemd-udevd[2272542]: Could not generate persistent MAC address for veth6bd7bb8: No such file or directory
Jul 24 02:11:40 sentry-docker00.cs.umd.edu systemd-udevd[2272543]: Could not generate persistent MAC address for veth0195c78: No such file or directory
Jul 24 02:17:44 sentry-docker00.cs.umd.edu systemd-udevd[2274666]: link_config: could not get ethtool features for veth2128bee
Jul 24 02:17:44 sentry-docker00.cs.umd.edu systemd-udevd[2274666]: Could not set offload features of veth2128bee: No such device
Jul 24 02:17:44 sentry-docker00.cs.umd.edu systemd-udevd[2274718]: Could not generate persistent MAC address for veth600818c: No such file or directory
Jul 24 02:17:44 sentry-docker00.cs.umd.edu systemd-udevd[2274719]: Could not generate persistent MAC address for vethf745d6b: No such file or directory
Jul 24 02:17:44 sentry-docker00.cs.umd.edu systemd-udevd[2274722]: Could not generate persistent MAC address for vethc4fe845: No such file or directory
Jul 24 02:17:44 sentry-docker00.cs.umd.edu systemd-udevd[2274723]: Could not generate persistent MAC address for vethc3f5e7f: No such file or directory
Jul 24 02:17:44 sentry-docker00.cs.umd.edu systemd-udevd[2274746]: Could not generate persistent MAC address for veth0f1d32f: No such file or directory
Jul 24 02:17:44 sentry-docker00.cs.umd.edu systemd-udevd[2274747]: Could not generate persistent MAC address for veth61567fa: No such file or directory
Jul 24 02:17:44 sentry-docker00.cs.umd.edu systemd-udevd[2274765]: Could not generate persistent MAC address for veth0163238: No such file or directory
Jul 24 02:17:44 sentry-docker00.cs.umd.edu systemd-udevd[2274754]: Could not generate persistent MAC address for veth5e276ca: No such file or directory
Jul 24 02:31:48 sentry-docker00.cs.umd.edu systemd-udevd[2281999]: Could not generate persistent MAC address for veth8391f58: No such file or directory
Jul 24 02:31:48 sentry-docker00.cs.umd.edu systemd-udevd[2282000]: Could not generate persistent MAC address for veth0f3f527: No such file or directory
Jul 24 02:37:52 sentry-docker00.cs.umd.edu systemd-udevd[2284275]: Could not generate persistent MAC address for veth8c9e409: No such file or directory
Jul 24 02:37:52 sentry-docker00.cs.umd.edu systemd-udevd[2284276]: Could not generate persistent MAC address for veth49f585f: No such file or directory
Jul 24 02:37:52 sentry-docker00.cs.umd.edu systemd-udevd[2284279]: Could not generate persistent MAC address for vethd5aa8a1: No such file or directory
Jul 24 02:37:53 sentry-docker00.cs.umd.edu systemd-udevd[2284280]: Could not generate persistent MAC address for veth345ed2e: No such file or directory
Jul 24 02:37:53 sentry-docker00.cs.umd.edu systemd-udevd[2284303]: Could not generate persistent MAC address for veth8d9e662: No such file or directory
Jul 24 02:37:53 sentry-docker00.cs.umd.edu systemd-udevd[2284305]: Could not generate persistent MAC address for veth1d8a179: No such file or directory
Jul 24 02:37:53 sentry-docker00.cs.umd.edu systemd-udevd[2284352]: Could not generate persistent MAC address for veth3b98324: No such file or directory
Jul 24 02:37:53 sentry-docker00.cs.umd.edu systemd-udevd[2284345]: Could not generate persistent MAC address for vetheb0ee6e: No such file or directory
Jul 24 02:51:56 sentry-docker00.cs.umd.edu systemd-udevd[2291834]: Could not generate persistent MAC address for veth942c15f: No such file or directory
Jul 24 02:51:56 sentry-docker00.cs.umd.edu systemd-udevd[2291835]: Could not generate persistent MAC address for veth2aebbd1: No such file or directory
Jul 24 02:58:01 sentry-docker00.cs.umd.edu systemd-udevd[2294011]: link_config: could not get ethtool features for veth8c9e409
Jul 24 02:58:01 sentry-docker00.cs.umd.edu systemd-udevd[2294011]: Could not set offload features of veth8c9e409: No such device
Jul 24 02:58:01 sentry-docker00.cs.umd.edu systemd-udevd[2294040]: Could not generate persistent MAC address for veth3ef8935: No such file or directory
Jul 24 02:58:01 sentry-docker00.cs.umd.edu systemd-udevd[2294041]: Could not generate persistent MAC address for veth0632307: No such file or directory
... 6 more distinct messages not shown
== strawberry (2 distinct, 8 total) ==
Jul 24 02:09:44 strawberry udisksd[1067]: Error performing housekeeping for drive /org/freedesktop/UDisks2/drives/ST2000DM001_1CH164_W1E8J5KJ: Error updating SMART data: Error sending ATA command CHECK POWER MODE: Unexpected sense data returned:#0120000: 00 00 00 00 00 00 00 00 00 00 00 00 00 00 00 00 ................#0120010: 00 00 00 00 00 00 00 00 00 00 00 00 00 00 00 00 ................#012 (g-io-error-quark, 0) [x6]
Jul 24 02:34:42 strawberry smartd[5314]: Device: /dev/sda [SAT], failed to read SMART Attribute Data [x2]
== submit26-b9-4 (5 distinct, 6 total) ==
Jul 24 02:24:04 submit26-b9-4 systemd[1]: user(a)1001.service: Main process exited, code=killed, status=9/KILL [x2]
Jul 24 02:24:05 submit26-b9-4 systemd-coredump[76305]: Process 76301 (simavr) of user 1001 dumped core.
Jul 24 02:24:06 submit26-b9-4 systemd-coredump[76370]: Process 76367 (simavr) of user 1001 dumped core.
Jul 24 02:45:07 submit26-b9-4 systemd-coredump[77457]: Process 77454 (simavr) of user 1001 dumped core.
Jul 24 02:45:07 submit26-b9-4 systemd-coredump[77498]: Process 77495 (simavr) of user 1001 dumped core.
1
0
Command: /usr/local/sbin/syslog-digest.py
Time : 0.5598s
Status : exited 0
Output :
Syslog digest — 2026-07-24 02:05 EDT
Processed 4,359 lines, filtered 3,344 (76%). 1,015 unknown (235 distinct) from 21 host(s).
== abuse (1 distinct, 347 total) ==
Jul 24 01:05:06 abuse rsyslogd[21745]: imjournal: open() failed for path: '/var/lib/rsyslog/imjournal.state.tmp': Input/output error [v8.2404.0 try https://www.rsyslog.com/e/2433 ] [x347]
== alec.cs.umd.edu (3 distinct, 60 total) ==
Jul 24 01:05:13 alec.cs.umd.edu setroubleshoot[2401151]: failed to retrieve rpm info for path '/run/netns/netns-a2b2cc2d-7532-4db7-6a36-b1dd3d5f51db': [x12]
Jul 24 01:05:14 alec.cs.umd.edu sedispatch[1526]: AVC Message regarding setroubleshoot, ignoring message [x24]
Jul 24 01:05:14 alec.cs.umd.edu setroubleshoot[2401151]: SELinux is preventing /usr/bin/df from getattr access on the file /run/netns/netns-a2b2cc2d-7532-4db7-6a36-b1dd3d5f51db. For complete SELinux messages run: sealert -l 23f93208-3063-4aac-b78a-bb0fcb40740c [x24]
== ar102 (134 distinct, 171 total) ==
Jul 21 08:45:47 ar102 puppet-agent[56137]: (Facter) invalid or malformed lldp data: MalformedDataError: no lldp interface data found
Jul 21 08:46:47 ar102 puppet-agent[56137]: Last metadata expiration check: 2:42:47 ago on Tue Jul 21 06:04:00 2026.
Jul 21 08:46:47 ar102 puppet-agent[56137]: Dependencies resolved. [x2]
Jul 21 08:46:47 ar102 puppet-agent[56137]: ======================================================================================================= [x6]
Jul 21 08:46:47 ar102 puppet-agent[56137]: Package Arch Version Repository Size [x2]
Jul 21 08:46:47 ar102 puppet-agent[56137]: Upgrading: [x2]
Jul 21 08:46:47 ar102 puppet-agent[56137]: java-21-openjdk aarch64 1:21.0.12.0.8-1.2.el10_2 rhel-10-for-aarch64-appstream-rpms 411 k [x2]
Jul 21 08:46:47 ar102 puppet-agent[56137]: java-21-openjdk-devel aarch64 1:21.0.12.0.8-1.2.el10_2 rhel-10-for-aarch64-appstream-rpms 5.0 M [x2]
Jul 21 08:46:47 ar102 puppet-agent[56137]: java-21-openjdk-headless aarch64 1:21.0.12.0.8-1.2.el10_2 rhel-10-for-aarch64-appstream-rpms 49 M [x2]
Jul 21 08:46:47 ar102 puppet-agent[56137]: [x6]
Jul 21 08:46:47 ar102 puppet-agent[56137]: Transaction Summary [x2]
Jul 21 08:46:47 ar102 puppet-agent[56137]: Upgrade 3 Packages [x2]
Jul 21 08:46:47 ar102 puppet-agent[56137]: Total download size: 54 M [x2]
Jul 21 08:46:47 ar102 puppet-agent[56137]: Downloading Packages: [x2]
Jul 21 08:46:47 ar102 puppet-agent[56137]: [MIRROR] java-21-openjdk-21.0.12.0.8-1.2.el10_2.aarch64.rpm: Curl error (91): SSL server certificate status verification FAILED for https://cdn.redhat.com/content/dist/rhel10/10/aarch64/appstream/os/Packages… [OCSP response has expired] [x2]
Jul 21 08:46:47 ar102 puppet-agent[56137]: [MIRROR] java-21-openjdk-devel-21.0.12.0.8-1.2.el10_2.aarch64.rpm: Curl error (91): SSL server certificate status verification FAILED for https://cdn.redhat.com/content/dist/rhel10/10/aarch64/appstream/os/Packages… [OCSP response has expired] [x3]
Jul 21 08:46:47 ar102 puppet-agent[56137]: [MIRROR] java-21-openjdk-headless-21.0.12.0.8-1.2.el10_2.aarch64.rpm: Curl error (91): SSL server certificate status verification FAILED for https://cdn.redhat.com/content/dist/rhel10/10/aarch64/appstream/os/Packages… [OCSP response has expired] [x3]
Jul 21 08:46:47 ar102 puppet-agent[56137]: [FAILED] java-21-openjdk-headless-21.0.12.0.8-1.2.el10_2.aarch64.rpm: No more mirrors to try - All mirrors were already tried without success
Jul 21 08:46:47 ar102 puppet-agent[56137]: The downloaded packages were saved in cache until the next successful transaction. [x2]
Jul 21 08:46:47 ar102 puppet-agent[56137]: Error: Error downloading packages: [x2]
Jul 21 08:46:47 ar102 puppet-agent[56137]: java-21-openjdk-headless-1:21.0.12.0.8-1.2.el10_2.aarch64: Cannot download, all mirrors were already tried without success
Jul 21 08:46:47 ar102 puppet-agent[56137]: (/Stage[main]/Profile::Base::Common::Workstation/Package[java-21-openjdk-headless]/ensure) Last metadata expiration check: 2:42:47 ago on Tue Jul 21 06:04:00 2026.
Jul 21 08:46:47 ar102 puppet-agent[56137]: (/Stage[main]/Profile::Base::Common::Workstation/Package[java-21-openjdk-headless]/ensure) Dependencies resolved.
Jul 21 08:46:47 ar102 puppet-agent[56137]: (/Stage[main]/Profile::Base::Common::Workstation/Package[java-21-openjdk-headless]/ensure) ======================================================================================================= [x3]
Jul 21 08:46:47 ar102 puppet-agent[56137]: (/Stage[main]/Profile::Base::Common::Workstation/Package[java-21-openjdk-headless]/ensure) Package Arch Version Repository Size
Jul 21 08:46:47 ar102 puppet-agent[56137]: (/Stage[main]/Profile::Base::Common::Workstation/Package[java-21-openjdk-headless]/ensure) Upgrading:
Jul 21 08:46:47 ar102 puppet-agent[56137]: (/Stage[main]/Profile::Base::Common::Workstation/Package[java-21-openjdk-headless]/ensure) java-21-openjdk aarch64 1:21.0.12.0.8-1.2.el10_2 rhel-10-for-aarch64-appstream-rpms 411 k
Jul 21 08:46:47 ar102 puppet-agent[56137]: (/Stage[main]/Profile::Base::Common::Workstation/Package[java-21-openjdk-headless]/ensure) java-21-openjdk-devel aarch64 1:21.0.12.0.8-1.2.el10_2 rhel-10-for-aarch64-appstream-rpms 5.0 M
Jul 21 08:46:47 ar102 puppet-agent[56137]: (/Stage[main]/Profile::Base::Common::Workstation/Package[java-21-openjdk-headless]/ensure) java-21-openjdk-headless aarch64 1:21.0.12.0.8-1.2.el10_2 rhel-10-for-aarch64-appstream-rpms 49 M
Jul 21 08:46:47 ar102 puppet-agent[56137]: (/Stage[main]/Profile::Base::Common::Workstation/Package[java-21-openjdk-headless]/ensure) [x3]
... 104 more distinct messages not shown
== biggulp.cs.umd.edu (1 distinct, 1 total) ==
Jul 24 01:35:08 biggulp.cs.umd.edu sshd[2859]: error: beginning MaxStartups throttling
== csfw00a (1 distinct, 192 total) ==
Jul 24 01:04:35 csfw00a kernel: bnxt_en 0000:09:00.0 eth3: NIC Link is Down [x192]
== dojo (1 distinct, 1 total) ==
Jul 24 01:20:41 dojo sshd[132716]: error: Protocol major versions differ: 2 vs. 1
== hackerman (1 distinct, 1 total) ==
Jul 24 01:19:01 hackerman gnome-software[2060381]: failed to commit changes to dconf: GDBus.Error:org.gtk.GDBus.UnmappedGError.Quark._g_2dfile_2derror_2dquark.Code2: Failed to create file “/adminhomes/sajith/.config/dconf/user.385FT3”: Permission denied
== hazfs.cs.umd.edu (11 distinct, 66 total) ==
Jul 24 01:46:52 hazfs.cs.umd.edu snmpd[1431]: send response: Failure in sendto [x6]
Jul 24 01:46:52 hazfs.cs.umd.edu snmpd[1431]: -- NET-SNMP-EXTEND-MIB::nsExtendStatus."userweb" [x6]
Jul 24 01:46:52 hazfs.cs.umd.edu snmpd[1431]: -- NET-SNMP-EXTEND-MIB::nsExtendStatus."zfslist" [x6]
Jul 24 01:46:52 hazfs.cs.umd.edu snmpd[1431]: -- NET-SNMP-EXTEND-MIB::nsExtendStatus."userhome" [x6]
Jul 24 01:46:52 hazfs.cs.umd.edu snmpd[1431]: -- NET-SNMP-EXTEND-MIB::nsExtendOutput1Line."userweb" [x6]
Jul 24 01:46:52 hazfs.cs.umd.edu snmpd[1431]: -- NET-SNMP-EXTEND-MIB::nsExtendOutput1Line."zfslist" [x6]
Jul 24 01:46:52 hazfs.cs.umd.edu snmpd[1431]: -- NET-SNMP-EXTEND-MIB::nsExtendOutput1Line."userhome" [x6]
Jul 24 01:46:52 hazfs.cs.umd.edu snmpd[1431]: -- NET-SNMP-EXTEND-MIB::nsExtendOutputFull."userweb" [x6]
Jul 24 01:46:52 hazfs.cs.umd.edu snmpd[1431]: -- NET-SNMP-EXTEND-MIB::nsExtendOutputFull."zfslist" [x6]
Jul 24 01:46:52 hazfs.cs.umd.edu snmpd[1431]: -- NET-SNMP-EXTEND-MIB::nsExtendOutputFull."userhome" [x6]
Jul 24 01:46:52 hazfs.cs.umd.edu snmpd[1431]: -- NET-SNMP-EXTEND-MIB::nsExtendOutNumLines."userweb" [x6]
== idm00 (2 distinct, 2 total) ==
Jul 24 01:23:59 idm00 named[1455]: client @0x7f3315455458 10.73.245.12#55410: update '73.10.in-addr.arpa/IN' denied
Jul 24 01:51:04 idm00 named[1455]: client @0x7f330c098ad8 10.73.240.42#63920: update '73.10.in-addr.arpa/IN' denied
== idmp0 (1 distinct, 1 total) ==
Jul 24 01:34:56 idmp0 named[5198]: client @0x7f992c014c68 10.73.240.43#59053: update '73.10.in-addr.arpa/IN' denied
== itmon02 (1 distinct, 46 total) ==
Jul 24 01:13:11 itmon02 sshd[1834]: error: beginning MaxStartups throttling [x46]
== newhonors2 (1 distinct, 24 total) ==
Jul 24 01:13:03 newhonors2 dhcpcd[197805]: dhcpcd is not running [x24]
== outbound00.cs.umd.edu (1 distinct, 6 total) ==
Jul 24 01:09:09 outbound00.cs.umd.edu python3[3147311]: ldapdb [x6]
== outbound01.cs.umd.edu (1 distinct, 6 total) ==
Jul 24 01:13:06 outbound01.cs.umd.edu python3[1175472]: ldapdb [x6]
== sentry-docker00.cs.umd.edu (42 distinct, 42 total) ==
Jul 24 01:11:23 sentry-docker00.cs.umd.edu systemd-udevd[2244101]: Could not generate persistent MAC address for vethbbec864: No such file or directory
Jul 24 01:11:23 sentry-docker00.cs.umd.edu systemd-udevd[2244102]: Could not generate persistent MAC address for vethc64d3bf: No such file or directory
Jul 24 01:17:19 sentry-docker00.cs.umd.edu systemd-udevd[2246173]: link_config: could not get ethtool features for veth05699b5
Jul 24 01:17:19 sentry-docker00.cs.umd.edu systemd-udevd[2246173]: Could not set offload features of veth05699b5: No such device
Jul 24 01:17:19 sentry-docker00.cs.umd.edu systemd-udevd[2246242]: Could not generate persistent MAC address for veth4cc8357: No such file or directory
Jul 24 01:17:19 sentry-docker00.cs.umd.edu systemd-udevd[2246243]: Could not generate persistent MAC address for veth394923b: No such file or directory
Jul 24 01:17:19 sentry-docker00.cs.umd.edu systemd-udevd[2246246]: Could not generate persistent MAC address for veth575a445: No such file or directory
Jul 24 01:17:19 sentry-docker00.cs.umd.edu systemd-udevd[2246247]: Could not generate persistent MAC address for veth43e1723: No such file or directory
Jul 24 01:17:19 sentry-docker00.cs.umd.edu systemd-udevd[2246271]: Could not generate persistent MAC address for veth8631914: No such file or directory
Jul 24 01:17:19 sentry-docker00.cs.umd.edu systemd-udevd[2246270]: Could not generate persistent MAC address for vethdd6c59a: No such file or directory
Jul 24 01:17:19 sentry-docker00.cs.umd.edu systemd-udevd[2246274]: Could not generate persistent MAC address for veth9390634: No such file or directory
Jul 24 01:17:19 sentry-docker00.cs.umd.edu systemd-udevd[2246285]: Could not generate persistent MAC address for veth021a03b: No such file or directory
Jul 24 01:31:27 sentry-docker00.cs.umd.edu systemd-udevd[2253529]: link_config: could not get ethtool features for vethbbec864
Jul 24 01:31:27 sentry-docker00.cs.umd.edu systemd-udevd[2253529]: Could not set offload features of vethbbec864: No such device
Jul 24 01:31:27 sentry-docker00.cs.umd.edu systemd-udevd[2253546]: Could not generate persistent MAC address for veth19fa785: No such file or directory
Jul 24 01:31:27 sentry-docker00.cs.umd.edu systemd-udevd[2253547]: Could not generate persistent MAC address for vethde3756e: No such file or directory
Jul 24 01:37:27 sentry-docker00.cs.umd.edu systemd-udevd[2255606]: link_config: could not get ethtool features for veth9390634
Jul 24 01:37:27 sentry-docker00.cs.umd.edu systemd-udevd[2255606]: Could not set offload features of veth9390634: No such device
Jul 24 01:37:28 sentry-docker00.cs.umd.edu systemd-udevd[2255677]: Could not generate persistent MAC address for vethe75a096: No such file or directory
Jul 24 01:37:28 sentry-docker00.cs.umd.edu systemd-udevd[2255678]: Could not generate persistent MAC address for veth1848d92: No such file or directory
Jul 24 01:37:28 sentry-docker00.cs.umd.edu systemd-udevd[2255696]: Could not generate persistent MAC address for veth9cabf02: No such file or directory
Jul 24 01:37:28 sentry-docker00.cs.umd.edu systemd-udevd[2255695]: Could not generate persistent MAC address for veth6cb6ef3: No such file or directory
Jul 24 01:37:28 sentry-docker00.cs.umd.edu systemd-udevd[2255686]: Could not generate persistent MAC address for veth7c68258: No such file or directory
Jul 24 01:37:28 sentry-docker00.cs.umd.edu systemd-udevd[2255689]: Could not generate persistent MAC address for veth449660c: No such file or directory
Jul 24 01:37:28 sentry-docker00.cs.umd.edu systemd-udevd[2255689]: Could not generate persistent MAC address for vetha566581: No such file or directory
Jul 24 01:37:28 sentry-docker00.cs.umd.edu systemd-udevd[2255686]: Could not generate persistent MAC address for veth8018f48: No such file or directory
Jul 24 01:51:35 sentry-docker00.cs.umd.edu systemd-udevd[2263001]: link_config: could not get ethtool features for veth19fa785
Jul 24 01:51:35 sentry-docker00.cs.umd.edu systemd-udevd[2263001]: Could not set offload features of veth19fa785: No such device
Jul 24 01:51:35 sentry-docker00.cs.umd.edu systemd-udevd[2263019]: Could not generate persistent MAC address for vethaa28940: No such file or directory
Jul 24 01:51:35 sentry-docker00.cs.umd.edu systemd-udevd[2263020]: Could not generate persistent MAC address for veth12d1f22: No such file or directory
... 12 more distinct messages not shown
== strawberry (2 distinct, 8 total) ==
Jul 24 01:09:44 strawberry udisksd[1067]: Error performing housekeeping for drive /org/freedesktop/UDisks2/drives/ST2000DM001_1CH164_W1E8J5KJ: Error updating SMART data: Error sending ATA command CHECK POWER MODE: Unexpected sense data returned:#0120000: 00 00 00 00 00 00 00 00 00 00 00 00 00 00 00 00 ................#0120010: 00 00 00 00 00 00 00 00 00 00 00 00 00 00 00 00 ................#012 (g-io-error-quark, 0) [x6]
Jul 24 01:34:42 strawberry smartd[5314]: Device: /dev/sda [SAT], failed to read SMART Attribute Data [x2]
== submit26-b9-2 (10 distinct, 17 total) ==
Jul 24 01:12:48 submit26-b9-2 setroubleshoot[74944]: SELinux is preventing /usr/bin/python3.9 from create access on the directory /(null). For complete SELinux messages run: sealert -l d506243c-d61e-48f3-b42a-4592c913deb0
Jul 24 01:12:48 submit26-b9-2 setroubleshoot[74944]: SELinux is preventing /usr/bin/python3.9 from add_name access on the directory /(null). For complete SELinux messages run: sealert -l 3b4752ac-1b9a-4af9-a05b-32e4c2eb13ab
Jul 24 01:12:48 submit26-b9-2 setroubleshoot[74944]: SELinux is preventing /usr/bin/python3.9 from create access on the file /(null). For complete SELinux messages run: sealert -l 29e5adbd-4381-4467-b40d-a2219101e096
Jul 24 01:12:48 submit26-b9-2 setroubleshoot[74944]: SELinux is preventing /usr/bin/python3.9 from open access on the file /tmp/libdnf.8XZGbd/repodata/repomd.xml. For complete SELinux messages run: sealert -l 1b38f2ec-01ce-4343-8059-ba7494ecc5c4
Jul 24 01:12:48 submit26-b9-2 setroubleshoot[74944]: SELinux is preventing /usr/bin/python3.9 from setattr access on the file repomd.xml. For complete SELinux messages run: sealert -l e5f9af40-1f63-4924-b012-27ab2a7b2266
Jul 24 01:12:48 submit26-b9-2 setroubleshoot[74944]: SELinux is preventing /usr/bin/python3.9 from read access on the directory libdnf.8XZGbd. For complete SELinux messages run: sealert -l 5c54db87-54a3-4a7c-97b4-b5c48d6c3543
Jul 24 01:12:48 submit26-b9-2 setroubleshoot[74944]: SELinux is preventing /usr/bin/python3.9 from remove_name access on the directory repomd.xml. For complete SELinux messages run: sealert -l 63cd60e1-1e61-4276-afea-dd8526ffe8b2
Jul 24 01:12:48 submit26-b9-2 setroubleshoot[74944]: SELinux is preventing /usr/bin/python3.9 from unlink access on the file repomd.xml. For complete SELinux messages run: sealert -l 81c7e9ec-e023-4c6d-b1ad-c02a242e655e
Jul 24 01:12:48 submit26-b9-2 setroubleshoot[74944]: SELinux is preventing /usr/bin/python3.9 from rmdir access on the directory repodata. For complete SELinux messages run: sealert -l 6ae9a597-e123-4d74-8eec-a8ebe0f5e4d0
Jul 24 01:13:07 submit26-b9-2 systemd[1]: user(a)1001.service: Main process exited, code=killed, status=9/KILL [x8]
== submit26-b9-3 (9 distinct, 9 total) ==
Jul 24 01:20:34 submit26-b9-3 setroubleshoot[547430]: SELinux is preventing /usr/bin/python3.9 from create access on the directory /(null). For complete SELinux messages run: sealert -l 5b912a44-22fd-4560-b201-2a4e289b73f5
Jul 24 01:20:34 submit26-b9-3 setroubleshoot[547430]: SELinux is preventing /usr/bin/python3.9 from add_name access on the directory /(null). For complete SELinux messages run: sealert -l 7f1df1e4-725e-4953-98eb-1079f908f543
Jul 24 01:20:34 submit26-b9-3 setroubleshoot[547430]: SELinux is preventing /usr/bin/python3.9 from create access on the file /(null). For complete SELinux messages run: sealert -l 40b8852a-f77b-44b4-affe-5f11fa33de43
Jul 24 01:20:34 submit26-b9-3 setroubleshoot[547430]: SELinux is preventing /usr/bin/python3.9 from open access on the file /tmp/libdnf.VxGjZO/repodata/repomd.xml. For complete SELinux messages run: sealert -l 45a8019e-f6b5-4baa-92c1-862594b40d46
Jul 24 01:20:34 submit26-b9-3 setroubleshoot[547430]: SELinux is preventing /usr/bin/python3.9 from setattr access on the file repomd.xml. For complete SELinux messages run: sealert -l e9f0bfff-7784-4126-baa4-2bb06da56591
Jul 24 01:20:34 submit26-b9-3 setroubleshoot[547430]: SELinux is preventing /usr/bin/python3.9 from read access on the directory libdnf.VxGjZO. For complete SELinux messages run: sealert -l 0b17cc3d-cdc6-4fe2-a11f-3892e7c41dc7
Jul 24 01:20:34 submit26-b9-3 setroubleshoot[547430]: SELinux is preventing /usr/bin/python3.9 from remove_name access on the directory repomd.xml. For complete SELinux messages run: sealert -l 10e38c64-b65f-4cdd-901e-4375652d9a42
Jul 24 01:20:34 submit26-b9-3 setroubleshoot[547430]: SELinux is preventing /usr/bin/python3.9 from unlink access on the file repomd.xml. For complete SELinux messages run: sealert -l 7fd9cf72-ef38-48e1-b6aa-b571b26a7b22
Jul 24 01:20:34 submit26-b9-3 setroubleshoot[547430]: SELinux is preventing /usr/bin/python3.9 from rmdir access on the directory repodata. For complete SELinux messages run: sealert -l b9b11116-89bd-4a3c-980c-1d422c5dcee4
== submit26-b9-4 (2 distinct, 5 total) ==
Jul 24 01:08:05 submit26-b9-4 systemd[1]: user(a)1001.service: Main process exited, code=killed, status=9/KILL [x4]
Jul 24 01:17:11 submit26-b9-4 systemd-coredump[73404]: Process 73401 (simavr) of user 1001 dumped core.
== submit26-clnb9 (9 distinct, 9 total) ==
Jul 24 01:31:52 submit26-clnb9 setroubleshoot[1222467]: SELinux is preventing /usr/bin/python3.9 from create access on the directory /(null). For complete SELinux messages run: sealert -l 6783ed2b-5ae4-42b5-975a-4bf50eec4658
Jul 24 01:31:52 submit26-clnb9 setroubleshoot[1222467]: SELinux is preventing /usr/bin/python3.9 from add_name access on the directory /(null). For complete SELinux messages run: sealert -l 9e7fa955-cc30-4804-ac8c-e1779e85946c
Jul 24 01:31:52 submit26-clnb9 setroubleshoot[1222467]: SELinux is preventing /usr/bin/python3.9 from create access on the file /(null). For complete SELinux messages run: sealert -l 69bfa6e3-089c-40ff-9563-fd30787d0774
Jul 24 01:31:52 submit26-clnb9 setroubleshoot[1222467]: SELinux is preventing /usr/bin/python3.9 from open access on the file /tmp/libdnf.xYVzWq/repodata/repomd.xml. For complete SELinux messages run: sealert -l 001acdb5-31ef-4e52-b10b-90f467a89ddc
Jul 24 01:31:52 submit26-clnb9 setroubleshoot[1222467]: SELinux is preventing /usr/bin/python3.9 from setattr access on the file repomd.xml. For complete SELinux messages run: sealert -l edacddcf-16ed-4dc3-8d82-7c597d5dee23
Jul 24 01:31:52 submit26-clnb9 setroubleshoot[1222467]: SELinux is preventing /usr/bin/python3.9 from read access on the directory libdnf.xYVzWq. For complete SELinux messages run: sealert -l 62b3782e-4730-4488-8178-94dafe9b552c
Jul 24 01:31:52 submit26-clnb9 setroubleshoot[1222467]: SELinux is preventing /usr/bin/python3.9 from remove_name access on the directory repomd.xml. For complete SELinux messages run: sealert -l 81cb3698-78f8-440a-8e3c-e5d1041e6b78
Jul 24 01:31:52 submit26-clnb9 setroubleshoot[1222467]: SELinux is preventing /usr/bin/python3.9 from unlink access on the file repomd.xml. For complete SELinux messages run: sealert -l 792b472a-115c-4799-9805-fc7436f916b9
Jul 24 01:31:52 submit26-clnb9 setroubleshoot[1222467]: SELinux is preventing /usr/bin/python3.9 from rmdir access on the directory repodata. For complete SELinux messages run: sealert -l 15c83a86-837b-41e2-b662-b39cd4e361cb
== tma-0 (1 distinct, 1 total) ==
Jul 24 01:05:08 tma-0 sshd[11083]: error: PAM: Authentication failure for admin from 86.236.62.34.bc.googleusercontent.com
1
0
Command: /usr/local/sbin/syslog-digest.py
Time : 0.5430s
Status : exited 0
Output :
Syslog digest — 2026-07-24 01:05 EDT
Processed 4,532 lines, filtered 3,588 (79%). 944 unknown (142 distinct) from 35 host(s).
== abuse (1 distinct, 347 total) ==
Jul 24 00:05:06 abuse rsyslogd[21745]: imjournal: open() failed for path: '/var/lib/rsyslog/imjournal.state.tmp': Input/output error [v8.2404.0 try https://www.rsyslog.com/e/2433 ] [x347]
== alec.cs.umd.edu (3 distinct, 58 total) ==
Jul 24 00:05:16 alec.cs.umd.edu setroubleshoot[2386491]: failed to retrieve rpm info for path '/run/netns/netns-a2b2cc2d-7532-4db7-6a36-b1dd3d5f51db': [x12]
Jul 24 00:05:17 alec.cs.umd.edu sedispatch[1526]: AVC Message regarding setroubleshoot, ignoring message [x22]
Jul 24 00:05:17 alec.cs.umd.edu setroubleshoot[2386491]: SELinux is preventing /usr/bin/df from getattr access on the file /run/netns/netns-a2b2cc2d-7532-4db7-6a36-b1dd3d5f51db. For complete SELinux messages run: sealert -l 23f93208-3063-4aac-b78a-bb0fcb40740c [x24]
== biggulp.cs.umd.edu (4 distinct, 4 total) ==
Jul 24 00:10:16 biggulp.cs.umd.edu sshd-session[4087557]: pam_access(sshd:auth): access denied for user `admin' from `35.195.202.190'
Jul 24 00:10:16 biggulp.cs.umd.edu krb5_child[4087559]: Client 'admin(a)UMD.EDU' not found in Kerberos database
Jul 24 00:10:16 biggulp.cs.umd.edu sshd-session[4087555]: error: PAM: System error for admin from 35.195.202.190
Jul 24 00:11:06 biggulp.cs.umd.edu sshd-session[4088149]: error: Protocol major versions differ: 2 vs. 1
== csfw00a (2 distinct, 280 total) ==
Jul 24 00:05:07 csfw00a kernel: bnxt_en 0000:09:00.0 eth3: NIC Link is Down [x264]
Jul 24 00:26:39 csfw00a ospf6d[1477]: [EC 100663307] Could not send entire message [x16]
== cskayako (4 distinct, 4 total) ==
Jul 24 00:30:22 cskayako setroubleshoot[330993]: SELinux is preventing /usr/bin/php from add_name access on the directory /var/www/html/(null). For complete SELinux messages run: sealert -l 5239c113-abc1-4953-a9c0-21d695a0d1bb
Jul 24 00:30:22 cskayako setroubleshoot[330993]: SELinux is preventing /usr/bin/php from create access on the file /var/www/html/(null). For complete SELinux messages run: sealert -l cacf8f36-45b0-4374-9a33-d15de767aae7
Jul 24 00:30:22 cskayako setroubleshoot[330993]: failed to retrieve rpm info for path '/var/www/html/__swift/logs/log.cron_24_Jul_2026_6e9d5a7c49.txt':
Jul 24 00:30:22 cskayako setroubleshoot[330993]: SELinux is preventing /usr/sbin/sendmail.postfix from append access on the file /var/www/html/__swift/logs/log.cron_24_Jul_2026_6e9d5a7c49.txt. For complete SELinux messages run: sealert -l c566b62c-2773-4bf0-808b-10f832f1eafb
== frabjous (2 distinct, 2 total) ==
Jul 24 01:03:47 frabjous krb5_child[1216175]: Client 'admin(a)UMD.EDU' not found in Kerberos database
Jul 24 01:03:49 frabjous sshd-session[1216171]: error: PAM: Authentication failure for admin from 34.62.236.86
== grades01.cs.umd.edu (3 distinct, 4 total) ==
Jul 24 00:10:12 grades01.cs.umd.edu systemd[1]: New main PID 17160 does not belong to service, and PID file is not owned by root. Refusing. [x2]
Jul 24 00:10:36 grades01.cs.umd.edu systemd[1]: Daemon never wrote its PID file. Failing.
Jul 24 00:10:51 grades01.cs.umd.edu systemd[1]: pmlogger.service: Supervising process 24757 which is not our child. We'll most likely not notice when it exits.
== grafana (1 distinct, 1 total) ==
Jul 24 00:59:02 grafana systemd[1]: httpd.service: Unit cannot be reloaded because it is inactive.
== idm00 (1 distinct, 1 total) ==
Jul 24 00:51:04 idm00 named[1455]: client @0x7f33153cee88 10.73.240.42#60631: update '73.10.in-addr.arpa/IN' denied
== idmp0 (1 distinct, 1 total) ==
Jul 24 00:34:56 idmp0 named[5198]: client @0x7f9910005288 10.73.240.43#64295: update '73.10.in-addr.arpa/IN' denied
== inbound00.cs.umd.edu (1 distinct, 1 total) ==
Jul 24 00:43:28 inbound00.cs.umd.edu krb5_child[3157647]: Client 'admin(a)UMD.EDU' not found in Kerberos database
== irb2156 (5 distinct, 18 total) ==
Jul 24 00:41:56 irb2156 setroubleshoot[525368]: failed to retrieve rpm info for path '/var/lib/sss/pipes/nss': [x5]
Jul 24 00:41:57 irb2156 setroubleshoot[525368]: SELinux is preventing /usr/bin/python3.12 from write access on the sock_file /var/lib/sss/pipes/nss. For complete SELinux messages run: sealert -l abc2274b-d33a-4914-8e4c-19cb26848a77 [x9]
Jul 24 00:42:32 irb2156 setroubleshoot[526219]: failed to retrieve rpm info for path '/var/log/falconctl.log':
Jul 24 00:42:33 irb2156 setroubleshoot[526219]: SELinux is preventing /opt/CrowdStrike/falconctl18708 from append access on the file /var/log/falconctl.log. For complete SELinux messages run: sealert -l 378093ff-b0d9-4ff5-9972-cb081e35f744
Jul 24 00:42:33 irb2156 setroubleshoot[526219]: SELinux is preventing /opt/CrowdStrike/falconctl18708 from write access on the file falconstore. For complete SELinux messages run: sealert -l cf3d4d4a-e5a2-4542-9fc5-dbd87dc3c82b [x2]
== itmon00 (3 distinct, 4 total) ==
Jul 24 00:10:12 itmon00 systemd[1]: New main PID 17489 does not belong to service, and PID file is not owned by root. Refusing. [x2]
Jul 24 00:10:34 itmon00 systemd[1]: Daemon never wrote its PID file. Failing.
Jul 24 00:10:46 itmon00 systemd[1]: pmlogger.service: Supervising process 24596 which is not our child. We'll most likely not notice when it exits.
== itmon02 (1 distinct, 40 total) ==
Jul 24 00:07:53 itmon02 sshd[1834]: error: beginning MaxStartups throttling [x40]
== jaws.cs.umd.edu (4 distinct, 5 total) ==
Jul 24 00:33:12 jaws.cs.umd.edu systemd-coredump[1108437]: Process 1108418 (podman) of user 981 dumped core.#012#012Stack trace of thread 1108418:#012#0 0x000055a12e29346e internal/runtime/syscall/linux.Syscall6 (podman + 0x48b46e)#012#1 0x000055a12e3730a6 syscall.Syscall (podman + 0x56b0a6)#012#2 0x000055a12e373c50 syscall.Syscall.abi0 (podman + 0x56bc50)#012#3 0x000055a12e4ddc2e github.com/containers/podman/vendor/golang.org/x/sys/unix.OpenTree (podman + 0x6d5c2e)#012#4 0x000055a12eb36f4b github.com/containers/podman/vendor/github.com/cyphar/filepath-securejoin/p… (podman + 0xd2ef4b)#012#5 0x000055a12eb36e54 github.com/containers/podman/vendor/github.com/cyphar/filepath-securejoin/p… (podman + 0xd2ee54)#012#6 0x000055a12e326dcc sync.(*Once).doSlow (podman + 0x51edcc)#012#7 0x000055a12e326cf9 sync.(*Once).Do (podman + 0x51ecf9)#012#8 0x000055a12eb36d
c5 github.com/containers/podman/vendor/github.com/cyphar/filepath-securejoin/p… (podman + 0xd2edc5)#012#9 0x000055a12eb383e2 github.com/containers/podman/vendor/github.com/cyphar/filepath-securejoin/p… (podman + 0xd303e2)#012#10 0x000055a12eb387f3 github.com/containers/podman/vendor/github.com/cyphar/filepath-securejoin/p… (podman + 0xd307f3)#012#11 0x000055a12eb3791c github.com/containers/podman/vendor/github.com/cyphar/filepath-securejoin/p… (podman + 0xd2f91c)#012#12 0x000055a12eb37358 github.com/containers/podman/vendor/github.com/cyphar/filepath-securejoin/p… (podman + 0xd2f358)#012#13 0x000055a12e326dcc sync.(*Once).doSlow (podman + 0x51edcc)#012#14 0x000055a12e326cf9 sync.(*Once).D
o (podman + 0x51ecf9)#012#15 0x000055a12eb372c5 github.com/containers/podman/vendor/github.com/cyphar/filepath-securejoin/p… (podman + 0xd2f2c5)#012#16 0x000055a12eb3879a github.com/containers/podman/vendor/github.com/cyphar/filepath-securejoin/p… (podman + 0xd3079a)#012#17 0x000055a12eb3f34e github.com/containers/podman/vendor/github.com/opencontainers/selinux/go-se… (podman + 0xd3734e)#012#18 0x000055a12eb3f838 github.com/containers/podman/vendor/github.com/opencontainers/selinux/go-se… (podman + 0xd37838)#012#19 0x000055a12eb3e5df github.com/containers/podman/vendor/github.com/opencontainers/selinux/go-se… (podman + 0xd365df)#012#20 0x000055a12eb3e873 github.com/containers/podman/vendor/github.com/opencontainers/selinux/go-se… (podman + 0xd36873)#012#21 0x000
055a12ed36f4b github.com/containers/podman/vendor/go.podman.io/common/pkg/config.defaultC… (podman + 0xf2ef4b)#012#22 0x000055a12ed3a912 github.com/containers/podman/vendor/go.podman.io/common/pkg/config.newLocked (podman + 0xf32912)#012#23 0x000055a12ed3a605 github.com/containers/podman/vendor/go.podman.io/common/pkg/config.New (podman + 0xf32605)#012#24 0x000055a12f4adfd3 github.com/containers/podman/cmd/podman/registry.newPodmanConfig (podman + 0x16a5fd3)#012#25 0x000055a12e326dcc sync.(*Once).doSlow (podman + 0x51edcc)#012#26 0x000055a12f4cec50 github.com/containers/podman/cmd/podman/common.init (podman + 0x16c6c50)#012#27 0x000055a12e2eca57 runtime.doInit1 (podman + 0x4e4a57)#012#28 0x000055a12e2dcf90 runtime.main (podman + 0x4d4f90)#012#29 0x000055a12e31cee1 runtime.goexit.abi0 (podman + 0x514ee1)#012ELF object binary architecture: AMD x86-64
Jul 24 00:33:13 jaws.cs.umd.edu systemd-coredump[1108457]: Process 1108447 (podman) of user 981 dumped core.#012#012Stack trace of thread 1108447:#012#0 0x000055972c50b46e internal/runtime/syscall/linux.Syscall6 (podman + 0x48b46e)#012#1 0x000055972c5eb0a6 syscall.Syscall (podman + 0x56b0a6)#012#2 0x000055972c5ebc50 syscall.Syscall.abi0 (podman + 0x56bc50)#012#3 0x000055972c755c2e github.com/containers/podman/vendor/golang.org/x/sys/unix.OpenTree (podman + 0x6d5c2e)#012#4 0x000055972cdaef4b github.com/containers/podman/vendor/github.com/cyphar/filepath-securejoin/p… (podman + 0xd2ef4b)#012#5 0x000055972cdaee54 github.com/containers/podman/vendor/github.com/cyphar/filepath-securejoin/p… (podman + 0xd2ee54)#012#6 0x000055972c59edcc sync.(*Once).doSlow (podman + 0x51edcc)#012#7 0x000055972c59ecf9 sync.(*Once).Do (podman + 0x51ecf9)#012#8 0x000055972cdaed
c5 github.com/containers/podman/vendor/github.com/cyphar/filepath-securejoin/p… (podman + 0xd2edc5)#012#9 0x000055972cdb03e2 github.com/containers/podman/vendor/github.com/cyphar/filepath-securejoin/p… (podman + 0xd303e2)#012#10 0x000055972cdb07f3 github.com/containers/podman/vendor/github.com/cyphar/filepath-securejoin/p… (podman + 0xd307f3)#012#11 0x000055972cdaf91c github.com/containers/podman/vendor/github.com/cyphar/filepath-securejoin/p… (podman + 0xd2f91c)#012#12 0x000055972cdaf358 github.com/containers/podman/vendor/github.com/cyphar/filepath-securejoin/p… (podman + 0xd2f358)#012#13 0x000055972c59edcc sync.(*Once).doSlow (podman + 0x51edcc)#012#14 0x000055972c59ecf9 sync.(*Once).D
o (podman + 0x51ecf9)#012#15 0x000055972cdaf2c5 github.com/containers/podman/vendor/github.com/cyphar/filepath-securejoin/p… (podman + 0xd2f2c5)#012#16 0x000055972cdb079a github.com/containers/podman/vendor/github.com/cyphar/filepath-securejoin/p… (podman + 0xd3079a)#012#17 0x000055972cdb734e github.com/containers/podman/vendor/github.com/opencontainers/selinux/go-se… (podman + 0xd3734e)#012#18 0x000055972cdb7838 github.com/containers/podman/vendor/github.com/opencontainers/selinux/go-se… (podman + 0xd37838)#012#19 0x000055972cdb65df github.com/containers/podman/vendor/github.com/opencontainers/selinux/go-se… (podman + 0xd365df)#012#20 0x000055972cdb6873 github.com/containers/podman/vendor/github.com/opencontainers/selinux/go-se… (podman + 0xd36873)#012#21 0x000
055972cfaef4b github.com/containers/podman/vendor/go.podman.io/common/pkg/config.defaultC… (podman + 0xf2ef4b)#012#22 0x000055972cfb2912 github.com/containers/podman/vendor/go.podman.io/common/pkg/config.newLocked (podman + 0xf32912)#012#23 0x000055972cfb2605 github.com/containers/podman/vendor/go.podman.io/common/pkg/config.New (podman + 0xf32605)#012#24 0x000055972d725fd3 github.com/containers/podman/cmd/podman/registry.newPodmanConfig (podman + 0x16a5fd3)#012#25 0x000055972c59edcc sync.(*Once).doSlow (podman + 0x51edcc)#012#26 0x000055972d746c50 github.com/containers/podman/cmd/podman/common.init (podman + 0x16c6c50)#012#27 0x000055972c564a57 runtime.doInit1 (podman + 0x4e4a57)#012#28 0x000055972c554f90 runtime.main (podman + 0x4d4f90)#012#29 0x000055972c594ee1 runtime.goexit.abi0 (podman + 0x514ee1)#012ELF object binary architecture: AMD x86-64
Jul 24 00:33:14 jaws.cs.umd.edu systemd-coredump[1108481]: Process 1108471 (podman) of user 981 dumped core.#012#012Stack trace of thread 1108471:#012#0 0x000056237839846e internal/runtime/syscall/linux.Syscall6 (podman + 0x48b46e)#012#1 0x00005623784780a6 syscall.Syscall (podman + 0x56b0a6)#012#2 0x0000562378478c50 syscall.Syscall.abi0 (podman + 0x56bc50)#012#3 0x00005623785e2c2e github.com/containers/podman/vendor/golang.org/x/sys/unix.OpenTree (podman + 0x6d5c2e)#012#4 0x0000562378c3bf4b github.com/containers/podman/vendor/github.com/cyphar/filepath-securejoin/p… (podman + 0xd2ef4b)#012#5 0x0000562378c3be54 github.com/containers/podman/vendor/github.com/cyphar/filepath-securejoin/p… (podman + 0xd2ee54)#012#6 0x000056237842bdcc sync.(*Once).doSlow (podman + 0x51edcc)#012#7 0x000056237842bcf9 sync.(*Once).Do (podman + 0x51ecf9)#012#8 0x0000562378c3bd
c5 github.com/containers/podman/vendor/github.com/cyphar/filepath-securejoin/p… (podman + 0xd2edc5)#012#9 0x0000562378c3d3e2 github.com/containers/podman/vendor/github.com/cyphar/filepath-securejoin/p… (podman + 0xd303e2)#012#10 0x0000562378c3d7f3 github.com/containers/podman/vendor/github.com/cyphar/filepath-securejoin/p… (podman + 0xd307f3)#012#11 0x0000562378c3c91c github.com/containers/podman/vendor/github.com/cyphar/filepath-securejoin/p… (podman + 0xd2f91c)#012#12 0x0000562378c3c358 github.com/containers/podman/vendor/github.com/cyphar/filepath-securejoin/p… (podman + 0xd2f358)#012#13 0x000056237842bdcc sync.(*Once).doSlow (podman + 0x51edcc)#012#14 0x000056237842bcf9 sync.(*Once).D
o (podman + 0x51ecf9)#012#15 0x0000562378c3c2c5 github.com/containers/podman/vendor/github.com/cyphar/filepath-securejoin/p… (podman + 0xd2f2c5)#012#16 0x0000562378c3d79a github.com/containers/podman/vendor/github.com/cyphar/filepath-securejoin/p… (podman + 0xd3079a)#012#17 0x0000562378c4434e github.com/containers/podman/vendor/github.com/opencontainers/selinux/go-se… (podman + 0xd3734e)#012#18 0x0000562378c44838 github.com/containers/podman/vendor/github.com/opencontainers/selinux/go-se… (podman + 0xd37838)#012#19 0x0000562378c435df github.com/containers/podman/vendor/github.com/opencontainers/selinux/go-se… (podman + 0xd365df)#012#20 0x0000562378c43873 github.com/containers/podman/vendor/github.com/opencontainers/selinux/go-se… (podman + 0xd36873)#012#21 0x000
0562378e3bf4b github.com/containers/podman/vendor/go.podman.io/common/pkg/config.defaultC… (podman + 0xf2ef4b)#012#22 0x0000562378e3f912 github.com/containers/podman/vendor/go.podman.io/common/pkg/config.newLocked (podman + 0xf32912)#012#23 0x0000562378e3f605 github.com/containers/podman/vendor/go.podman.io/common/pkg/config.New (podman + 0xf32605)#012#24 0x00005623795b2fd3 github.com/containers/podman/cmd/podman/registry.newPodmanConfig (podman + 0x16a5fd3)#012#25 0x000056237842bdcc sync.(*Once).doSlow (podman + 0x51edcc)#012#26 0x00005623795d3c50 github.com/containers/podman/cmd/podman/common.init (podman + 0x16c6c50)#012#27 0x00005623783f1a57 runtime.doInit1 (podman + 0x4e4a57)#012#28 0x00005623783e1f90 runtime.main (podman + 0x4d4f90)#012#29 0x0000562378421ee1 runtime.goexit.abi0 (podman + 0x514ee1)#012ELF object binary architecture: AMD x86-64
Jul 24 00:33:14 jaws.cs.umd.edu setroubleshoot[1108421]: SELinux is preventing /usr/bin/podman from using the nnp_transition access on a process. For complete SELinux messages run: sealert -l 3c7643bc-dd69-4695-b48c-7d780b62b6cf [x2]
== jubjub.cs.umd.edu (3 distinct, 4 total) ==
Jul 24 00:10:12 jubjub.cs.umd.edu systemd[1]: New main PID 2493985 does not belong to service, and PID file is not owned by root. Refusing. [x2]
Jul 24 00:10:31 jubjub.cs.umd.edu systemd[1]: Daemon never wrote its PID file. Failing.
Jul 24 00:10:39 jubjub.cs.umd.edu systemd[1]: pmlogger.service: Supervising process 2501522 which is not our child. We'll most likely not notice when it exits.
== mirrors.cs.umd.edu (3 distinct, 4 total) ==
Jul 24 00:10:12 mirrors.cs.umd.edu systemd[1]: New main PID 23717 does not belong to service, and PID file is not owned by root. Refusing. [x2]
Jul 24 00:10:31 mirrors.cs.umd.edu systemd[1]: Daemon never wrote its PID file. Failing.
Jul 24 00:10:44 mirrors.cs.umd.edu systemd[1]: pmlogger.service: Supervising process 30732 which is not our child. We'll most likely not notice when it exits.
== misty.cs.umd.edu (3 distinct, 4 total) ==
Jul 24 00:10:15 misty.cs.umd.edu systemd[1]: New main PID 26620 does not belong to service, and PID file is not owned by root. Refusing. [x2]
Jul 24 00:10:35 misty.cs.umd.edu systemd[1]: Daemon never wrote its PID file. Failing.
Jul 24 00:10:51 misty.cs.umd.edu systemd[1]: pmlogger.service: Supervising process 34447 which is not our child. We'll most likely not notice when it exits.
== nagios-worker-admin-avw00.cs.umd.edu (1 distinct, 1 total) ==
Jul 24 00:08:08 nagios-worker-admin-avw00.cs.umd.edu pcp[101698]: pmie_daily failed - see /var/log/pcp/pmie/pmie_daily.log
== netman.cs.umd.edu (3 distinct, 3 total) ==
Jul 24 00:29:57 netman.cs.umd.edu setroubleshoot[301775]: SELinux is preventing /usr/bin/gpg from read access on the file gpg.conf. For complete SELinux messages run: sealert -l 019ad1da-a874-4814-8037-3b3e5f413ad2
Jul 24 00:29:58 netman.cs.umd.edu setroubleshoot[301775]: SELinux is preventing /usr/bin/gpg from open access on the file /root/.gnupg/gpg.conf. For complete SELinux messages run: sealert -l cb54177e-d44c-46a1-b246-5c0bbb8343be
Jul 24 00:30:04 netman.cs.umd.edu setroubleshoot[301775]: SELinux is preventing /usr/bin/gpg from getattr access on the file /root/.gnupg/gpg.conf. For complete SELinux messages run: sealert -l fbba2e30-b7ab-491c-9ec6-f553e9ef72af
== newhonors2 (1 distinct, 24 total) ==
Jul 24 00:13:03 newhonors2 dhcpcd[195926]: dhcpcd is not running [x24]
== openrepo (1 distinct, 1 total) ==
Jul 24 00:26:53 openrepo (nin-node)[3898957]: munin-node.service: Referenced but unset environment variable evaluates to an empty string: DAEMON_ARGS
== outbound00.cs.umd.edu (1 distinct, 6 total) ==
Jul 24 00:09:09 outbound00.cs.umd.edu python3[3132885]: ldapdb [x6]
== outbound01.cs.umd.edu (1 distinct, 6 total) ==
Jul 24 00:13:06 outbound01.cs.umd.edu python3[1161559]: ldapdb [x6]
== sentry-docker00.cs.umd.edu (38 distinct, 38 total) ==
Jul 24 00:11:06 sentry-docker00.cs.umd.edu systemd-udevd[2215731]: Could not generate persistent MAC address for vethc86eeb3: No such file or directory
Jul 24 00:11:06 sentry-docker00.cs.umd.edu systemd-udevd[2215732]: Could not generate persistent MAC address for vethc8450a6: No such file or directory
Jul 24 00:16:54 sentry-docker00.cs.umd.edu systemd-udevd[2217823]: link_config: could not get ethtool features for vethb41a43a
Jul 24 00:16:54 sentry-docker00.cs.umd.edu systemd-udevd[2217823]: Could not set offload features of vethb41a43a: No such device
Jul 24 00:16:54 sentry-docker00.cs.umd.edu systemd-udevd[2217838]: Could not generate persistent MAC address for veth8d952c7: No such file or directory
Jul 24 00:16:54 sentry-docker00.cs.umd.edu systemd-udevd[2217839]: Could not generate persistent MAC address for vethf24b661: No such file or directory
Jul 24 00:16:54 sentry-docker00.cs.umd.edu systemd-udevd[2217857]: Could not generate persistent MAC address for veth31d33f9: No such file or directory
Jul 24 00:16:54 sentry-docker00.cs.umd.edu systemd-udevd[2217864]: Could not generate persistent MAC address for vethb379bdc: No such file or directory
Jul 24 00:16:54 sentry-docker00.cs.umd.edu systemd-udevd[2217866]: Could not generate persistent MAC address for veth5e70001: No such file or directory
Jul 24 00:16:54 sentry-docker00.cs.umd.edu systemd-udevd[2217867]: Could not generate persistent MAC address for veth0dcd2fd: No such file or directory
Jul 24 00:16:54 sentry-docker00.cs.umd.edu systemd-udevd[2217944]: Could not generate persistent MAC address for vethf69b892: No such file or directory
Jul 24 00:16:54 sentry-docker00.cs.umd.edu systemd-udevd[2217946]: Could not generate persistent MAC address for vethf4a3440: No such file or directory
Jul 24 00:31:14 sentry-docker00.cs.umd.edu systemd-udevd[2225187]: Could not generate persistent MAC address for veth9971126: No such file or directory
Jul 24 00:31:14 sentry-docker00.cs.umd.edu systemd-udevd[2225188]: Could not generate persistent MAC address for vethdde1cbd: No such file or directory
Jul 24 00:37:03 sentry-docker00.cs.umd.edu systemd-udevd[2227265]: link_config: could not get ethtool features for veth5e70001
Jul 24 00:37:03 sentry-docker00.cs.umd.edu systemd-udevd[2227265]: Could not set offload features of veth5e70001: No such device
Jul 24 00:37:03 sentry-docker00.cs.umd.edu systemd-udevd[2227265]: Could not generate persistent MAC address for vethede7f87: No such file or directory
Jul 24 00:37:03 sentry-docker00.cs.umd.edu systemd-udevd[2227278]: Could not generate persistent MAC address for vethc19a370: No such file or directory
Jul 24 00:37:03 sentry-docker00.cs.umd.edu systemd-udevd[2227338]: Could not generate persistent MAC address for vethb77f586: No such file or directory
Jul 24 00:37:03 sentry-docker00.cs.umd.edu systemd-udevd[2227339]: Could not generate persistent MAC address for veth9771fda: No such file or directory
Jul 24 00:37:03 sentry-docker00.cs.umd.edu systemd-udevd[2227347]: Could not generate persistent MAC address for veth5562d94: No such file or directory
Jul 24 00:37:03 sentry-docker00.cs.umd.edu systemd-udevd[2227350]: Could not generate persistent MAC address for veth89de296: No such file or directory
Jul 24 00:37:03 sentry-docker00.cs.umd.edu systemd-udevd[2227429]: Could not generate persistent MAC address for veth90dc4f3: No such file or directory
Jul 24 00:37:03 sentry-docker00.cs.umd.edu systemd-udevd[2227430]: Could not generate persistent MAC address for veth9e9fea0: No such file or directory
Jul 24 00:51:18 sentry-docker00.cs.umd.edu systemd-udevd[2234643]: link_config: could not get ethtool features for veth9971126
Jul 24 00:51:18 sentry-docker00.cs.umd.edu systemd-udevd[2234643]: Could not set offload features of veth9971126: No such device
Jul 24 00:51:19 sentry-docker00.cs.umd.edu systemd-udevd[2234659]: Could not generate persistent MAC address for vethe616ed0: No such file or directory
Jul 24 00:51:19 sentry-docker00.cs.umd.edu systemd-udevd[2234660]: Could not generate persistent MAC address for veth9ded9e6: No such file or directory
Jul 24 00:57:11 sentry-docker00.cs.umd.edu systemd-udevd[2236673]: link_config: could not get ethtool features for vethc19a370
Jul 24 00:57:11 sentry-docker00.cs.umd.edu systemd-udevd[2236673]: Could not set offload features of vethc19a370: No such device
... 8 more distinct messages not shown
== soul (2 distinct, 2 total) ==
Jul 24 00:43:11 soul krb5_child[1498793]: Client 'admin(a)UMD.EDU' not found in Kerberos database
Jul 24 00:43:32 soul sshd-session[1498795]: error: Protocol major versions differ: 2 vs. 1
== strawberry (3 distinct, 9 total) ==
Jul 24 00:09:44 strawberry udisksd[1067]: Error performing housekeeping for drive /org/freedesktop/UDisks2/drives/ST2000DM001_1CH164_W1E8J5KJ: Error updating SMART data: Error sending ATA command CHECK POWER MODE: Unexpected sense data returned:#0120000: 00 00 00 00 00 00 00 00 00 00 00 00 00 00 00 00 ................#0120010: 00 00 00 00 00 00 00 00 00 00 00 00 00 00 00 00 ................#012 (g-io-error-quark, 0) [x6]
Jul 24 00:34:42 strawberry smartd[5314]: Device: /dev/sda [SAT], failed to read SMART Attribute Data [x2]
Jul 24 01:04:42 strawberry smartd[5314]: Device: /dev/sda [SAT], not capable of Offline or Self-Testing.
== submit10-cln25 (3 distinct, 4 total) ==
Jul 24 00:10:11 submit10-cln25 systemd: New main PID 17992 does not belong to service, and PID file is not owned by root. Refusing. [x2]
Jul 24 00:10:30 submit10-cln25 systemd: Daemon never wrote its PID file. Failing.
Jul 24 00:10:36 submit10-cln25 systemd: pmlogger.service: Supervising process 24892 which is not our child. We'll most likely not notice when it exits.
== submit26-b9-2 (10 distinct, 20 total) ==
Jul 24 00:05:06 submit26-b9-2 systemd[1]: user(a)1001.service: Main process exited, code=killed, status=9/KILL [x11]
Jul 24 00:05:49 submit26-b9-2 systemd-coredump[60661]: Process 60658 (simavr) of user 1001 dumped core.
Jul 24 00:07:35 submit26-b9-2 systemd-coredump[60716]: Process 60713 (simavr) of user 1001 dumped core.
Jul 24 00:14:22 submit26-b9-2 systemd-coredump[64617]: Process 64614 (simavr) of user 1001 dumped core.
Jul 24 00:14:22 submit26-b9-2 systemd-coredump[64629]: Process 64626 (simavr) of user 1001 dumped core.
Jul 24 00:14:23 submit26-b9-2 systemd-coredump[64655]: Process 64652 (simavr) of user 1001 dumped core.
Jul 24 00:28:28 submit26-b9-2 systemd-coredump[68920]: Process 68917 (simavr) of user 1001 dumped core.
Jul 24 00:35:18 submit26-b9-2 systemd-coredump[71240]: Process 71237 (simavr) of user 1001 dumped core.
Jul 24 00:35:18 submit26-b9-2 systemd-coredump[71252]: Process 71249 (simavr) of user 1001 dumped core.
Jul 24 00:35:19 submit26-b9-2 systemd-coredump[71279]: Process 71276 (simavr) of user 1001 dumped core.
== submit26-b9-4 (18 distinct, 28 total) ==
Jul 24 00:05:06 submit26-b9-4 systemd[1]: user(a)1001.service: Main process exited, code=killed, status=9/KILL [x11]
Jul 24 00:15:24 submit26-b9-4 setroubleshoot[62642]: SELinux is preventing /usr/bin/python3.9 from create access on the directory /(null). For complete SELinux messages run: sealert -l a4e66030-8621-4da9-bd27-5988bb1bf8ad
Jul 24 00:15:24 submit26-b9-4 setroubleshoot[62642]: SELinux is preventing /usr/bin/python3.9 from add_name access on the directory /(null). For complete SELinux messages run: sealert -l c055e37d-bbf5-4800-9083-d606f792c8c1
Jul 24 00:15:24 submit26-b9-4 setroubleshoot[62642]: SELinux is preventing /usr/bin/python3.9 from create access on the file /(null). For complete SELinux messages run: sealert -l e5bc3a56-6d6f-4776-954f-ddde1579648f
Jul 24 00:15:24 submit26-b9-4 setroubleshoot[62642]: SELinux is preventing /usr/bin/python3.9 from open access on the file /tmp/libdnf.SCjw4M/repodata/repomd.xml. For complete SELinux messages run: sealert -l a8ec5e1b-49f9-4fbc-a8ae-22e800f7abf2
Jul 24 00:15:24 submit26-b9-4 setroubleshoot[62642]: SELinux is preventing /usr/bin/python3.9 from setattr access on the file repomd.xml. For complete SELinux messages run: sealert -l 945db714-d0c0-4402-911e-932978b8b036
Jul 24 00:15:24 submit26-b9-4 setroubleshoot[62642]: SELinux is preventing /usr/bin/python3.9 from read access on the directory libdnf.SCjw4M. For complete SELinux messages run: sealert -l 463998a0-fb0d-463c-82b1-471135710a14
Jul 24 00:15:24 submit26-b9-4 setroubleshoot[62642]: SELinux is preventing /usr/bin/python3.9 from remove_name access on the directory repomd.xml. For complete SELinux messages run: sealert -l 473d2e21-15d8-407a-a9ee-2b842607fa00
Jul 24 00:15:24 submit26-b9-4 setroubleshoot[62642]: SELinux is preventing /usr/bin/python3.9 from unlink access on the file repomd.xml. For complete SELinux messages run: sealert -l 80c54d4f-bf4b-4501-addb-1627383587d0
Jul 24 00:15:24 submit26-b9-4 setroubleshoot[62642]: SELinux is preventing /usr/bin/python3.9 from rmdir access on the directory repodata. For complete SELinux messages run: sealert -l c63d3890-151e-49a0-83f0-3dfb69d051e5
Jul 24 00:17:59 submit26-b9-4 systemd-coredump[64315]: Process 64312 (simavr) of user 1001 dumped core.
Jul 24 00:17:59 submit26-b9-4 systemd-coredump[64327]: Process 64324 (simavr) of user 1001 dumped core.
Jul 24 00:17:59 submit26-b9-4 systemd-coredump[64354]: Process 64351 (simavr) of user 1001 dumped core.
Jul 24 00:32:50 submit26-b9-4 systemd-coredump[66105]: Process 66102 (simavr) of user 1001 dumped core.
Jul 24 00:39:16 submit26-b9-4 systemd-coredump[68777]: Process 68774 (simavr) of user 1001 dumped core.
Jul 24 00:39:16 submit26-b9-4 systemd-coredump[68789]: Process 68786 (simavr) of user 1001 dumped core.
Jul 24 00:39:16 submit26-b9-4 systemd-coredump[68815]: Process 68812 (simavr) of user 1001 dumped core.
Jul 24 00:55:14 submit26-b9-4 systemd-coredump[71122]: Process 71119 (simavr) of user 1001 dumped core.
== tma-0 (3 distinct, 4 total) ==
Jul 24 00:10:13 tma-0 systemd[1]: New main PID 25218 does not belong to service, and PID file is not owned by root. Refusing. [x2]
Jul 24 00:10:30 tma-0 systemd[1]: Daemon never wrote its PID file. Failing.
Jul 24 00:10:38 tma-0 systemd[1]: pmlogger.service: Supervising process 32204 which is not our child. We'll most likely not notice when it exits.
== uffish.cs.umd.edu (3 distinct, 4 total) ==
Jul 24 00:10:13 uffish.cs.umd.edu systemd[1]: New main PID 2033016 does not belong to service, and PID file is not owned by root. Refusing. [x2]
Jul 24 00:10:35 uffish.cs.umd.edu systemd[1]: Daemon never wrote its PID file. Failing.
Jul 24 00:10:52 uffish.cs.umd.edu systemd[1]: pmlogger.service: Supervising process 2040611 which is not our child. We'll most likely not notice when it exits.
== updates00.cs.umd.edu (3 distinct, 4 total) ==
Jul 24 00:10:12 updates00.cs.umd.edu systemd[1]: New main PID 2698 does not belong to service, and PID file is not owned by root. Refusing. [x2]
Jul 24 00:10:29 updates00.cs.umd.edu systemd[1]: Daemon never wrote its PID file. Failing.
Jul 24 00:10:36 updates00.cs.umd.edu systemd[1]: pmlogger.service: Supervising process 9655 which is not our child. We'll most likely not notice when it exits.
== vacuum.cs.umd.edu (3 distinct, 4 total) ==
Jul 24 00:10:14 vacuum.cs.umd.edu systemd[1]: New main PID 6096 does not belong to service, and PID file is not owned by root. Refusing. [x2]
Jul 24 00:10:34 vacuum.cs.umd.edu systemd[1]: Daemon never wrote its PID file. Failing.
Jul 24 00:10:44 vacuum.cs.umd.edu systemd[1]: pmlogger.service: Supervising process 13777 which is not our child. We'll most likely not notice when it exits.
== whiffle.cs.umd.edu (3 distinct, 4 total) ==
Jul 24 00:10:13 whiffle.cs.umd.edu systemd[1]: New main PID 1899144 does not belong to service, and PID file is not owned by root. Refusing. [x2]
Jul 24 00:10:32 whiffle.cs.umd.edu systemd[1]: Daemon never wrote its PID file. Failing.
Jul 24 00:10:46 whiffle.cs.umd.edu systemd[1]: pmlogger.service: Supervising process 1906300 which is not our child. We'll most likely not notice when it exits.
1
0
Command: /usr/local/sbin/syslog-digest.py
Time : 0.4995s
Status : exited 0
Output :
Syslog digest — 2026-07-24 00:05 EDT
Processed 4,372 lines, filtered 3,510 (80%). 862 unknown (148 distinct) from 43 host(s).
== abuse (1 distinct, 346 total) ==
Jul 23 23:05:06 abuse rsyslogd[21745]: imjournal: open() failed for path: '/var/lib/rsyslog/imjournal.state.tmp': Input/output error [v8.2404.0 try https://www.rsyslog.com/e/2433 ] [x346]
== ai-course (2 distinct, 2 total) ==
Jul 23 23:16:34 ai-course falcon-sensor-bpf[663]: CrowdStrike(4): Could not retrieve DisableProxy value: c0000225
Jul 23 23:16:34 ai-course falcon-sensor-bpf[663]: CrowdStrike(4): ConnectWithProxy: Unable to get application proxy host from CsConfig: c0000225
== alec.cs.umd.edu (4 distinct, 60 total) ==
Jul 23 23:05:16 alec.cs.umd.edu setroubleshoot[2371534]: failed to retrieve rpm info for path '/run/netns/netns-a2b2cc2d-7532-4db7-6a36-b1dd3d5f51db': [x12]
Jul 23 23:05:16 alec.cs.umd.edu sedispatch[1526]: AVC Message regarding setroubleshoot, ignoring message [x24]
Jul 23 23:05:16 alec.cs.umd.edu setroubleshoot[2371534]: SELinux is preventing /usr/bin/df from getattr access on the file /run/netns/netns-a2b2cc2d-7532-4db7-6a36-b1dd3d5f51db. For complete SELinux messages run: sealert -l 23f93208-3063-4aac-b78a-bb0fcb40740c [x23]
Jul 23 23:57:52 alec.cs.umd.edu mariadb-drupal[1865641]: 2026-07-24 3:57:52 24 [Warning] Aborted connection 24 to db: 'unconnected' user: 'root' host: 'localhost' (Got timeout reading communication packets)
== biggulp.cs.umd.edu (2 distinct, 2 total) ==
Jul 23 23:06:02 biggulp.cs.umd.edu falcon-sensor-bpf[834]: CrowdStrike(4): Could not retrieve DisableProxy value: c0000225
Jul 23 23:06:02 biggulp.cs.umd.edu falcon-sensor-bpf[834]: CrowdStrike(4): ConnectWithProxy: Unable to get application proxy host from CsConfig: c0000225
== bigtuna (2 distinct, 2 total) ==
Jul 23 23:05:02 bigtuna falcon-sensor-bpf[874]: CrowdStrike(4): Could not retrieve DisableProxy value: c0000225
Jul 23 23:05:02 bigtuna falcon-sensor-bpf[874]: CrowdStrike(4): ConnectWithProxy: Unable to get application proxy host from CsConfig: c0000225
== borealis (2 distinct, 2 total) ==
Jul 23 23:10:55 borealis falcon-sensor-bpf[921]: CrowdStrike(4): Could not retrieve DisableProxy value: c0000225
Jul 23 23:10:55 borealis falcon-sensor-bpf[921]: CrowdStrike(4): ConnectWithProxy: Unable to get application proxy host from CsConfig: c0000225
== borogove.cs.umd.edu (2 distinct, 2 total) ==
Jul 23 23:08:08 borogove.cs.umd.edu falcon-sensor-bpf[1394]: CrowdStrike(4): Could not retrieve DisableProxy value: c0000225
Jul 23 23:08:08 borogove.cs.umd.edu falcon-sensor-bpf[1394]: CrowdStrike(4): ConnectWithProxy: Unable to get application proxy host from CsConfig: c0000225
== cheezit.cs.umd.edu (8 distinct, 9 total) ==
Jul 23 23:26:28 cheezit.cs.umd.edu falcon-sensor-bpf[1347]: CrowdStrike(4): Could not retrieve DisableProxy value: c0000225
Jul 23 23:26:28 cheezit.cs.umd.edu falcon-sensor-bpf[1347]: CrowdStrike(4): ConnectWithProxy: Unable to get application proxy host from CsConfig: c0000225
Jul 23 23:29:12 cheezit.cs.umd.edu sshd-session[1168680]: pam_access(sshd:auth): access denied for user `admin' from `207.175.50.104'
Jul 23 23:29:12 cheezit.cs.umd.edu krb5_child[1168682]: Client 'admin(a)UMD.EDU' not found in Kerberos database [x2]
Jul 23 23:29:12 cheezit.cs.umd.edu sshd-session[1168678]: error: PAM: System error for admin from 207.175.50.104
Jul 23 23:38:48 cheezit.cs.umd.edu sshd-session[1170653]: pam_access(sshd:auth): access denied for user `admin' from `34.76.161.62'
Jul 23 23:38:49 cheezit.cs.umd.edu sshd-session[1170651]: error: PAM: System error for admin from 34.76.161.62
Jul 23 23:40:32 cheezit.cs.umd.edu sshd-session[1170915]: error: Protocol major versions differ: 2 vs. 1
== csfw00a (2 distinct, 206 total) ==
Jul 23 23:05:54 csfw00a kernel: bnxt_en 0000:09:00.0 eth3: NIC Link is Down [x198]
Jul 23 23:42:17 csfw00a ospf6d[1477]: [EC 100663307] Could not send entire message [x8]
== cskayako (2 distinct, 2 total) ==
Jul 23 23:18:44 cskayako falcon-sensor-bpf[746]: CrowdStrike(4): Could not retrieve DisableProxy value: c0000225
Jul 23 23:18:44 cskayako falcon-sensor-bpf[746]: CrowdStrike(4): ConnectWithProxy: Unable to get application proxy host from CsConfig: c0000225
== defer (2 distinct, 2 total) ==
Jul 23 23:23:55 defer falcon-sensor-bpf[811]: CrowdStrike(4): Could not retrieve DisableProxy value: c0000225
Jul 23 23:23:55 defer falcon-sensor-bpf[811]: CrowdStrike(4): ConnectWithProxy: Unable to get application proxy host from CsConfig: c0000225
== emaar (2 distinct, 2 total) ==
Jul 23 23:12:30 emaar falcon-sensor-bpf[971]: CrowdStrike(4): Could not retrieve DisableProxy value: c0000225
Jul 23 23:12:30 emaar falcon-sensor-bpf[971]: CrowdStrike(4): ConnectWithProxy: Unable to get application proxy host from CsConfig: c0000225
== frozone (2 distinct, 2 total) ==
Jul 23 23:11:41 frozone falcon-sensor-bpf[1052]: CrowdStrike(4): Could not retrieve DisableProxy value: c0000225
Jul 23 23:11:41 frozone falcon-sensor-bpf[1052]: CrowdStrike(4): ConnectWithProxy: Unable to get application proxy host from CsConfig: c0000225
== galahad.cs.umd.edu (2 distinct, 2 total) ==
Jul 23 23:21:13 galahad.cs.umd.edu falcon-sensor-bpf[970]: CrowdStrike(4): Could not retrieve DisableProxy value: c0000225
Jul 23 23:21:13 galahad.cs.umd.edu falcon-sensor-bpf[970]: CrowdStrike(4): ConnectWithProxy: Unable to get application proxy host from CsConfig: c0000225
== gle-omnibus00.cs.umd.edu (2 distinct, 2 total) ==
Jul 23 23:06:32 gle-omnibus00.cs.umd.edu falcon-sensor-bpf[974]: CrowdStrike(4): Could not retrieve DisableProxy value: c0000225
Jul 23 23:06:32 gle-omnibus00.cs.umd.edu falcon-sensor-bpf[974]: CrowdStrike(4): ConnectWithProxy: Unable to get application proxy host from CsConfig: c0000225
== grosh (2 distinct, 2 total) ==
Jul 23 23:16:29 grosh falcon-sensor-bpf[110450]: CrowdStrike(4): Could not retrieve DisableProxy value: c0000225
Jul 23 23:16:29 grosh falcon-sensor-bpf[110450]: CrowdStrike(4): ConnectWithProxy: Unable to get application proxy host from CsConfig: c0000225
== hackerman (8 distinct, 10 total) ==
Jul 23 23:12:34 hackerman falcon-sensor-bpf[896]: CrowdStrike(4): Could not retrieve DisableProxy value: c0000225
Jul 23 23:12:34 hackerman falcon-sensor-bpf[896]: CrowdStrike(4): ConnectWithProxy: Unable to get application proxy host from CsConfig: c0000225
Jul 23 23:19:01 hackerman gnome-software[2060381]: failed to commit changes to dconf: GDBus.Error:org.gtk.GDBus.UnmappedGError.Quark._g_2dfile_2derror_2dquark.Code2: Failed to create file “/adminhomes/sajith/.config/dconf/user.N78XS3”: Permission denied
Jul 23 23:20:04 hackerman gnome-software[2060381]: can't reliably fixup error code 4 in domain g-io-error-quark: Not a directory [x3]
Jul 23 23:20:12 hackerman gnome-software[2060381]: Only 0 apps for recent list, hiding
Jul 23 23:20:28 hackerman gnome-software[2060381]: failed to commit changes to dconf: GDBus.Error:org.gtk.GDBus.UnmappedGError.Quark._g_2dfile_2derror_2dquark.Code2: Failed to create file “/adminhomes/sajith/.config/dconf/user.8A66S3”: Permission denied
Jul 23 23:20:29 hackerman packagekitd[4167049]: Failed to get cache filename for libreoffice
Jul 23 23:20:29 hackerman packagekitd[4167049]: Failed to get cache filename for kernel
== haproxy03.cs.umd.edu (2 distinct, 2 total) ==
Jul 23 23:22:10 haproxy03.cs.umd.edu falcon-sensor-bpf[1401]: CrowdStrike(4): Could not retrieve DisableProxy value: c0000225
Jul 23 23:22:10 haproxy03.cs.umd.edu falcon-sensor-bpf[1401]: CrowdStrike(4): ConnectWithProxy: Unable to get application proxy host from CsConfig: c0000225
== hasaraumd (2 distinct, 2 total) ==
Jul 23 23:15:53 hasaraumd falcon-sensor-bpf[730]: CrowdStrike(4): Could not retrieve DisableProxy value: c0000225
Jul 23 23:15:53 hasaraumd falcon-sensor-bpf[730]: CrowdStrike(4): ConnectWithProxy: Unable to get application proxy host from CsConfig: c0000225
== hspc (1 distinct, 1 total) ==
Jul 24 00:00:02 hspc kernel: kauditd_printk_skb: 2 callbacks suppressed
== idm00 (1 distinct, 1 total) ==
Jul 23 23:51:04 idm00 named[1455]: client @0x7f330c44bf28 10.73.240.42#63370: update '73.10.in-addr.arpa/IN' denied
== idmp0 (1 distinct, 1 total) ==
Jul 23 23:34:56 idmp0 named[5198]: client @0x7f991003a0f8 10.73.240.43#60758: update '73.10.in-addr.arpa/IN' denied
== irb2156 (4 distinct, 4 total) ==
Jul 23 23:05:29 irb2156 falcon-sensor-bpf[3825]: CrowdStrike(4): Could not retrieve DisableProxy value: c0000225
Jul 23 23:05:29 irb2156 falcon-sensor-bpf[3825]: CrowdStrike(4): ConnectWithProxy: Unable to get application proxy host from CsConfig: c0000225
Jul 23 23:06:32 irb2156 systemd-resolved[3520]: Using degraded feature set UDP instead of UDP+EDNS0 for DNS server 128.8.74.3.
Jul 23 23:06:37 irb2156 systemd-resolved[3520]: Using degraded feature set TCP instead of UDP for DNS server 128.8.76.3.
== itmon02 (2 distinct, 44 total) ==
Jul 23 23:07:48 itmon02 sshd[1834]: error: beginning MaxStartups throttling [x43]
Jul 23 23:12:38 itmon02 kernel: hrtimer: interrupt took 7617 ns
== jaws.cs.umd.edu (2 distinct, 2 total) ==
Jul 23 23:18:38 jaws.cs.umd.edu falcon-sensor-bpf[1195]: CrowdStrike(4): Could not retrieve DisableProxy value: c0000225
Jul 23 23:18:38 jaws.cs.umd.edu falcon-sensor-bpf[1195]: CrowdStrike(4): ConnectWithProxy: Unable to get application proxy host from CsConfig: c0000225
== krispykreme.cs.umd.edu (4 distinct, 4 total) ==
Jul 23 23:28:57 krispykreme.cs.umd.edu sshd-session[2811414]: pam_access(sshd:auth): access denied for user `admin' from `34.156.78.96'
Jul 23 23:28:57 krispykreme.cs.umd.edu krb5_child[2811416]: Client 'admin(a)UMD.EDU' not found in Kerberos database
Jul 23 23:28:57 krispykreme.cs.umd.edu sshd-session[2811412]: error: PAM: System error for admin from 34.156.78.96
Jul 23 23:29:29 krispykreme.cs.umd.edu sshd-session[2811495]: error: Protocol major versions differ: 2 vs. 1
== mashie (2 distinct, 2 total) ==
Jul 23 23:19:34 mashie falcon-sensor-bpf[786]: CrowdStrike(4): Could not retrieve DisableProxy value: c0000225
Jul 23 23:19:34 mashie falcon-sensor-bpf[786]: CrowdStrike(4): ConnectWithProxy: Unable to get application proxy host from CsConfig: c0000225
== matrix (1 distinct, 1 total) ==
Jul 24 00:00:02 matrix (nin-node)[694568]: munin-node.service: Referenced but unset environment variable evaluates to an empty string: DAEMON_ARGS
== neo-gizmonic (1 distinct, 1 total) ==
Jul 24 00:00:14 neo-gizmonic (nin-node)[3444601]: munin-node.service: Referenced but unset environment variable evaluates to an empty string: DAEMON_ARGS
== neoavion (1 distinct, 1 total) ==
Jul 24 00:00:11 neoavion (nin-node)[1289800]: munin-node.service: Referenced but unset environment variable evaluates to an empty string: DAEMON_ARGS
== netman.cs.umd.edu (3 distinct, 6 total) ==
Jul 23 23:41:14 netman.cs.umd.edu krb5_child[287745]: Client 'admin(a)UMD.EDU' not found in Kerberos database [x4]
Jul 23 23:41:19 netman.cs.umd.edu sshd[287742]: error: PAM: Authentication failure for admin from 34.140.11.164
Jul 23 23:42:17 netman.cs.umd.edu sshd[287830]: error: Protocol major versions differ: 2 vs. 1
== newhonors.cs.umd.edu (3 distinct, 3 total) ==
Jul 23 23:38:26 newhonors.cs.umd.edu sshd[11294]: fatal: Unable to negotiate with 34.140.11.164 port 33974: no matching host key type found. Their offer: ssh-dss [preauth]
Jul 23 23:38:27 newhonors.cs.umd.edu sshd[11300]: fatal: Unable to negotiate with 34.140.11.164 port 33990: no matching host key type found. Their offer: ecdsa-sha2-nistp384 [preauth]
Jul 23 23:38:28 newhonors.cs.umd.edu sshd[11302]: fatal: Unable to negotiate with 34.140.11.164 port 33992: no matching host key type found. Their offer: ecdsa-sha2-nistp521 [preauth]
== newhonors2 (2 distinct, 25 total) ==
Jul 23 23:13:02 newhonors2 dhcpcd[193794]: dhcpcd is not running [x24]
Jul 24 00:00:01 newhonors2 (nin-node)[195379]: munin-node.service: Referenced but unset environment variable evaluates to an empty string: DAEMON_ARGS
== outbound00.cs.umd.edu (2 distinct, 7 total) ==
Jul 23 23:09:09 outbound00.cs.umd.edu python3[3118864]: ldapdb [x6]
Jul 23 23:47:35 outbound00.cs.umd.edu krb5_child[3127421]: Client 'admin(a)UMD.EDU' not found in Kerberos database
== outbound01.cs.umd.edu (1 distinct, 6 total) ==
Jul 23 23:13:06 outbound01.cs.umd.edu python3[1146909]: ldapdb [x6]
== quiss (2 distinct, 2 total) ==
Jul 23 23:21:43 quiss falcon-sensor-bpf[1564085]: CrowdStrike(4): Could not retrieve DisableProxy value: c0000225
Jul 23 23:21:43 quiss falcon-sensor-bpf[1564085]: CrowdStrike(4): ConnectWithProxy: Unable to get application proxy host from CsConfig: c0000225
== sentry-docker00.cs.umd.edu (40 distinct, 40 total) ==
Jul 23 23:10:49 sentry-docker00.cs.umd.edu systemd-udevd[2187273]: Could not generate persistent MAC address for veth242b9aa: No such file or directory
Jul 23 23:10:49 sentry-docker00.cs.umd.edu systemd-udevd[2187274]: Could not generate persistent MAC address for vethdbfe7ce: No such file or directory
Jul 23 23:16:29 sentry-docker00.cs.umd.edu systemd-udevd[2189286]: link_config: could not get ethtool features for veth9627c5a
Jul 23 23:16:29 sentry-docker00.cs.umd.edu systemd-udevd[2189286]: Could not set offload features of veth9627c5a: No such device
Jul 23 23:16:29 sentry-docker00.cs.umd.edu systemd-udevd[2189370]: Could not generate persistent MAC address for veth94c2c74: No such file or directory
Jul 23 23:16:29 sentry-docker00.cs.umd.edu systemd-udevd[2189371]: Could not generate persistent MAC address for veth144b13d: No such file or directory
Jul 23 23:16:29 sentry-docker00.cs.umd.edu systemd-udevd[2189396]: Could not generate persistent MAC address for vethc8c7086: No such file or directory
Jul 23 23:16:29 sentry-docker00.cs.umd.edu systemd-udevd[2189397]: Could not generate persistent MAC address for veth52765c2: No such file or directory
Jul 23 23:16:29 sentry-docker00.cs.umd.edu systemd-udevd[2189408]: Could not generate persistent MAC address for veth002a208: No such file or directory
Jul 23 23:16:29 sentry-docker00.cs.umd.edu systemd-udevd[2189419]: Could not generate persistent MAC address for vetha171122: No such file or directory
Jul 23 23:16:29 sentry-docker00.cs.umd.edu systemd-udevd[2189450]: Could not generate persistent MAC address for veth00686ac: No such file or directory
Jul 23 23:16:29 sentry-docker00.cs.umd.edu systemd-udevd[2189451]: Could not generate persistent MAC address for veth03cdc5b: No such file or directory
Jul 23 23:30:53 sentry-docker00.cs.umd.edu systemd-udevd[2196819]: Could not generate persistent MAC address for veth79a22b3: No such file or directory
Jul 23 23:30:53 sentry-docker00.cs.umd.edu systemd-udevd[2196820]: Could not generate persistent MAC address for veth9181e10: No such file or directory
Jul 23 23:36:37 sentry-docker00.cs.umd.edu systemd-udevd[2198964]: link_config: could not get ethtool features for veth00686ac
Jul 23 23:36:37 sentry-docker00.cs.umd.edu systemd-udevd[2198964]: Could not set offload features of veth00686ac: No such device
Jul 23 23:36:37 sentry-docker00.cs.umd.edu systemd-udevd[2199040]: link_config: could not get ethtool features for vethc8c7086
Jul 23 23:36:37 sentry-docker00.cs.umd.edu systemd-udevd[2199040]: Could not set offload features of vethc8c7086: No such device
Jul 23 23:36:38 sentry-docker00.cs.umd.edu systemd-udevd[2199063]: Could not generate persistent MAC address for veth9d74919: No such file or directory
Jul 23 23:36:38 sentry-docker00.cs.umd.edu systemd-udevd[2199064]: Could not generate persistent MAC address for veth75b6f4a: No such file or directory
Jul 23 23:36:38 sentry-docker00.cs.umd.edu systemd-udevd[2199082]: Could not generate persistent MAC address for veth6da37b9: No such file or directory
Jul 23 23:36:38 sentry-docker00.cs.umd.edu systemd-udevd[2199078]: Could not generate persistent MAC address for vethb340123: No such file or directory
Jul 23 23:36:38 sentry-docker00.cs.umd.edu systemd-udevd[2199091]: Could not generate persistent MAC address for veth9ad48b6: No such file or directory
Jul 23 23:36:38 sentry-docker00.cs.umd.edu systemd-udevd[2199092]: Could not generate persistent MAC address for vethad8cd9d: No such file or directory
Jul 23 23:36:38 sentry-docker00.cs.umd.edu systemd-udevd[2199146]: Could not generate persistent MAC address for veth69790b9: No such file or directory
Jul 23 23:36:38 sentry-docker00.cs.umd.edu systemd-udevd[2199149]: Could not generate persistent MAC address for vethe616d6e: No such file or directory
Jul 23 23:50:58 sentry-docker00.cs.umd.edu systemd-udevd[2206283]: link_config: could not get ethtool features for veth79a22b3
Jul 23 23:50:58 sentry-docker00.cs.umd.edu systemd-udevd[2206283]: Could not set offload features of veth79a22b3: No such device
Jul 23 23:50:58 sentry-docker00.cs.umd.edu systemd-udevd[2206299]: Could not generate persistent MAC address for vetheb74953: No such file or directory
Jul 23 23:50:58 sentry-docker00.cs.umd.edu systemd-udevd[2206300]: Could not generate persistent MAC address for veth1b49db0: No such file or directory
... 10 more distinct messages not shown
== strawberry (5 distinct, 11 total) ==
Jul 23 23:09:44 strawberry udisksd[1067]: Error performing housekeeping for drive /org/freedesktop/UDisks2/drives/ST2000DM001_1CH164_W1E8J5KJ: Error updating SMART data: Error sending ATA command CHECK POWER MODE: Unexpected sense data returned:#0120000: 00 00 00 00 00 00 00 00 00 00 00 00 00 00 00 00 ................#0120010: 00 00 00 00 00 00 00 00 00 00 00 00 00 00 00 00 ................#012 (g-io-error-quark, 0) [x6]
Jul 23 23:13:12 strawberry falcon-sensor-bpf[808]: CrowdStrike(4): Could not retrieve DisableProxy value: c0000225
Jul 23 23:13:12 strawberry falcon-sensor-bpf[808]: CrowdStrike(4): ConnectWithProxy: Unable to get application proxy host from CsConfig: c0000225
Jul 23 23:34:43 strawberry smartd[5314]: Device: /dev/sda [SAT], failed to read SMART Attribute Data [x2]
Jul 24 00:00:03 strawberry kernel: kauditd_printk_skb: 38 callbacks suppressed
== submit26-b9-2 (5 distinct, 16 total) ==
Jul 23 23:05:05 submit26-b9-2 systemd[1]: user(a)1001.service: Main process exited, code=killed, status=9/KILL [x12]
Jul 23 23:43:57 submit26-b9-2 systemd-coredump[48959]: Process 48956 (simavr) of user 1001 dumped core.
Jul 23 23:56:23 submit26-b9-2 systemd-coredump[56977]: Process 56974 (simavr) of user 1001 dumped core.
Jul 23 23:56:23 submit26-b9-2 systemd-coredump[56990]: Process 56986 (simavr) of user 1001 dumped core.
Jul 23 23:56:24 submit26-b9-2 systemd-coredump[57016]: Process 57013 (simavr) of user 1001 dumped core.
== submit26-b9-4 (6 distinct, 17 total) ==
Jul 23 23:08:05 submit26-b9-4 systemd[1]: user(a)1001.service: Main process exited, code=killed, status=9/KILL [x12]
Jul 23 23:13:08 submit26-b9-4 systemd-coredump[47071]: Process 47068 (simavr) of user 1001 dumped core.
Jul 23 23:35:09 submit26-b9-4 systemd-coredump[53669]: Process 53666 (simavr) of user 1001 dumped core.
Jul 23 23:53:11 submit26-b9-4 systemd-coredump[57171]: Process 57168 (simavr) of user 1001 dumped core.
Jul 23 23:53:11 submit26-b9-4 systemd-coredump[57183]: Process 57180 (simavr) of user 1001 dumped core.
Jul 23 23:53:11 submit26-b9-4 systemd-coredump[57210]: Process 57207 (simavr) of user 1001 dumped core.
== talkhosts9 (2 distinct, 2 total) ==
Jul 23 23:21:35 talkhosts9 falcon-sensor-bpf[714]: CrowdStrike(4): Could not retrieve DisableProxy value: c0000225
Jul 23 23:21:35 talkhosts9 falcon-sensor-bpf[714]: CrowdStrike(4): ConnectWithProxy: Unable to get application proxy host from CsConfig: c0000225
== wraith (4 distinct, 4 total) ==
Jul 23 23:24:30 wraith falcon-sensor[917]: CrowdStrike(4): Could not retrieve DisableProxy value: c0000225
Jul 23 23:24:30 wraith falcon-sensor[917]: CrowdStrike(4): ConnectWithProxy: Unable to get application proxy host from CsConfig: c0000225
Jul 24 00:00:30 wraith kernel: kauditd_printk_skb: 113 callbacks suppressed
Jul 24 00:00:30 wraith (nin-node)[427944]: munin-node.service: Referenced but unset environment variable evaluates to an empty string: DAEMON_ARGS
== yogurt (2 distinct, 2 total) ==
Jul 23 23:24:39 yogurt falcon-sensor-bpf[950]: CrowdStrike(4): Could not retrieve DisableProxy value: c0000225
Jul 23 23:24:39 yogurt falcon-sensor-bpf[950]: CrowdStrike(4): ConnectWithProxy: Unable to get application proxy host from CsConfig: c0000225
1
0
Command: /usr/local/sbin/syslog-digest.py
Time : 0.5415s
Status : exited 0
Output :
Syslog digest — 2026-07-23 23:05 EDT
Processed 4,451 lines, filtered 3,471 (77%). 980 unknown (164 distinct) from 57 host(s).
== abadi-computer (2 distinct, 4 total) ==
Jul 23 22:32:52 abadi-computer falcon-sensor-bpf[529]: CrowdStrike(4): Could not retrieve DisableProxy value: c0000225 [x2]
Jul 23 22:32:52 abadi-computer falcon-sensor-bpf[529]: CrowdStrike(4): ConnectWithProxy: Unable to get application proxy host from CsConfig: c0000225 [x2]
== abuse (1 distinct, 347 total) ==
Jul 23 22:05:06 abuse rsyslogd[21745]: imjournal: open() failed for path: '/var/lib/rsyslog/imjournal.state.tmp': Input/output error [v8.2404.0 try https://www.rsyslog.com/e/2433 ] [x347]
== ai-course (2 distinct, 2 total) ==
Jul 23 22:46:33 ai-course falcon-sensor-bpf[663]: CrowdStrike(4): Could not retrieve DisableProxy value: c0000225
Jul 23 22:46:33 ai-course falcon-sensor-bpf[663]: CrowdStrike(4): ConnectWithProxy: Unable to get application proxy host from CsConfig: c0000225
== alec.cs.umd.edu (3 distinct, 57 total) ==
Jul 23 22:05:20 alec.cs.umd.edu setroubleshoot[2356768]: failed to retrieve rpm info for path '/run/netns/netns-a2b2cc2d-7532-4db7-6a36-b1dd3d5f51db': [x12]
Jul 23 22:05:21 alec.cs.umd.edu sedispatch[1526]: AVC Message regarding setroubleshoot, ignoring message [x22]
Jul 23 22:05:21 alec.cs.umd.edu setroubleshoot[2356768]: SELinux is preventing /usr/bin/df from getattr access on the file /run/netns/netns-a2b2cc2d-7532-4db7-6a36-b1dd3d5f51db. For complete SELinux messages run: sealert -l 23f93208-3063-4aac-b78a-bb0fcb40740c [x23]
== bale (1 distinct, 1 total) ==
Jul 23 22:05:36 bale setroubleshoot[818619]: SELinux is preventing /usr/bin/tar from using the fowner capability. For complete SELinux messages run: sealert -l 8f58859c-1c63-4aee-afff-7c8e1dd95f45
== biggulp.cs.umd.edu (2 distinct, 2 total) ==
Jul 23 22:36:01 biggulp.cs.umd.edu falcon-sensor-bpf[834]: CrowdStrike(4): Could not retrieve DisableProxy value: c0000225
Jul 23 22:36:01 biggulp.cs.umd.edu falcon-sensor-bpf[834]: CrowdStrike(4): ConnectWithProxy: Unable to get application proxy host from CsConfig: c0000225
== bigtuna (2 distinct, 2 total) ==
Jul 23 22:35:01 bigtuna falcon-sensor-bpf[874]: CrowdStrike(4): Could not retrieve DisableProxy value: c0000225
Jul 23 22:35:01 bigtuna falcon-sensor-bpf[874]: CrowdStrike(4): ConnectWithProxy: Unable to get application proxy host from CsConfig: c0000225
== borealis (2 distinct, 2 total) ==
Jul 23 22:40:53 borealis falcon-sensor-bpf[921]: CrowdStrike(4): Could not retrieve DisableProxy value: c0000225
Jul 23 22:40:53 borealis falcon-sensor-bpf[921]: CrowdStrike(4): ConnectWithProxy: Unable to get application proxy host from CsConfig: c0000225
== borogove.cs.umd.edu (2 distinct, 2 total) ==
Jul 23 22:38:07 borogove.cs.umd.edu falcon-sensor-bpf[1394]: CrowdStrike(4): Could not retrieve DisableProxy value: c0000225
Jul 23 22:38:07 borogove.cs.umd.edu falcon-sensor-bpf[1394]: CrowdStrike(4): ConnectWithProxy: Unable to get application proxy host from CsConfig: c0000225
== cheezit.cs.umd.edu (2 distinct, 2 total) ==
Jul 23 22:26:27 cheezit.cs.umd.edu falcon-sensor-bpf[1347]: CrowdStrike(4): Could not retrieve DisableProxy value: c0000225
Jul 23 22:26:27 cheezit.cs.umd.edu falcon-sensor-bpf[1347]: CrowdStrike(4): ConnectWithProxy: Unable to get application proxy host from CsConfig: c0000225
== cmsc436-0101-redis (3 distinct, 3 total) ==
Jul 23 22:18:24 cmsc436-0101-redis krb5_child[185615]: Client 'admin(a)UMD.EDU' not found in Kerberos database
Jul 23 22:18:26 cmsc436-0101-redis sshd-session[185611]: error: PAM: Authentication failure for admin from 34.156.251.108
Jul 23 22:24:01 cmsc436-0101-redis sshd-session[185916]: error: Protocol major versions differ: 2 vs. 1
== csfw00a (1 distinct, 260 total) ==
Jul 23 22:04:42 csfw00a kernel: bnxt_en 0000:09:00.0 eth3: NIC Link is Down [x260]
== cskayako (2 distinct, 2 total) ==
Jul 23 22:18:43 cskayako falcon-sensor-bpf[746]: CrowdStrike(4): Could not retrieve DisableProxy value: c0000225
Jul 23 22:18:43 cskayako falcon-sensor-bpf[746]: CrowdStrike(4): ConnectWithProxy: Unable to get application proxy host from CsConfig: c0000225
== defer (2 distinct, 2 total) ==
Jul 23 22:23:53 defer falcon-sensor-bpf[811]: CrowdStrike(4): Could not retrieve DisableProxy value: c0000225
Jul 23 22:23:53 defer falcon-sensor-bpf[811]: CrowdStrike(4): ConnectWithProxy: Unable to get application proxy host from CsConfig: c0000225
== dojo (2 distinct, 4 total) ==
Jul 23 22:29:23 dojo falcon-sensor-bpf[2284]: CrowdStrike(4): Could not retrieve DisableProxy value: c0000225 [x2]
Jul 23 22:29:23 dojo falcon-sensor-bpf[2284]: CrowdStrike(4): ConnectWithProxy: Unable to get application proxy host from CsConfig: c0000225 [x2]
== emaar (2 distinct, 2 total) ==
Jul 23 22:42:29 emaar falcon-sensor-bpf[971]: CrowdStrike(4): Could not retrieve DisableProxy value: c0000225
Jul 23 22:42:29 emaar falcon-sensor-bpf[971]: CrowdStrike(4): ConnectWithProxy: Unable to get application proxy host from CsConfig: c0000225
== frabjous (2 distinct, 4 total) ==
Jul 23 22:33:43 frabjous falcon-sensor-bpf[1357]: CrowdStrike(4): Could not retrieve DisableProxy value: c0000225 [x2]
Jul 23 22:33:43 frabjous falcon-sensor-bpf[1357]: CrowdStrike(4): ConnectWithProxy: Unable to get application proxy host from CsConfig: c0000225 [x2]
== frozone (2 distinct, 2 total) ==
Jul 23 22:41:40 frozone falcon-sensor-bpf[1052]: CrowdStrike(4): Could not retrieve DisableProxy value: c0000225
Jul 23 22:41:40 frozone falcon-sensor-bpf[1052]: CrowdStrike(4): ConnectWithProxy: Unable to get application proxy host from CsConfig: c0000225
== galahad.cs.umd.edu (2 distinct, 2 total) ==
Jul 23 22:21:10 galahad.cs.umd.edu falcon-sensor-bpf[970]: CrowdStrike(4): Could not retrieve DisableProxy value: c0000225
Jul 23 22:21:10 galahad.cs.umd.edu falcon-sensor-bpf[970]: CrowdStrike(4): ConnectWithProxy: Unable to get application proxy host from CsConfig: c0000225
== gle-omnibus00.cs.umd.edu (2 distinct, 2 total) ==
Jul 23 22:36:30 gle-omnibus00.cs.umd.edu falcon-sensor-bpf[974]: CrowdStrike(4): Could not retrieve DisableProxy value: c0000225
Jul 23 22:36:30 gle-omnibus00.cs.umd.edu falcon-sensor-bpf[974]: CrowdStrike(4): ConnectWithProxy: Unable to get application proxy host from CsConfig: c0000225
== grosh (2 distinct, 2 total) ==
Jul 23 22:46:27 grosh falcon-sensor-bpf[110450]: CrowdStrike(4): Could not retrieve DisableProxy value: c0000225
Jul 23 22:46:27 grosh falcon-sensor-bpf[110450]: CrowdStrike(4): ConnectWithProxy: Unable to get application proxy host from CsConfig: c0000225
== hackerman (8 distinct, 13 total) ==
Jul 23 22:20:04 hackerman gnome-software[2060381]: can't reliably fixup error code 4 in domain g-io-error-quark: Not a directory [x4]
Jul 23 22:20:13 hackerman gnome-software[2060381]: Only 0 apps for recent list, hiding
Jul 23 22:20:28 hackerman gnome-software[2060381]: failed to commit changes to dconf: GDBus.Error:org.gtk.GDBus.UnmappedGError.Quark._g_2dfile_2derror_2dquark.Code2: Failed to create file “/adminhomes/sajith/.config/dconf/user.6LS3S3”: Permission denied
Jul 23 22:20:28 hackerman packagekitd[4153419]: Failed to get cache filename for libreoffice [x2]
Jul 23 22:20:28 hackerman packagekitd[4153419]: Failed to get cache filename for kernel [x2]
Jul 23 22:20:38 hackerman packagekitd[4153419]: failed to parse public key for /etc/pki/rpm-gpg/RPM-GPG-KEY-PQC-redhat-release
Jul 23 22:42:33 hackerman falcon-sensor-bpf[896]: CrowdStrike(4): Could not retrieve DisableProxy value: c0000225
Jul 23 22:42:33 hackerman falcon-sensor-bpf[896]: CrowdStrike(4): ConnectWithProxy: Unable to get application proxy host from CsConfig: c0000225
== haproxy02.cs.umd.edu (2 distinct, 4 total) ==
Jul 23 22:29:14 haproxy02.cs.umd.edu falcon-sensor-bpf[990]: CrowdStrike(4): Could not retrieve DisableProxy value: c0000225 [x2]
Jul 23 22:29:14 haproxy02.cs.umd.edu falcon-sensor-bpf[990]: CrowdStrike(4): ConnectWithProxy: Unable to get application proxy host from CsConfig: c0000225 [x2]
== haproxy03.cs.umd.edu (2 distinct, 2 total) ==
Jul 23 22:22:08 haproxy03.cs.umd.edu falcon-sensor-bpf[1401]: CrowdStrike(4): Could not retrieve DisableProxy value: c0000225
Jul 23 22:22:08 haproxy03.cs.umd.edu falcon-sensor-bpf[1401]: CrowdStrike(4): ConnectWithProxy: Unable to get application proxy host from CsConfig: c0000225
== hasaraumd (2 distinct, 2 total) ==
Jul 23 22:45:52 hasaraumd falcon-sensor-bpf[730]: CrowdStrike(4): Could not retrieve DisableProxy value: c0000225
Jul 23 22:45:52 hasaraumd falcon-sensor-bpf[730]: CrowdStrike(4): ConnectWithProxy: Unable to get application proxy host from CsConfig: c0000225
== hspc (2 distinct, 4 total) ==
Jul 23 22:33:43 hspc falcon-sensor-bpf[1008]: CrowdStrike(4): Could not retrieve DisableProxy value: c0000225 [x2]
Jul 23 22:33:43 hspc falcon-sensor-bpf[1008]: CrowdStrike(4): ConnectWithProxy: Unable to get application proxy host from CsConfig: c0000225 [x2]
== idm00 (1 distinct, 1 total) ==
Jul 23 22:51:04 idm00 named[1455]: client @0x7f33103836b8 10.73.240.42#54679: update '73.10.in-addr.arpa/IN' denied
== idmp0 (1 distinct, 1 total) ==
Jul 23 22:34:56 idmp0 named[5198]: client @0x7f9924007ab8 10.73.240.43#63844: update '73.10.in-addr.arpa/IN' denied
== irb2156 (4 distinct, 6 total) ==
Jul 23 22:35:27 irb2156 falcon-sensor-bpf[3825]: CrowdStrike(4): Could not retrieve DisableProxy value: c0000225
Jul 23 22:35:27 irb2156 falcon-sensor-bpf[3825]: CrowdStrike(4): ConnectWithProxy: Unable to get application proxy host from CsConfig: c0000225
Jul 23 23:01:55 irb2156 gcr-prompter[512049]: cannot open display: :1 [x2]
Jul 23 23:01:55 irb2156 gnome-keyring-d[165848]: couldn't create system prompt: GDBus.Error:org.freedesktop.DBus.Error.NameHasNoOwner: Could not activate remote peer 'org.gnome.keyring.SystemPrompter': unit failed [x2]
== itmon02 (1 distinct, 42 total) ==
Jul 23 22:08:08 itmon02 sshd[1834]: error: beginning MaxStartups throttling [x42]
== jaws.cs.umd.edu (6 distinct, 7 total) ==
Jul 23 22:18:37 jaws.cs.umd.edu falcon-sensor-bpf[1195]: CrowdStrike(4): Could not retrieve DisableProxy value: c0000225
Jul 23 22:18:37 jaws.cs.umd.edu falcon-sensor-bpf[1195]: CrowdStrike(4): ConnectWithProxy: Unable to get application proxy host from CsConfig: c0000225
Jul 23 22:33:09 jaws.cs.umd.edu systemd-coredump[1082052]: Process 1082035 (podman) of user 981 dumped core.#012#012Stack trace of thread 1082035:#012#0 0x0000555a4c8bb46e internal/runtime/syscall/linux.Syscall6 (podman + 0x48b46e)#012#1 0x0000555a4c99b0a6 syscall.Syscall (podman + 0x56b0a6)#012#2 0x0000555a4c99bc50 syscall.Syscall.abi0 (podman + 0x56bc50)#012#3 0x0000555a4cb05c2e github.com/containers/podman/vendor/golang.org/x/sys/unix.OpenTree (podman + 0x6d5c2e)#012#4 0x0000555a4d15ef4b github.com/containers/podman/vendor/github.com/cyphar/filepath-securejoin/p… (podman + 0xd2ef4b)#012#5 0x0000555a4d15ee54 github.com/containers/podman/vendor/github.com/cyphar/filepath-securejoin/p… (podman + 0xd2ee54)#012#6 0x0000555a4c94edcc sync.(*Once).doSlow (podman + 0x51edcc)#012#7 0x0000555a4c94ecf9 sync.(*Once).Do (podman + 0x51ecf9)#012#8 0x0000555a4d15ed
c5 github.com/containers/podman/vendor/github.com/cyphar/filepath-securejoin/p… (podman + 0xd2edc5)#012#9 0x0000555a4d1603e2 github.com/containers/podman/vendor/github.com/cyphar/filepath-securejoin/p… (podman + 0xd303e2)#012#10 0x0000555a4d1607f3 github.com/containers/podman/vendor/github.com/cyphar/filepath-securejoin/p… (podman + 0xd307f3)#012#11 0x0000555a4d15f91c github.com/containers/podman/vendor/github.com/cyphar/filepath-securejoin/p… (podman + 0xd2f91c)#012#12 0x0000555a4d15f358 github.com/containers/podman/vendor/github.com/cyphar/filepath-securejoin/p… (podman + 0xd2f358)#012#13 0x0000555a4c94edcc sync.(*Once).doSlow (podman + 0x51edcc)#012#14 0x0000555a4c94ecf9 sync.(*Once).D
o (podman + 0x51ecf9)#012#15 0x0000555a4d15f2c5 github.com/containers/podman/vendor/github.com/cyphar/filepath-securejoin/p… (podman + 0xd2f2c5)#012#16 0x0000555a4d16079a github.com/containers/podman/vendor/github.com/cyphar/filepath-securejoin/p… (podman + 0xd3079a)#012#17 0x0000555a4d16734e github.com/containers/podman/vendor/github.com/opencontainers/selinux/go-se… (podman + 0xd3734e)#012#18 0x0000555a4d167838 github.com/containers/podman/vendor/github.com/opencontainers/selinux/go-se… (podman + 0xd37838)#012#19 0x0000555a4d1665df github.com/containers/podman/vendor/github.com/opencontainers/selinux/go-se… (podman + 0xd365df)#012#20 0x0000555a4d166873 github.com/containers/podman/vendor/github.com/opencontainers/selinux/go-se… (podman + 0xd36873)#012#21 0x000
0555a4d35ef4b github.com/containers/podman/vendor/go.podman.io/common/pkg/config.defaultC… (podman + 0xf2ef4b)#012#22 0x0000555a4d362912 github.com/containers/podman/vendor/go.podman.io/common/pkg/config.newLocked (podman + 0xf32912)#012#23 0x0000555a4d362605 github.com/containers/podman/vendor/go.podman.io/common/pkg/config.New (podman + 0xf32605)#012#24 0x0000555a4dad5fd3 github.com/containers/podman/cmd/podman/registry.newPodmanConfig (podman + 0x16a5fd3)#012#25 0x0000555a4c94edcc sync.(*Once).doSlow (podman + 0x51edcc)#012#26 0x0000555a4daf6c50 github.com/containers/podman/cmd/podman/common.init (podman + 0x16c6c50)#012#27 0x0000555a4c914a57 runtime.doInit1 (podman + 0x4e4a57)#012#28 0x0000555a4c904f90 runtime.main (podman + 0x4d4f90)#012#29 0x0000555a4c944ee1 runtime.goexit.abi0 (podman + 0x514ee1)#012ELF object binary architecture: AMD x86-64
Jul 23 22:33:10 jaws.cs.umd.edu systemd-coredump[1082069]: Process 1082061 (podman) of user 981 dumped core.#012#012Stack trace of thread 1082061:#012#0 0x0000563c707e046e internal/runtime/syscall/linux.Syscall6 (podman + 0x48b46e)#012#1 0x0000563c708c00a6 syscall.Syscall (podman + 0x56b0a6)#012#2 0x0000563c708c0c50 syscall.Syscall.abi0 (podman + 0x56bc50)#012#3 0x0000563c70a2ac2e github.com/containers/podman/vendor/golang.org/x/sys/unix.OpenTree (podman + 0x6d5c2e)#012#4 0x0000563c71083f4b github.com/containers/podman/vendor/github.com/cyphar/filepath-securejoin/p… (podman + 0xd2ef4b)#012#5 0x0000563c71083e54 github.com/containers/podman/vendor/github.com/cyphar/filepath-securejoin/p… (podman + 0xd2ee54)#012#6 0x0000563c70873dcc sync.(*Once).doSlow (podman + 0x51edcc)#012#7 0x0000563c70873cf9 sync.(*Once).Do (podman + 0x51ecf9)#012#8 0x0000563c71083d
c5 github.com/containers/podman/vendor/github.com/cyphar/filepath-securejoin/p… (podman + 0xd2edc5)#012#9 0x0000563c710853e2 github.com/containers/podman/vendor/github.com/cyphar/filepath-securejoin/p… (podman + 0xd303e2)#012#10 0x0000563c710857f3 github.com/containers/podman/vendor/github.com/cyphar/filepath-securejoin/p… (podman + 0xd307f3)#012#11 0x0000563c7108491c github.com/containers/podman/vendor/github.com/cyphar/filepath-securejoin/p… (podman + 0xd2f91c)#012#12 0x0000563c71084358 github.com/containers/podman/vendor/github.com/cyphar/filepath-securejoin/p… (podman + 0xd2f358)#012#13 0x0000563c70873dcc sync.(*Once).doSlow (podman + 0x51edcc)#012#14 0x0000563c70873cf9 sync.(*Once).D
o (podman + 0x51ecf9)#012#15 0x0000563c710842c5 github.com/containers/podman/vendor/github.com/cyphar/filepath-securejoin/p… (podman + 0xd2f2c5)#012#16 0x0000563c7108579a github.com/containers/podman/vendor/github.com/cyphar/filepath-securejoin/p… (podman + 0xd3079a)#012#17 0x0000563c7108c34e github.com/containers/podman/vendor/github.com/opencontainers/selinux/go-se… (podman + 0xd3734e)#012#18 0x0000563c7108c838 github.com/containers/podman/vendor/github.com/opencontainers/selinux/go-se… (podman + 0xd37838)#012#19 0x0000563c7108b5df github.com/containers/podman/vendor/github.com/opencontainers/selinux/go-se… (podman + 0xd365df)#012#20 0x0000563c7108b873 github.com/containers/podman/vendor/github.com/opencontainers/selinux/go-se… (podman + 0xd36873)#012#21 0x000
0563c71283f4b github.com/containers/podman/vendor/go.podman.io/common/pkg/config.defaultC… (podman + 0xf2ef4b)#012#22 0x0000563c71287912 github.com/containers/podman/vendor/go.podman.io/common/pkg/config.newLocked (podman + 0xf32912)#012#23 0x0000563c71287605 github.com/containers/podman/vendor/go.podman.io/common/pkg/config.New (podman + 0xf32605)#012#24 0x0000563c719fafd3 github.com/containers/podman/cmd/podman/registry.newPodmanConfig (podman + 0x16a5fd3)#012#25 0x0000563c70873dcc sync.(*Once).doSlow (podman + 0x51edcc)#012#26 0x0000563c71a1bc50 github.com/containers/podman/cmd/podman/common.init (podman + 0x16c6c50)#012#27 0x0000563c70839a57 runtime.doInit1 (podman + 0x4e4a57)#012#28 0x0000563c70829f90 runtime.main (podman + 0x4d4f90)#012#29 0x0000563c70869ee1 runtime.goexit.abi0 (podman + 0x514ee1)#012ELF object binary architecture: AMD x86-64
Jul 23 22:33:11 jaws.cs.umd.edu systemd-coredump[1082087]: Process 1082079 (podman) of user 981 dumped core.#012#012Stack trace of thread 1082079:#012#0 0x000055857a4a146e internal/runtime/syscall/linux.Syscall6 (podman + 0x48b46e)#012#1 0x000055857a5810a6 syscall.Syscall (podman + 0x56b0a6)#012#2 0x000055857a581c50 syscall.Syscall.abi0 (podman + 0x56bc50)#012#3 0x000055857a6ebc2e github.com/containers/podman/vendor/golang.org/x/sys/unix.OpenTree (podman + 0x6d5c2e)#012#4 0x000055857ad44f4b github.com/containers/podman/vendor/github.com/cyphar/filepath-securejoin/p… (podman + 0xd2ef4b)#012#5 0x000055857ad44e54 github.com/containers/podman/vendor/github.com/cyphar/filepath-securejoin/p… (podman + 0xd2ee54)#012#6 0x000055857a534dcc sync.(*Once).doSlow (podman + 0x51edcc)#012#7 0x000055857a534cf9 sync.(*Once).Do (podman + 0x51ecf9)#012#8 0x000055857ad44d
c5 github.com/containers/podman/vendor/github.com/cyphar/filepath-securejoin/p… (podman + 0xd2edc5)#012#9 0x000055857ad463e2 github.com/containers/podman/vendor/github.com/cyphar/filepath-securejoin/p… (podman + 0xd303e2)#012#10 0x000055857ad467f3 github.com/containers/podman/vendor/github.com/cyphar/filepath-securejoin/p… (podman + 0xd307f3)#012#11 0x000055857ad4591c github.com/containers/podman/vendor/github.com/cyphar/filepath-securejoin/p… (podman + 0xd2f91c)#012#12 0x000055857ad45358 github.com/containers/podman/vendor/github.com/cyphar/filepath-securejoin/p… (podman + 0xd2f358)#012#13 0x000055857a534dcc sync.(*Once).doSlow (podman + 0x51edcc)#012#14 0x000055857a534cf9 sync.(*Once).D
o (podman + 0x51ecf9)#012#15 0x000055857ad452c5 github.com/containers/podman/vendor/github.com/cyphar/filepath-securejoin/p… (podman + 0xd2f2c5)#012#16 0x000055857ad4679a github.com/containers/podman/vendor/github.com/cyphar/filepath-securejoin/p… (podman + 0xd3079a)#012#17 0x000055857ad4d34e github.com/containers/podman/vendor/github.com/opencontainers/selinux/go-se… (podman + 0xd3734e)#012#18 0x000055857ad4d838 github.com/containers/podman/vendor/github.com/opencontainers/selinux/go-se… (podman + 0xd37838)#012#19 0x000055857ad4c5df github.com/containers/podman/vendor/github.com/opencontainers/selinux/go-se… (podman + 0xd365df)#012#20 0x000055857ad4c873 github.com/containers/podman/vendor/github.com/opencontainers/selinux/go-se… (podman + 0xd36873)#012#21 0x000
055857af44f4b github.com/containers/podman/vendor/go.podman.io/common/pkg/config.defaultC… (podman + 0xf2ef4b)#012#22 0x000055857af48912 github.com/containers/podman/vendor/go.podman.io/common/pkg/config.newLocked (podman + 0xf32912)#012#23 0x000055857af48605 github.com/containers/podman/vendor/go.podman.io/common/pkg/config.New (podman + 0xf32605)#012#24 0x000055857b6bbfd3 github.com/containers/podman/cmd/podman/registry.newPodmanConfig (podman + 0x16a5fd3)#012#25 0x000055857a534dcc sync.(*Once).doSlow (podman + 0x51edcc)#012#26 0x000055857b6dcc50 github.com/containers/podman/cmd/podman/common.init (podman + 0x16c6c50)#012#27 0x000055857a4faa57 runtime.doInit1 (podman + 0x4e4a57)#012#28 0x000055857a4eaf90 runtime.main (podman + 0x4d4f90)#012#29 0x000055857a52aee1 runtime.goexit.abi0 (podman + 0x514ee1)#012ELF object binary architecture: AMD x86-64
Jul 23 22:33:12 jaws.cs.umd.edu setroubleshoot[1082051]: SELinux is preventing /usr/bin/podman from using the nnp_transition access on a process. For complete SELinux messages run: sealert -l 3c7643bc-dd69-4695-b48c-7d780b62b6cf [x2]
== kadath.cs.umd.edu (2 distinct, 4 total) ==
Jul 23 22:31:34 kadath.cs.umd.edu falcon-sensor-bpf[938]: CrowdStrike(4): Could not retrieve DisableProxy value: c0000225 [x2]
Jul 23 22:31:34 kadath.cs.umd.edu falcon-sensor-bpf[938]: CrowdStrike(4): ConnectWithProxy: Unable to get application proxy host from CsConfig: c0000225 [x2]
== krispykreme.cs.umd.edu (5 distinct, 7 total) ==
Jul 23 22:33:13 krispykreme.cs.umd.edu falcon-sensor-bpf[1296]: CrowdStrike(4): Could not retrieve DisableProxy value: c0000225 [x2]
Jul 23 22:33:13 krispykreme.cs.umd.edu falcon-sensor-bpf[1296]: CrowdStrike(4): ConnectWithProxy: Unable to get application proxy host from CsConfig: c0000225 [x2]
Jul 23 23:04:58 krispykreme.cs.umd.edu sshd-session[2804504]: pam_access(sshd:auth): access denied for user `admin' from `34.78.100.66'
Jul 23 23:04:58 krispykreme.cs.umd.edu krb5_child[2804506]: Client 'admin(a)UMD.EDU' not found in Kerberos database
Jul 23 23:04:58 krispykreme.cs.umd.edu sshd-session[2804502]: error: PAM: System error for admin from 34.78.100.66
== mashie (2 distinct, 2 total) ==
Jul 23 22:19:32 mashie falcon-sensor-bpf[786]: CrowdStrike(4): Could not retrieve DisableProxy value: c0000225
Jul 23 22:19:32 mashie falcon-sensor-bpf[786]: CrowdStrike(4): ConnectWithProxy: Unable to get application proxy host from CsConfig: c0000225
== neodontcare.cs.umd.edu (2 distinct, 4 total) ==
Jul 23 22:33:43 neodontcare.cs.umd.edu falcon-sensor-bpf[950]: CrowdStrike(4): Could not retrieve DisableProxy value: c0000225 [x2]
Jul 23 22:33:43 neodontcare.cs.umd.edu falcon-sensor-bpf[950]: CrowdStrike(4): ConnectWithProxy: Unable to get application proxy host from CsConfig: c0000225 [x2]
== neograd (2 distinct, 4 total) ==
Jul 23 22:31:42 neograd falcon-sensor-bpf[697]: CrowdStrike(4): Could not retrieve DisableProxy value: c0000225 [x2]
Jul 23 22:31:42 neograd falcon-sensor-bpf[697]: CrowdStrike(4): ConnectWithProxy: Unable to get application proxy host from CsConfig: c0000225 [x2]
== netman.cs.umd.edu (3 distinct, 17 total) ==
Jul 23 22:05:40 netman.cs.umd.edu setroubleshoot[261718]: SELinux is preventing /usr/bin/tar from using the fowner capability. For complete SELinux messages run: sealert -l 49825fae-e786-4ccd-8ab4-15b21ec01b20 [x13]
Jul 23 22:30:57 netman.cs.umd.edu falcon-sensor-bpf[1129]: CrowdStrike(4): Could not retrieve DisableProxy value: c0000225 [x2]
Jul 23 22:30:57 netman.cs.umd.edu falcon-sensor-bpf[1129]: CrowdStrike(4): ConnectWithProxy: Unable to get application proxy host from CsConfig: c0000225 [x2]
== newhonors2 (1 distinct, 24 total) ==
Jul 23 22:13:03 newhonors2 dhcpcd[191950]: dhcpcd is not running [x24]
== nightingale (2 distinct, 4 total) ==
Jul 23 22:32:54 nightingale falcon-sensor-bpf[909]: CrowdStrike(4): Could not retrieve DisableProxy value: c0000225 [x2]
Jul 23 22:32:54 nightingale falcon-sensor-bpf[909]: CrowdStrike(4): ConnectWithProxy: Unable to get application proxy host from CsConfig: c0000225 [x2]
== orchids (2 distinct, 4 total) ==
Jul 23 22:27:42 orchids falcon-sensor-bpf[1099]: CrowdStrike(4): Could not retrieve DisableProxy value: c0000225 [x2]
Jul 23 22:27:42 orchids falcon-sensor-bpf[1099]: CrowdStrike(4): ConnectWithProxy: Unable to get application proxy host from CsConfig: c0000225 [x2]
== outbound00.cs.umd.edu (1 distinct, 6 total) ==
Jul 23 22:09:09 outbound00.cs.umd.edu python3[3104910]: ldapdb [x6]
== outbound01.cs.umd.edu (1 distinct, 6 total) ==
Jul 23 22:13:06 outbound01.cs.umd.edu python3[1133124]: ldapdb [x6]
== peach.cs.umd.edu (2 distinct, 2 total) ==
Jul 23 22:22:08 peach.cs.umd.edu setroubleshoot[392991]: SELinux is preventing /usr/bin/qemu-ga from search access on the directory /var/lib/containers/storage/overlay. For complete SELinux messages run: sealert -l ba415951-a2c6-424e-b17d-305c5300b9f3
Jul 23 22:22:08 peach.cs.umd.edu setroubleshoot[392991]: SELinux is preventing /usr/bin/qemu-ga from search access on the directory /var/lib/containers/storage/overlay. For complete SELinux messages run: sealert -l 6aeb0956-fcf2-462a-ae4d-439b912c16d0
== quiss (2 distinct, 2 total) ==
Jul 23 22:21:42 quiss falcon-sensor-bpf[1564085]: CrowdStrike(4): Could not retrieve DisableProxy value: c0000225
Jul 23 22:21:42 quiss falcon-sensor-bpf[1564085]: CrowdStrike(4): ConnectWithProxy: Unable to get application proxy host from CsConfig: c0000225
== sentry-docker00.cs.umd.edu (38 distinct, 38 total) ==
Jul 23 22:10:32 sentry-docker00.cs.umd.edu systemd-udevd[2158941]: link_config: could not get ethtool features for veth71805c2
Jul 23 22:10:32 sentry-docker00.cs.umd.edu systemd-udevd[2158941]: Could not set offload features of veth71805c2: No such device
Jul 23 22:10:33 sentry-docker00.cs.umd.edu systemd-udevd[2158960]: Could not generate persistent MAC address for veth2e36032: No such file or directory
Jul 23 22:10:33 sentry-docker00.cs.umd.edu systemd-udevd[2158961]: Could not generate persistent MAC address for vetha17e26a: No such file or directory
Jul 23 22:16:04 sentry-docker00.cs.umd.edu systemd-udevd[2160898]: link_config: could not get ethtool features for veth382024c
Jul 23 22:16:04 sentry-docker00.cs.umd.edu systemd-udevd[2160898]: Could not set offload features of veth382024c: No such device
Jul 23 22:16:04 sentry-docker00.cs.umd.edu systemd-udevd[2160997]: Could not generate persistent MAC address for veth85eddf0: No such file or directory
Jul 23 22:16:04 sentry-docker00.cs.umd.edu systemd-udevd[2160998]: Could not generate persistent MAC address for vethc5561d8: No such file or directory
Jul 23 22:16:04 sentry-docker00.cs.umd.edu systemd-udevd[2160997]: Could not generate persistent MAC address for veth04467da: No such file or directory
Jul 23 22:16:04 sentry-docker00.cs.umd.edu systemd-udevd[2161011]: Could not generate persistent MAC address for vetha19a3ee: No such file or directory
Jul 23 22:16:04 sentry-docker00.cs.umd.edu systemd-udevd[2161046]: Could not generate persistent MAC address for vethba8054c: No such file or directory
Jul 23 22:16:04 sentry-docker00.cs.umd.edu systemd-udevd[2161045]: Could not generate persistent MAC address for veth4c3156f: No such file or directory
Jul 23 22:16:04 sentry-docker00.cs.umd.edu systemd-udevd[2161058]: Could not generate persistent MAC address for veth0ceeccf: No such file or directory
Jul 23 22:16:04 sentry-docker00.cs.umd.edu systemd-udevd[2161056]: Could not generate persistent MAC address for veth06a1946: No such file or directory
Jul 23 22:30:41 sentry-docker00.cs.umd.edu systemd-udevd[2168411]: link_config: could not get ethtool features for veth2e36032
Jul 23 22:30:41 sentry-docker00.cs.umd.edu systemd-udevd[2168411]: Could not set offload features of veth2e36032: No such device
Jul 23 22:30:41 sentry-docker00.cs.umd.edu systemd-udevd[2168429]: Could not generate persistent MAC address for veth393930d: No such file or directory
Jul 23 22:30:41 sentry-docker00.cs.umd.edu systemd-udevd[2168430]: Could not generate persistent MAC address for veth2f0a399: No such file or directory
Jul 23 22:36:13 sentry-docker00.cs.umd.edu systemd-udevd[2170437]: link_config: could not get ethtool features for veth85eddf0
Jul 23 22:36:13 sentry-docker00.cs.umd.edu systemd-udevd[2170437]: Could not set offload features of veth85eddf0: No such device
Jul 23 22:36:13 sentry-docker00.cs.umd.edu systemd-udevd[2170461]: Could not generate persistent MAC address for vethe11cff4: No such file or directory
Jul 23 22:36:13 sentry-docker00.cs.umd.edu systemd-udevd[2170462]: Could not generate persistent MAC address for vethc13fb19: No such file or directory
Jul 23 22:36:13 sentry-docker00.cs.umd.edu systemd-udevd[2170480]: Could not generate persistent MAC address for vethf8017bb: No such file or directory
Jul 23 22:36:13 sentry-docker00.cs.umd.edu systemd-udevd[2170487]: Could not generate persistent MAC address for veth068f1dd: No such file or directory
Jul 23 22:36:13 sentry-docker00.cs.umd.edu systemd-udevd[2170490]: Could not generate persistent MAC address for veth86b14f8: No such file or directory
Jul 23 22:36:13 sentry-docker00.cs.umd.edu systemd-udevd[2170489]: Could not generate persistent MAC address for veth7d61577: No such file or directory
Jul 23 22:36:13 sentry-docker00.cs.umd.edu systemd-udevd[2170557]: Could not generate persistent MAC address for vethad4d55f: No such file or directory
Jul 23 22:36:13 sentry-docker00.cs.umd.edu systemd-udevd[2170562]: Could not generate persistent MAC address for vethd56c389: No such file or directory
Jul 23 22:50:45 sentry-docker00.cs.umd.edu systemd-udevd[2177838]: Could not generate persistent MAC address for veth6492fd3: No such file or directory
Jul 23 22:50:45 sentry-docker00.cs.umd.edu systemd-udevd[2177839]: Could not generate persistent MAC address for veth5bdf82b: No such file or directory
... 8 more distinct messages not shown
== strawberry (4 distinct, 10 total) ==
Jul 23 22:09:44 strawberry udisksd[1067]: Error performing housekeeping for drive /org/freedesktop/UDisks2/drives/ST2000DM001_1CH164_W1E8J5KJ: Error updating SMART data: Error sending ATA command CHECK POWER MODE: Unexpected sense data returned:#0120000: 00 00 00 00 00 00 00 00 00 00 00 00 00 00 00 00 ................#0120010: 00 00 00 00 00 00 00 00 00 00 00 00 00 00 00 00 ................#012 (g-io-error-quark, 0) [x6]
Jul 23 22:34:42 strawberry smartd[5314]: Device: /dev/sda [SAT], failed to read SMART Attribute Data [x2]
Jul 23 22:43:11 strawberry falcon-sensor-bpf[808]: CrowdStrike(4): Could not retrieve DisableProxy value: c0000225
Jul 23 22:43:11 strawberry falcon-sensor-bpf[808]: CrowdStrike(4): ConnectWithProxy: Unable to get application proxy host from CsConfig: c0000225
== stuckeys (2 distinct, 4 total) ==
Jul 23 22:32:50 stuckeys falcon-sensor-bpf[824199]: CrowdStrike(4): Could not retrieve DisableProxy value: c0000225 [x2]
Jul 23 22:32:50 stuckeys falcon-sensor-bpf[824199]: CrowdStrike(4): ConnectWithProxy: Unable to get application proxy host from CsConfig: c0000225 [x2]
== submit26-b9-2 (1 distinct, 12 total) ==
Jul 23 22:05:07 submit26-b9-2 systemd[1]: user(a)1001.service: Main process exited, code=killed, status=9/KILL [x12]
== submit26-b9-4 (2 distinct, 13 total) ==
Jul 23 22:05:04 submit26-b9-4 systemd[1]: user(a)1001.service: Main process exited, code=killed, status=9/KILL [x12]
Jul 23 22:52:14 submit26-b9-4 systemd-coredump[42353]: Process 42350 (simavr) of user 1001 dumped core.
== talkhosts9 (3 distinct, 4 total) ==
Jul 23 22:21:34 talkhosts9 falcon-sensor-bpf[714]: CrowdStrike(4): Could not retrieve DisableProxy value: c0000225
Jul 23 22:21:34 talkhosts9 falcon-sensor-bpf[714]: CrowdStrike(4): ConnectWithProxy: Unable to get application proxy host from CsConfig: c0000225
Jul 23 23:00:20 talkhosts9 setroubleshoot[3073666]: SELinux is preventing /usr/bin/lsof from getattr access on the unix_stream_socket unix_stream_socket. For complete SELinux messages run: sealert -l a6df89b3-c497-469c-8232-c4fde0508abf [x2]
== teaching-awards (4 distinct, 6 total) ==
Jul 23 22:31:12 teaching-awards falcon-sensor-bpf[782]: CrowdStrike(4): Could not retrieve DisableProxy value: c0000225 [x2]
Jul 23 22:31:12 teaching-awards falcon-sensor-bpf[782]: CrowdStrike(4): ConnectWithProxy: Unable to get application proxy host from CsConfig: c0000225 [x2]
Jul 23 22:49:37 teaching-awards krb5_child[1114242]: Client 'admin(a)UMD.EDU' not found in Kerberos database
Jul 23 22:50:49 teaching-awards sshd-session[1114260]: error: Protocol major versions differ: 2 vs. 1
== tulgey.cs.umd.edu (2 distinct, 4 total) ==
Jul 23 22:33:31 tulgey.cs.umd.edu falcon-sensor-bpf[1526]: CrowdStrike(4): Could not retrieve DisableProxy value: c0000225 [x2]
Jul 23 22:33:31 tulgey.cs.umd.edu falcon-sensor-bpf[1526]: CrowdStrike(4): ConnectWithProxy: Unable to get application proxy host from CsConfig: c0000225 [x2]
== tumtum.cs.umd.edu (2 distinct, 4 total) ==
Jul 23 22:29:32 tumtum.cs.umd.edu falcon-sensor-bpf[1360]: CrowdStrike(4): Could not retrieve DisableProxy value: c0000225 [x2]
Jul 23 22:29:32 tumtum.cs.umd.edu falcon-sensor-bpf[1360]: CrowdStrike(4): ConnectWithProxy: Unable to get application proxy host from CsConfig: c0000225 [x2]
== vacuum.cs.umd.edu (4 distinct, 4 total) ==
Jul 23 22:09:50 vacuum.cs.umd.edu abrt-hook-ccpp[6920]: Process 3304 (driver) of user 33 killed by SIGSEGV - dumping core
Jul 23 22:09:50 vacuum.cs.umd.edu abrt-server[6921]: Package 'amanda-backup_server' isn't signed with proper key
Jul 23 22:09:50 vacuum.cs.umd.edu abrt-server[6921]: 'post-create' on '/var/spool/abrt/ccpp-2026-07-23-22:09:50-3304' exited with 1
Jul 23 22:09:50 vacuum.cs.umd.edu abrt-server[6921]: Deleting problem directory '/var/spool/abrt/ccpp-2026-07-23-22:09:50-3304'
== yogurt (2 distinct, 2 total) ==
Jul 23 22:24:37 yogurt falcon-sensor-bpf[950]: CrowdStrike(4): Could not retrieve DisableProxy value: c0000225
Jul 23 22:24:37 yogurt falcon-sensor-bpf[950]: CrowdStrike(4): ConnectWithProxy: Unable to get application proxy host from CsConfig: c0000225
== zfs00.cs.umd.edu (1 distinct, 1 total) ==
Jul 23 22:19:56 zfs00.cs.umd.edu rsyslogd: imrelp[2514]: error 'error when receiving data, session broken', object 'lstn 2514: conn to clt 10.73.255.10/frozone.cs.umd.edu' - input may not work as intended [v8.2604.0 try https://www.rsyslog.com/e/2353 ]
== zwicker-computer (2 distinct, 4 total) ==
Jul 23 22:33:23 zwicker-computer falcon-sensor-bpf[718]: CrowdStrike(4): Could not retrieve DisableProxy value: c0000225 [x2]
Jul 23 22:33:23 zwicker-computer falcon-sensor-bpf[718]: CrowdStrike(4): ConnectWithProxy: Unable to get application proxy host from CsConfig: c0000225 [x2]
1
0
Command: /usr/local/sbin/syslog-digest.py
Time : 0.4998s
Status : exited 0
Output :
Syslog digest — 2026-07-23 22:05 EDT
Processed 4,225 lines, filtered 3,388 (80%). 837 unknown (93 distinct) from 21 host(s).
== abuse (1 distinct, 346 total) ==
Jul 23 21:05:06 abuse rsyslogd[21745]: imjournal: open() failed for path: '/var/lib/rsyslog/imjournal.state.tmp': Input/output error [v8.2404.0 try https://www.rsyslog.com/e/2433 ] [x346]
== alec.cs.umd.edu (3 distinct, 61 total) ==
Jul 23 21:05:10 alec.cs.umd.edu setroubleshoot[2342025]: failed to retrieve rpm info for path '/run/netns/netns-a2b2cc2d-7532-4db7-6a36-b1dd3d5f51db': [x12]
Jul 23 21:05:11 alec.cs.umd.edu sedispatch[1526]: AVC Message regarding setroubleshoot, ignoring message [x24]
Jul 23 21:05:11 alec.cs.umd.edu setroubleshoot[2342025]: SELinux is preventing /usr/bin/df from getattr access on the file /run/netns/netns-a2b2cc2d-7532-4db7-6a36-b1dd3d5f51db. For complete SELinux messages run: sealert -l 23f93208-3063-4aac-b78a-bb0fcb40740c [x25]
== bachata (1 distinct, 2 total) ==
Jul 23 21:13:56 bachata setroubleshoot[1804122]: SELinux is preventing /usr/sbin/smbd from name_bind access on the udp_socket port 698. For complete SELinux messages run: sealert -l 8f7247f1-69a5-4a62-a4f0-88a324bfd75c [x2]
== csfw00a (1 distinct, 232 total) ==
Jul 23 21:04:50 csfw00a kernel: bnxt_en 0000:09:00.0 eth3: NIC Link is Down [x232]
== hackerman (7 distinct, 12 total) ==
Jul 23 21:19:01 hackerman gnome-software[2060381]: failed to commit changes to dconf: GDBus.Error:org.gtk.GDBus.UnmappedGError.Quark._g_2dfile_2derror_2dquark.Code2: Failed to create file “/adminhomes/sajith/.config/dconf/user.V8OBT3”: Permission denied
Jul 23 21:20:04 hackerman gnome-software[2060381]: can't reliably fixup error code 4 in domain g-io-error-quark: Not a directory [x4]
Jul 23 21:20:13 hackerman gnome-software[2060381]: Only 0 apps for recent list, hiding
Jul 23 21:20:28 hackerman gnome-software[2060381]: failed to commit changes to dconf: GDBus.Error:org.gtk.GDBus.UnmappedGError.Quark._g_2dfile_2derror_2dquark.Code2: Failed to create file “/adminhomes/sajith/.config/dconf/user.7Z88S3”: Permission denied
Jul 23 21:20:29 hackerman packagekitd[4139662]: Failed to get cache filename for libreoffice [x2]
Jul 23 21:20:29 hackerman packagekitd[4139662]: Failed to get cache filename for kernel [x2]
Jul 23 21:20:39 hackerman packagekitd[4139662]: failed to parse public key for /etc/pki/rpm-gpg/RPM-GPG-KEY-PQC-redhat-release
== idm00 (1 distinct, 1 total) ==
Jul 23 21:51:03 idm00 named[1455]: client @0x7f330c465cd8 10.73.240.42#57899: update '73.10.in-addr.arpa/IN' denied
== idmp0 (1 distinct, 1 total) ==
Jul 23 21:34:56 idmp0 named[5198]: client @0x7f9920014e58 10.73.240.43#57082: update '73.10.in-addr.arpa/IN' denied
== inbound00.cs.umd.edu (2 distinct, 2 total) ==
Jul 23 21:12:08 inbound00.cs.umd.edu krb5_child[3107600]: Client 'admin(a)UMD.EDU' not found in Kerberos database
Jul 23 21:44:51 inbound00.cs.umd.edu krb5_child[3115003]: Client 'gitlab(a)UMD.EDU' not found in Kerberos database
== itmon02 (1 distinct, 39 total) ==
Jul 23 21:07:47 itmon02 sshd[1834]: error: beginning MaxStartups throttling [x39]
== newhonors2 (1 distinct, 24 total) ==
Jul 23 21:13:03 newhonors2 dhcpcd[190011]: dhcpcd is not running [x24]
== outbound00.cs.umd.edu (1 distinct, 6 total) ==
Jul 23 21:09:09 outbound00.cs.umd.edu python3[3091058]: ldapdb [x6]
== outbound01.cs.umd.edu (3 distinct, 8 total) ==
Jul 23 21:13:06 outbound01.cs.umd.edu python3[1119143]: ldapdb [x6]
Jul 23 21:27:46 outbound01.cs.umd.edu krb5_child[1122692]: Preauthentication failed
Jul 23 21:55:10 outbound01.cs.umd.edu krb5_child[1128649]: Client 'george(a)UMD.EDU' not found in Kerberos database
== sentry-docker00.cs.umd.edu (36 distinct, 36 total) ==
Jul 23 21:10:08 sentry-docker00.cs.umd.edu systemd-udevd[2130542]: Could not generate persistent MAC address for veth577fb06: No such file or directory
Jul 23 21:10:08 sentry-docker00.cs.umd.edu systemd-udevd[2130543]: Could not generate persistent MAC address for veth3ccf0f4: No such file or directory
Jul 23 21:15:39 sentry-docker00.cs.umd.edu systemd-udevd[2132585]: link_config: could not get ethtool features for veth752696b
Jul 23 21:15:39 sentry-docker00.cs.umd.edu systemd-udevd[2132585]: Could not set offload features of veth752696b: No such device
Jul 23 21:15:39 sentry-docker00.cs.umd.edu systemd-udevd[2132614]: Could not generate persistent MAC address for veth0f33433: No such file or directory
Jul 23 21:15:39 sentry-docker00.cs.umd.edu systemd-udevd[2132615]: Could not generate persistent MAC address for veth198ddfa: No such file or directory
Jul 23 21:15:39 sentry-docker00.cs.umd.edu systemd-udevd[2132618]: Could not generate persistent MAC address for veth3babdd0: No such file or directory
Jul 23 21:15:39 sentry-docker00.cs.umd.edu systemd-udevd[2132619]: Could not generate persistent MAC address for veth46a7da1: No such file or directory
Jul 23 21:15:39 sentry-docker00.cs.umd.edu systemd-udevd[2132623]: Could not generate persistent MAC address for veth7c5f222: No such file or directory
Jul 23 21:15:39 sentry-docker00.cs.umd.edu systemd-udevd[2132615]: Could not generate persistent MAC address for veth61f0784: No such file or directory
Jul 23 21:15:39 sentry-docker00.cs.umd.edu systemd-udevd[2132623]: Could not generate persistent MAC address for vethc59d209: No such file or directory
Jul 23 21:15:39 sentry-docker00.cs.umd.edu systemd-udevd[2132615]: Could not generate persistent MAC address for vethcc7df7c: No such file or directory
Jul 23 21:30:16 sentry-docker00.cs.umd.edu systemd-udevd[2139764]: Could not generate persistent MAC address for veth43c6f4c: No such file or directory
Jul 23 21:30:16 sentry-docker00.cs.umd.edu systemd-udevd[2139765]: Could not generate persistent MAC address for veth51e1d97: No such file or directory
Jul 23 21:35:48 sentry-docker00.cs.umd.edu systemd-udevd[2142032]: link_config: could not get ethtool features for vethcc7df7c
Jul 23 21:35:48 sentry-docker00.cs.umd.edu systemd-udevd[2142032]: Could not set offload features of vethcc7df7c: No such device
Jul 23 21:35:48 sentry-docker00.cs.umd.edu systemd-udevd[2142055]: Could not generate persistent MAC address for veth1ce7752: No such file or directory
Jul 23 21:35:48 sentry-docker00.cs.umd.edu systemd-udevd[2142056]: Could not generate persistent MAC address for veth0c4673a: No such file or directory
Jul 23 21:35:48 sentry-docker00.cs.umd.edu systemd-udevd[2142060]: Could not generate persistent MAC address for veth676a984: No such file or directory
Jul 23 21:35:48 sentry-docker00.cs.umd.edu systemd-udevd[2142059]: Could not generate persistent MAC address for veth2a274f6: No such file or directory
Jul 23 21:35:48 sentry-docker00.cs.umd.edu systemd-udevd[2142083]: Could not generate persistent MAC address for veth9efd1fa: No such file or directory
Jul 23 21:35:48 sentry-docker00.cs.umd.edu systemd-udevd[2142084]: Could not generate persistent MAC address for veth8bf4e00: No such file or directory
Jul 23 21:35:48 sentry-docker00.cs.umd.edu systemd-udevd[2142103]: Could not generate persistent MAC address for vethde06461: No such file or directory
Jul 23 21:35:48 sentry-docker00.cs.umd.edu systemd-udevd[2142111]: Could not generate persistent MAC address for veth75b2918: No such file or directory
Jul 23 21:50:24 sentry-docker00.cs.umd.edu systemd-udevd[2149219]: link_config: could not get ethtool features for veth43c6f4c
Jul 23 21:50:24 sentry-docker00.cs.umd.edu systemd-udevd[2149219]: Could not set offload features of veth43c6f4c: No such device
Jul 23 21:50:24 sentry-docker00.cs.umd.edu systemd-udevd[2149236]: Could not generate persistent MAC address for veth71805c2: No such file or directory
Jul 23 21:50:24 sentry-docker00.cs.umd.edu systemd-udevd[2149237]: Could not generate persistent MAC address for veth59dd3a2: No such file or directory
Jul 23 21:55:56 sentry-docker00.cs.umd.edu systemd-udevd[2151542]: Could not generate persistent MAC address for vethaac1db1: No such file or directory
Jul 23 21:55:56 sentry-docker00.cs.umd.edu systemd-udevd[2151543]: Could not generate persistent MAC address for vethdebe364: No such file or directory
... 6 more distinct messages not shown
== strawberry (2 distinct, 8 total) ==
Jul 23 21:09:44 strawberry udisksd[1067]: Error performing housekeeping for drive /org/freedesktop/UDisks2/drives/ST2000DM001_1CH164_W1E8J5KJ: Error updating SMART data: Error sending ATA command CHECK POWER MODE: Unexpected sense data returned:#0120000: 00 00 00 00 00 00 00 00 00 00 00 00 00 00 00 00 ................#0120010: 00 00 00 00 00 00 00 00 00 00 00 00 00 00 00 00 ................#012 (g-io-error-quark, 0) [x6]
Jul 23 21:34:42 strawberry smartd[5314]: Device: /dev/sda [SAT], failed to read SMART Attribute Data [x2]
== submit26-b9-2 (10 distinct, 24 total) ==
Jul 23 21:05:07 submit26-b9-2 systemd[1]: user(a)1001.service: Main process exited, code=killed, status=9/KILL [x12]
Jul 23 21:12:43 submit26-b9-2 setroubleshoot[23512]: SELinux is preventing /usr/bin/python3.9 from create access on the directory /(null). For complete SELinux messages run: sealert -l d506243c-d61e-48f3-b42a-4592c913deb0
Jul 23 21:12:43 submit26-b9-2 setroubleshoot[23512]: SELinux is preventing /usr/bin/python3.9 from add_name access on the directory /(null). For complete SELinux messages run: sealert -l 3b4752ac-1b9a-4af9-a05b-32e4c2eb13ab
Jul 23 21:12:43 submit26-b9-2 setroubleshoot[23512]: SELinux is preventing /usr/bin/python3.9 from create access on the file /(null). For complete SELinux messages run: sealert -l 29e5adbd-4381-4467-b40d-a2219101e096 [x2]
Jul 23 21:12:43 submit26-b9-2 setroubleshoot[23512]: SELinux is preventing /usr/bin/python3.9 from open access on the file /tmp/libdnf.sefxeD/repodata/repomd.xml. For complete SELinux messages run: sealert -l 1b38f2ec-01ce-4343-8059-ba7494ecc5c4 [x2]
Jul 23 21:12:43 submit26-b9-2 setroubleshoot[23512]: SELinux is preventing /usr/bin/python3.9 from setattr access on the file repomd.xml. For complete SELinux messages run: sealert -l e5f9af40-1f63-4924-b012-27ab2a7b2266 [x2]
Jul 23 21:12:43 submit26-b9-2 setroubleshoot[23512]: SELinux is preventing /usr/bin/python3.9 from read access on the directory libdnf.sefxeD. For complete SELinux messages run: sealert -l 5c54db87-54a3-4a7c-97b4-b5c48d6c3543
Jul 23 21:12:43 submit26-b9-2 setroubleshoot[23512]: SELinux is preventing /usr/bin/python3.9 from remove_name access on the directory repomd.xml. For complete SELinux messages run: sealert -l 63cd60e1-1e61-4276-afea-dd8526ffe8b2
Jul 23 21:12:43 submit26-b9-2 setroubleshoot[23512]: SELinux is preventing /usr/bin/python3.9 from unlink access on the file repomd.xml. For complete SELinux messages run: sealert -l 81c7e9ec-e023-4c6d-b1ad-c02a242e655e
Jul 23 21:12:43 submit26-b9-2 setroubleshoot[23512]: SELinux is preventing /usr/bin/python3.9 from rmdir access on the directory repodata. For complete SELinux messages run: sealert -l 6ae9a597-e123-4d74-8eec-a8ebe0f5e4d0
== submit26-b9-3 (9 distinct, 11 total) ==
Jul 23 21:20:34 submit26-b9-3 setroubleshoot[543341]: SELinux is preventing /usr/bin/python3.9 from create access on the directory /(null). For complete SELinux messages run: sealert -l 5b912a44-22fd-4560-b201-2a4e289b73f5 [x2]
Jul 23 21:20:34 submit26-b9-3 setroubleshoot[543341]: SELinux is preventing /usr/bin/python3.9 from add_name access on the directory /(null). For complete SELinux messages run: sealert -l 7f1df1e4-725e-4953-98eb-1079f908f543 [x2]
Jul 23 21:20:34 submit26-b9-3 setroubleshoot[543341]: SELinux is preventing /usr/bin/python3.9 from create access on the file /(null). For complete SELinux messages run: sealert -l 40b8852a-f77b-44b4-affe-5f11fa33de43
Jul 23 21:20:34 submit26-b9-3 setroubleshoot[543341]: SELinux is preventing /usr/bin/python3.9 from open access on the file /tmp/libdnf.cNyhjM/repodata/repomd.xml. For complete SELinux messages run: sealert -l 45a8019e-f6b5-4baa-92c1-862594b40d46
Jul 23 21:20:34 submit26-b9-3 setroubleshoot[543341]: SELinux is preventing /usr/bin/python3.9 from setattr access on the file repomd.xml. For complete SELinux messages run: sealert -l e9f0bfff-7784-4126-baa4-2bb06da56591
Jul 23 21:20:34 submit26-b9-3 setroubleshoot[543341]: SELinux is preventing /usr/bin/python3.9 from read access on the directory libdnf.cNyhjM. For complete SELinux messages run: sealert -l 0b17cc3d-cdc6-4fe2-a11f-3892e7c41dc7
Jul 23 21:20:34 submit26-b9-3 setroubleshoot[543341]: SELinux is preventing /usr/bin/python3.9 from remove_name access on the directory repomd.xml. For complete SELinux messages run: sealert -l 10e38c64-b65f-4cdd-901e-4375652d9a42
Jul 23 21:20:34 submit26-b9-3 setroubleshoot[543341]: SELinux is preventing /usr/bin/python3.9 from unlink access on the file repomd.xml. For complete SELinux messages run: sealert -l 7fd9cf72-ef38-48e1-b6aa-b571b26a7b22
Jul 23 21:20:34 submit26-b9-3 setroubleshoot[543341]: SELinux is preventing /usr/bin/python3.9 from rmdir access on the directory repodata. For complete SELinux messages run: sealert -l b9b11116-89bd-4a3c-980c-1d422c5dcee4
== submit26-b9-4 (1 distinct, 12 total) ==
Jul 23 21:05:05 submit26-b9-4 systemd[1]: user(a)1001.service: Main process exited, code=killed, status=9/KILL [x12]
== submit26-clnb9 (9 distinct, 9 total) ==
Jul 23 21:31:52 submit26-clnb9 setroubleshoot[1214310]: SELinux is preventing /usr/bin/python3.9 from create access on the directory /(null). For complete SELinux messages run: sealert -l 6783ed2b-5ae4-42b5-975a-4bf50eec4658
Jul 23 21:31:52 submit26-clnb9 setroubleshoot[1214310]: SELinux is preventing /usr/bin/python3.9 from add_name access on the directory /(null). For complete SELinux messages run: sealert -l 9e7fa955-cc30-4804-ac8c-e1779e85946c
Jul 23 21:31:52 submit26-clnb9 setroubleshoot[1214310]: SELinux is preventing /usr/bin/python3.9 from create access on the file /(null). For complete SELinux messages run: sealert -l 69bfa6e3-089c-40ff-9563-fd30787d0774
Jul 23 21:31:52 submit26-clnb9 setroubleshoot[1214310]: SELinux is preventing /usr/bin/python3.9 from open access on the file /tmp/libdnf.kZKmPj/repodata/repomd.xml. For complete SELinux messages run: sealert -l 001acdb5-31ef-4e52-b10b-90f467a89ddc
Jul 23 21:31:52 submit26-clnb9 setroubleshoot[1214310]: SELinux is preventing /usr/bin/python3.9 from setattr access on the file repomd.xml. For complete SELinux messages run: sealert -l edacddcf-16ed-4dc3-8d82-7c597d5dee23
Jul 23 21:31:52 submit26-clnb9 setroubleshoot[1214310]: SELinux is preventing /usr/bin/python3.9 from read access on the directory libdnf.kZKmPj. For complete SELinux messages run: sealert -l 62b3782e-4730-4488-8178-94dafe9b552c
Jul 23 21:31:52 submit26-clnb9 setroubleshoot[1214310]: SELinux is preventing /usr/bin/python3.9 from remove_name access on the directory repomd.xml. For complete SELinux messages run: sealert -l 81cb3698-78f8-440a-8e3c-e5d1041e6b78
Jul 23 21:31:52 submit26-clnb9 setroubleshoot[1214310]: SELinux is preventing /usr/bin/python3.9 from unlink access on the file repomd.xml. For complete SELinux messages run: sealert -l 792b472a-115c-4799-9805-fc7436f916b9
Jul 23 21:31:52 submit26-clnb9 setroubleshoot[1214310]: SELinux is preventing /usr/bin/python3.9 from rmdir access on the directory repodata. For complete SELinux messages run: sealert -l 15c83a86-837b-41e2-b662-b39cd4e361cb
== unknown (1 distinct, 1 total) ==
using-explainable-ai
== zebatinsky.cs.umd.edu (1 distinct, 1 total) ==
Jul 23 22:03:09 zebatinsky.cs.umd.edu setroubleshoot[2860825]: SELinux is preventing /usr/sbin/pdns_server from name_bind access on the udp_socket port 10082. For complete SELinux messages run: sealert -l eeaf6a9c-b485-4f06-8a81-4f338c7654f8
== zwicker-computer (1 distinct, 1 total) ==
Jul 23 21:30:40 zwicker-computer sshd[3977767]: error: connect_to 127.0.0.1 port 36585: failed.
1
0