Command: /usr/local/sbin/syslog-digest.py
Time : 0.5053s
Status : exited 0
Output :
Syslog digest — 2026-07-26 09:05 EDT
Processed 4,986 lines, filtered 4,366 (87%). 620 unknown (89 distinct) from 21 host(s).
== abuse (1 distinct, 346 total) ==
Jul 26 08:05:06 abuse rsyslogd[21745]: imjournal: open() failed for path: '/var/lib/rsyslog/imjournal.state.tmp': Input/output error [v8.2404.0 try https://www.rsyslog.com/e/2433 ] [x346]
== alec.cs.umd.edu (3 distinct, 60 total) ==
Jul 26 08:05:16 alec.cs.umd.edu setroubleshoot[3219426]: failed to retrieve rpm info for path '/run/netns/netns-9dfd0347-71eb-5698-085c-c769043aa5c3': [x12]
Jul 26 08:05:17 alec.cs.umd.edu sedispatch[1526]: AVC Message regarding setroubleshoot, ignoring message [x24]
Jul 26 08:05:17 alec.cs.umd.edu setroubleshoot[3219426]: SELinux is preventing /usr/bin/df from getattr access on the file /run/netns/netns-9dfd0347-71eb-5698-085c-c769043aa5c3. For complete SELinux messages run: sealert -l 23f93208-3063-4aac-b78a-bb0fcb40740c [x24]
== b0b02.cs.umd.edu (1 distinct, 1 total) ==
Jul 26 08:55:36 b0b02.cs.umd.edu rustdesk[721930]: cannot open display:
== cheezit.cs.umd.edu (6 distinct, 6 total) ==
Jul 26 08:56:11 cheezit.cs.umd.edu sshd-session[2007078]: error: kex_protocol_error: type 20 seq 2 [preauth]
Jul 26 08:56:11 cheezit.cs.umd.edu sshd-session[2007078]: error: kex_protocol_error: type 30 seq 3 [preauth]
Jul 26 08:56:13 cheezit.cs.umd.edu sshd-session[2007078]: error: kex_protocol_error: type 20 seq 4 [preauth]
Jul 26 08:56:13 cheezit.cs.umd.edu sshd-session[2007078]: error: kex_protocol_error: type 30 seq 5 [preauth]
Jul 26 08:56:15 cheezit.cs.umd.edu sshd-session[2007078]: error: kex_protocol_error: type 20 seq 6 [preauth]
Jul 26 08:56:15 cheezit.cs.umd.edu sshd-session[2007078]: error: kex_protocol_error: type 30 seq 7 [preauth]
== contest (1 distinct, 33 total) ==
Jul 26 08:06:25 contest goferd[1007]: [ERROR][worker-0] gofer.messaging.adapter.connect:33 - connect: proton+amqps://satellite8.cs.umd.edu:5647, failed: Connection amqps://satellite8.cs.umd.edu:5647 disconnected: Condition('proton.pythonio', 'Connection refused to all addresses') [x33]
== csfw00a (1 distinct, 2 total) ==
Jul 26 09:01:27 csfw00a kernel: bnxt_en 0000:09:00.0 eth3: NIC Link is Down [x2]
== emaar (1 distinct, 1 total) ==
Jul 26 08:43:28 emaar puppet-agent[150526]: (Facter) invalid or malformed lldp data: MalformedDataError: no lldp interface data found
== hackerman (8 distinct, 16 total) ==
Jul 26 08:20:04 hackerman gnome-software[2060381]: can't reliably fixup error code 4 in domain g-io-error-quark: Not a directory [x5]
Jul 26 08:20:13 hackerman gnome-software[2060381]: Only 0 apps for recent list, hiding
Jul 26 08:20:28 hackerman packagekitd[761245]: Failed to get cache filename for libreoffice [x3]
Jul 26 08:20:28 hackerman packagekitd[761245]: Failed to get cache filename for kernel [x3]
Jul 26 08:20:31 hackerman gnome-software[2060381]: failed to commit changes to dconf: GDBus.Error:org.gtk.GDBus.UnmappedGError.Quark._g_2dfile_2derror_2dquark.Code2: Failed to create file “/adminhomes/sajith/.config/dconf/user.5A6FT3”: Permission denied
Jul 26 08:20:38 hackerman packagekitd[761245]: failed to parse public key for /etc/pki/rpm-gpg/RPM-GPG-KEY-PQC-redhat-release
Jul 26 08:21:08 hackerman gnome-software[2060381]: failed to commit changes to dconf: GDBus.Error:org.gtk.GDBus.UnmappedGError.Quark._g_2dfile_2derror_2dquark.Code2: Failed to create file “/adminhomes/sajith/.config/dconf/user.9LFXS3”: Permission denied
Jul 26 08:44:25 hackerman systemd[1]: insights-client.service: Start request repeated too quickly.
== idm00 (1 distinct, 1 total) ==
Jul 26 08:51:08 idm00 named[1455]: client @0x7f33157d8918 10.73.240.42#58766: update '73.10.in-addr.arpa/IN' denied
== idmp0 (1 distinct, 1 total) ==
Jul 26 08:34:57 idmp0 named[5198]: client @0x7f9918084e38 10.73.240.43#59307: update '73.10.in-addr.arpa/IN' denied
== itmon02 (1 distinct, 41 total) ==
Jul 26 08:07:59 itmon02 sshd[1834]: error: beginning MaxStartups throttling [x41]
== jaws.cs.umd.edu (4 distinct, 5 total) ==
Jul 26 08:34:24 jaws.cs.umd.edu systemd-coredump[1879866]: Process 1879849 (podman) of user 981 dumped core.#012#012Stack trace of thread 1879849:#012#0 0x0000562bc175f46e internal/runtime/syscall/linux.Syscall6 (podman + 0x48b46e)#012#1 0x0000562bc183f0a6 syscall.Syscall (podman + 0x56b0a6)#012#2 0x0000562bc183fc50 syscall.Syscall.abi0 (podman + 0x56bc50)#012#3 0x0000562bc19a9c2e github.com/containers/podman/vendor/golang.org/x/sys/unix.OpenTree (podman + 0x6d5c2e)#012#4 0x0000562bc2002f4b github.com/containers/podman/vendor/github.com/cyphar/filepath-securejoin/p… (podman + 0xd2ef4b)#012#5 0x0000562bc2002e54 github.com/containers/podman/vendor/github.com/cyphar/filepath-securejoin/p… (podman + 0xd2ee54)#012#6 0x0000562bc17f2dcc sync.(*Once).doSlow (podman + 0x51edcc)#012#7 0x0000562bc17f2cf9 sync.(*Once).Do (podman + 0x51ecf9)#012#8 0x0000562bc2002d
c5 github.com/containers/podman/vendor/github.com/cyphar/filepath-securejoin/p… (podman + 0xd2edc5)#012#9 0x0000562bc20043e2 github.com/containers/podman/vendor/github.com/cyphar/filepath-securejoin/p… (podman + 0xd303e2)#012#10 0x0000562bc20047f3 github.com/containers/podman/vendor/github.com/cyphar/filepath-securejoin/p… (podman + 0xd307f3)#012#11 0x0000562bc200391c github.com/containers/podman/vendor/github.com/cyphar/filepath-securejoin/p… (podman + 0xd2f91c)#012#12 0x0000562bc2003358 github.com/containers/podman/vendor/github.com/cyphar/filepath-securejoin/p… (podman + 0xd2f358)#012#13 0x0000562bc17f2dcc sync.(*Once).doSlow (podman + 0x51edcc)#012#14 0x0000562bc17f2cf9 sync.(*Once).D
o (podman + 0x51ecf9)#012#15 0x0000562bc20032c5 github.com/containers/podman/vendor/github.com/cyphar/filepath-securejoin/p… (podman + 0xd2f2c5)#012#16 0x0000562bc200479a github.com/containers/podman/vendor/github.com/cyphar/filepath-securejoin/p… (podman + 0xd3079a)#012#17 0x0000562bc200b34e github.com/containers/podman/vendor/github.com/opencontainers/selinux/go-se… (podman + 0xd3734e)#012#18 0x0000562bc200b838 github.com/containers/podman/vendor/github.com/opencontainers/selinux/go-se… (podman + 0xd37838)#012#19 0x0000562bc200a5df github.com/containers/podman/vendor/github.com/opencontainers/selinux/go-se… (podman + 0xd365df)#012#20 0x0000562bc200a873 github.com/containers/podman/vendor/github.com/opencontainers/selinux/go-se… (podman + 0xd36873)#012#21 0x000
0562bc2202f4b github.com/containers/podman/vendor/go.podman.io/common/pkg/config.defaultC… (podman + 0xf2ef4b)#012#22 0x0000562bc2206912 github.com/containers/podman/vendor/go.podman.io/common/pkg/config.newLocked (podman + 0xf32912)#012#23 0x0000562bc2206605 github.com/containers/podman/vendor/go.podman.io/common/pkg/config.New (podman + 0xf32605)#012#24 0x0000562bc2979fd3 github.com/containers/podman/cmd/podman/registry.newPodmanConfig (podman + 0x16a5fd3)#012#25 0x0000562bc17f2dcc sync.(*Once).doSlow (podman + 0x51edcc)#012#26 0x0000562bc299ac50 github.com/containers/podman/cmd/podman/common.init (podman + 0x16c6c50)#012#27 0x0000562bc17b8a57 runtime.doInit1 (podman + 0x4e4a57)#012#28 0x0000562bc17a8f90 runtime.main (podman + 0x4d4f90)#012#29 0x0000562bc17e8ee1 runtime.goexit.abi0 (podman + 0x514ee1)#012ELF object binary architecture: AMD x86-64
Jul 26 08:34:25 jaws.cs.umd.edu systemd-coredump[1879884]: Process 1879875 (podman) of user 981 dumped core.#012#012Stack trace of thread 1879875:#012#0 0x000055d3c944c46e internal/runtime/syscall/linux.Syscall6 (podman + 0x48b46e)#012#1 0x000055d3c952c0a6 syscall.Syscall (podman + 0x56b0a6)#012#2 0x000055d3c952cc50 syscall.Syscall.abi0 (podman + 0x56bc50)#012#3 0x000055d3c9696c2e github.com/containers/podman/vendor/golang.org/x/sys/unix.OpenTree (podman + 0x6d5c2e)#012#4 0x000055d3c9ceff4b github.com/containers/podman/vendor/github.com/cyphar/filepath-securejoin/p… (podman + 0xd2ef4b)#012#5 0x000055d3c9cefe54 github.com/containers/podman/vendor/github.com/cyphar/filepath-securejoin/p… (podman + 0xd2ee54)#012#6 0x000055d3c94dfdcc sync.(*Once).doSlow (podman + 0x51edcc)#012#7 0x000055d3c94dfcf9 sync.(*Once).Do (podman + 0x51ecf9)#012#8 0x000055d3c9cefd
c5 github.com/containers/podman/vendor/github.com/cyphar/filepath-securejoin/p… (podman + 0xd2edc5)#012#9 0x000055d3c9cf13e2 github.com/containers/podman/vendor/github.com/cyphar/filepath-securejoin/p… (podman + 0xd303e2)#012#10 0x000055d3c9cf17f3 github.com/containers/podman/vendor/github.com/cyphar/filepath-securejoin/p… (podman + 0xd307f3)#012#11 0x000055d3c9cf091c github.com/containers/podman/vendor/github.com/cyphar/filepath-securejoin/p… (podman + 0xd2f91c)#012#12 0x000055d3c9cf0358 github.com/containers/podman/vendor/github.com/cyphar/filepath-securejoin/p… (podman + 0xd2f358)#012#13 0x000055d3c94dfdcc sync.(*Once).doSlow (podman + 0x51edcc)#012#14 0x000055d3c94dfcf9 sync.(*Once).D
o (podman + 0x51ecf9)#012#15 0x000055d3c9cf02c5 github.com/containers/podman/vendor/github.com/cyphar/filepath-securejoin/p… (podman + 0xd2f2c5)#012#16 0x000055d3c9cf179a github.com/containers/podman/vendor/github.com/cyphar/filepath-securejoin/p… (podman + 0xd3079a)#012#17 0x000055d3c9cf834e github.com/containers/podman/vendor/github.com/opencontainers/selinux/go-se… (podman + 0xd3734e)#012#18 0x000055d3c9cf8838 github.com/containers/podman/vendor/github.com/opencontainers/selinux/go-se… (podman + 0xd37838)#012#19 0x000055d3c9cf75df github.com/containers/podman/vendor/github.com/opencontainers/selinux/go-se… (podman + 0xd365df)#012#20 0x000055d3c9cf7873 github.com/containers/podman/vendor/github.com/opencontainers/selinux/go-se… (podman + 0xd36873)#012#21 0x000
055d3c9eeff4b github.com/containers/podman/vendor/go.podman.io/common/pkg/config.defaultC… (podman + 0xf2ef4b)#012#22 0x000055d3c9ef3912 github.com/containers/podman/vendor/go.podman.io/common/pkg/config.newLocked (podman + 0xf32912)#012#23 0x000055d3c9ef3605 github.com/containers/podman/vendor/go.podman.io/common/pkg/config.New (podman + 0xf32605)#012#24 0x000055d3ca666fd3 github.com/containers/podman/cmd/podman/registry.newPodmanConfig (podman + 0x16a5fd3)#012#25 0x000055d3c94dfdcc sync.(*Once).doSlow (podman + 0x51edcc)#012#26 0x000055d3ca687c50 github.com/containers/podman/cmd/podman/common.init (podman + 0x16c6c50)#012#27 0x000055d3c94a5a57 runtime.doInit1 (podman + 0x4e4a57)#012#28 0x000055d3c9495f90 runtime.main (podman + 0x4d4f90)#012#29 0x000055d3c94d5ee1 runtime.goexit.abi0 (podman + 0x514ee1)#012ELF object binary architecture: AMD x86-64
Jul 26 08:34:26 jaws.cs.umd.edu systemd-coredump[1879900]: Process 1879890 (podman) of user 981 dumped core.#012#012Stack trace of thread 1879890:#012#0 0x000055f68f76646e internal/runtime/syscall/linux.Syscall6 (podman + 0x48b46e)#012#1 0x000055f68f8460a6 syscall.Syscall (podman + 0x56b0a6)#012#2 0x000055f68f846c50 syscall.Syscall.abi0 (podman + 0x56bc50)#012#3 0x000055f68f9b0c2e github.com/containers/podman/vendor/golang.org/x/sys/unix.OpenTree (podman + 0x6d5c2e)#012#4 0x000055f690009f4b github.com/containers/podman/vendor/github.com/cyphar/filepath-securejoin/p… (podman + 0xd2ef4b)#012#5 0x000055f690009e54 github.com/containers/podman/vendor/github.com/cyphar/filepath-securejoin/p… (podman + 0xd2ee54)#012#6 0x000055f68f7f9dcc sync.(*Once).doSlow (podman + 0x51edcc)#012#7 0x000055f68f7f9cf9 sync.(*Once).Do (podman + 0x51ecf9)#012#8 0x000055f690009d
c5 github.com/containers/podman/vendor/github.com/cyphar/filepath-securejoin/p… (podman + 0xd2edc5)#012#9 0x000055f69000b3e2 github.com/containers/podman/vendor/github.com/cyphar/filepath-securejoin/p… (podman + 0xd303e2)#012#10 0x000055f69000b7f3 github.com/containers/podman/vendor/github.com/cyphar/filepath-securejoin/p… (podman + 0xd307f3)#012#11 0x000055f69000a91c github.com/containers/podman/vendor/github.com/cyphar/filepath-securejoin/p… (podman + 0xd2f91c)#012#12 0x000055f69000a358 github.com/containers/podman/vendor/github.com/cyphar/filepath-securejoin/p… (podman + 0xd2f358)#012#13 0x000055f68f7f9dcc sync.(*Once).doSlow (podman + 0x51edcc)#012#14 0x000055f68f7f9cf9 sync.(*Once).D
o (podman + 0x51ecf9)#012#15 0x000055f69000a2c5 github.com/containers/podman/vendor/github.com/cyphar/filepath-securejoin/p… (podman + 0xd2f2c5)#012#16 0x000055f69000b79a github.com/containers/podman/vendor/github.com/cyphar/filepath-securejoin/p… (podman + 0xd3079a)#012#17 0x000055f69001234e github.com/containers/podman/vendor/github.com/opencontainers/selinux/go-se… (podman + 0xd3734e)#012#18 0x000055f690012838 github.com/containers/podman/vendor/github.com/opencontainers/selinux/go-se… (podman + 0xd37838)#012#19 0x000055f6900115df github.com/containers/podman/vendor/github.com/opencontainers/selinux/go-se… (podman + 0xd365df)#012#20 0x000055f690011873 github.com/containers/podman/vendor/github.com/opencontainers/selinux/go-se… (podman + 0xd36873)#012#21 0x000
055f690209f4b github.com/containers/podman/vendor/go.podman.io/common/pkg/config.defaultC… (podman + 0xf2ef4b)#012#22 0x000055f69020d912 github.com/containers/podman/vendor/go.podman.io/common/pkg/config.newLocked (podman + 0xf32912)#012#23 0x000055f69020d605 github.com/containers/podman/vendor/go.podman.io/common/pkg/config.New (podman + 0xf32605)#012#24 0x000055f690980fd3 github.com/containers/podman/cmd/podman/registry.newPodmanConfig (podman + 0x16a5fd3)#012#25 0x000055f68f7f9dcc sync.(*Once).doSlow (podman + 0x51edcc)#012#26 0x000055f6909a1c50 github.com/containers/podman/cmd/podman/common.init (podman + 0x16c6c50)#012#27 0x000055f68f7bfa57 runtime.doInit1 (podman + 0x4e4a57)#012#28 0x000055f68f7aff90 runtime.main (podman + 0x4d4f90)#012#29 0x000055f68f7efee1 runtime.goexit.abi0 (podman + 0x514ee1)#012ELF object binary architecture: AMD x86-64
Jul 26 08:34:27 jaws.cs.umd.edu setroubleshoot[1879865]: SELinux is preventing /usr/bin/podman from using the nnp_transition access on a process. For complete SELinux messages run: sealert -l 3c7643bc-dd69-4695-b48c-7d780b62b6cf [x2]
== krispykreme.cs.umd.edu (6 distinct, 6 total) ==
Jul 26 08:56:11 krispykreme.cs.umd.edu sshd-session[3755600]: error: kex_protocol_error: type 20 seq 2 [preauth]
Jul 26 08:56:11 krispykreme.cs.umd.edu sshd-session[3755600]: error: kex_protocol_error: type 30 seq 3 [preauth]
Jul 26 08:56:13 krispykreme.cs.umd.edu sshd-session[3755600]: error: kex_protocol_error: type 20 seq 4 [preauth]
Jul 26 08:56:13 krispykreme.cs.umd.edu sshd-session[3755600]: error: kex_protocol_error: type 30 seq 5 [preauth]
Jul 26 08:56:16 krispykreme.cs.umd.edu sshd-session[3755600]: error: kex_protocol_error: type 20 seq 6 [preauth]
Jul 26 08:56:16 krispykreme.cs.umd.edu sshd-session[3755600]: error: kex_protocol_error: type 30 seq 7 [preauth]
== netman.cs.umd.edu (3 distinct, 6 total) ==
Jul 26 08:29:56 netman.cs.umd.edu setroubleshoot[1236103]: SELinux is preventing /usr/bin/gpg from read access on the file gpg.conf. For complete SELinux messages run: sealert -l 019ad1da-a874-4814-8037-3b3e5f413ad2 [x2]
Jul 26 08:29:56 netman.cs.umd.edu setroubleshoot[1236103]: SELinux is preventing /usr/bin/gpg from open access on the file /root/.gnupg/gpg.conf. For complete SELinux messages run: sealert -l cb54177e-d44c-46a1-b246-5c0bbb8343be [x2]
Jul 26 08:29:57 netman.cs.umd.edu setroubleshoot[1236103]: SELinux is preventing /usr/bin/gpg from getattr access on the file /root/.gnupg/gpg.conf. For complete SELinux messages run: sealert -l fbba2e30-b7ab-491c-9ec6-f553e9ef72af [x2]
== newhonors2 (1 distinct, 24 total) ==
Jul 26 08:13:03 newhonors2 dhcpcd[304254]: dhcpcd is not running [x24]
== outbound00.cs.umd.edu (1 distinct, 6 total) ==
Jul 26 08:09:09 outbound00.cs.umd.edu python3[3918059]: ldapdb [x6]
== outbound01.cs.umd.edu (1 distinct, 6 total) ==
Jul 26 08:13:06 outbound01.cs.umd.edu python3[1947258]: ldapdb [x6]
== sentry-docker00.cs.umd.edu (36 distinct, 36 total) ==
Jul 26 08:10:26 sentry-docker00.cs.umd.edu systemd-udevd[3879917]: Could not generate persistent MAC address for vethc088ca9: No such file or directory
Jul 26 08:10:26 sentry-docker00.cs.umd.edu systemd-udevd[3879918]: Could not generate persistent MAC address for veth2ead2e9: No such file or directory
Jul 26 08:20:04 sentry-docker00.cs.umd.edu systemd-udevd[3884144]: link_config: could not get ethtool features for veth4d2b0d4
Jul 26 08:20:04 sentry-docker00.cs.umd.edu systemd-udevd[3884144]: Could not set offload features of veth4d2b0d4: No such device
Jul 26 08:20:04 sentry-docker00.cs.umd.edu systemd-udevd[3884169]: Could not generate persistent MAC address for veth1e6fafe: No such file or directory
Jul 26 08:20:04 sentry-docker00.cs.umd.edu systemd-udevd[3884170]: Could not generate persistent MAC address for vethcfca9e2: No such file or directory
Jul 26 08:20:04 sentry-docker00.cs.umd.edu systemd-udevd[3884173]: Could not generate persistent MAC address for veth2dd57bc: No such file or directory
Jul 26 08:20:04 sentry-docker00.cs.umd.edu systemd-udevd[3884174]: Could not generate persistent MAC address for vethd385df8: No such file or directory
Jul 26 08:20:04 sentry-docker00.cs.umd.edu systemd-udevd[3884197]: Could not generate persistent MAC address for vethba79822: No such file or directory
Jul 26 08:20:04 sentry-docker00.cs.umd.edu systemd-udevd[3884198]: Could not generate persistent MAC address for veth8ab2de5: No such file or directory
Jul 26 08:20:04 sentry-docker00.cs.umd.edu systemd-udevd[3884216]: Could not generate persistent MAC address for veth6ed0837: No such file or directory
Jul 26 08:20:04 sentry-docker00.cs.umd.edu systemd-udevd[3884215]: Could not generate persistent MAC address for veth4ea4792: No such file or directory
Jul 26 08:30:30 sentry-docker00.cs.umd.edu systemd-udevd[3889320]: link_config: could not get ethtool features for vethc088ca9
Jul 26 08:30:30 sentry-docker00.cs.umd.edu systemd-udevd[3889320]: Could not set offload features of vethc088ca9: No such device
Jul 26 08:30:30 sentry-docker00.cs.umd.edu systemd-udevd[3889338]: Could not generate persistent MAC address for veth4aa2546: No such file or directory
Jul 26 08:30:30 sentry-docker00.cs.umd.edu systemd-udevd[3889339]: Could not generate persistent MAC address for vethb41e71b: No such file or directory
Jul 26 08:40:12 sentry-docker00.cs.umd.edu systemd-udevd[3893580]: Could not generate persistent MAC address for vethca040fc: No such file or directory
Jul 26 08:40:12 sentry-docker00.cs.umd.edu systemd-udevd[3893581]: Could not generate persistent MAC address for vethdf1a3e8: No such file or directory
Jul 26 08:40:12 sentry-docker00.cs.umd.edu systemd-udevd[3893606]: Could not generate persistent MAC address for veth6226e7c: No such file or directory
Jul 26 08:40:12 sentry-docker00.cs.umd.edu systemd-udevd[3893607]: Could not generate persistent MAC address for veth08628df: No such file or directory
Jul 26 08:40:12 sentry-docker00.cs.umd.edu systemd-udevd[3893625]: Could not generate persistent MAC address for vethf1ceb1e: No such file or directory
Jul 26 08:40:12 sentry-docker00.cs.umd.edu systemd-udevd[3893631]: Could not generate persistent MAC address for veth432c8e1: No such file or directory
Jul 26 08:40:12 sentry-docker00.cs.umd.edu systemd-udevd[3893629]: Could not generate persistent MAC address for veth4b9216b: No such file or directory
Jul 26 08:40:12 sentry-docker00.cs.umd.edu systemd-udevd[3893607]: Could not generate persistent MAC address for vethdc32fec: No such file or directory
Jul 26 08:50:35 sentry-docker00.cs.umd.edu systemd-udevd[3898793]: Could not generate persistent MAC address for veth6c5bf5f: No such file or directory
Jul 26 08:50:35 sentry-docker00.cs.umd.edu systemd-udevd[3898794]: Could not generate persistent MAC address for veth29d1f12: No such file or directory
Jul 26 09:00:20 sentry-docker00.cs.umd.edu systemd-udevd[3904483]: link_config: could not get ethtool features for veth4b9216b
Jul 26 09:00:20 sentry-docker00.cs.umd.edu systemd-udevd[3904483]: Could not set offload features of veth4b9216b: No such device
Jul 26 09:00:20 sentry-docker00.cs.umd.edu systemd-udevd[3904543]: Could not generate persistent MAC address for veth8bc8bcf: No such file or directory
Jul 26 09:00:20 sentry-docker00.cs.umd.edu systemd-udevd[3904544]: Could not generate persistent MAC address for veth8bb9647: No such file or directory
... 6 more distinct messages not shown
== strawberry (2 distinct, 8 total) ==
Jul 26 08:09:44 strawberry udisksd[1067]: Error performing housekeeping for drive /org/freedesktop/UDisks2/drives/ST2000DM001_1CH164_W1E8J5KJ: Error updating SMART data: Error sending ATA command CHECK POWER MODE: Unexpected sense data returned:#0120000: 00 00 00 00 00 00 00 00 00 00 00 00 00 00 00 00 ................#0120010: 00 00 00 00 00 00 00 00 00 00 00 00 00 00 00 00 ................#012 (g-io-error-quark, 0) [x6]
Jul 26 08:34:42 strawberry smartd[5314]: Device: /dev/sda [SAT], failed to read SMART Attribute Data [x2]
== submit26-b9-4 (9 distinct, 12 total) ==
Jul 26 08:15:25 submit26-b9-4 setroubleshoot[232679]: SELinux is preventing /usr/bin/python3.9 from create access on the directory /(null). For complete SELinux messages run: sealert -l a4e66030-8621-4da9-bd27-5988bb1bf8ad
Jul 26 08:15:25 submit26-b9-4 setroubleshoot[232679]: SELinux is preventing /usr/bin/python3.9 from add_name access on the directory /(null). For complete SELinux messages run: sealert -l c055e37d-bbf5-4800-9083-d606f792c8c1
Jul 26 08:15:25 submit26-b9-4 setroubleshoot[232679]: SELinux is preventing /usr/bin/python3.9 from create access on the file /(null). For complete SELinux messages run: sealert -l e5bc3a56-6d6f-4776-954f-ddde1579648f [x2]
Jul 26 08:15:25 submit26-b9-4 setroubleshoot[232679]: SELinux is preventing /usr/bin/python3.9 from open access on the file /tmp/libdnf.FwOach/repodata/repomd.xml. For complete SELinux messages run: sealert -l a8ec5e1b-49f9-4fbc-a8ae-22e800f7abf2 [x2]
Jul 26 08:15:25 submit26-b9-4 setroubleshoot[232679]: SELinux is preventing /usr/bin/python3.9 from setattr access on the file repomd.xml. For complete SELinux messages run: sealert -l 945db714-d0c0-4402-911e-932978b8b036 [x2]
Jul 26 08:15:25 submit26-b9-4 setroubleshoot[232679]: SELinux is preventing /usr/bin/python3.9 from read access on the directory libdnf.FwOach. For complete SELinux messages run: sealert -l 463998a0-fb0d-463c-82b1-471135710a14
Jul 26 08:15:25 submit26-b9-4 setroubleshoot[232679]: SELinux is preventing /usr/bin/python3.9 from remove_name access on the directory repomd.xml. For complete SELinux messages run: sealert -l 473d2e21-15d8-407a-a9ee-2b842607fa00
Jul 26 08:15:25 submit26-b9-4 setroubleshoot[232679]: SELinux is preventing /usr/bin/python3.9 from unlink access on the file repomd.xml. For complete SELinux messages run: sealert -l 80c54d4f-bf4b-4501-addb-1627383587d0
Jul 26 08:15:25 submit26-b9-4 setroubleshoot[232679]: SELinux is preventing /usr/bin/python3.9 from rmdir access on the directory repodata. For complete SELinux messages run: sealert -l c63d3890-151e-49a0-83f0-3dfb69d051e5
== zfs00.cs.umd.edu (1 distinct, 3 total) ==
Jul 26 08:16:54 zfs00.cs.umd.edu rsyslogd: imrelp[2514]: error 'server closed relp session, session broken', object 'lstn 2514: conn to clt 10.227.96.13/irb2156.csdips.umd.edu' - input may not work as intended [v8.2604.0 try https://www.rsyslog.com/e/2353 ] [x3]
1
0
Command: /usr/local/sbin/syslog-digest.py
Time : 0.4839s
Status : exited 0
Output :
Syslog digest — 2026-07-26 08:05 EDT
Processed 4,232 lines, filtered 3,548 (83%). 684 unknown (91 distinct) from 20 host(s).
== abuse (1 distinct, 347 total) ==
Jul 26 07:05:06 abuse rsyslogd[21745]: imjournal: open() failed for path: '/var/lib/rsyslog/imjournal.state.tmp': Input/output error [v8.2404.0 try https://www.rsyslog.com/e/2433 ] [x347]
== alec.cs.umd.edu (3 distinct, 62 total) ==
Jul 26 07:05:12 alec.cs.umd.edu setroubleshoot[3204668]: failed to retrieve rpm info for path '/run/netns/netns-9dfd0347-71eb-5698-085c-c769043aa5c3': [x12]
Jul 26 07:05:13 alec.cs.umd.edu sedispatch[1526]: AVC Message regarding setroubleshoot, ignoring message [x25]
Jul 26 07:05:13 alec.cs.umd.edu setroubleshoot[3204668]: SELinux is preventing /usr/bin/df from getattr access on the file /run/netns/netns-9dfd0347-71eb-5698-085c-c769043aa5c3. For complete SELinux messages run: sealert -l 23f93208-3063-4aac-b78a-bb0fcb40740c [x25]
== b0b02.cs.umd.edu (4 distinct, 4 total) ==
Jul 26 07:05:04 b0b02.cs.umd.edu setroubleshoot[692803]: SELinux is preventing /usr/bin/python3.9 from read access on the file /etc/authselect/nsswitch.conf. For complete SELinux messages run: sealert -l 97d74423-e027-4cd6-8810-ad80944900b5
Jul 26 07:05:07 b0b02.cs.umd.edu setroubleshoot[692803]: SELinux is preventing /usr/bin/python3.9 from open access on the file /etc/authselect/nsswitch.conf. For complete SELinux messages run: sealert -l 4f253f6a-62d6-46dd-8eaf-0b4d29df41c6
Jul 26 07:55:33 b0b02.cs.umd.edu rustdesk[706736]: cannot open display:
Jul 26 08:05:00 b0b02.cs.umd.edu systemd[1]: insights-client.service: Start request repeated too quickly.
== contest (1 distinct, 34 total) ==
Jul 26 07:05:43 contest goferd[1007]: [ERROR][worker-0] gofer.messaging.adapter.connect:33 - connect: proton+amqps://satellite8.cs.umd.edu:5647, failed: Connection amqps://satellite8.cs.umd.edu:5647 disconnected: Condition('proton.pythonio', 'Connection refused to all addresses') [x34]
== csfw00a (1 distinct, 4 total) ==
Jul 26 07:21:38 csfw00a kernel: bnxt_en 0000:09:00.0 eth3: NIC Link is Down [x4]
== dojo (2 distinct, 2 total) ==
Jul 26 07:38:10 dojo nologin[332283]: Attempted login by UNKNOWN (UID: 65534) on UNKNOWN
Jul 26 07:38:21 dojo puppet-agent[332284]: The current total number of fact values: 17067 exceeds the fact values limit: 10240
== hackerman (7 distinct, 12 total) ==
Jul 26 07:19:01 hackerman gnome-software[2060381]: failed to commit changes to dconf: GDBus.Error:org.gtk.GDBus.UnmappedGError.Quark._g_2dfile_2derror_2dquark.Code2: Failed to create file “/adminhomes/sajith/.config/dconf/user.D8T5S3”: Permission denied
Jul 26 07:20:04 hackerman gnome-software[2060381]: can't reliably fixup error code 4 in domain g-io-error-quark: Not a directory [x4]
Jul 26 07:20:13 hackerman gnome-software[2060381]: Only 0 apps for recent list, hiding
Jul 26 07:20:29 hackerman gnome-software[2060381]: failed to commit changes to dconf: GDBus.Error:org.gtk.GDBus.UnmappedGError.Quark._g_2dfile_2derror_2dquark.Code2: Failed to create file “/adminhomes/sajith/.config/dconf/user.Z63ZS3”: Permission denied
Jul 26 07:20:29 hackerman packagekitd[746827]: Failed to get cache filename for libreoffice [x2]
Jul 26 07:20:29 hackerman packagekitd[746827]: Failed to get cache filename for kernel [x2]
Jul 26 07:20:38 hackerman packagekitd[746827]: failed to parse public key for /etc/pki/rpm-gpg/RPM-GPG-KEY-PQC-redhat-release
== hazfs.cs.umd.edu (11 distinct, 66 total) ==
Jul 26 07:50:37 hazfs.cs.umd.edu snmpd[1431]: send response: Failure in sendto [x6]
Jul 26 07:50:37 hazfs.cs.umd.edu snmpd[1431]: -- NET-SNMP-EXTEND-MIB::nsExtendStatus."userweb" [x6]
Jul 26 07:50:37 hazfs.cs.umd.edu snmpd[1431]: -- NET-SNMP-EXTEND-MIB::nsExtendStatus."zfslist" [x6]
Jul 26 07:50:37 hazfs.cs.umd.edu snmpd[1431]: -- NET-SNMP-EXTEND-MIB::nsExtendStatus."userhome" [x6]
Jul 26 07:50:37 hazfs.cs.umd.edu snmpd[1431]: -- NET-SNMP-EXTEND-MIB::nsExtendOutput1Line."userweb" [x6]
Jul 26 07:50:37 hazfs.cs.umd.edu snmpd[1431]: -- NET-SNMP-EXTEND-MIB::nsExtendOutput1Line."zfslist" [x6]
Jul 26 07:50:37 hazfs.cs.umd.edu snmpd[1431]: -- NET-SNMP-EXTEND-MIB::nsExtendOutput1Line."userhome" [x6]
Jul 26 07:50:37 hazfs.cs.umd.edu snmpd[1431]: -- NET-SNMP-EXTEND-MIB::nsExtendOutputFull."userweb" [x6]
Jul 26 07:50:37 hazfs.cs.umd.edu snmpd[1431]: -- NET-SNMP-EXTEND-MIB::nsExtendOutputFull."zfslist" [x6]
Jul 26 07:50:37 hazfs.cs.umd.edu snmpd[1431]: -- NET-SNMP-EXTEND-MIB::nsExtendOutputFull."userhome" [x6]
Jul 26 07:50:37 hazfs.cs.umd.edu snmpd[1431]: -- NET-SNMP-EXTEND-MIB::nsExtendOutNumLines."userweb" [x6]
== idm00 (1 distinct, 1 total) ==
Jul 26 07:51:07 idm00 named[1455]: client @0x7f33154991e8 10.73.240.42#56565: update '73.10.in-addr.arpa/IN' denied
== idmp0 (1 distinct, 1 total) ==
Jul 26 07:34:57 idmp0 named[5198]: client @0x7f990c007ab8 10.73.240.43#50043: update '73.10.in-addr.arpa/IN' denied
== inbound01.cs.umd.edu (6 distinct, 21 total) ==
Jul 26 07:41:21 inbound01.cs.umd.edu sshd-session[1950548]: error: maximum authentication attempts exceeded for root from 191.180.161.164 port 35099 ssh2 [preauth]
Jul 26 07:41:43 inbound01.cs.umd.edu sshd-session[1950566]: error: maximum authentication attempts exceeded for root from 191.180.161.164 port 36342 ssh2 [preauth]
Jul 26 07:42:06 inbound01.cs.umd.edu sshd-session[1950670]: error: maximum authentication attempts exceeded for root from 191.180.161.164 port 37558 ssh2 [preauth]
Jul 26 07:42:13 inbound01.cs.umd.edu krb5_child[1950946]: Client 'admin(a)UMD.EDU' not found in Kerberos database [x16]
Jul 26 07:42:35 inbound01.cs.umd.edu sshd-session[1950943]: error: maximum authentication attempts exceeded for admin from 191.180.161.164 port 38936 ssh2 [preauth]
Jul 26 07:42:59 inbound01.cs.umd.edu sshd-session[1951062]: error: maximum authentication attempts exceeded for admin from 191.180.161.164 port 39981 ssh2 [preauth]
== irb2156 (3 distinct, 3 total) ==
Jul 26 07:29:29 irb2156 systemd-resolved[3520]: Using degraded feature set UDP instead of UDP+EDNS0 for DNS server 128.8.76.3.
Jul 26 07:29:56 irb2156 systemd-resolved[3520]: Using degraded feature set UDP instead of UDP+EDNS0 for DNS server 128.8.74.3.
Jul 26 07:30:01 irb2156 systemd-resolved[3520]: Using degraded feature set TCP instead of UDP for DNS server 128.8.76.3.
== itmon02 (1 distinct, 37 total) ==
Jul 26 07:08:04 itmon02 sshd[1834]: error: beginning MaxStartups throttling [x37]
== newhonors2 (1 distinct, 24 total) ==
Jul 26 07:13:03 newhonors2 dhcpcd[302410]: dhcpcd is not running [x24]
== outbound00.cs.umd.edu (1 distinct, 6 total) ==
Jul 26 07:09:08 outbound00.cs.umd.edu python3[3904271]: ldapdb [x6]
== outbound01.cs.umd.edu (1 distinct, 6 total) ==
Jul 26 07:13:06 outbound01.cs.umd.edu python3[1933414]: ldapdb [x6]
== sentry-docker00.cs.umd.edu (42 distinct, 42 total) ==
Jul 26 07:10:09 sentry-docker00.cs.umd.edu systemd-udevd[3851546]: link_config: could not get ethtool features for veth5302324
Jul 26 07:10:09 sentry-docker00.cs.umd.edu systemd-udevd[3851546]: Could not set offload features of veth5302324: No such device
Jul 26 07:10:09 sentry-docker00.cs.umd.edu systemd-udevd[3851564]: Could not generate persistent MAC address for vethf8ad721: No such file or directory
Jul 26 07:10:09 sentry-docker00.cs.umd.edu systemd-udevd[3851565]: Could not generate persistent MAC address for veth2238af6: No such file or directory
Jul 26 07:19:39 sentry-docker00.cs.umd.edu systemd-udevd[3855750]: link_config: could not get ethtool features for veth0d32eea
Jul 26 07:19:39 sentry-docker00.cs.umd.edu systemd-udevd[3855750]: Could not set offload features of veth0d32eea: No such device
Jul 26 07:19:39 sentry-docker00.cs.umd.edu systemd-udevd[3855779]: Could not generate persistent MAC address for vethd85b513: No such file or directory
Jul 26 07:19:39 sentry-docker00.cs.umd.edu systemd-udevd[3855780]: Could not generate persistent MAC address for vethcbcb33f: No such file or directory
Jul 26 07:19:39 sentry-docker00.cs.umd.edu systemd-udevd[3855784]: Could not generate persistent MAC address for veth0976e80: No such file or directory
Jul 26 07:19:39 sentry-docker00.cs.umd.edu systemd-udevd[3855783]: Could not generate persistent MAC address for veth0e4622b: No such file or directory
Jul 26 07:19:39 sentry-docker00.cs.umd.edu systemd-udevd[3855797]: Could not generate persistent MAC address for vethedcd961: No such file or directory
Jul 26 07:19:39 sentry-docker00.cs.umd.edu systemd-udevd[3855806]: Could not generate persistent MAC address for veth6b66d41: No such file or directory
Jul 26 07:19:39 sentry-docker00.cs.umd.edu systemd-udevd[3855828]: Could not generate persistent MAC address for vethbe83257: No such file or directory
Jul 26 07:19:39 sentry-docker00.cs.umd.edu systemd-udevd[3855830]: Could not generate persistent MAC address for veth812f7d1: No such file or directory
Jul 26 07:30:17 sentry-docker00.cs.umd.edu systemd-udevd[3861004]: link_config: could not get ethtool features for vethf8ad721
Jul 26 07:30:17 sentry-docker00.cs.umd.edu systemd-udevd[3861004]: Could not set offload features of vethf8ad721: No such device
Jul 26 07:30:18 sentry-docker00.cs.umd.edu systemd-udevd[3861013]: Could not generate persistent MAC address for vetheb46af8: No such file or directory
Jul 26 07:30:18 sentry-docker00.cs.umd.edu systemd-udevd[3861014]: Could not generate persistent MAC address for veth3bbd57c: No such file or directory
Jul 26 07:39:47 sentry-docker00.cs.umd.edu systemd-udevd[3865149]: link_config: could not get ethtool features for veth6b66d41
Jul 26 07:39:47 sentry-docker00.cs.umd.edu systemd-udevd[3865149]: Could not set offload features of veth6b66d41: No such device
Jul 26 07:39:47 sentry-docker00.cs.umd.edu systemd-udevd[3865219]: Could not generate persistent MAC address for vethd5bb8a5: No such file or directory
Jul 26 07:39:47 sentry-docker00.cs.umd.edu systemd-udevd[3865220]: Could not generate persistent MAC address for veth0d4089f: No such file or directory
Jul 26 07:39:47 sentry-docker00.cs.umd.edu systemd-udevd[3865223]: Could not generate persistent MAC address for vethd879070: No such file or directory
Jul 26 07:39:47 sentry-docker00.cs.umd.edu systemd-udevd[3865224]: Could not generate persistent MAC address for vethf633ad6: No such file or directory
Jul 26 07:39:47 sentry-docker00.cs.umd.edu systemd-udevd[3865233]: Could not generate persistent MAC address for vethfdca3f1: No such file or directory
Jul 26 07:39:47 sentry-docker00.cs.umd.edu systemd-udevd[3865220]: Could not generate persistent MAC address for veth1168eff: No such file or directory
Jul 26 07:39:47 sentry-docker00.cs.umd.edu systemd-udevd[3865251]: Could not generate persistent MAC address for veth27abb41: No such file or directory
Jul 26 07:39:47 sentry-docker00.cs.umd.edu systemd-udevd[3865252]: Could not generate persistent MAC address for veth2712e96: No such file or directory
Jul 26 07:50:22 sentry-docker00.cs.umd.edu systemd-udevd[3870457]: link_config: could not get ethtool features for vetheb46af8
Jul 26 07:50:22 sentry-docker00.cs.umd.edu systemd-udevd[3870457]: Could not set offload features of vetheb46af8: No such device
... 12 more distinct messages not shown
== strawberry (2 distinct, 8 total) ==
Jul 26 07:09:44 strawberry udisksd[1067]: Error performing housekeeping for drive /org/freedesktop/UDisks2/drives/ST2000DM001_1CH164_W1E8J5KJ: Error updating SMART data: Error sending ATA command CHECK POWER MODE: Unexpected sense data returned:#0120000: 00 00 00 00 00 00 00 00 00 00 00 00 00 00 00 00 ................#0120010: 00 00 00 00 00 00 00 00 00 00 00 00 00 00 00 00 ................#012 (g-io-error-quark, 0) [x6]
Jul 26 07:34:42 strawberry smartd[5314]: Device: /dev/sda [SAT], failed to read SMART Attribute Data [x2]
== submit10-cln25 (1 distinct, 1 total) ==
Jul 26 07:37:00 submit10-cln25 systemd: Failed at step EXEC spawning /usr/local/bin/cronjob: No such file or directory
== zfs00.cs.umd.edu (1 distinct, 3 total) ==
Jul 26 07:20:29 zfs00.cs.umd.edu rsyslogd: imrelp[2514]: error 'server closed relp session, session broken', object 'lstn 2514: conn to clt 10.227.96.13/irb2156.csdips.umd.edu' - input may not work as intended [v8.2604.0 try https://www.rsyslog.com/e/2353 ] [x3]
1
0
Command: /usr/local/sbin/syslog-digest.py
Time : 0.5023s
Status : exited 0
Output :
Syslog digest — 2026-07-26 07:05 EDT
Processed 4,186 lines, filtered 3,521 (84%). 665 unknown (117 distinct) from 21 host(s).
== abadi-computer (2 distinct, 2 total) ==
Jul 26 06:15:01 abadi-computer nologin[3662817]: Attempted login by UNKNOWN (UID: 65534) on UNKNOWN
Jul 26 06:15:01 abadi-computer pipewire[3662815]: mod.jackdbus-detect: Failed to receive jackdbus reply: org.freedesktop.DBus.Error.ServiceUnknown: The name org.jackaudio.service was not provided by any .service files
== abuse (1 distinct, 346 total) ==
Jul 26 06:05:06 abuse rsyslogd[21745]: imjournal: open() failed for path: '/var/lib/rsyslog/imjournal.state.tmp': Input/output error [v8.2404.0 try https://www.rsyslog.com/e/2433 ] [x346]
== alec.cs.umd.edu (3 distinct, 60 total) ==
Jul 26 06:05:06 alec.cs.umd.edu setroubleshoot[3188904]: failed to retrieve rpm info for path '/run/netns/netns-9dfd0347-71eb-5698-085c-c769043aa5c3': [x12]
Jul 26 06:05:06 alec.cs.umd.edu sedispatch[1526]: AVC Message regarding setroubleshoot, ignoring message [x24]
Jul 26 06:05:06 alec.cs.umd.edu setroubleshoot[3188904]: SELinux is preventing /usr/bin/df from getattr access on the file /run/netns/netns-9dfd0347-71eb-5698-085c-c769043aa5c3. For complete SELinux messages run: sealert -l 23f93208-3063-4aac-b78a-bb0fcb40740c [x24]
== b0b02.cs.umd.edu (3 distinct, 3 total) ==
Jul 26 06:05:03 b0b02.cs.umd.edu setroubleshoot[677711]: SELinux is preventing /usr/bin/python3.9 from open access on the file /etc/authselect/nsswitch.conf. For complete SELinux messages run: sealert -l 4f253f6a-62d6-46dd-8eaf-0b4d29df41c6
Jul 26 06:55:30 b0b02.cs.umd.edu rustdesk[690686]: cannot open display:
Jul 26 07:05:01 b0b02.cs.umd.edu setroubleshoot[692803]: SELinux is preventing /usr/bin/python3.9 from getattr access on the file /etc/authselect/nsswitch.conf. For complete SELinux messages run: sealert -l 9a1e2952-3fde-4937-a8ab-f7f59791a458
== contest (1 distinct, 33 total) ==
Jul 26 06:06:48 contest goferd[1007]: [ERROR][worker-0] gofer.messaging.adapter.connect:33 - connect: proton+amqps://satellite8.cs.umd.edu:5647, failed: Connection amqps://satellite8.cs.umd.edu:5647 disconnected: Condition('proton.pythonio', 'Connection refused to all addresses') [x33]
== csfw00a (1 distinct, 10 total) ==
Jul 26 06:17:22 csfw00a kernel: bnxt_en 0000:09:00.0 eth3: NIC Link is Down [x10]
== hackerman (6 distinct, 11 total) ==
Jul 26 06:20:04 hackerman gnome-software[2060381]: can't reliably fixup error code 4 in domain g-io-error-quark: Not a directory [x4]
Jul 26 06:20:13 hackerman gnome-software[2060381]: Only 0 apps for recent list, hiding
Jul 26 06:20:33 hackerman packagekitd[733081]: Failed to get cache filename for libreoffice [x2]
Jul 26 06:20:33 hackerman packagekitd[733081]: Failed to get cache filename for kernel [x2]
Jul 26 06:20:37 hackerman gnome-software[2060381]: failed to commit changes to dconf: GDBus.Error:org.gtk.GDBus.UnmappedGError.Quark._g_2dfile_2derror_2dquark.Code2: Failed to create file “/adminhomes/sajith/.config/dconf/user.DSU0S3”: Permission denied
Jul 26 06:20:39 hackerman packagekitd[733081]: failed to parse public key for /etc/pki/rpm-gpg/RPM-GPG-KEY-PQC-redhat-release
== idm00 (1 distinct, 1 total) ==
Jul 26 06:51:07 idm00 named[1455]: client @0x7f3314ae55e8 10.73.240.42#49533: update '73.10.in-addr.arpa/IN' denied
== idmp0 (1 distinct, 1 total) ==
Jul 26 06:34:57 idmp0 named[5198]: client @0x7f993004bd18 10.73.240.43#50193: update '73.10.in-addr.arpa/IN' denied
== inbound00.cs.umd.edu (1 distinct, 1 total) ==
Jul 26 06:06:55 inbound00.cs.umd.edu systemd[1]: Configuration file /usr/lib/systemd/system/authentication_milter.service is marked executable. Please remove executable permission bits. Proceeding anyway.
== inbound01.cs.umd.edu (1 distinct, 1 total) ==
Jul 26 06:18:00 inbound01.cs.umd.edu systemd[1]: Configuration file /usr/lib/systemd/system/authentication_milter.service is marked executable. Please remove executable permission bits. Proceeding anyway.
== itmon02 (1 distinct, 44 total) ==
Jul 26 06:08:05 itmon02 sshd[1834]: error: beginning MaxStartups throttling [x44]
== jaws.cs.umd.edu (4 distinct, 5 total) ==
Jul 26 06:34:22 jaws.cs.umd.edu systemd-coredump[1852942]: Process 1852922 (podman) of user 981 dumped core.#012#012Stack trace of thread 1852922:#012#0 0x00005567978cd46e internal/runtime/syscall/linux.Syscall6 (podman + 0x48b46e)#012#1 0x00005567979ad0a6 syscall.Syscall (podman + 0x56b0a6)#012#2 0x00005567979adc50 syscall.Syscall.abi0 (podman + 0x56bc50)#012#3 0x0000556797b17c2e github.com/containers/podman/vendor/golang.org/x/sys/unix.OpenTree (podman + 0x6d5c2e)#012#4 0x0000556798170f4b github.com/containers/podman/vendor/github.com/cyphar/filepath-securejoin/p… (podman + 0xd2ef4b)#012#5 0x0000556798170e54 github.com/containers/podman/vendor/github.com/cyphar/filepath-securejoin/p… (podman + 0xd2ee54)#012#6 0x0000556797960dcc sync.(*Once).doSlow (podman + 0x51edcc)#012#7 0x0000556797960cf9 sync.(*Once).Do (podman + 0x51ecf9)#012#8 0x0000556798170d
c5 github.com/containers/podman/vendor/github.com/cyphar/filepath-securejoin/p… (podman + 0xd2edc5)#012#9 0x00005567981723e2 github.com/containers/podman/vendor/github.com/cyphar/filepath-securejoin/p… (podman + 0xd303e2)#012#10 0x00005567981727f3 github.com/containers/podman/vendor/github.com/cyphar/filepath-securejoin/p… (podman + 0xd307f3)#012#11 0x000055679817191c github.com/containers/podman/vendor/github.com/cyphar/filepath-securejoin/p… (podman + 0xd2f91c)#012#12 0x0000556798171358 github.com/containers/podman/vendor/github.com/cyphar/filepath-securejoin/p… (podman + 0xd2f358)#012#13 0x0000556797960dcc sync.(*Once).doSlow (podman + 0x51edcc)#012#14 0x0000556797960cf9 sync.(*Once).D
o (podman + 0x51ecf9)#012#15 0x00005567981712c5 github.com/containers/podman/vendor/github.com/cyphar/filepath-securejoin/p… (podman + 0xd2f2c5)#012#16 0x000055679817279a github.com/containers/podman/vendor/github.com/cyphar/filepath-securejoin/p… (podman + 0xd3079a)#012#17 0x000055679817934e github.com/containers/podman/vendor/github.com/opencontainers/selinux/go-se… (podman + 0xd3734e)#012#18 0x0000556798179838 github.com/containers/podman/vendor/github.com/opencontainers/selinux/go-se… (podman + 0xd37838)#012#19 0x00005567981785df github.com/containers/podman/vendor/github.com/opencontainers/selinux/go-se… (podman + 0xd365df)#012#20 0x0000556798178873 github.com/containers/podman/vendor/github.com/opencontainers/selinux/go-se… (podman + 0xd36873)#012#21 0x000
0556798370f4b github.com/containers/podman/vendor/go.podman.io/common/pkg/config.defaultC… (podman + 0xf2ef4b)#012#22 0x0000556798374912 github.com/containers/podman/vendor/go.podman.io/common/pkg/config.newLocked (podman + 0xf32912)#012#23 0x0000556798374605 github.com/containers/podman/vendor/go.podman.io/common/pkg/config.New (podman + 0xf32605)#012#24 0x0000556798ae7fd3 github.com/containers/podman/cmd/podman/registry.newPodmanConfig (podman + 0x16a5fd3)#012#25 0x0000556797960dcc sync.(*Once).doSlow (podman + 0x51edcc)#012#26 0x0000556798b08c50 github.com/containers/podman/cmd/podman/common.init (podman + 0x16c6c50)#012#27 0x0000556797926a57 runtime.doInit1 (podman + 0x4e4a57)#012#28 0x0000556797916f90 runtime.main (podman + 0x4d4f90)#012#29 0x0000556797956ee1 runtime.goexit.abi0 (podman + 0x514ee1)#012ELF object binary architecture: AMD x86-64
Jul 26 06:34:23 jaws.cs.umd.edu systemd-coredump[1852978]: Process 1852954 (podman) of user 981 dumped core.#012#012Stack trace of thread 1852954:#012#0 0x0000555c7f5df46e internal/runtime/syscall/linux.Syscall6 (podman + 0x48b46e)#012#1 0x0000555c7f6bf0a6 syscall.Syscall (podman + 0x56b0a6)#012#2 0x0000555c7f6bfc50 syscall.Syscall.abi0 (podman + 0x56bc50)#012#3 0x0000555c7f829c2e github.com/containers/podman/vendor/golang.org/x/sys/unix.OpenTree (podman + 0x6d5c2e)#012#4 0x0000555c7fe82f4b github.com/containers/podman/vendor/github.com/cyphar/filepath-securejoin/p… (podman + 0xd2ef4b)#012#5 0x0000555c7fe82e54 github.com/containers/podman/vendor/github.com/cyphar/filepath-securejoin/p… (podman + 0xd2ee54)#012#6 0x0000555c7f672dcc sync.(*Once).doSlow (podman + 0x51edcc)#012#7 0x0000555c7f672cf9 sync.(*Once).Do (podman + 0x51ecf9)#012#8 0x0000555c7fe82d
c5 github.com/containers/podman/vendor/github.com/cyphar/filepath-securejoin/p… (podman + 0xd2edc5)#012#9 0x0000555c7fe843e2 github.com/containers/podman/vendor/github.com/cyphar/filepath-securejoin/p… (podman + 0xd303e2)#012#10 0x0000555c7fe847f3 github.com/containers/podman/vendor/github.com/cyphar/filepath-securejoin/p… (podman + 0xd307f3)#012#11 0x0000555c7fe8391c github.com/containers/podman/vendor/github.com/cyphar/filepath-securejoin/p… (podman + 0xd2f91c)#012#12 0x0000555c7fe83358 github.com/containers/podman/vendor/github.com/cyphar/filepath-securejoin/p… (podman + 0xd2f358)#012#13 0x0000555c7f672dcc sync.(*Once).doSlow (podman + 0x51edcc)#012#14 0x0000555c7f672cf9 sync.(*Once).D
o (podman + 0x51ecf9)#012#15 0x0000555c7fe832c5 github.com/containers/podman/vendor/github.com/cyphar/filepath-securejoin/p… (podman + 0xd2f2c5)#012#16 0x0000555c7fe8479a github.com/containers/podman/vendor/github.com/cyphar/filepath-securejoin/p… (podman + 0xd3079a)#012#17 0x0000555c7fe8b34e github.com/containers/podman/vendor/github.com/opencontainers/selinux/go-se… (podman + 0xd3734e)#012#18 0x0000555c7fe8b838 github.com/containers/podman/vendor/github.com/opencontainers/selinux/go-se… (podman + 0xd37838)#012#19 0x0000555c7fe8a5df github.com/containers/podman/vendor/github.com/opencontainers/selinux/go-se… (podman + 0xd365df)#012#20 0x0000555c7fe8a873 github.com/containers/podman/vendor/github.com/opencontainers/selinux/go-se… (podman + 0xd36873)#012#21 0x000
0555c80082f4b github.com/containers/podman/vendor/go.podman.io/common/pkg/config.defaultC… (podman + 0xf2ef4b)#012#22 0x0000555c80086912 github.com/containers/podman/vendor/go.podman.io/common/pkg/config.newLocked (podman + 0xf32912)#012#23 0x0000555c80086605 github.com/containers/podman/vendor/go.podman.io/common/pkg/config.New (podman + 0xf32605)#012#24 0x0000555c807f9fd3 github.com/containers/podman/cmd/podman/registry.newPodmanConfig (podman + 0x16a5fd3)#012#25 0x0000555c7f672dcc sync.(*Once).doSlow (podman + 0x51edcc)#012#26 0x0000555c8081ac50 github.com/containers/podman/cmd/podman/common.init (podman + 0x16c6c50)#012#27 0x0000555c7f638a57 runtime.doInit1 (podman + 0x4e4a57)#012#28 0x0000555c7f628f90 runtime.main (podman + 0x4d4f90)#012#29 0x0000555c7f668ee1 runtime.goexit.abi0 (podman + 0x514ee1)#012ELF object binary architecture: AMD x86-64
Jul 26 06:34:24 jaws.cs.umd.edu setroubleshoot[1852941]: SELinux is preventing /usr/bin/podman from using the nnp_transition access on a process. For complete SELinux messages run: sealert -l 3c7643bc-dd69-4695-b48c-7d780b62b6cf [x2]
Jul 26 06:34:25 jaws.cs.umd.edu systemd-coredump[1852994]: Process 1852985 (podman) of user 981 dumped core.#012#012Stack trace of thread 1852985:#012#0 0x000055b75857746e internal/runtime/syscall/linux.Syscall6 (podman + 0x48b46e)#012#1 0x000055b7586570a6 syscall.Syscall (podman + 0x56b0a6)#012#2 0x000055b758657c50 syscall.Syscall.abi0 (podman + 0x56bc50)#012#3 0x000055b7587c1c2e github.com/containers/podman/vendor/golang.org/x/sys/unix.OpenTree (podman + 0x6d5c2e)#012#4 0x000055b758e1af4b github.com/containers/podman/vendor/github.com/cyphar/filepath-securejoin/p… (podman + 0xd2ef4b)#012#5 0x000055b758e1ae54 github.com/containers/podman/vendor/github.com/cyphar/filepath-securejoin/p… (podman + 0xd2ee54)#012#6 0x000055b75860adcc sync.(*Once).doSlow (podman + 0x51edcc)#012#7 0x000055b75860acf9 sync.(*Once).Do (podman + 0x51ecf9)#012#8 0x000055b758e1ad
c5 github.com/containers/podman/vendor/github.com/cyphar/filepath-securejoin/p… (podman + 0xd2edc5)#012#9 0x000055b758e1c3e2 github.com/containers/podman/vendor/github.com/cyphar/filepath-securejoin/p… (podman + 0xd303e2)#012#10 0x000055b758e1c7f3 github.com/containers/podman/vendor/github.com/cyphar/filepath-securejoin/p… (podman + 0xd307f3)#012#11 0x000055b758e1b91c github.com/containers/podman/vendor/github.com/cyphar/filepath-securejoin/p… (podman + 0xd2f91c)#012#12 0x000055b758e1b358 github.com/containers/podman/vendor/github.com/cyphar/filepath-securejoin/p… (podman + 0xd2f358)#012#13 0x000055b75860adcc sync.(*Once).doSlow (podman + 0x51edcc)#012#14 0x000055b75860acf9 sync.(*Once).D
o (podman + 0x51ecf9)#012#15 0x000055b758e1b2c5 github.com/containers/podman/vendor/github.com/cyphar/filepath-securejoin/p… (podman + 0xd2f2c5)#012#16 0x000055b758e1c79a github.com/containers/podman/vendor/github.com/cyphar/filepath-securejoin/p… (podman + 0xd3079a)#012#17 0x000055b758e2334e github.com/containers/podman/vendor/github.com/opencontainers/selinux/go-se… (podman + 0xd3734e)#012#18 0x000055b758e23838 github.com/containers/podman/vendor/github.com/opencontainers/selinux/go-se… (podman + 0xd37838)#012#19 0x000055b758e225df github.com/containers/podman/vendor/github.com/opencontainers/selinux/go-se… (podman + 0xd365df)#012#20 0x000055b758e22873 github.com/containers/podman/vendor/github.com/opencontainers/selinux/go-se… (podman + 0xd36873)#012#21 0x000
055b75901af4b github.com/containers/podman/vendor/go.podman.io/common/pkg/config.defaultC… (podman + 0xf2ef4b)#012#22 0x000055b75901e912 github.com/containers/podman/vendor/go.podman.io/common/pkg/config.newLocked (podman + 0xf32912)#012#23 0x000055b75901e605 github.com/containers/podman/vendor/go.podman.io/common/pkg/config.New (podman + 0xf32605)#012#24 0x000055b759791fd3 github.com/containers/podman/cmd/podman/registry.newPodmanConfig (podman + 0x16a5fd3)#012#25 0x000055b75860adcc sync.(*Once).doSlow (podman + 0x51edcc)#012#26 0x000055b7597b2c50 github.com/containers/podman/cmd/podman/common.init (podman + 0x16c6c50)#012#27 0x000055b7585d0a57 runtime.doInit1 (podman + 0x4e4a57)#012#28 0x000055b7585c0f90 runtime.main (podman + 0x4d4f90)#012#29 0x000055b758600ee1 runtime.goexit.abi0 (podman + 0x514ee1)#012ELF object binary architecture: AMD x86-64
== neodontcare.cs.umd.edu (5 distinct, 6 total) ==
Jul 26 06:13:30 neodontcare.cs.umd.edu gnome-software[7556]: Only 0 apps for recent list, hiding
Jul 26 06:13:34 neodontcare.cs.umd.edu packagekitd[3580117]: Failed to get cache filename for gnu-free-mono-fonts
Jul 26 06:13:34 neodontcare.cs.umd.edu packagekitd[3580117]: Failed to get cache filename for gnu-free-serif-fonts
Jul 26 06:13:34 neodontcare.cs.umd.edu packagekitd[3580117]: Failed to get cache filename for libreoffice [x2]
Jul 26 06:13:38 neodontcare.cs.umd.edu packagekitd[3580117]: failed to parse public key for /etc/pki/rpm-gpg/RPM-GPG-KEY-PQC-redhat-release
== newhonors2 (38 distinct, 65 total) ==
Jul 26 06:13:02 newhonors2 dhcpcd[300088]: dhcpcd is not running [x28]
Jul 26 06:48:05 newhonors2 puppet-agent[301234]: Could not update: Execution of '/usr/bin/apt-get -q -y -o DPkg::Options::=--force-confold --force-yes install openvox-agent=8.27.0-1+ubuntu24.04' returned 100: Reading package lists...
Jul 26 06:48:05 newhonors2 puppet-agent[301234]: Building dependency tree...
Jul 26 06:48:05 newhonors2 puppet-agent[301234]: Reading state information...
Jul 26 06:48:05 newhonors2 puppet-agent[301234]: Package openvox-agent is not available, but is referred to by another package.
Jul 26 06:48:05 newhonors2 puppet-agent[301234]: This may mean that the package is missing, has been obsoleted, or
Jul 26 06:48:05 newhonors2 puppet-agent[301234]: is only available from another source
Jul 26 06:48:05 newhonors2 puppet-agent[301234]:
Jul 26 06:48:05 newhonors2 puppet-agent[301234]: W: --force-yes is deprecated, use one of the options starting with --allow instead.
Jul 26 06:48:05 newhonors2 puppet-agent[301234]: E: Version '8.27.0-1+ubuntu24.04' for 'openvox-agent' was not found
Jul 26 06:48:05 newhonors2 puppet-agent[301234]: (/Stage[main]/Puppet::Agent::Install/Package[openvox-agent]/ensure) change from '7.37.2-1+ubuntu24.04' to '8.27.0-1+ubuntu24.04' failed: Could not update: Execution of '/usr/bin/apt-get -q -y -o DPkg::Options::=--force-confold --force-yes install openvox-agent=8.27.0-1+ubuntu24.04' returned 100: Reading package lists...
Jul 26 06:48:05 newhonors2 puppet-agent[301234]: (/Stage[main]/Puppet::Agent::Install/Package[openvox-agent]/ensure) Building dependency tree...
Jul 26 06:48:05 newhonors2 puppet-agent[301234]: (/Stage[main]/Puppet::Agent::Install/Package[openvox-agent]/ensure) Reading state information...
Jul 26 06:48:05 newhonors2 puppet-agent[301234]: (/Stage[main]/Puppet::Agent::Install/Package[openvox-agent]/ensure) Package openvox-agent is not available, but is referred to by another package.
Jul 26 06:48:05 newhonors2 puppet-agent[301234]: (/Stage[main]/Puppet::Agent::Install/Package[openvox-agent]/ensure) This may mean that the package is missing, has been obsoleted, or
Jul 26 06:48:05 newhonors2 puppet-agent[301234]: (/Stage[main]/Puppet::Agent::Install/Package[openvox-agent]/ensure) is only available from another source
Jul 26 06:48:05 newhonors2 puppet-agent[301234]: (/Stage[main]/Puppet::Agent::Install/Package[openvox-agent]/ensure)
Jul 26 06:48:05 newhonors2 puppet-agent[301234]: (/Stage[main]/Puppet::Agent::Install/Package[openvox-agent]/ensure) W: --force-yes is deprecated, use one of the options starting with --allow instead.
Jul 26 06:48:05 newhonors2 puppet-agent[301234]: (/Stage[main]/Puppet::Agent::Install/Package[openvox-agent]/ensure) E: Version '8.27.0-1+ubuntu24.04' for 'openvox-agent' was not found
Jul 26 06:48:29 newhonors2 puppet-agent[301234]: (/Stage[main]/Puppet::Agent::Config/Puppet::Config::Agent[classfile]/Puppet::Config::Entry[agent_classfile]/Concat::Fragment[puppet.conf_agent]/Concat_fragment[puppet.conf_agent]) Skipping because of failed dependencies
Jul 26 06:48:29 newhonors2 puppet-agent[301234]: (/Stage[main]/Puppet::Agent::Config/Puppet::Config::Agent[classfile]/Puppet::Config::Entry[agent_classfile]/Concat::Fragment[puppet.conf_agent_end]/Concat_fragment[puppet.conf_agent_end]) Skipping because of failed dependencies
Jul 26 06:48:29 newhonors2 puppet-agent[301234]: (/Stage[main]/Puppet::Agent::Config/Puppet::Config::Agent[classfile]/Puppet::Config::Entry[agent_classfile]/Concat::Fragment[puppet.conf_agent_classfile]/Concat_fragment[puppet.conf_agent_classfile]) Skipping because of failed dependencies
Jul 26 06:48:29 newhonors2 puppet-agent[301234]: (/Stage[main]/Puppet::Agent::Config/Puppet::Config::Agent[default_schedules]/Puppet::Config::Entry[agent_default_schedules]/Concat::Fragment[puppet.conf_agent_default_schedules]/Concat_fragment[puppet.conf_agent_default_schedules]) Skipping because of failed dependencies
Jul 26 06:48:29 newhonors2 puppet-agent[301234]: (/Stage[main]/Puppet::Agent::Config/Puppet::Config::Agent[report]/Puppet::Config::Entry[agent_report]/Concat::Fragment[puppet.conf_agent_report]/Concat_fragment[puppet.conf_agent_report]) Skipping because of failed dependencies
Jul 26 06:48:29 newhonors2 puppet-agent[301234]: (/Stage[main]/Puppet::Agent::Config/Puppet::Config::Agent[masterport]/Puppet::Config::Entry[agent_masterport]/Concat::Fragment[puppet.conf_agent_masterport]/Concat_fragment[puppet.conf_agent_masterport]) Skipping because of failed dependencies
Jul 26 06:48:29 newhonors2 puppet-agent[301234]: (/Stage[main]/Puppet::Agent::Config/Puppet::Config::Agent[splay]/Puppet::Config::Entry[agent_splay]/Concat::Fragment[puppet.conf_agent_splay]/Concat_fragment[puppet.conf_agent_splay]) Skipping because of failed dependencies
Jul 26 06:48:29 newhonors2 puppet-agent[301234]: (/Stage[main]/Puppet::Agent::Config/Puppet::Config::Agent[splaylimit]/Puppet::Config::Entry[agent_splaylimit]/Concat::Fragment[puppet.conf_agent_splaylimit]/Concat_fragment[puppet.conf_agent_splaylimit]) Skipping because of failed dependencies
Jul 26 06:48:29 newhonors2 puppet-agent[301234]: (/Stage[main]/Puppet::Agent::Config/Puppet::Config::Agent[runinterval]/Puppet::Config::Entry[agent_runinterval]/Concat::Fragment[puppet.conf_agent_runinterval]/Concat_fragment[puppet.conf_agent_runinterval]) Skipping because of failed dependencies
Jul 26 06:48:29 newhonors2 puppet-agent[301234]: (/Stage[main]/Puppet::Agent::Config/Puppet::Config::Agent[noop]/Puppet::Config::Entry[agent_noop]/Concat::Fragment[puppet.conf_agent_noop]/Concat_fragment[puppet.conf_agent_noop]) Skipping because of failed dependencies
Jul 26 06:48:29 newhonors2 puppet-agent[301234]: (/Stage[main]/Puppet::Agent::Config/Puppet::Config::Agent[usecacheonfailure]/Puppet::Config::Entry[agent_usecacheonfailure]/Concat::Fragment[puppet.conf_agent_usecacheonfailure]/Concat_fragment[puppet.conf_agent_usecacheonfailure]) Skipping because of failed dependencies
... 8 more distinct messages not shown
== outbound00.cs.umd.edu (1 distinct, 6 total) ==
Jul 26 06:09:09 outbound00.cs.umd.edu python3[3890310]: ldapdb [x6]
== outbound01.cs.umd.edu (2 distinct, 17 total) ==
Jul 26 06:13:06 outbound01.cs.umd.edu python3[1919435]: ldapdb [x6]
Jul 26 06:31:05 outbound01.cs.umd.edu krb5_child[1923979]: Client 'admin(a)UMD.EDU' not found in Kerberos database [x11]
== sentry-docker00.cs.umd.edu (38 distinct, 38 total) ==
Jul 26 06:09:44 sentry-docker00.cs.umd.edu systemd-udevd[3822901]: link_config: could not get ethtool features for veth57a4961
Jul 26 06:09:44 sentry-docker00.cs.umd.edu systemd-udevd[3822901]: Could not set offload features of veth57a4961: No such device
Jul 26 06:09:44 sentry-docker00.cs.umd.edu systemd-udevd[3822920]: Could not generate persistent MAC address for veth166bc1d: No such file or directory
Jul 26 06:09:44 sentry-docker00.cs.umd.edu systemd-udevd[3822921]: Could not generate persistent MAC address for vethd18aaf5: No such file or directory
Jul 26 06:19:14 sentry-docker00.cs.umd.edu systemd-udevd[3827317]: link_config: could not get ethtool features for veth62c473c
Jul 26 06:19:14 sentry-docker00.cs.umd.edu systemd-udevd[3827317]: Could not set offload features of veth62c473c: No such device
Jul 26 06:19:14 sentry-docker00.cs.umd.edu systemd-udevd[3827380]: Could not generate persistent MAC address for veth50f71e1: No such file or directory
Jul 26 06:19:14 sentry-docker00.cs.umd.edu systemd-udevd[3827381]: Could not generate persistent MAC address for veth394b3ac: No such file or directory
Jul 26 06:19:14 sentry-docker00.cs.umd.edu systemd-udevd[3827384]: Could not generate persistent MAC address for veth04bc1ad: No such file or directory
Jul 26 06:19:14 sentry-docker00.cs.umd.edu systemd-udevd[3827385]: Could not generate persistent MAC address for veth56b735f: No such file or directory
Jul 26 06:19:14 sentry-docker00.cs.umd.edu systemd-udevd[3827395]: Could not generate persistent MAC address for veth664aa1d: No such file or directory
Jul 26 06:19:14 sentry-docker00.cs.umd.edu systemd-udevd[3827385]: Could not generate persistent MAC address for veth49d4936: No such file or directory
Jul 26 06:19:14 sentry-docker00.cs.umd.edu systemd-udevd[3827410]: Could not generate persistent MAC address for veth7d52841: No such file or directory
Jul 26 06:19:14 sentry-docker00.cs.umd.edu systemd-udevd[3827411]: Could not generate persistent MAC address for vethebec1c9: No such file or directory
Jul 26 06:29:53 sentry-docker00.cs.umd.edu systemd-udevd[3832378]: Could not generate persistent MAC address for veth051178b: No such file or directory
Jul 26 06:29:53 sentry-docker00.cs.umd.edu systemd-udevd[3832379]: Could not generate persistent MAC address for vethfa1753a: No such file or directory
Jul 26 06:39:22 sentry-docker00.cs.umd.edu systemd-udevd[3836826]: link_config: could not get ethtool features for veth7d52841
Jul 26 06:39:22 sentry-docker00.cs.umd.edu systemd-udevd[3836826]: Could not set offload features of veth7d52841: No such device
Jul 26 06:39:22 sentry-docker00.cs.umd.edu systemd-udevd[3836845]: Could not generate persistent MAC address for veth3a2c099: No such file or directory
Jul 26 06:39:22 sentry-docker00.cs.umd.edu systemd-udevd[3836846]: Could not generate persistent MAC address for vethcfd4969: No such file or directory
Jul 26 06:39:22 sentry-docker00.cs.umd.edu systemd-udevd[3836849]: Could not generate persistent MAC address for veth8a14fb6: No such file or directory
Jul 26 06:39:22 sentry-docker00.cs.umd.edu systemd-udevd[3836850]: Could not generate persistent MAC address for vethfcb29dc: No such file or directory
Jul 26 06:39:22 sentry-docker00.cs.umd.edu systemd-udevd[3836854]: Could not generate persistent MAC address for veth2d05fde: No such file or directory
Jul 26 06:39:22 sentry-docker00.cs.umd.edu systemd-udevd[3836860]: Could not generate persistent MAC address for vethc2fd81a: No such file or directory
Jul 26 06:39:22 sentry-docker00.cs.umd.edu systemd-udevd[3836861]: Could not generate persistent MAC address for veth3078cdb: No such file or directory
Jul 26 06:39:22 sentry-docker00.cs.umd.edu systemd-udevd[3836855]: Could not generate persistent MAC address for veth3599e45: No such file or directory
Jul 26 06:50:01 sentry-docker00.cs.umd.edu systemd-udevd[3841798]: link_config: could not get ethtool features for veth051178b
Jul 26 06:50:01 sentry-docker00.cs.umd.edu systemd-udevd[3841798]: Could not set offload features of veth051178b: No such device
Jul 26 06:50:01 sentry-docker00.cs.umd.edu systemd-udevd[3841815]: Could not generate persistent MAC address for veth5302324: No such file or directory
Jul 26 06:50:01 sentry-docker00.cs.umd.edu systemd-udevd[3841816]: Could not generate persistent MAC address for veth3936bab: No such file or directory
... 8 more distinct messages not shown
== strawberry (5 distinct, 11 total) ==
Jul 26 06:09:44 strawberry udisksd[1067]: Error performing housekeeping for drive /org/freedesktop/UDisks2/drives/ST2000DM001_1CH164_W1E8J5KJ: Error updating SMART data: Error sending ATA command CHECK POWER MODE: Unexpected sense data returned:#0120000: 00 00 00 00 00 00 00 00 00 00 00 00 00 00 00 00 ................#0120010: 00 00 00 00 00 00 00 00 00 00 00 00 00 00 00 00 ................#012 (g-io-error-quark, 0) [x6]
Jul 26 06:31:01 strawberry nologin[2813079]: Attempted login by UNKNOWN (UID: 65534) on UNKNOWN
Jul 26 06:31:01 strawberry pipewire[2813078]: mod.jackdbus-detect: Failed to receive jackdbus reply: org.freedesktop.DBus.Error.ServiceUnknown: The name org.jackaudio.service was not provided by any .service files
Jul 26 06:31:01 strawberry kernel: kauditd_printk_skb: 4 callbacks suppressed
Jul 26 06:34:42 strawberry smartd[5314]: Device: /dev/sda [SAT], failed to read SMART Attribute Data [x2]
== tlsrpt (1 distinct, 1 total) ==
Jul 26 06:38:03 tlsrpt (httpd)[224703]: httpd.service: Referenced but unset environment variable evaluates to an empty string: OPTIONS
== zfs00.cs.umd.edu (1 distinct, 3 total) ==
Jul 26 06:07:17 zfs00.cs.umd.edu rsyslogd: imrelp[2514]: error 'server closed relp session, session broken', object 'lstn 2514: conn to clt 10.227.96.13/irb2156.csdips.umd.edu' - input may not work as intended [v8.2604.0 try https://www.rsyslog.com/e/2353 ] [x3]
1
0
Command: /usr/local/sbin/syslog-digest.py
Time : 0.4874s
Status : exited 0
Output :
Syslog digest — 2026-07-26 06:05 EDT
Processed 3,990 lines, filtered 3,354 (84%). 636 unknown (101 distinct) from 21 host(s).
== abuse (1 distinct, 346 total) ==
Jul 26 05:05:06 abuse rsyslogd[21745]: imjournal: open() failed for path: '/var/lib/rsyslog/imjournal.state.tmp': Input/output error [v8.2404.0 try https://www.rsyslog.com/e/2433 ] [x346]
== alec.cs.umd.edu (3 distinct, 61 total) ==
Jul 26 05:05:29 alec.cs.umd.edu setroubleshoot[3173937]: failed to retrieve rpm info for path '/run/netns/netns-9dfd0347-71eb-5698-085c-c769043aa5c3': [x12]
Jul 26 05:05:30 alec.cs.umd.edu sedispatch[1526]: AVC Message regarding setroubleshoot, ignoring message [x24]
Jul 26 05:05:30 alec.cs.umd.edu setroubleshoot[3173937]: SELinux is preventing /usr/bin/df from getattr access on the file /run/netns/netns-9dfd0347-71eb-5698-085c-c769043aa5c3. For complete SELinux messages run: sealert -l 23f93208-3063-4aac-b78a-bb0fcb40740c [x25]
== b0b02.cs.umd.edu (3 distinct, 3 total) ==
Jul 26 05:55:27 b0b02.cs.umd.edu rustdesk[675419]: cannot open display:
Jul 26 06:04:57 b0b02.cs.umd.edu setroubleshoot[677711]: SELinux is preventing /usr/bin/python3.9 from getattr access on the file /etc/authselect/nsswitch.conf. For complete SELinux messages run: sealert -l 9a1e2952-3fde-4937-a8ab-f7f59791a458
Jul 26 06:05:00 b0b02.cs.umd.edu setroubleshoot[677711]: SELinux is preventing /usr/bin/python3.9 from read access on the file /etc/authselect/nsswitch.conf. For complete SELinux messages run: sealert -l 97d74423-e027-4cd6-8810-ad80944900b5
== contest (9 distinct, 42 total) ==
Jul 26 05:06:06 contest goferd[1007]: [ERROR][worker-0] gofer.messaging.adapter.connect:33 - connect: proton+amqps://satellite8.cs.umd.edu:5647, failed: Connection amqps://satellite8.cs.umd.edu:5647 disconnected: Condition('proton.pythonio', 'Connection refused to all addresses') [x34]
Jul 26 05:48:13 contest setroubleshoot[103109]: SELinux is preventing /usr/libexec/platform-python3.6 from create access on the directory libdnf.nUHaRH. For complete SELinux messages run: sealert -l cb6b25c6-4765-4cf2-88a0-9b3b508e94e9
Jul 26 05:48:13 contest setroubleshoot[103109]: SELinux is preventing /usr/bin/gpgconf from add_name access on the directory repodata. For complete SELinux messages run: sealert -l 41cf7b1b-0f34-4609-98f2-b66e7825fef7
Jul 26 05:48:13 contest setroubleshoot[103109]: SELinux is preventing /usr/libexec/platform-python3.6 from create access on the file mirrorlist. For complete SELinux messages run: sealert -l fc20ff92-ea83-4f38-a24b-ddfd737a3141
Jul 26 05:48:13 contest setroubleshoot[103109]: SELinux is preventing /usr/libexec/platform-python3.6 from setattr access on the file repomd.xml. For complete SELinux messages run: sealert -l ac675631-fa35-4e93-adc9-b692b18e53e5
Jul 26 05:48:13 contest setroubleshoot[103109]: SELinux is preventing /usr/libexec/platform-python3.6 from read access on the directory libdnf.nUHaRH. For complete SELinux messages run: sealert -l 45d103b6-0810-4890-a705-990118577ce8
Jul 26 05:48:17 contest setroubleshoot[103109]: SELinux is preventing /usr/libexec/platform-python3.6 from remove_name access on the directory repomd.xml. For complete SELinux messages run: sealert -l 7e499113-2fd7-4f67-bec6-3521efbe3637
Jul 26 05:48:21 contest setroubleshoot[103109]: SELinux is preventing rhsmcertd-worke from unlink access on the file repomd.xml. For complete SELinux messages run: sealert -l 22835727-7fef-4cfb-b3b5-881f66888317
Jul 26 05:48:33 contest setroubleshoot[103159]: SELinux is preventing /usr/libexec/platform-python3.6 from rmdir access on the directory repodata. For complete SELinux messages run: sealert -l 3928930b-a1ed-448d-950b-0665ac2adef8
== csfw00a (1 distinct, 10 total) ==
Jul 26 05:13:40 csfw00a kernel: bnxt_en 0000:09:00.0 eth3: NIC Link is Down [x10]
== grades01.cs.umd.edu (1 distinct, 1 total) ==
Jul 26 05:48:14 grades01.cs.umd.edu puppet-agent[20146]: The directory '/srv/grades' contains 2471 entries, which exceeds the default soft limit 1000 and may cause excessive resource consumption and degraded performance. To remove this warning set a value for `max_files` parameter or consider using an alternate method to manage large directory trees
== hackerman (1 distinct, 1 total) ==
Jul 26 05:19:01 hackerman gnome-software[2060381]: failed to commit changes to dconf: GDBus.Error:org.gtk.GDBus.UnmappedGError.Quark._g_2dfile_2derror_2dquark.Code2: Failed to create file “/adminhomes/sajith/.config/dconf/user.7QK7S3”: Permission denied
== idm00 (1 distinct, 1 total) ==
Jul 26 05:51:07 idm00 named[1455]: client @0x7f3310365af8 10.73.240.42#59571: update '73.10.in-addr.arpa/IN' denied
== idmp0 (1 distinct, 1 total) ==
Jul 26 05:34:56 idmp0 named[5198]: client @0x7f99000c0828 10.73.240.43#65381: update '73.10.in-addr.arpa/IN' denied
== itmon02 (1 distinct, 42 total) ==
Jul 26 05:07:56 itmon02 sshd[1834]: error: beginning MaxStartups throttling [x42]
== newhonors2 (1 distinct, 24 total) ==
Jul 26 05:13:03 newhonors2 dhcpcd[298235]: dhcpcd is not running [x24]
== outbound00.cs.umd.edu (1 distinct, 6 total) ==
Jul 26 05:09:09 outbound00.cs.umd.edu python3[3876373]: ldapdb [x6]
== outbound01.cs.umd.edu (2 distinct, 8 total) ==
Jul 26 05:08:48 outbound01.cs.umd.edu python3[1903864]: ldapdb [x7]
Jul 26 05:09:50 outbound01.cs.umd.edu systemd[1]: Configuration file /usr/lib/systemd/system/authentication_milter.service is marked executable. Please remove executable permission bits. Proceeding anyway.
== peach.cs.umd.edu (2 distinct, 4 total) ==
Jul 26 05:22:07 peach.cs.umd.edu setroubleshoot[838533]: SELinux is preventing /usr/bin/qemu-ga from search access on the directory /var/lib/containers/storage/overlay. For complete SELinux messages run: sealert -l ba415951-a2c6-424e-b17d-305c5300b9f3 [x2]
Jul 26 05:22:07 peach.cs.umd.edu setroubleshoot[838533]: SELinux is preventing /usr/bin/qemu-ga from search access on the directory /var/lib/containers/storage/overlay. For complete SELinux messages run: sealert -l 6aeb0956-fcf2-462a-ae4d-439b912c16d0 [x2]
== sentry-docker00.cs.umd.edu (38 distinct, 38 total) ==
Jul 26 05:09:28 sentry-docker00.cs.umd.edu systemd-udevd[3794422]: Could not generate persistent MAC address for veth93a8f56: No such file or directory
Jul 26 05:09:28 sentry-docker00.cs.umd.edu systemd-udevd[3794423]: Could not generate persistent MAC address for veth1ca35e2: No such file or directory
Jul 26 05:18:49 sentry-docker00.cs.umd.edu systemd-udevd[3798807]: link_config: could not get ethtool features for vethafdcce7
Jul 26 05:18:49 sentry-docker00.cs.umd.edu systemd-udevd[3798807]: Could not set offload features of vethafdcce7: No such device
Jul 26 05:18:49 sentry-docker00.cs.umd.edu systemd-udevd[3798875]: Could not generate persistent MAC address for vethae4951f: No such file or directory
Jul 26 05:18:49 sentry-docker00.cs.umd.edu systemd-udevd[3798876]: Could not generate persistent MAC address for veth27d7d88: No such file or directory
Jul 26 05:18:49 sentry-docker00.cs.umd.edu systemd-udevd[3798879]: Could not generate persistent MAC address for vethfe89845: No such file or directory
Jul 26 05:18:49 sentry-docker00.cs.umd.edu systemd-udevd[3798880]: Could not generate persistent MAC address for vethc56130e: No such file or directory
Jul 26 05:18:49 sentry-docker00.cs.umd.edu systemd-udevd[3798880]: Could not generate persistent MAC address for veth4cd0f65: No such file or directory
Jul 26 05:18:49 sentry-docker00.cs.umd.edu systemd-udevd[3798879]: Could not generate persistent MAC address for veth07d49ee: No such file or directory
Jul 26 05:18:49 sentry-docker00.cs.umd.edu systemd-udevd[3798896]: Could not generate persistent MAC address for vethc20dd62: No such file or directory
Jul 26 05:18:49 sentry-docker00.cs.umd.edu systemd-udevd[3798881]: Could not generate persistent MAC address for vethaf384ed: No such file or directory
Jul 26 05:29:32 sentry-docker00.cs.umd.edu systemd-udevd[3804052]: link_config: could not get ethtool features for veth93a8f56
Jul 26 05:29:32 sentry-docker00.cs.umd.edu systemd-udevd[3804052]: Could not set offload features of veth93a8f56: No such device
Jul 26 05:29:32 sentry-docker00.cs.umd.edu systemd-udevd[3804070]: Could not generate persistent MAC address for veth17d90d0: No such file or directory
Jul 26 05:29:32 sentry-docker00.cs.umd.edu systemd-udevd[3804071]: Could not generate persistent MAC address for vethb8e2ed3: No such file or directory
Jul 26 05:38:57 sentry-docker00.cs.umd.edu systemd-udevd[3808493]: link_config: could not get ethtool features for veth07d49ee
Jul 26 05:38:57 sentry-docker00.cs.umd.edu systemd-udevd[3808493]: Could not set offload features of veth07d49ee: No such device
Jul 26 05:38:57 sentry-docker00.cs.umd.edu systemd-udevd[3808523]: Could not generate persistent MAC address for vethd3ef246: No such file or directory
Jul 26 05:38:57 sentry-docker00.cs.umd.edu systemd-udevd[3808524]: Could not generate persistent MAC address for veth481ae24: No such file or directory
Jul 26 05:38:57 sentry-docker00.cs.umd.edu systemd-udevd[3808527]: Could not generate persistent MAC address for veth460b757: No such file or directory
Jul 26 05:38:57 sentry-docker00.cs.umd.edu systemd-udevd[3808528]: Could not generate persistent MAC address for vetha0da217: No such file or directory
Jul 26 05:38:57 sentry-docker00.cs.umd.edu systemd-udevd[3808532]: Could not generate persistent MAC address for vethcaca6af: No such file or directory
Jul 26 05:38:57 sentry-docker00.cs.umd.edu systemd-udevd[3808550]: Could not generate persistent MAC address for veth8714a3c: No such file or directory
Jul 26 05:38:57 sentry-docker00.cs.umd.edu systemd-udevd[3808532]: Could not generate persistent MAC address for vethc03f9a0: No such file or directory
Jul 26 05:38:57 sentry-docker00.cs.umd.edu systemd-udevd[3808541]: Could not generate persistent MAC address for veth984e453: No such file or directory
Jul 26 05:49:40 sentry-docker00.cs.umd.edu systemd-udevd[3813495]: Could not generate persistent MAC address for veth57a4961: No such file or directory
Jul 26 05:49:40 sentry-docker00.cs.umd.edu systemd-udevd[3813496]: Could not generate persistent MAC address for vethb355ad8: No such file or directory
Jul 26 05:59:05 sentry-docker00.cs.umd.edu systemd-udevd[3817837]: link_config: could not get ethtool features for vethd3ef246
Jul 26 05:59:05 sentry-docker00.cs.umd.edu systemd-udevd[3817837]: Could not set offload features of vethd3ef246: No such device
... 8 more distinct messages not shown
== strawberry (2 distinct, 8 total) ==
Jul 26 05:09:44 strawberry udisksd[1067]: Error performing housekeeping for drive /org/freedesktop/UDisks2/drives/ST2000DM001_1CH164_W1E8J5KJ: Error updating SMART data: Error sending ATA command CHECK POWER MODE: Unexpected sense data returned:#0120000: 00 00 00 00 00 00 00 00 00 00 00 00 00 00 00 00 ................#0120010: 00 00 00 00 00 00 00 00 00 00 00 00 00 00 00 00 ................#012 (g-io-error-quark, 0) [x6]
Jul 26 05:34:42 strawberry smartd[5314]: Device: /dev/sda [SAT], failed to read SMART Attribute Data [x2]
== submit26-b9-2 (10 distinct, 13 total) ==
Jul 26 05:12:49 submit26-b9-2 setroubleshoot[219714]: SELinux is preventing /usr/bin/python3.9 from create access on the directory /(null). For complete SELinux messages run: sealert -l d506243c-d61e-48f3-b42a-4592c913deb0
Jul 26 05:12:49 submit26-b9-2 setroubleshoot[219714]: SELinux is preventing /usr/bin/python3.9 from add_name access on the directory /(null). For complete SELinux messages run: sealert -l 3b4752ac-1b9a-4af9-a05b-32e4c2eb13ab
Jul 26 05:12:49 submit26-b9-2 setroubleshoot[219714]: SELinux is preventing /usr/bin/python3.9 from create access on the file /(null). For complete SELinux messages run: sealert -l 29e5adbd-4381-4467-b40d-a2219101e096 [x2]
Jul 26 05:12:49 submit26-b9-2 setroubleshoot[219714]: SELinux is preventing /usr/bin/python3.9 from open access on the file /tmp/libdnf.GNJb0R/repodata/repomd.xml. For complete SELinux messages run: sealert -l 1b38f2ec-01ce-4343-8059-ba7494ecc5c4
Jul 26 05:12:49 submit26-b9-2 setroubleshoot[219714]: SELinux is preventing /usr/bin/python3.9 from setattr access on the file repomd.xml. For complete SELinux messages run: sealert -l e5f9af40-1f63-4924-b012-27ab2a7b2266 [x2]
Jul 26 05:12:49 submit26-b9-2 setroubleshoot[219714]: SELinux is preventing /usr/bin/python3.9 from read access on the directory libdnf.GNJb0R. For complete SELinux messages run: sealert -l 5c54db87-54a3-4a7c-97b4-b5c48d6c3543
Jul 26 05:12:49 submit26-b9-2 setroubleshoot[219714]: SELinux is preventing /usr/bin/python3.9 from remove_name access on the directory repomd.xml. For complete SELinux messages run: sealert -l 63cd60e1-1e61-4276-afea-dd8526ffe8b2
Jul 26 05:12:49 submit26-b9-2 setroubleshoot[219714]: SELinux is preventing /usr/bin/python3.9 from unlink access on the file repomd.xml. For complete SELinux messages run: sealert -l 81c7e9ec-e023-4c6d-b1ad-c02a242e655e [x2]
Jul 26 05:12:49 submit26-b9-2 setroubleshoot[219714]: SELinux is preventing /usr/bin/python3.9 from rmdir access on the directory repodata. For complete SELinux messages run: sealert -l 6ae9a597-e123-4d74-8eec-a8ebe0f5e4d0
Jul 26 05:12:49 submit26-b9-2 setroubleshoot[219714]: SELinux is preventing /usr/bin/python3.9 from open access on the file /tmp/libdnf.DISK2j/repodata/repomd.xml. For complete SELinux messages run: sealert -l 1b38f2ec-01ce-4343-8059-ba7494ecc5c4
== submit26-b9-3 (9 distinct, 9 total) ==
Jul 26 05:20:35 submit26-b9-3 setroubleshoot[600887]: SELinux is preventing /usr/bin/python3.9 from create access on the directory /(null). For complete SELinux messages run: sealert -l 5b912a44-22fd-4560-b201-2a4e289b73f5
Jul 26 05:20:35 submit26-b9-3 setroubleshoot[600887]: SELinux is preventing /usr/bin/python3.9 from add_name access on the directory /(null). For complete SELinux messages run: sealert -l 7f1df1e4-725e-4953-98eb-1079f908f543
Jul 26 05:20:35 submit26-b9-3 setroubleshoot[600887]: SELinux is preventing /usr/bin/python3.9 from create access on the file /(null). For complete SELinux messages run: sealert -l 40b8852a-f77b-44b4-affe-5f11fa33de43
Jul 26 05:20:35 submit26-b9-3 setroubleshoot[600887]: SELinux is preventing /usr/bin/python3.9 from open access on the file /tmp/libdnf.taKF1X/repodata/repomd.xml. For complete SELinux messages run: sealert -l 45a8019e-f6b5-4baa-92c1-862594b40d46
Jul 26 05:20:35 submit26-b9-3 setroubleshoot[600887]: SELinux is preventing /usr/bin/python3.9 from setattr access on the file repomd.xml. For complete SELinux messages run: sealert -l e9f0bfff-7784-4126-baa4-2bb06da56591
Jul 26 05:20:35 submit26-b9-3 setroubleshoot[600887]: SELinux is preventing /usr/bin/python3.9 from read access on the directory libdnf.taKF1X. For complete SELinux messages run: sealert -l 0b17cc3d-cdc6-4fe2-a11f-3892e7c41dc7
Jul 26 05:20:35 submit26-b9-3 setroubleshoot[600887]: SELinux is preventing /usr/bin/python3.9 from remove_name access on the directory repomd.xml. For complete SELinux messages run: sealert -l 10e38c64-b65f-4cdd-901e-4375652d9a42
Jul 26 05:20:35 submit26-b9-3 setroubleshoot[600887]: SELinux is preventing /usr/bin/python3.9 from unlink access on the file repomd.xml. For complete SELinux messages run: sealert -l 7fd9cf72-ef38-48e1-b6aa-b571b26a7b22
Jul 26 05:20:35 submit26-b9-3 setroubleshoot[600887]: SELinux is preventing /usr/bin/python3.9 from rmdir access on the directory repodata. For complete SELinux messages run: sealert -l b9b11116-89bd-4a3c-980c-1d422c5dcee4
== submit26-clnb9 (10 distinct, 13 total) ==
Jul 26 05:31:53 submit26-clnb9 setroubleshoot[1328852]: SELinux is preventing /usr/bin/python3.9 from create access on the directory /(null). For complete SELinux messages run: sealert -l 6783ed2b-5ae4-42b5-975a-4bf50eec4658
Jul 26 05:31:53 submit26-clnb9 setroubleshoot[1328852]: SELinux is preventing /usr/bin/python3.9 from add_name access on the directory /(null). For complete SELinux messages run: sealert -l 9e7fa955-cc30-4804-ac8c-e1779e85946c
Jul 26 05:31:53 submit26-clnb9 setroubleshoot[1328852]: SELinux is preventing /usr/bin/python3.9 from create access on the file /(null). For complete SELinux messages run: sealert -l 69bfa6e3-089c-40ff-9563-fd30787d0774 [x2]
Jul 26 05:31:53 submit26-clnb9 setroubleshoot[1328852]: SELinux is preventing /usr/bin/python3.9 from open access on the file /tmp/libdnf.yQrffd/repodata/repomd.xml. For complete SELinux messages run: sealert -l 001acdb5-31ef-4e52-b10b-90f467a89ddc
Jul 26 05:31:53 submit26-clnb9 setroubleshoot[1328852]: SELinux is preventing /usr/bin/python3.9 from setattr access on the file repomd.xml. For complete SELinux messages run: sealert -l edacddcf-16ed-4dc3-8d82-7c597d5dee23 [x2]
Jul 26 05:31:53 submit26-clnb9 setroubleshoot[1328852]: SELinux is preventing /usr/bin/python3.9 from read access on the directory libdnf.yQrffd. For complete SELinux messages run: sealert -l 62b3782e-4730-4488-8178-94dafe9b552c
Jul 26 05:31:53 submit26-clnb9 setroubleshoot[1328852]: SELinux is preventing /usr/bin/python3.9 from remove_name access on the directory repomd.xml. For complete SELinux messages run: sealert -l 81cb3698-78f8-440a-8e3c-e5d1041e6b78
Jul 26 05:31:53 submit26-clnb9 setroubleshoot[1328852]: SELinux is preventing /usr/bin/python3.9 from unlink access on the file repomd.xml. For complete SELinux messages run: sealert -l 792b472a-115c-4799-9805-fc7436f916b9 [x2]
Jul 26 05:31:53 submit26-clnb9 setroubleshoot[1328852]: SELinux is preventing /usr/bin/python3.9 from rmdir access on the directory repodata. For complete SELinux messages run: sealert -l 15c83a86-837b-41e2-b662-b39cd4e361cb
Jul 26 05:31:53 submit26-clnb9 setroubleshoot[1328852]: SELinux is preventing /usr/bin/python3.9 from open access on the file /tmp/libdnf.go5vSS/repodata/repomd.xml. For complete SELinux messages run: sealert -l 001acdb5-31ef-4e52-b10b-90f467a89ddc
== updates00.cs.umd.edu (3 distinct, 3 total) ==
Jul 26 05:18:31 updates00.cs.umd.edu puppet-agent[16422]: Could not retrieve catalog from remote server: Error 500 on SERVER: Server Error: Function lookup() did not find a value for the name 'vault::kerberos' on node updates00.cs.umd.edu
Jul 26 05:18:31 updates00.cs.umd.edu puppet-agent[16422]: Not using cache on failed catalog
Jul 26 05:18:31 updates00.cs.umd.edu puppet-agent[16422]: Could not retrieve catalog; skipping run
== zfs00.cs.umd.edu (1 distinct, 2 total) ==
Jul 26 05:12:55 zfs00.cs.umd.edu rsyslogd: imrelp[2514]: error 'server closed relp session, session broken', object 'lstn 2514: conn to clt 10.227.96.13/irb2156.csdips.umd.edu' - input may not work as intended [v8.2604.0 try https://www.rsyslog.com/e/2353 ] [x2]
1
0
Command: /usr/local/sbin/syslog-digest.py
Time : 0.4964s
Status : exited 0
Output :
Syslog digest — 2026-07-26 05:05 EDT
Processed 4,100 lines, filtered 3,470 (84%). 630 unknown (90 distinct) from 23 host(s).
== abadi-computer (2 distinct, 2 total) ==
Jul 26 04:15:00 abadi-computer nologin[3647121]: Attempted login by UNKNOWN (UID: 65534) on UNKNOWN
Jul 26 04:15:00 abadi-computer pipewire[3647119]: mod.jackdbus-detect: Failed to receive jackdbus reply: org.freedesktop.DBus.Error.ServiceUnknown: The name org.jackaudio.service was not provided by any .service files
== abuse (1 distinct, 346 total) ==
Jul 26 04:05:06 abuse rsyslogd[21745]: imjournal: open() failed for path: '/var/lib/rsyslog/imjournal.state.tmp': Input/output error [v8.2404.0 try https://www.rsyslog.com/e/2433 ] [x346]
== alec.cs.umd.edu (3 distinct, 60 total) ==
Jul 26 04:05:12 alec.cs.umd.edu setroubleshoot[3158709]: failed to retrieve rpm info for path '/run/netns/netns-9dfd0347-71eb-5698-085c-c769043aa5c3': [x12]
Jul 26 04:05:13 alec.cs.umd.edu sedispatch[1526]: AVC Message regarding setroubleshoot, ignoring message [x24]
Jul 26 04:05:13 alec.cs.umd.edu setroubleshoot[3158709]: SELinux is preventing /usr/bin/df from getattr access on the file /run/netns/netns-9dfd0347-71eb-5698-085c-c769043aa5c3. For complete SELinux messages run: sealert -l 23f93208-3063-4aac-b78a-bb0fcb40740c [x24]
== b0b02.cs.umd.edu (4 distinct, 4 total) ==
Jul 26 04:55:25 b0b02.cs.umd.edu rustdesk[660219]: cannot open display:
Jul 26 05:04:52 b0b02.cs.umd.edu setroubleshoot[662658]: SELinux is preventing /usr/bin/python3.9 from getattr access on the file /etc/authselect/nsswitch.conf. For complete SELinux messages run: sealert -l 9a1e2952-3fde-4937-a8ab-f7f59791a458
Jul 26 05:04:55 b0b02.cs.umd.edu setroubleshoot[662658]: SELinux is preventing /usr/bin/python3.9 from read access on the file /etc/authselect/nsswitch.conf. For complete SELinux messages run: sealert -l 97d74423-e027-4cd6-8810-ad80944900b5
Jul 26 05:04:58 b0b02.cs.umd.edu setroubleshoot[662658]: SELinux is preventing /usr/bin/python3.9 from open access on the file /etc/authselect/nsswitch.conf. For complete SELinux messages run: sealert -l 4f253f6a-62d6-46dd-8eaf-0b4d29df41c6
== contest (1 distinct, 34 total) ==
Jul 26 04:05:24 contest goferd[1007]: [ERROR][worker-0] gofer.messaging.adapter.connect:33 - connect: proton+amqps://satellite8.cs.umd.edu:5647, failed: Connection amqps://satellite8.cs.umd.edu:5647 disconnected: Condition('proton.pythonio', 'Connection refused to all addresses') [x34]
== csfw00a (1 distinct, 16 total) ==
Jul 26 04:08:53 csfw00a kernel: bnxt_en 0000:09:00.0 eth3: NIC Link is Down [x16]
== dojo (1 distinct, 1 total) ==
Jul 26 04:15:01 dojo nologin[320397]: Attempted login by UNKNOWN (UID: 65534) on UNKNOWN
== forge00 (1 distinct, 1 total) ==
Jul 26 04:09:03 forge00 (httpd)[476458]: httpd.service: Referenced but unset environment variable evaluates to an empty string: OPTIONS
== idm00 (1 distinct, 1 total) ==
Jul 26 04:51:07 idm00 named[1455]: client @0x7f33041b37e8 10.73.240.42#54803: update '73.10.in-addr.arpa/IN' denied
== idmp0 (1 distinct, 1 total) ==
Jul 26 04:34:56 idmp0 named[5198]: client @0x7f990c026208 10.73.240.43#63230: update '73.10.in-addr.arpa/IN' denied
== itmon02 (1 distinct, 43 total) ==
Jul 26 04:07:49 itmon02 sshd[1834]: error: beginning MaxStartups throttling [x43]
== jaws.cs.umd.edu (4 distinct, 5 total) ==
Jul 26 04:34:19 jaws.cs.umd.edu systemd-coredump[1826218]: Process 1826201 (podman) of user 981 dumped core.#012#012Stack trace of thread 1826201:#012#0 0x000055a2cb71246e internal/runtime/syscall/linux.Syscall6 (podman + 0x48b46e)#012#1 0x000055a2cb7f20a6 syscall.Syscall (podman + 0x56b0a6)#012#2 0x000055a2cb7f2c50 syscall.Syscall.abi0 (podman + 0x56bc50)#012#3 0x000055a2cb95cc2e github.com/containers/podman/vendor/golang.org/x/sys/unix.OpenTree (podman + 0x6d5c2e)#012#4 0x000055a2cbfb5f4b github.com/containers/podman/vendor/github.com/cyphar/filepath-securejoin/p… (podman + 0xd2ef4b)#012#5 0x000055a2cbfb5e54 github.com/containers/podman/vendor/github.com/cyphar/filepath-securejoin/p… (podman + 0xd2ee54)#012#6 0x000055a2cb7a5dcc sync.(*Once).doSlow (podman + 0x51edcc)#012#7 0x000055a2cb7a5cf9 sync.(*Once).Do (podman + 0x51ecf9)#012#8 0x000055a2cbfb5d
c5 github.com/containers/podman/vendor/github.com/cyphar/filepath-securejoin/p… (podman + 0xd2edc5)#012#9 0x000055a2cbfb73e2 github.com/containers/podman/vendor/github.com/cyphar/filepath-securejoin/p… (podman + 0xd303e2)#012#10 0x000055a2cbfb77f3 github.com/containers/podman/vendor/github.com/cyphar/filepath-securejoin/p… (podman + 0xd307f3)#012#11 0x000055a2cbfb691c github.com/containers/podman/vendor/github.com/cyphar/filepath-securejoin/p… (podman + 0xd2f91c)#012#12 0x000055a2cbfb6358 github.com/containers/podman/vendor/github.com/cyphar/filepath-securejoin/p… (podman + 0xd2f358)#012#13 0x000055a2cb7a5dcc sync.(*Once).doSlow (podman + 0x51edcc)#012#14 0x000055a2cb7a5cf9 sync.(*Once).D
o (podman + 0x51ecf9)#012#15 0x000055a2cbfb62c5 github.com/containers/podman/vendor/github.com/cyphar/filepath-securejoin/p… (podman + 0xd2f2c5)#012#16 0x000055a2cbfb779a github.com/containers/podman/vendor/github.com/cyphar/filepath-securejoin/p… (podman + 0xd3079a)#012#17 0x000055a2cbfbe34e github.com/containers/podman/vendor/github.com/opencontainers/selinux/go-se… (podman + 0xd3734e)#012#18 0x000055a2cbfbe838 github.com/containers/podman/vendor/github.com/opencontainers/selinux/go-se… (podman + 0xd37838)#012#19 0x000055a2cbfbd5df github.com/containers/podman/vendor/github.com/opencontainers/selinux/go-se… (podman + 0xd365df)#012#20 0x000055a2cbfbd873 github.com/containers/podman/vendor/github.com/opencontainers/selinux/go-se… (podman + 0xd36873)#012#21 0x000
055a2cc1b5f4b github.com/containers/podman/vendor/go.podman.io/common/pkg/config.defaultC… (podman + 0xf2ef4b)#012#22 0x000055a2cc1b9912 github.com/containers/podman/vendor/go.podman.io/common/pkg/config.newLocked (podman + 0xf32912)#012#23 0x000055a2cc1b9605 github.com/containers/podman/vendor/go.podman.io/common/pkg/config.New (podman + 0xf32605)#012#24 0x000055a2cc92cfd3 github.com/containers/podman/cmd/podman/registry.newPodmanConfig (podman + 0x16a5fd3)#012#25 0x000055a2cb7a5dcc sync.(*Once).doSlow (podman + 0x51edcc)#012#26 0x000055a2cc94dc50 github.com/containers/podman/cmd/podman/common.init (podman + 0x16c6c50)#012#27 0x000055a2cb76ba57 runtime.doInit1 (podman + 0x4e4a57)#012#28 0x000055a2cb75bf90 runtime.main (podman + 0x4d4f90)#012#29 0x000055a2cb79bee1 runtime.goexit.abi0 (podman + 0x514ee1)#012ELF object binary architecture: AMD x86-64
Jul 26 04:34:20 jaws.cs.umd.edu systemd-coredump[1826236]: Process 1826228 (podman) of user 981 dumped core.#012#012Stack trace of thread 1826228:#012#0 0x0000564d6300b46e internal/runtime/syscall/linux.Syscall6 (podman + 0x48b46e)#012#1 0x0000564d630eb0a6 syscall.Syscall (podman + 0x56b0a6)#012#2 0x0000564d630ebc50 syscall.Syscall.abi0 (podman + 0x56bc50)#012#3 0x0000564d63255c2e github.com/containers/podman/vendor/golang.org/x/sys/unix.OpenTree (podman + 0x6d5c2e)#012#4 0x0000564d638aef4b github.com/containers/podman/vendor/github.com/cyphar/filepath-securejoin/p… (podman + 0xd2ef4b)#012#5 0x0000564d638aee54 github.com/containers/podman/vendor/github.com/cyphar/filepath-securejoin/p… (podman + 0xd2ee54)#012#6 0x0000564d6309edcc sync.(*Once).doSlow (podman + 0x51edcc)#012#7 0x0000564d6309ecf9 sync.(*Once).Do (podman + 0x51ecf9)#012#8 0x0000564d638aed
c5 github.com/containers/podman/vendor/github.com/cyphar/filepath-securejoin/p… (podman + 0xd2edc5)#012#9 0x0000564d638b03e2 github.com/containers/podman/vendor/github.com/cyphar/filepath-securejoin/p… (podman + 0xd303e2)#012#10 0x0000564d638b07f3 github.com/containers/podman/vendor/github.com/cyphar/filepath-securejoin/p… (podman + 0xd307f3)#012#11 0x0000564d638af91c github.com/containers/podman/vendor/github.com/cyphar/filepath-securejoin/p… (podman + 0xd2f91c)#012#12 0x0000564d638af358 github.com/containers/podman/vendor/github.com/cyphar/filepath-securejoin/p… (podman + 0xd2f358)#012#13 0x0000564d6309edcc sync.(*Once).doSlow (podman + 0x51edcc)#012#14 0x0000564d6309ecf9 sync.(*Once).D
o (podman + 0x51ecf9)#012#15 0x0000564d638af2c5 github.com/containers/podman/vendor/github.com/cyphar/filepath-securejoin/p… (podman + 0xd2f2c5)#012#16 0x0000564d638b079a github.com/containers/podman/vendor/github.com/cyphar/filepath-securejoin/p… (podman + 0xd3079a)#012#17 0x0000564d638b734e github.com/containers/podman/vendor/github.com/opencontainers/selinux/go-se… (podman + 0xd3734e)#012#18 0x0000564d638b7838 github.com/containers/podman/vendor/github.com/opencontainers/selinux/go-se… (podman + 0xd37838)#012#19 0x0000564d638b65df github.com/containers/podman/vendor/github.com/opencontainers/selinux/go-se… (podman + 0xd365df)#012#20 0x0000564d638b6873 github.com/containers/podman/vendor/github.com/opencontainers/selinux/go-se… (podman + 0xd36873)#012#21 0x000
0564d63aaef4b github.com/containers/podman/vendor/go.podman.io/common/pkg/config.defaultC… (podman + 0xf2ef4b)#012#22 0x0000564d63ab2912 github.com/containers/podman/vendor/go.podman.io/common/pkg/config.newLocked (podman + 0xf32912)#012#23 0x0000564d63ab2605 github.com/containers/podman/vendor/go.podman.io/common/pkg/config.New (podman + 0xf32605)#012#24 0x0000564d64225fd3 github.com/containers/podman/cmd/podman/registry.newPodmanConfig (podman + 0x16a5fd3)#012#25 0x0000564d6309edcc sync.(*Once).doSlow (podman + 0x51edcc)#012#26 0x0000564d64246c50 github.com/containers/podman/cmd/podman/common.init (podman + 0x16c6c50)#012#27 0x0000564d63064a57 runtime.doInit1 (podman + 0x4e4a57)#012#28 0x0000564d63054f90 runtime.main (podman + 0x4d4f90)#012#29 0x0000564d63094ee1 runtime.goexit.abi0 (podman + 0x514ee1)#012ELF object binary architecture: AMD x86-64
Jul 26 04:34:21 jaws.cs.umd.edu systemd-coredump[1826253]: Process 1826243 (podman) of user 981 dumped core.#012#012Stack trace of thread 1826243:#012#0 0x000055be8120246e internal/runtime/syscall/linux.Syscall6 (podman + 0x48b46e)#012#1 0x000055be812e20a6 syscall.Syscall (podman + 0x56b0a6)#012#2 0x000055be812e2c50 syscall.Syscall.abi0 (podman + 0x56bc50)#012#3 0x000055be8144cc2e github.com/containers/podman/vendor/golang.org/x/sys/unix.OpenTree (podman + 0x6d5c2e)#012#4 0x000055be81aa5f4b github.com/containers/podman/vendor/github.com/cyphar/filepath-securejoin/p… (podman + 0xd2ef4b)#012#5 0x000055be81aa5e54 github.com/containers/podman/vendor/github.com/cyphar/filepath-securejoin/p… (podman + 0xd2ee54)#012#6 0x000055be81295dcc sync.(*Once).doSlow (podman + 0x51edcc)#012#7 0x000055be81295cf9 sync.(*Once).Do (podman + 0x51ecf9)#012#8 0x000055be81aa5d
c5 github.com/containers/podman/vendor/github.com/cyphar/filepath-securejoin/p… (podman + 0xd2edc5)#012#9 0x000055be81aa73e2 github.com/containers/podman/vendor/github.com/cyphar/filepath-securejoin/p… (podman + 0xd303e2)#012#10 0x000055be81aa77f3 github.com/containers/podman/vendor/github.com/cyphar/filepath-securejoin/p… (podman + 0xd307f3)#012#11 0x000055be81aa691c github.com/containers/podman/vendor/github.com/cyphar/filepath-securejoin/p… (podman + 0xd2f91c)#012#12 0x000055be81aa6358 github.com/containers/podman/vendor/github.com/cyphar/filepath-securejoin/p… (podman + 0xd2f358)#012#13 0x000055be81295dcc sync.(*Once).doSlow (podman + 0x51edcc)#012#14 0x000055be81295cf9 sync.(*Once).D
o (podman + 0x51ecf9)#012#15 0x000055be81aa62c5 github.com/containers/podman/vendor/github.com/cyphar/filepath-securejoin/p… (podman + 0xd2f2c5)#012#16 0x000055be81aa779a github.com/containers/podman/vendor/github.com/cyphar/filepath-securejoin/p… (podman + 0xd3079a)#012#17 0x000055be81aae34e github.com/containers/podman/vendor/github.com/opencontainers/selinux/go-se… (podman + 0xd3734e)#012#18 0x000055be81aae838 github.com/containers/podman/vendor/github.com/opencontainers/selinux/go-se… (podman + 0xd37838)#012#19 0x000055be81aad5df github.com/containers/podman/vendor/github.com/opencontainers/selinux/go-se… (podman + 0xd365df)#012#20 0x000055be81aad873 github.com/containers/podman/vendor/github.com/opencontainers/selinux/go-se… (podman + 0xd36873)#012#21 0x000
055be81ca5f4b github.com/containers/podman/vendor/go.podman.io/common/pkg/config.defaultC… (podman + 0xf2ef4b)#012#22 0x000055be81ca9912 github.com/containers/podman/vendor/go.podman.io/common/pkg/config.newLocked (podman + 0xf32912)#012#23 0x000055be81ca9605 github.com/containers/podman/vendor/go.podman.io/common/pkg/config.New (podman + 0xf32605)#012#24 0x000055be8241cfd3 github.com/containers/podman/cmd/podman/registry.newPodmanConfig (podman + 0x16a5fd3)#012#25 0x000055be81295dcc sync.(*Once).doSlow (podman + 0x51edcc)#012#26 0x000055be8243dc50 github.com/containers/podman/cmd/podman/common.init (podman + 0x16c6c50)#012#27 0x000055be8125ba57 runtime.doInit1 (podman + 0x4e4a57)#012#28 0x000055be8124bf90 runtime.main (podman + 0x4d4f90)#012#29 0x000055be8128bee1 runtime.goexit.abi0 (podman + 0x514ee1)#012ELF object binary architecture: AMD x86-64
Jul 26 04:34:22 jaws.cs.umd.edu setroubleshoot[1826217]: SELinux is preventing /usr/bin/podman from using the nnp_transition access on a process. For complete SELinux messages run: sealert -l 3c7643bc-dd69-4695-b48c-7d780b62b6cf [x2]
== matrix (11 distinct, 13 total) ==
Jul 26 04:45:59 matrix systemd[1]: networkd-dispatcher.service: Got notification message from PID 2522822, but reception only permitted for main PID 720
Jul 26 04:45:59 matrix systemd[1]: networkd-dispatcher.service: Got notification message from PID 2522828, but reception only permitted for main PID 720
Jul 26 04:46:07 matrix systemd[1]: networkd-dispatcher.service: Got notification message from PID 2522934, but reception only permitted for main PID 720
Jul 26 04:46:07 matrix networkctl[2522945]: Interface "vethd51c889" not found.
Jul 26 04:46:07 matrix systemd[1]: networkd-dispatcher.service: Got notification message from PID 2522945, but reception only permitted for main PID 720 [x2]
Jul 26 04:46:08 matrix systemd[1]: networkd-dispatcher.service: Got notification message from PID 2523007, but reception only permitted for main PID 720
Jul 26 04:46:08 matrix systemd[1]: networkd-dispatcher.service: Got notification message from PID 2523017, but reception only permitted for main PID 720
Jul 26 04:46:17 matrix systemd[1]: networkd-dispatcher.service: Got notification message from PID 2523129, but reception only permitted for main PID 720
Jul 26 04:46:17 matrix systemd[1]: networkd-dispatcher.service: Got notification message from PID 2523134, but reception only permitted for main PID 720
Jul 26 04:46:17 matrix networkctl[2523145]: Interface "vethb4f8c0e" not found.
Jul 26 04:46:17 matrix systemd[1]: networkd-dispatcher.service: Got notification message from PID 2523145, but reception only permitted for main PID 720 [x2]
== netman.cs.umd.edu (3 distinct, 6 total) ==
Jul 26 04:29:57 netman.cs.umd.edu setroubleshoot[1169964]: SELinux is preventing /usr/bin/gpg from read access on the file gpg.conf. For complete SELinux messages run: sealert -l 019ad1da-a874-4814-8037-3b3e5f413ad2 [x2]
Jul 26 04:29:57 netman.cs.umd.edu setroubleshoot[1169964]: SELinux is preventing /usr/bin/gpg from open access on the file /root/.gnupg/gpg.conf. For complete SELinux messages run: sealert -l cb54177e-d44c-46a1-b246-5c0bbb8343be [x2]
Jul 26 04:29:57 netman.cs.umd.edu setroubleshoot[1169964]: SELinux is preventing /usr/bin/gpg from getattr access on the file /root/.gnupg/gpg.conf. For complete SELinux messages run: sealert -l fbba2e30-b7ab-491c-9ec6-f553e9ef72af [x2]
== newhonors2 (1 distinct, 24 total) ==
Jul 26 04:13:03 newhonors2 dhcpcd[296371]: dhcpcd is not running [x24]
== outbound00.cs.umd.edu (1 distinct, 6 total) ==
Jul 26 04:09:09 outbound00.cs.umd.edu python3[3862441]: ldapdb [x6]
== outbound01.cs.umd.edu (1 distinct, 6 total) ==
Jul 26 04:13:06 outbound01.cs.umd.edu python3[1890692]: ldapdb [x6]
== sentry-docker00.cs.umd.edu (36 distinct, 36 total) ==
Jul 26 04:09:15 sentry-docker00.cs.umd.edu systemd-udevd[3766021]: Could not generate persistent MAC address for veth36cbaed: No such file or directory
Jul 26 04:09:15 sentry-docker00.cs.umd.edu systemd-udevd[3766022]: Could not generate persistent MAC address for veth3facc2f: No such file or directory
Jul 26 04:18:24 sentry-docker00.cs.umd.edu systemd-udevd[3770440]: link_config: could not get ethtool features for veth928e5c6
Jul 26 04:18:24 sentry-docker00.cs.umd.edu systemd-udevd[3770440]: Could not set offload features of veth928e5c6: No such device
Jul 26 04:18:24 sentry-docker00.cs.umd.edu systemd-udevd[3770470]: Could not generate persistent MAC address for vethc7fd1c6: No such file or directory
Jul 26 04:18:24 sentry-docker00.cs.umd.edu systemd-udevd[3770471]: Could not generate persistent MAC address for vetha0372b3: No such file or directory
Jul 26 04:18:24 sentry-docker00.cs.umd.edu systemd-udevd[3770474]: Could not generate persistent MAC address for veth5cddec3: No such file or directory
Jul 26 04:18:24 sentry-docker00.cs.umd.edu systemd-udevd[3770475]: Could not generate persistent MAC address for veth7192a72: No such file or directory
Jul 26 04:18:24 sentry-docker00.cs.umd.edu systemd-udevd[3770498]: Could not generate persistent MAC address for vethcb13e77: No such file or directory
Jul 26 04:18:24 sentry-docker00.cs.umd.edu systemd-udevd[3770499]: Could not generate persistent MAC address for veth9d2cbc6: No such file or directory
Jul 26 04:18:24 sentry-docker00.cs.umd.edu systemd-udevd[3770523]: Could not generate persistent MAC address for veth1371aac: No such file or directory
Jul 26 04:18:24 sentry-docker00.cs.umd.edu systemd-udevd[3770502]: Could not generate persistent MAC address for vethc8bd976: No such file or directory
Jul 26 04:29:19 sentry-docker00.cs.umd.edu systemd-udevd[3775553]: Could not generate persistent MAC address for vethfcadaa7: No such file or directory
Jul 26 04:29:19 sentry-docker00.cs.umd.edu systemd-udevd[3775554]: Could not generate persistent MAC address for veth5fd4ff5: No such file or directory
Jul 26 04:38:32 sentry-docker00.cs.umd.edu systemd-udevd[3779880]: link_config: could not get ethtool features for vethcb13e77
Jul 26 04:38:32 sentry-docker00.cs.umd.edu systemd-udevd[3779880]: Could not set offload features of vethcb13e77: No such device
Jul 26 04:38:32 sentry-docker00.cs.umd.edu systemd-udevd[3779913]: Could not generate persistent MAC address for veth3100175: No such file or directory
Jul 26 04:38:32 sentry-docker00.cs.umd.edu systemd-udevd[3779914]: Could not generate persistent MAC address for veth9a517c7: No such file or directory
Jul 26 04:38:32 sentry-docker00.cs.umd.edu systemd-udevd[3779917]: Could not generate persistent MAC address for veth688db57: No such file or directory
Jul 26 04:38:32 sentry-docker00.cs.umd.edu systemd-udevd[3779918]: Could not generate persistent MAC address for veth0c21b68: No such file or directory
Jul 26 04:38:32 sentry-docker00.cs.umd.edu systemd-udevd[3779926]: Could not generate persistent MAC address for veth986ea7a: No such file or directory
Jul 26 04:38:32 sentry-docker00.cs.umd.edu systemd-udevd[3779939]: Could not generate persistent MAC address for veth6dc5e78: No such file or directory
Jul 26 04:38:32 sentry-docker00.cs.umd.edu systemd-udevd[3779924]: Could not generate persistent MAC address for veth5b96877: No such file or directory
Jul 26 04:38:32 sentry-docker00.cs.umd.edu systemd-udevd[3779926]: Could not generate persistent MAC address for vethb435529: No such file or directory
Jul 26 04:49:23 sentry-docker00.cs.umd.edu systemd-udevd[3784956]: Could not generate persistent MAC address for veth67d42ee: No such file or directory
Jul 26 04:49:23 sentry-docker00.cs.umd.edu systemd-udevd[3784957]: Could not generate persistent MAC address for veth3bb4782: No such file or directory
Jul 26 04:58:40 sentry-docker00.cs.umd.edu systemd-udevd[3789298]: link_config: could not get ethtool features for veth6dc5e78
Jul 26 04:58:40 sentry-docker00.cs.umd.edu systemd-udevd[3789298]: Could not set offload features of veth6dc5e78: No such device
Jul 26 04:58:40 sentry-docker00.cs.umd.edu systemd-udevd[3789365]: Could not generate persistent MAC address for veth8addb34: No such file or directory
Jul 26 04:58:40 sentry-docker00.cs.umd.edu systemd-udevd[3789366]: Could not generate persistent MAC address for veth23f0c1b: No such file or directory
... 6 more distinct messages not shown
== soul (1 distinct, 1 total) ==
Jul 26 04:19:43 soul sshd-session[1884217]: fatal: userauth_pubkey: parse publickey packet: incomplete message [preauth]
== strawberry (4 distinct, 10 total) ==
Jul 26 04:09:44 strawberry udisksd[1067]: Error performing housekeeping for drive /org/freedesktop/UDisks2/drives/ST2000DM001_1CH164_W1E8J5KJ: Error updating SMART data: Error sending ATA command CHECK POWER MODE: Unexpected sense data returned:#0120000: 00 00 00 00 00 00 00 00 00 00 00 00 00 00 00 00 ................#0120010: 00 00 00 00 00 00 00 00 00 00 00 00 00 00 00 00 ................#012 (g-io-error-quark, 0) [x6]
Jul 26 04:15:04 strawberry nologin[2803319]: Attempted login by UNKNOWN (UID: 65534) on UNKNOWN
Jul 26 04:15:04 strawberry pipewire[2803318]: mod.jackdbus-detect: Failed to receive jackdbus reply: org.freedesktop.DBus.Error.ServiceUnknown: The name org.jackaudio.service was not provided by any .service files
Jul 26 04:34:42 strawberry smartd[5314]: Device: /dev/sda [SAT], failed to read SMART Attribute Data [x2]
== submit26-b9-4 (9 distinct, 9 total) ==
Jul 26 04:16:11 submit26-b9-4 setroubleshoot[222952]: SELinux is preventing /usr/bin/python3.9 from create access on the directory /(null). For complete SELinux messages run: sealert -l a4e66030-8621-4da9-bd27-5988bb1bf8ad
Jul 26 04:16:11 submit26-b9-4 setroubleshoot[222952]: SELinux is preventing /usr/bin/python3.9 from add_name access on the directory /(null). For complete SELinux messages run: sealert -l c055e37d-bbf5-4800-9083-d606f792c8c1
Jul 26 04:16:11 submit26-b9-4 setroubleshoot[222952]: SELinux is preventing /usr/bin/python3.9 from create access on the file /(null). For complete SELinux messages run: sealert -l e5bc3a56-6d6f-4776-954f-ddde1579648f
Jul 26 04:16:11 submit26-b9-4 setroubleshoot[222952]: SELinux is preventing /usr/bin/python3.9 from open access on the file /tmp/libdnf.AYU0pa/repodata/repomd.xml. For complete SELinux messages run: sealert -l a8ec5e1b-49f9-4fbc-a8ae-22e800f7abf2
Jul 26 04:16:11 submit26-b9-4 setroubleshoot[222952]: SELinux is preventing /usr/bin/python3.9 from setattr access on the file repomd.xml. For complete SELinux messages run: sealert -l 945db714-d0c0-4402-911e-932978b8b036
Jul 26 04:16:11 submit26-b9-4 setroubleshoot[222952]: SELinux is preventing /usr/bin/python3.9 from read access on the directory libdnf.AYU0pa. For complete SELinux messages run: sealert -l 463998a0-fb0d-463c-82b1-471135710a14
Jul 26 04:16:11 submit26-b9-4 setroubleshoot[222952]: SELinux is preventing /usr/bin/python3.9 from remove_name access on the directory repomd.xml. For complete SELinux messages run: sealert -l 473d2e21-15d8-407a-a9ee-2b842607fa00
Jul 26 04:16:11 submit26-b9-4 setroubleshoot[222952]: SELinux is preventing /usr/bin/python3.9 from unlink access on the file repomd.xml. For complete SELinux messages run: sealert -l 80c54d4f-bf4b-4501-addb-1627383587d0
Jul 26 04:16:11 submit26-b9-4 setroubleshoot[222952]: SELinux is preventing /usr/bin/python3.9 from rmdir access on the directory repodata. For complete SELinux messages run: sealert -l c63d3890-151e-49a0-83f0-3dfb69d051e5
== talkhosts9 (1 distinct, 2 total) ==
Jul 26 05:03:15 talkhosts9 setroubleshoot[3554178]: SELinux is preventing /usr/bin/lsof from getattr access on the unix_stream_socket unix_stream_socket. For complete SELinux messages run: sealert -l a6df89b3-c497-469c-8232-c4fde0508abf [x2]
== zfs00.cs.umd.edu (1 distinct, 3 total) ==
Jul 26 04:17:29 zfs00.cs.umd.edu rsyslogd: imrelp[2514]: error 'server closed relp session, session broken', object 'lstn 2514: conn to clt 10.227.96.13/irb2156.csdips.umd.edu' - input may not work as intended [v8.2604.0 try https://www.rsyslog.com/e/2353 ] [x3]
1
0
Command: /usr/local/sbin/syslog-digest.py
Time : 0.4850s
Status : exited 0
Output :
Syslog digest — 2026-07-26 04:05 EDT
Processed 4,250 lines, filtered 3,584 (84%). 666 unknown (103 distinct) from 23 host(s).
== abuse (1 distinct, 345 total) ==
Jul 26 03:05:06 abuse rsyslogd[21745]: imjournal: open() failed for path: '/var/lib/rsyslog/imjournal.state.tmp': Input/output error [v8.2404.0 try https://www.rsyslog.com/e/2433 ] [x345]
== alec.cs.umd.edu (3 distinct, 59 total) ==
Jul 26 03:05:10 alec.cs.umd.edu setroubleshoot[3143930]: failed to retrieve rpm info for path '/run/netns/netns-9dfd0347-71eb-5698-085c-c769043aa5c3': [x12]
Jul 26 03:05:10 alec.cs.umd.edu sedispatch[1526]: AVC Message regarding setroubleshoot, ignoring message [x22]
Jul 26 03:05:10 alec.cs.umd.edu setroubleshoot[3143930]: SELinux is preventing /usr/bin/df from getattr access on the file /run/netns/netns-9dfd0347-71eb-5698-085c-c769043aa5c3. For complete SELinux messages run: sealert -l 23f93208-3063-4aac-b78a-bb0fcb40740c [x25]
== b0b02.cs.umd.edu (4 distinct, 4 total) ==
Jul 26 03:55:22 b0b02.cs.umd.edu rustdesk[645267]: cannot open display:
Jul 26 04:04:48 b0b02.cs.umd.edu setroubleshoot[647300]: SELinux is preventing /usr/bin/python3.9 from getattr access on the file /etc/authselect/nsswitch.conf. For complete SELinux messages run: sealert -l 9a1e2952-3fde-4937-a8ab-f7f59791a458
Jul 26 04:04:51 b0b02.cs.umd.edu setroubleshoot[647300]: SELinux is preventing /usr/bin/python3.9 from read access on the file /etc/authselect/nsswitch.conf. For complete SELinux messages run: sealert -l 97d74423-e027-4cd6-8810-ad80944900b5
Jul 26 04:04:54 b0b02.cs.umd.edu setroubleshoot[647300]: SELinux is preventing /usr/bin/python3.9 from open access on the file /etc/authselect/nsswitch.conf. For complete SELinux messages run: sealert -l 4f253f6a-62d6-46dd-8eaf-0b4d29df41c6
== bac102 (29 distinct, 29 total) ==
Jul 30 03:33:07 bac102 puppet-agent[428694]: (Facter) invalid or malformed lldp data: MalformedDataError: no lldp interface data found
Jul 30 03:33:28 bac102 puppet-agent[428694]: Last metadata expiration check: 1:11:07 ago on Thu Jul 30 02:22:21 2026.
Jul 30 03:33:28 bac102 puppet-agent[428694]: Error:
Jul 30 03:33:28 bac102 puppet-agent[428694]: Problem: conflicting requests
Jul 30 03:33:28 bac102 puppet-agent[428694]: - package falcon-sensor-7.34.0-18708.el10.x86_64 from csd-rhel-10 does not have a compatible architecture
Jul 30 03:33:28 bac102 puppet-agent[428694]: - nothing provides ld-linux-x86-64.so.2()(64bit) needed by falcon-sensor-7.34.0-18708.el10.x86_64 from csd-rhel-10
Jul 30 03:33:28 bac102 puppet-agent[428694]: - nothing provides libm.so.6(GLIBC_2.2.5)(64bit) needed by falcon-sensor-7.34.0-18708.el10.x86_64 from csd-rhel-10
Jul 30 03:33:28 bac102 puppet-agent[428694]: - nothing provides ld-linux-x86-64.so.2(GLIBC_2.3)(64bit) needed by falcon-sensor-7.34.0-18708.el10.x86_64 from csd-rhel-10
Jul 30 03:33:28 bac102 puppet-agent[428694]: - nothing provides libc.so.6(GLIBC_2.9)(64bit) needed by falcon-sensor-7.34.0-18708.el10.x86_64 from csd-rhel-10
Jul 30 03:33:28 bac102 puppet-agent[428694]: - nothing provides libdl.so.2(GLIBC_2.2.5)(64bit) needed by falcon-sensor-7.34.0-18708.el10.x86_64 from csd-rhel-10
Jul 30 03:33:28 bac102 puppet-agent[428694]: - nothing provides libpthread.so.0(GLIBC_2.2.5)(64bit) needed by falcon-sensor-7.34.0-18708.el10.x86_64 from csd-rhel-10
Jul 30 03:33:28 bac102 puppet-agent[428694]: - nothing provides libpthread.so.0(GLIBC_2.3.2)(64bit) needed by falcon-sensor-7.34.0-18708.el10.x86_64 from csd-rhel-10
Jul 30 03:33:28 bac102 puppet-agent[428694]: - nothing provides librt.so.1(GLIBC_2.2.5)(64bit) needed by falcon-sensor-7.34.0-18708.el10.x86_64 from csd-rhel-10
Jul 30 03:33:28 bac102 puppet-agent[428694]: (try to add '--skip-broken' to skip uninstallable packages or '--nobest' to use not only best candidate packages)
Jul 30 03:33:28 bac102 puppet-agent[428694]: (/Stage[main]/Profile::Ditcrowdstrike/Package[falcon-sensor]/ensure) Last metadata expiration check: 1:11:07 ago on Thu Jul 30 02:22:21 2026.
Jul 30 03:33:28 bac102 puppet-agent[428694]: (/Stage[main]/Profile::Ditcrowdstrike/Package[falcon-sensor]/ensure) Error:
Jul 30 03:33:28 bac102 puppet-agent[428694]: (/Stage[main]/Profile::Ditcrowdstrike/Package[falcon-sensor]/ensure) Problem: conflicting requests
Jul 30 03:33:28 bac102 puppet-agent[428694]: (/Stage[main]/Profile::Ditcrowdstrike/Package[falcon-sensor]/ensure) - package falcon-sensor-7.34.0-18708.el10.x86_64 from csd-rhel-10 does not have a compatible architecture
Jul 30 03:33:28 bac102 puppet-agent[428694]: (/Stage[main]/Profile::Ditcrowdstrike/Package[falcon-sensor]/ensure) - nothing provides ld-linux-x86-64.so.2()(64bit) needed by falcon-sensor-7.34.0-18708.el10.x86_64 from csd-rhel-10
Jul 30 03:33:28 bac102 puppet-agent[428694]: (/Stage[main]/Profile::Ditcrowdstrike/Package[falcon-sensor]/ensure) - nothing provides libm.so.6(GLIBC_2.2.5)(64bit) needed by falcon-sensor-7.34.0-18708.el10.x86_64 from csd-rhel-10
Jul 30 03:33:28 bac102 puppet-agent[428694]: (/Stage[main]/Profile::Ditcrowdstrike/Package[falcon-sensor]/ensure) - nothing provides ld-linux-x86-64.so.2(GLIBC_2.3)(64bit) needed by falcon-sensor-7.34.0-18708.el10.x86_64 from csd-rhel-10
Jul 30 03:33:28 bac102 puppet-agent[428694]: (/Stage[main]/Profile::Ditcrowdstrike/Package[falcon-sensor]/ensure) - nothing provides libc.so.6(GLIBC_2.9)(64bit) needed by falcon-sensor-7.34.0-18708.el10.x86_64 from csd-rhel-10
Jul 30 03:33:28 bac102 puppet-agent[428694]: (/Stage[main]/Profile::Ditcrowdstrike/Package[falcon-sensor]/ensure) - nothing provides libdl.so.2(GLIBC_2.2.5)(64bit) needed by falcon-sensor-7.34.0-18708.el10.x86_64 from csd-rhel-10
Jul 30 03:33:28 bac102 puppet-agent[428694]: (/Stage[main]/Profile::Ditcrowdstrike/Package[falcon-sensor]/ensure) - nothing provides libpthread.so.0(GLIBC_2.2.5)(64bit) needed by falcon-sensor-7.34.0-18708.el10.x86_64 from csd-rhel-10
Jul 30 03:33:28 bac102 puppet-agent[428694]: (/Stage[main]/Profile::Ditcrowdstrike/Package[falcon-sensor]/ensure) - nothing provides libpthread.so.0(GLIBC_2.3.2)(64bit) needed by falcon-sensor-7.34.0-18708.el10.x86_64 from csd-rhel-10
Jul 30 03:33:28 bac102 puppet-agent[428694]: (/Stage[main]/Profile::Ditcrowdstrike/Package[falcon-sensor]/ensure) - nothing provides librt.so.1(GLIBC_2.2.5)(64bit) needed by falcon-sensor-7.34.0-18708.el10.x86_64 from csd-rhel-10
Jul 30 03:33:28 bac102 puppet-agent[428694]: (/Stage[main]/Profile::Ditcrowdstrike/Package[falcon-sensor]/ensure) (try to add '--skip-broken' to skip uninstallable packages or '--nobest' to use not only best candidate packages)
Jul 30 03:33:28 bac102 puppet-agent[428694]: (/Stage[main]/Profile::Ditcrowdstrike/Exec[falcon_set_cid]) Skipping because of failed dependencies
Jul 30 03:33:28 bac102 puppet-agent[428694]: (/Stage[main]/Profile::Ditcrowdstrike/Service[falcon-sensor]) Skipping because of failed dependencies
== cmsc436-0101-redis (3 distinct, 3 total) ==
Jul 26 04:02:45 cmsc436-0101-redis krb5_child[304760]: Client 'admin(a)UMD.EDU' not found in Kerberos database
Jul 26 04:02:46 cmsc436-0101-redis sshd-session[304756]: error: PAM: Authentication failure for admin from 34.62.49.5
Jul 26 04:02:49 cmsc436-0101-redis sshd-session[304762]: error: Protocol major versions differ: 2 vs. 1
== contest (1 distinct, 33 total) ==
Jul 26 03:06:29 contest goferd[1007]: [ERROR][worker-0] gofer.messaging.adapter.connect:33 - connect: proton+amqps://satellite8.cs.umd.edu:5647, failed: Connection amqps://satellite8.cs.umd.edu:5647 disconnected: Condition('proton.pythonio', 'Connection refused to all addresses') [x33]
== csfw00a (1 distinct, 46 total) ==
Jul 26 03:04:37 csfw00a kernel: bnxt_en 0000:09:00.0 eth3: NIC Link is Down [x46]
== hackerman (1 distinct, 1 total) ==
Jul 26 03:19:01 hackerman gnome-software[2060381]: failed to commit changes to dconf: GDBus.Error:org.gtk.GDBus.UnmappedGError.Quark._g_2dfile_2derror_2dquark.Code2: Failed to create file “/adminhomes/sajith/.config/dconf/user.XULAT3”: Permission denied
== idm00 (1 distinct, 1 total) ==
Jul 26 03:51:07 idm00 named[1455]: client @0x7f33040e61c8 10.73.240.42#64948: update '73.10.in-addr.arpa/IN' denied
== idmp0 (1 distinct, 1 total) ==
Jul 26 03:34:56 idmp0 named[5198]: client @0x7f992c0104c8 10.73.240.43#49291: update '73.10.in-addr.arpa/IN' denied
== itmon02 (2 distinct, 46 total) ==
Jul 26 03:07:48 itmon02 sshd[1834]: error: beginning MaxStartups throttling [x45]
Jul 26 03:15:03 itmon02 (httpd)[4132266]: httpd.service: Referenced but unset environment variable evaluates to an empty string: OPTIONS
== kadath.cs.umd.edu (1 distinct, 1 total) ==
Jul 26 03:47:31 kadath.cs.umd.edu puppet-agent[3890438]: (Facter) invalid or malformed lldp data: MalformedDataError: no lldp interface data found
== neoavion (1 distinct, 1 total) ==
Jul 26 03:34:22 neoavion krb5_child[1700130]: No credentials cache found
== netbox (1 distinct, 1 total) ==
Jul 26 03:08:02 netbox (httpd)[352116]: httpd.service: Referenced but unset environment variable evaluates to an empty string: OPTIONS
== newhonors.cs.umd.edu (1 distinct, 1 total) ==
Jul 26 03:10:35 newhonors.cs.umd.edu sshd[27118]: fatal: ssh_packet_get_string: incomplete message [preauth]
== newhonors2 (1 distinct, 24 total) ==
Jul 26 03:13:03 newhonors2 dhcpcd[293912]: dhcpcd is not running [x24]
== outbound00.cs.umd.edu (2 distinct, 8 total) ==
Jul 26 03:09:08 outbound00.cs.umd.edu python3[3847795]: ldapdb [x7]
Jul 26 03:24:12 outbound00.cs.umd.edu systemd[1]: Configuration file /usr/lib/systemd/system/authentication_milter.service is marked executable. Please remove executable permission bits. Proceeding anyway.
== outbound01.cs.umd.edu (1 distinct, 6 total) ==
Jul 26 03:13:06 outbound01.cs.umd.edu python3[1876894]: ldapdb [x6]
== sebatinsky.cs.umd.edu (1 distinct, 1 total) ==
Jul 26 03:57:20 sebatinsky.cs.umd.edu setroubleshoot[3614207]: SELinux is preventing /usr/sbin/pdns_server from name_bind access on the udp_socket port 11111. For complete SELinux messages run: sealert -l 0638297d-b4c1-4e8b-8c20-8dfaa882adcf
== sentry-docker00.cs.umd.edu (42 distinct, 42 total) ==
Jul 26 03:08:58 sentry-docker00.cs.umd.edu systemd-udevd[3737898]: link_config: could not get ethtool features for veth17b602f
Jul 26 03:08:58 sentry-docker00.cs.umd.edu systemd-udevd[3737898]: Could not set offload features of veth17b602f: No such device
Jul 26 03:08:58 sentry-docker00.cs.umd.edu systemd-udevd[3737914]: Could not generate persistent MAC address for vethc5f2f62: No such file or directory
Jul 26 03:08:58 sentry-docker00.cs.umd.edu systemd-udevd[3737915]: Could not generate persistent MAC address for vethabec51d: No such file or directory
Jul 26 03:17:59 sentry-docker00.cs.umd.edu systemd-udevd[3741148]: link_config: could not get ethtool features for vethb334687
Jul 26 03:17:59 sentry-docker00.cs.umd.edu systemd-udevd[3741148]: Could not set offload features of vethb334687: No such device
Jul 26 03:17:59 sentry-docker00.cs.umd.edu systemd-udevd[3741210]: Could not generate persistent MAC address for veth6887600: No such file or directory
Jul 26 03:17:59 sentry-docker00.cs.umd.edu systemd-udevd[3741211]: Could not generate persistent MAC address for veth7e6fb8c: No such file or directory
Jul 26 03:17:59 sentry-docker00.cs.umd.edu systemd-udevd[3741214]: Could not generate persistent MAC address for vethdf9bc9c: No such file or directory
Jul 26 03:17:59 sentry-docker00.cs.umd.edu systemd-udevd[3741215]: Could not generate persistent MAC address for vethcc6357a: No such file or directory
Jul 26 03:17:59 sentry-docker00.cs.umd.edu systemd-udevd[3741234]: Could not generate persistent MAC address for vethbaccc6d: No such file or directory
Jul 26 03:17:59 sentry-docker00.cs.umd.edu systemd-udevd[3741218]: Could not generate persistent MAC address for vethfb51eeb: No such file or directory
Jul 26 03:17:59 sentry-docker00.cs.umd.edu systemd-udevd[3741240]: Could not generate persistent MAC address for veth0c0e312: No such file or directory
Jul 26 03:17:59 sentry-docker00.cs.umd.edu systemd-udevd[3741241]: Could not generate persistent MAC address for vethab50961: No such file or directory
Jul 26 03:29:02 sentry-docker00.cs.umd.edu systemd-udevd[3747348]: link_config: could not get ethtool features for vethc5f2f62
Jul 26 03:29:02 sentry-docker00.cs.umd.edu systemd-udevd[3747348]: Could not set offload features of vethc5f2f62: No such device
Jul 26 03:29:02 sentry-docker00.cs.umd.edu systemd-udevd[3747366]: Could not generate persistent MAC address for veth4378d5f: No such file or directory
Jul 26 03:29:02 sentry-docker00.cs.umd.edu systemd-udevd[3747367]: Could not generate persistent MAC address for vethaf3df18: No such file or directory
Jul 26 03:38:07 sentry-docker00.cs.umd.edu systemd-udevd[3750713]: link_config: could not get ethtool features for veth0c0e312
Jul 26 03:38:07 sentry-docker00.cs.umd.edu systemd-udevd[3750713]: Could not set offload features of veth0c0e312: No such device
Jul 26 03:38:07 sentry-docker00.cs.umd.edu systemd-udevd[3750798]: Could not generate persistent MAC address for veth68323a0: No such file or directory
Jul 26 03:38:07 sentry-docker00.cs.umd.edu systemd-udevd[3750799]: Could not generate persistent MAC address for veth696c088: No such file or directory
Jul 26 03:38:07 sentry-docker00.cs.umd.edu systemd-udevd[3750802]: Could not generate persistent MAC address for veth4aad637: No such file or directory
Jul 26 03:38:07 sentry-docker00.cs.umd.edu systemd-udevd[3750803]: Could not generate persistent MAC address for veth47811eb: No such file or directory
Jul 26 03:38:07 sentry-docker00.cs.umd.edu systemd-udevd[3750827]: Could not generate persistent MAC address for veth0e55190: No such file or directory
Jul 26 03:38:07 sentry-docker00.cs.umd.edu systemd-udevd[3750828]: Could not generate persistent MAC address for veth0ec1e63: No such file or directory
Jul 26 03:38:07 sentry-docker00.cs.umd.edu systemd-udevd[3750843]: Could not generate persistent MAC address for veth90558ec: No such file or directory
Jul 26 03:38:07 sentry-docker00.cs.umd.edu systemd-udevd[3750832]: Could not generate persistent MAC address for vetha4b2580: No such file or directory
Jul 26 03:49:06 sentry-docker00.cs.umd.edu systemd-udevd[3756587]: link_config: could not get ethtool features for veth4378d5f
Jul 26 03:49:06 sentry-docker00.cs.umd.edu systemd-udevd[3756587]: Could not set offload features of veth4378d5f: No such device
... 12 more distinct messages not shown
== strawberry (2 distinct, 8 total) ==
Jul 26 03:09:44 strawberry udisksd[1067]: Error performing housekeeping for drive /org/freedesktop/UDisks2/drives/ST2000DM001_1CH164_W1E8J5KJ: Error updating SMART data: Error sending ATA command CHECK POWER MODE: Unexpected sense data returned:#0120000: 00 00 00 00 00 00 00 00 00 00 00 00 00 00 00 00 ................#0120010: 00 00 00 00 00 00 00 00 00 00 00 00 00 00 00 00 ................#012 (g-io-error-quark, 0) [x6]
Jul 26 03:34:42 strawberry smartd[5314]: Device: /dev/sda [SAT], failed to read SMART Attribute Data [x2]
== zebatinsky.cs.umd.edu (1 distinct, 1 total) ==
Jul 26 03:40:09 zebatinsky.cs.umd.edu setroubleshoot[3346925]: SELinux is preventing pdns/comm-main from name_bind access on the udp_socket port 16851. For complete SELinux messages run: sealert -l 9bd50d3c-e338-4d6a-af7b-ff1c9630b926
== zfs00.cs.umd.edu (2 distinct, 4 total) ==
Jul 26 03:20:14 zfs00.cs.umd.edu rsyslogd: imrelp[2514]: error 'server closed relp session, session broken', object 'lstn 2514: conn to clt 10.227.96.13/irb2156.csdips.umd.edu' - input may not work as intended [v8.2604.0 try https://www.rsyslog.com/e/2353 ] [x3]
Jul 26 03:44:22 zfs00.cs.umd.edu kernel: kauditd_printk_skb: 4 callbacks suppressed
1
0
Command: /usr/local/sbin/syslog-digest.py
Time : 0.5215s
Status : exited 0
Output :
Syslog digest — 2026-07-26 03:05 EDT
Processed 4,328 lines, filtered 3,535 (81%). 793 unknown (76 distinct) from 22 host(s).
== abuse (1 distinct, 348 total) ==
Jul 26 02:05:06 abuse rsyslogd[21745]: imjournal: open() failed for path: '/var/lib/rsyslog/imjournal.state.tmp': Input/output error [v8.2404.0 try https://www.rsyslog.com/e/2433 ] [x348]
== alec.cs.umd.edu (3 distinct, 60 total) ==
Jul 26 02:05:06 alec.cs.umd.edu setroubleshoot[3129161]: failed to retrieve rpm info for path '/run/netns/netns-9dfd0347-71eb-5698-085c-c769043aa5c3': [x12]
Jul 26 02:05:07 alec.cs.umd.edu sedispatch[1526]: AVC Message regarding setroubleshoot, ignoring message [x24]
Jul 26 02:05:07 alec.cs.umd.edu setroubleshoot[3129161]: SELinux is preventing /usr/bin/df from getattr access on the file /run/netns/netns-9dfd0347-71eb-5698-085c-c769043aa5c3. For complete SELinux messages run: sealert -l 23f93208-3063-4aac-b78a-bb0fcb40740c [x24]
== b0b02.cs.umd.edu (4 distinct, 4 total) ==
Jul 26 02:55:20 b0b02.cs.umd.edu rustdesk[630172]: cannot open display:
Jul 26 03:04:43 b0b02.cs.umd.edu setroubleshoot[632201]: SELinux is preventing /usr/bin/python3.9 from getattr access on the file /etc/authselect/nsswitch.conf. For complete SELinux messages run: sealert -l 9a1e2952-3fde-4937-a8ab-f7f59791a458
Jul 26 03:04:46 b0b02.cs.umd.edu setroubleshoot[632201]: SELinux is preventing /usr/bin/python3.9 from read access on the file /etc/authselect/nsswitch.conf. For complete SELinux messages run: sealert -l 97d74423-e027-4cd6-8810-ad80944900b5
Jul 26 03:04:49 b0b02.cs.umd.edu setroubleshoot[632201]: SELinux is preventing /usr/bin/python3.9 from open access on the file /etc/authselect/nsswitch.conf. For complete SELinux messages run: sealert -l 4f253f6a-62d6-46dd-8eaf-0b4d29df41c6
== contest (1 distinct, 34 total) ==
Jul 26 02:05:47 contest goferd[1007]: [ERROR][worker-0] gofer.messaging.adapter.connect:33 - connect: proton+amqps://satellite8.cs.umd.edu:5647, failed: Connection amqps://satellite8.cs.umd.edu:5647 disconnected: Condition('proton.pythonio', 'Connection refused to all addresses') [x34]
== csfw00a (1 distinct, 198 total) ==
Jul 26 02:06:10 csfw00a kernel: bnxt_en 0000:09:00.0 eth3: NIC Link is Down [x198]
== idm00 (1 distinct, 1 total) ==
Jul 26 02:51:07 idm00 named[1455]: client @0x7f331556a5b8 10.73.240.42#51019: update '73.10.in-addr.arpa/IN' denied
== idmp0 (1 distinct, 1 total) ==
Jul 26 02:34:56 idmp0 named[5198]: client @0x7f98e88d1c18 10.73.240.43#61102: update '73.10.in-addr.arpa/IN' denied
== inbound00.cs.umd.edu (2 distinct, 2 total) ==
Jul 26 02:36:03 inbound00.cs.umd.edu krb5_child[3861079]: Client 'admin(a)UMD.EDU' not found in Kerberos database
Jul 26 02:37:31 inbound00.cs.umd.edu sshd-session[3861291]: error: Protocol major versions differ: 2 vs. 1
== inbound01.cs.umd.edu (1 distinct, 1 total) ==
Jul 26 02:33:15 inbound01.cs.umd.edu krb5_child[1878587]: Client 'admin(a)UMD.EDU' not found in Kerberos database
== itmon02 (1 distinct, 39 total) ==
Jul 26 02:08:13 itmon02 sshd[1834]: error: beginning MaxStartups throttling [x39]
== jaws.cs.umd.edu (4 distinct, 5 total) ==
Jul 26 02:34:17 jaws.cs.umd.edu systemd-coredump[1799146]: Process 1799130 (podman) of user 981 dumped core.#012#012Stack trace of thread 1799130:#012#0 0x000056329c6cc46e internal/runtime/syscall/linux.Syscall6 (podman + 0x48b46e)#012#1 0x000056329c7ac0a6 syscall.Syscall (podman + 0x56b0a6)#012#2 0x000056329c7acc50 syscall.Syscall.abi0 (podman + 0x56bc50)#012#3 0x000056329c916c2e github.com/containers/podman/vendor/golang.org/x/sys/unix.OpenTree (podman + 0x6d5c2e)#012#4 0x000056329cf6ff4b github.com/containers/podman/vendor/github.com/cyphar/filepath-securejoin/p… (podman + 0xd2ef4b)#012#5 0x000056329cf6fe54 github.com/containers/podman/vendor/github.com/cyphar/filepath-securejoin/p… (podman + 0xd2ee54)#012#6 0x000056329c75fdcc sync.(*Once).doSlow (podman + 0x51edcc)#012#7 0x000056329c75fcf9 sync.(*Once).Do (podman + 0x51ecf9)#012#8 0x000056329cf6fd
c5 github.com/containers/podman/vendor/github.com/cyphar/filepath-securejoin/p… (podman + 0xd2edc5)#012#9 0x000056329cf713e2 github.com/containers/podman/vendor/github.com/cyphar/filepath-securejoin/p… (podman + 0xd303e2)#012#10 0x000056329cf717f3 github.com/containers/podman/vendor/github.com/cyphar/filepath-securejoin/p… (podman + 0xd307f3)#012#11 0x000056329cf7091c github.com/containers/podman/vendor/github.com/cyphar/filepath-securejoin/p… (podman + 0xd2f91c)#012#12 0x000056329cf70358 github.com/containers/podman/vendor/github.com/cyphar/filepath-securejoin/p… (podman + 0xd2f358)#012#13 0x000056329c75fdcc sync.(*Once).doSlow (podman + 0x51edcc)#012#14 0x000056329c75fcf9 sync.(*Once).D
o (podman + 0x51ecf9)#012#15 0x000056329cf702c5 github.com/containers/podman/vendor/github.com/cyphar/filepath-securejoin/p… (podman + 0xd2f2c5)#012#16 0x000056329cf7179a github.com/containers/podman/vendor/github.com/cyphar/filepath-securejoin/p… (podman + 0xd3079a)#012#17 0x000056329cf7834e github.com/containers/podman/vendor/github.com/opencontainers/selinux/go-se… (podman + 0xd3734e)#012#18 0x000056329cf78838 github.com/containers/podman/vendor/github.com/opencontainers/selinux/go-se… (podman + 0xd37838)#012#19 0x000056329cf775df github.com/containers/podman/vendor/github.com/opencontainers/selinux/go-se… (podman + 0xd365df)#012#20 0x000056329cf77873 github.com/containers/podman/vendor/github.com/opencontainers/selinux/go-se… (podman + 0xd36873)#012#21 0x000
056329d16ff4b github.com/containers/podman/vendor/go.podman.io/common/pkg/config.defaultC… (podman + 0xf2ef4b)#012#22 0x000056329d173912 github.com/containers/podman/vendor/go.podman.io/common/pkg/config.newLocked (podman + 0xf32912)#012#23 0x000056329d173605 github.com/containers/podman/vendor/go.podman.io/common/pkg/config.New (podman + 0xf32605)#012#24 0x000056329d8e6fd3 github.com/containers/podman/cmd/podman/registry.newPodmanConfig (podman + 0x16a5fd3)#012#25 0x000056329c75fdcc sync.(*Once).doSlow (podman + 0x51edcc)#012#26 0x000056329d907c50 github.com/containers/podman/cmd/podman/common.init (podman + 0x16c6c50)#012#27 0x000056329c725a57 runtime.doInit1 (podman + 0x4e4a57)#012#28 0x000056329c715f90 runtime.main (podman + 0x4d4f90)#012#29 0x000056329c755ee1 runtime.goexit.abi0 (podman + 0x514ee1)#012ELF object binary architecture: AMD x86-64
Jul 26 02:34:17 jaws.cs.umd.edu systemd-coredump[1799164]: Process 1799155 (podman) of user 981 dumped core.#012#012Stack trace of thread 1799155:#012#0 0x000055b09f00046e internal/runtime/syscall/linux.Syscall6 (podman + 0x48b46e)#012#1 0x000055b09f0e00a6 syscall.Syscall (podman + 0x56b0a6)#012#2 0x000055b09f0e0c50 syscall.Syscall.abi0 (podman + 0x56bc50)#012#3 0x000055b09f24ac2e github.com/containers/podman/vendor/golang.org/x/sys/unix.OpenTree (podman + 0x6d5c2e)#012#4 0x000055b09f8a3f4b github.com/containers/podman/vendor/github.com/cyphar/filepath-securejoin/p… (podman + 0xd2ef4b)#012#5 0x000055b09f8a3e54 github.com/containers/podman/vendor/github.com/cyphar/filepath-securejoin/p… (podman + 0xd2ee54)#012#6 0x000055b09f093dcc sync.(*Once).doSlow (podman + 0x51edcc)#012#7 0x000055b09f093cf9 sync.(*Once).Do (podman + 0x51ecf9)#012#8 0x000055b09f8a3d
c5 github.com/containers/podman/vendor/github.com/cyphar/filepath-securejoin/p… (podman + 0xd2edc5)#012#9 0x000055b09f8a53e2 github.com/containers/podman/vendor/github.com/cyphar/filepath-securejoin/p… (podman + 0xd303e2)#012#10 0x000055b09f8a57f3 github.com/containers/podman/vendor/github.com/cyphar/filepath-securejoin/p… (podman + 0xd307f3)#012#11 0x000055b09f8a491c github.com/containers/podman/vendor/github.com/cyphar/filepath-securejoin/p… (podman + 0xd2f91c)#012#12 0x000055b09f8a4358 github.com/containers/podman/vendor/github.com/cyphar/filepath-securejoin/p… (podman + 0xd2f358)#012#13 0x000055b09f093dcc sync.(*Once).doSlow (podman + 0x51edcc)#012#14 0x000055b09f093cf9 sync.(*Once).D
o (podman + 0x51ecf9)#012#15 0x000055b09f8a42c5 github.com/containers/podman/vendor/github.com/cyphar/filepath-securejoin/p… (podman + 0xd2f2c5)#012#16 0x000055b09f8a579a github.com/containers/podman/vendor/github.com/cyphar/filepath-securejoin/p… (podman + 0xd3079a)#012#17 0x000055b09f8ac34e github.com/containers/podman/vendor/github.com/opencontainers/selinux/go-se… (podman + 0xd3734e)#012#18 0x000055b09f8ac838 github.com/containers/podman/vendor/github.com/opencontainers/selinux/go-se… (podman + 0xd37838)#012#19 0x000055b09f8ab5df github.com/containers/podman/vendor/github.com/opencontainers/selinux/go-se… (podman + 0xd365df)#012#20 0x000055b09f8ab873 github.com/containers/podman/vendor/github.com/opencontainers/selinux/go-se… (podman + 0xd36873)#012#21 0x000
055b09faa3f4b github.com/containers/podman/vendor/go.podman.io/common/pkg/config.defaultC… (podman + 0xf2ef4b)#012#22 0x000055b09faa7912 github.com/containers/podman/vendor/go.podman.io/common/pkg/config.newLocked (podman + 0xf32912)#012#23 0x000055b09faa7605 github.com/containers/podman/vendor/go.podman.io/common/pkg/config.New (podman + 0xf32605)#012#24 0x000055b0a021afd3 github.com/containers/podman/cmd/podman/registry.newPodmanConfig (podman + 0x16a5fd3)#012#25 0x000055b09f093dcc sync.(*Once).doSlow (podman + 0x51edcc)#012#26 0x000055b0a023bc50 github.com/containers/podman/cmd/podman/common.init (podman + 0x16c6c50)#012#27 0x000055b09f059a57 runtime.doInit1 (podman + 0x4e4a57)#012#28 0x000055b09f049f90 runtime.main (podman + 0x4d4f90)#012#29 0x000055b09f089ee1 runtime.goexit.abi0 (podman + 0x514ee1)#012ELF object binary architecture: AMD x86-64
Jul 26 02:34:19 jaws.cs.umd.edu systemd-coredump[1799196]: Process 1799179 (podman) of user 981 dumped core.#012#012Stack trace of thread 1799179:#012#0 0x0000558eb15a646e internal/runtime/syscall/linux.Syscall6 (podman + 0x48b46e)#012#1 0x0000558eb16860a6 syscall.Syscall (podman + 0x56b0a6)#012#2 0x0000558eb1686c50 syscall.Syscall.abi0 (podman + 0x56bc50)#012#3 0x0000558eb17f0c2e github.com/containers/podman/vendor/golang.org/x/sys/unix.OpenTree (podman + 0x6d5c2e)#012#4 0x0000558eb1e49f4b github.com/containers/podman/vendor/github.com/cyphar/filepath-securejoin/p… (podman + 0xd2ef4b)#012#5 0x0000558eb1e49e54 github.com/containers/podman/vendor/github.com/cyphar/filepath-securejoin/p… (podman + 0xd2ee54)#012#6 0x0000558eb1639dcc sync.(*Once).doSlow (podman + 0x51edcc)#012#7 0x0000558eb1639cf9 sync.(*Once).Do (podman + 0x51ecf9)#012#8 0x0000558eb1e49d
c5 github.com/containers/podman/vendor/github.com/cyphar/filepath-securejoin/p… (podman + 0xd2edc5)#012#9 0x0000558eb1e4b3e2 github.com/containers/podman/vendor/github.com/cyphar/filepath-securejoin/p… (podman + 0xd303e2)#012#10 0x0000558eb1e4b7f3 github.com/containers/podman/vendor/github.com/cyphar/filepath-securejoin/p… (podman + 0xd307f3)#012#11 0x0000558eb1e4a91c github.com/containers/podman/vendor/github.com/cyphar/filepath-securejoin/p… (podman + 0xd2f91c)#012#12 0x0000558eb1e4a358 github.com/containers/podman/vendor/github.com/cyphar/filepath-securejoin/p… (podman + 0xd2f358)#012#13 0x0000558eb1639dcc sync.(*Once).doSlow (podman + 0x51edcc)#012#14 0x0000558eb1639cf9 sync.(*Once).D
o (podman + 0x51ecf9)#012#15 0x0000558eb1e4a2c5 github.com/containers/podman/vendor/github.com/cyphar/filepath-securejoin/p… (podman + 0xd2f2c5)#012#16 0x0000558eb1e4b79a github.com/containers/podman/vendor/github.com/cyphar/filepath-securejoin/p… (podman + 0xd3079a)#012#17 0x0000558eb1e5234e github.com/containers/podman/vendor/github.com/opencontainers/selinux/go-se… (podman + 0xd3734e)#012#18 0x0000558eb1e52838 github.com/containers/podman/vendor/github.com/opencontainers/selinux/go-se… (podman + 0xd37838)#012#19 0x0000558eb1e515df github.com/containers/podman/vendor/github.com/opencontainers/selinux/go-se… (podman + 0xd365df)#012#20 0x0000558eb1e51873 github.com/containers/podman/vendor/github.com/opencontainers/selinux/go-se… (podman + 0xd36873)#012#21 0x000
0558eb2049f4b github.com/containers/podman/vendor/go.podman.io/common/pkg/config.defaultC… (podman + 0xf2ef4b)#012#22 0x0000558eb204d912 github.com/containers/podman/vendor/go.podman.io/common/pkg/config.newLocked (podman + 0xf32912)#012#23 0x0000558eb204d605 github.com/containers/podman/vendor/go.podman.io/common/pkg/config.New (podman + 0xf32605)#012#24 0x0000558eb27c0fd3 github.com/containers/podman/cmd/podman/registry.newPodmanConfig (podman + 0x16a5fd3)#012#25 0x0000558eb1639dcc sync.(*Once).doSlow (podman + 0x51edcc)#012#26 0x0000558eb27e1c50 github.com/containers/podman/cmd/podman/common.init (podman + 0x16c6c50)#012#27 0x0000558eb15ffa57 runtime.doInit1 (podman + 0x4e4a57)#012#28 0x0000558eb15eff90 runtime.main (podman + 0x4d4f90)#012#29 0x0000558eb162fee1 runtime.goexit.abi0 (podman + 0x514ee1)#012ELF object binary architecture: AMD x86-64
Jul 26 02:34:19 jaws.cs.umd.edu setroubleshoot[1799132]: SELinux is preventing /usr/bin/podman from using the nnp_transition access on a process. For complete SELinux messages run: sealert -l 3c7643bc-dd69-4695-b48c-7d780b62b6cf [x2]
== jubjub.cs.umd.edu (1 distinct, 1 total) ==
Jul 26 02:15:05 jubjub.cs.umd.edu kernel: perf: interrupt took too long (6169 > 6153), lowering kernel.perf_event_max_sample_rate to 32000
== krispykreme.cs.umd.edu (3 distinct, 3 total) ==
Jul 26 02:33:45 krispykreme.cs.umd.edu sshd-session[3650617]: pam_access(sshd:auth): access denied for user `admin' from `34.34.169.50'
Jul 26 02:33:46 krispykreme.cs.umd.edu krb5_child[3650619]: Client 'admin(a)UMD.EDU' not found in Kerberos database
Jul 26 02:33:46 krispykreme.cs.umd.edu sshd-session[3650614]: error: PAM: System error for admin from 34.34.169.50
== mcstic (2 distinct, 5 total) ==
Jul 26 03:03:26 mcstic krb5_child[1663064]: Client 'admin(a)UMD.EDU' not found in Kerberos database [x4]
Jul 26 03:03:31 mcstic sshd[1663059]: error: PAM: Authentication failure for admin from 34.53.244.63
== netman.cs.umd.edu (1 distinct, 1 total) ==
Jul 26 02:29:42 netman.cs.umd.edu sshd[1136868]: error: PAM: Authentication failure for postgres from 121.164.135.251
== newhonors2 (1 distinct, 24 total) ==
Jul 26 02:13:02 newhonors2 dhcpcd[292064]: dhcpcd is not running [x24]
== outbound00.cs.umd.edu (1 distinct, 6 total) ==
Jul 26 02:09:09 outbound00.cs.umd.edu python3[3833790]: ldapdb [x6]
== outbound01.cs.umd.edu (1 distinct, 6 total) ==
Jul 26 02:13:07 outbound01.cs.umd.edu python3[1863031]: ldapdb [x6]
== sebatinsky.cs.umd.edu (1 distinct, 1 total) ==
Jul 26 03:00:15 sebatinsky.cs.umd.edu setroubleshoot[3605545]: SELinux is preventing /usr/sbin/pdns_server from name_bind access on the udp_socket port 10081. For complete SELinux messages run: sealert -l af222830-ab0f-4bc8-91ab-730551076ae5
== sentry-docker00.cs.umd.edu (42 distinct, 42 total) ==
Jul 26 02:08:41 sentry-docker00.cs.umd.edu systemd-udevd[3709209]: link_config: could not get ethtool features for vethd08bff0
Jul 26 02:08:41 sentry-docker00.cs.umd.edu systemd-udevd[3709209]: Could not set offload features of vethd08bff0: No such device
Jul 26 02:08:41 sentry-docker00.cs.umd.edu systemd-udevd[3709218]: Could not generate persistent MAC address for vethbde3431: No such file or directory
Jul 26 02:08:41 sentry-docker00.cs.umd.edu systemd-udevd[3709219]: Could not generate persistent MAC address for veth5b7940e: No such file or directory
Jul 26 02:17:34 sentry-docker00.cs.umd.edu systemd-udevd[3712463]: link_config: could not get ethtool features for vethfa04ed5
Jul 26 02:17:34 sentry-docker00.cs.umd.edu systemd-udevd[3712463]: Could not set offload features of vethfa04ed5: No such device
Jul 26 02:17:34 sentry-docker00.cs.umd.edu systemd-udevd[3712493]: Could not generate persistent MAC address for veth4dbdda2: No such file or directory
Jul 26 02:17:34 sentry-docker00.cs.umd.edu systemd-udevd[3712494]: Could not generate persistent MAC address for vethbc5c1fc: No such file or directory
Jul 26 02:17:34 sentry-docker00.cs.umd.edu systemd-udevd[3712497]: Could not generate persistent MAC address for vethf8145ca: No such file or directory
Jul 26 02:17:34 sentry-docker00.cs.umd.edu systemd-udevd[3712498]: Could not generate persistent MAC address for vetha45f848: No such file or directory
Jul 26 02:17:34 sentry-docker00.cs.umd.edu systemd-udevd[3712521]: Could not generate persistent MAC address for veth4a30698: No such file or directory
Jul 26 02:17:34 sentry-docker00.cs.umd.edu systemd-udevd[3712522]: Could not generate persistent MAC address for vethbea3df0: No such file or directory
Jul 26 02:17:34 sentry-docker00.cs.umd.edu systemd-udevd[3712540]: Could not generate persistent MAC address for veth372f539: No such file or directory
Jul 26 02:17:34 sentry-docker00.cs.umd.edu systemd-udevd[3712538]: Could not generate persistent MAC address for vethc39a153: No such file or directory
Jul 26 02:28:45 sentry-docker00.cs.umd.edu systemd-udevd[3718759]: link_config: could not get ethtool features for vethbde3431
Jul 26 02:28:45 sentry-docker00.cs.umd.edu systemd-udevd[3718759]: Could not set offload features of vethbde3431: No such device
Jul 26 02:28:46 sentry-docker00.cs.umd.edu systemd-udevd[3718776]: Could not generate persistent MAC address for veth151a616: No such file or directory
Jul 26 02:28:46 sentry-docker00.cs.umd.edu systemd-udevd[3718777]: Could not generate persistent MAC address for veth086b8d4: No such file or directory
Jul 26 02:37:42 sentry-docker00.cs.umd.edu systemd-udevd[3722307]: link_config: could not get ethtool features for veth4a30698
Jul 26 02:37:42 sentry-docker00.cs.umd.edu systemd-udevd[3722307]: Could not set offload features of veth4a30698: No such device
Jul 26 02:37:42 sentry-docker00.cs.umd.edu systemd-udevd[3722332]: Could not generate persistent MAC address for vethc110c9e: No such file or directory
Jul 26 02:37:42 sentry-docker00.cs.umd.edu systemd-udevd[3722331]: Could not generate persistent MAC address for veth8910b83: No such file or directory
Jul 26 02:37:42 sentry-docker00.cs.umd.edu systemd-udevd[3722336]: Could not generate persistent MAC address for veth2d8b90c: No such file or directory
Jul 26 02:37:42 sentry-docker00.cs.umd.edu systemd-udevd[3722335]: Could not generate persistent MAC address for veth4c777fa: No such file or directory
Jul 26 02:37:42 sentry-docker00.cs.umd.edu systemd-udevd[3722346]: Could not generate persistent MAC address for veth6618ed7: No such file or directory
Jul 26 02:37:42 sentry-docker00.cs.umd.edu systemd-udevd[3722356]: Could not generate persistent MAC address for veth61c9da7: No such file or directory
Jul 26 02:37:42 sentry-docker00.cs.umd.edu systemd-udevd[3722340]: Could not generate persistent MAC address for veth8361bf2: No such file or directory
Jul 26 02:37:42 sentry-docker00.cs.umd.edu systemd-udevd[3722355]: Could not generate persistent MAC address for veth2fd5a51: No such file or directory
Jul 26 02:48:54 sentry-docker00.cs.umd.edu systemd-udevd[3728509]: link_config: could not get ethtool features for veth151a616
Jul 26 02:48:54 sentry-docker00.cs.umd.edu systemd-udevd[3728509]: Could not set offload features of veth151a616: No such device
... 12 more distinct messages not shown
== strawberry (2 distinct, 8 total) ==
Jul 26 02:09:44 strawberry udisksd[1067]: Error performing housekeeping for drive /org/freedesktop/UDisks2/drives/ST2000DM001_1CH164_W1E8J5KJ: Error updating SMART data: Error sending ATA command CHECK POWER MODE: Unexpected sense data returned:#0120000: 00 00 00 00 00 00 00 00 00 00 00 00 00 00 00 00 ................#0120010: 00 00 00 00 00 00 00 00 00 00 00 00 00 00 00 00 ................#012 (g-io-error-quark, 0) [x6]
Jul 26 02:34:42 strawberry smartd[5314]: Device: /dev/sda [SAT], failed to read SMART Attribute Data [x2]
== zfs00.cs.umd.edu (1 distinct, 3 total) ==
Jul 26 02:21:33 zfs00.cs.umd.edu rsyslogd: imrelp[2514]: error 'server closed relp session, session broken', object 'lstn 2514: conn to clt 10.227.96.13/irb2156.csdips.umd.edu' - input may not work as intended [v8.2604.0 try https://www.rsyslog.com/e/2353 ] [x3]
1
0
Command: /usr/local/sbin/syslog-digest.py
Time : 0.5225s
Status : exited 0
Output :
Syslog digest — 2026-07-26 02:05 EDT
Processed 4,313 lines, filtered 3,405 (78%). 908 unknown (117 distinct) from 22 host(s).
== abuse (1 distinct, 347 total) ==
Jul 26 01:05:06 abuse rsyslogd[21745]: imjournal: open() failed for path: '/var/lib/rsyslog/imjournal.state.tmp': Input/output error [v8.2404.0 try https://www.rsyslog.com/e/2433 ] [x347]
== alec.cs.umd.edu (3 distinct, 61 total) ==
Jul 26 01:05:05 alec.cs.umd.edu setroubleshoot[3114421]: failed to retrieve rpm info for path '/run/netns/netns-9dfd0347-71eb-5698-085c-c769043aa5c3': [x12]
Jul 26 01:05:06 alec.cs.umd.edu sedispatch[1526]: AVC Message regarding setroubleshoot, ignoring message [x24]
Jul 26 01:05:06 alec.cs.umd.edu setroubleshoot[3114421]: SELinux is preventing /usr/bin/df from getattr access on the file /run/netns/netns-9dfd0347-71eb-5698-085c-c769043aa5c3. For complete SELinux messages run: sealert -l 23f93208-3063-4aac-b78a-bb0fcb40740c [x25]
== b0b02.cs.umd.edu (4 distinct, 4 total) ==
Jul 26 01:55:18 b0b02.cs.umd.edu rustdesk[614737]: cannot open display:
Jul 26 02:04:39 b0b02.cs.umd.edu setroubleshoot[617140]: SELinux is preventing /usr/bin/python3.9 from getattr access on the file /etc/authselect/nsswitch.conf. For complete SELinux messages run: sealert -l 9a1e2952-3fde-4937-a8ab-f7f59791a458
Jul 26 02:04:42 b0b02.cs.umd.edu setroubleshoot[617140]: SELinux is preventing /usr/bin/python3.9 from read access on the file /etc/authselect/nsswitch.conf. For complete SELinux messages run: sealert -l 97d74423-e027-4cd6-8810-ad80944900b5
Jul 26 02:04:45 b0b02.cs.umd.edu setroubleshoot[617140]: SELinux is preventing /usr/bin/python3.9 from open access on the file /etc/authselect/nsswitch.conf. For complete SELinux messages run: sealert -l 4f253f6a-62d6-46dd-8eaf-0b4d29df41c6
== contest (10 distinct, 44 total) ==
Jul 26 01:05:05 contest goferd[1007]: [ERROR][worker-0] gofer.messaging.adapter.connect:33 - connect: proton+amqps://satellite8.cs.umd.edu:5647, failed: Connection amqps://satellite8.cs.umd.edu:5647 disconnected: Condition('proton.pythonio', 'Connection refused to all addresses') [x34]
Jul 26 01:48:13 contest setroubleshoot[93885]: SELinux is preventing /usr/libexec/platform-python3.6 from create access on the directory libdnf.jM9RHb. For complete SELinux messages run: sealert -l cb6b25c6-4765-4cf2-88a0-9b3b508e94e9
Jul 26 01:48:13 contest setroubleshoot[93885]: SELinux is preventing /usr/bin/gpgconf from add_name access on the directory repodata. For complete SELinux messages run: sealert -l 41cf7b1b-0f34-4609-98f2-b66e7825fef7
Jul 26 01:48:13 contest setroubleshoot[93885]: SELinux is preventing /usr/libexec/platform-python3.6 from create access on the file mirrorlist. For complete SELinux messages run: sealert -l fc20ff92-ea83-4f38-a24b-ddfd737a3141
Jul 26 01:48:13 contest setroubleshoot[93885]: SELinux is preventing /usr/libexec/platform-python3.6 from setattr access on the file repomd.xml. For complete SELinux messages run: sealert -l ac675631-fa35-4e93-adc9-b692b18e53e5
Jul 26 01:48:13 contest setroubleshoot[93885]: SELinux is preventing /usr/bin/gpgconf from add_name access on the directory repomd.xml.asc. For complete SELinux messages run: sealert -l 41cf7b1b-0f34-4609-98f2-b66e7825fef7
Jul 26 01:48:13 contest setroubleshoot[93885]: SELinux is preventing /usr/libexec/platform-python3.6 from read access on the directory libdnf.jM9RHb. For complete SELinux messages run: sealert -l 45d103b6-0810-4890-a705-990118577ce8
Jul 26 01:48:13 contest setroubleshoot[93885]: SELinux is preventing /usr/libexec/platform-python3.6 from remove_name access on the directory repomd.xml. For complete SELinux messages run: sealert -l 7e499113-2fd7-4f67-bec6-3521efbe3637 [x2]
Jul 26 01:48:14 contest setroubleshoot[93885]: SELinux is preventing /usr/libexec/platform-python3.6 from rmdir access on the directory repodata. For complete SELinux messages run: sealert -l 3928930b-a1ed-448d-950b-0665ac2adef8
Jul 26 01:48:15 contest setroubleshoot[93885]: SELinux is preventing /usr/libexec/platform-python3.6 from create access on the directory libdnf.HG7X02. For complete SELinux messages run: sealert -l cb6b25c6-4765-4cf2-88a0-9b3b508e94e9
== csfw00a (1 distinct, 206 total) ==
Jul 26 01:04:57 csfw00a kernel: bnxt_en 0000:09:00.0 eth3: NIC Link is Down [x206]
== frabjous (3 distinct, 3 total) ==
Jul 26 01:07:33 frabjous krb5_child[1502428]: Client 'admin(a)UMD.EDU' not found in Kerberos database
Jul 26 01:07:35 frabjous sshd-session[1502424]: error: PAM: Authentication failure for admin from 34.22.226.141
Jul 26 01:08:36 frabjous sshd-session[1502502]: error: Protocol major versions differ: 2 vs. 1
== hackerman (1 distinct, 1 total) ==
Jul 26 01:19:01 hackerman gnome-software[2060381]: failed to commit changes to dconf: GDBus.Error:org.gtk.GDBus.UnmappedGError.Quark._g_2dfile_2derror_2dquark.Code2: Failed to create file “/adminhomes/sajith/.config/dconf/user.6ZR9S3”: Permission denied
== hazfs.cs.umd.edu (11 distinct, 66 total) ==
Jul 26 01:48:43 hazfs.cs.umd.edu snmpd[1431]: send response: Failure in sendto [x6]
Jul 26 01:48:43 hazfs.cs.umd.edu snmpd[1431]: -- NET-SNMP-EXTEND-MIB::nsExtendStatus."userweb" [x6]
Jul 26 01:48:43 hazfs.cs.umd.edu snmpd[1431]: -- NET-SNMP-EXTEND-MIB::nsExtendStatus."zfslist" [x6]
Jul 26 01:48:43 hazfs.cs.umd.edu snmpd[1431]: -- NET-SNMP-EXTEND-MIB::nsExtendStatus."userhome" [x6]
Jul 26 01:48:43 hazfs.cs.umd.edu snmpd[1431]: -- NET-SNMP-EXTEND-MIB::nsExtendOutput1Line."userweb" [x6]
Jul 26 01:48:43 hazfs.cs.umd.edu snmpd[1431]: -- NET-SNMP-EXTEND-MIB::nsExtendOutput1Line."zfslist" [x6]
Jul 26 01:48:43 hazfs.cs.umd.edu snmpd[1431]: -- NET-SNMP-EXTEND-MIB::nsExtendOutput1Line."userhome" [x6]
Jul 26 01:48:43 hazfs.cs.umd.edu snmpd[1431]: -- NET-SNMP-EXTEND-MIB::nsExtendOutputFull."userweb" [x6]
Jul 26 01:48:43 hazfs.cs.umd.edu snmpd[1431]: -- NET-SNMP-EXTEND-MIB::nsExtendOutputFull."zfslist" [x6]
Jul 26 01:48:43 hazfs.cs.umd.edu snmpd[1431]: -- NET-SNMP-EXTEND-MIB::nsExtendOutputFull."userhome" [x6]
Jul 26 01:48:43 hazfs.cs.umd.edu snmpd[1431]: -- NET-SNMP-EXTEND-MIB::nsExtendOutNumLines."userweb" [x6]
== idm00 (2 distinct, 2 total) ==
Jul 26 01:23:59 idm00 named[1455]: client @0x7f33041f95f8 10.73.245.12#54705: update '73.10.in-addr.arpa/IN' denied
Jul 26 01:51:07 idm00 named[1455]: client @0x7f3310548a48 10.73.240.42#55733: update '73.10.in-addr.arpa/IN' denied
== idmp0 (1 distinct, 1 total) ==
Jul 26 01:34:56 idmp0 named[5198]: client @0x7f9908014618 10.73.240.43#64977: update '73.10.in-addr.arpa/IN' denied
== itmon02 (1 distinct, 46 total) ==
Jul 26 01:07:48 itmon02 sshd[1834]: error: beginning MaxStartups throttling [x46]
== mcstic (1 distinct, 1 total) ==
Jul 26 01:56:44 mcstic sshd[1661076]: fatal: userauth_pubkey: parse publickey packet: incomplete message [preauth]
== netman.cs.umd.edu (3 distinct, 6 total) ==
Jul 26 01:20:31 netman.cs.umd.edu krb5_child[1115515]: Client 'admin(a)UMD.EDU' not found in Kerberos database [x4]
Jul 26 01:20:38 netman.cs.umd.edu sshd[1115496]: error: PAM: Authentication failure for admin from 34.140.242.122
Jul 26 01:21:15 netman.cs.umd.edu sshd[1115561]: error: Protocol major versions differ: 2 vs. 1
== newhonors2 (1 distinct, 24 total) ==
Jul 26 01:13:03 newhonors2 dhcpcd[290220]: dhcpcd is not running [x24]
== outbound00.cs.umd.edu (2 distinct, 7 total) ==
Jul 26 01:09:09 outbound00.cs.umd.edu python3[3819985]: ldapdb [x6]
Jul 26 01:37:46 outbound00.cs.umd.edu krb5_child[3826593]: Client 'admin(a)UMD.EDU' not found in Kerberos database
== outbound01.cs.umd.edu (1 distinct, 6 total) ==
Jul 26 01:13:06 outbound01.cs.umd.edu python3[1849036]: ldapdb [x6]
== sentry-docker00.cs.umd.edu (40 distinct, 40 total) ==
Jul 26 01:08:29 sentry-docker00.cs.umd.edu systemd-udevd[3680701]: link_config: could not get ethtool features for veth3e398ff
Jul 26 01:08:29 sentry-docker00.cs.umd.edu systemd-udevd[3680701]: Could not set offload features of veth3e398ff: No such device
Jul 26 01:08:29 sentry-docker00.cs.umd.edu systemd-udevd[3680710]: Could not generate persistent MAC address for veth3a27c99: No such file or directory
Jul 26 01:08:29 sentry-docker00.cs.umd.edu systemd-udevd[3680711]: Could not generate persistent MAC address for veth61b4ba7: No such file or directory
Jul 26 01:17:09 sentry-docker00.cs.umd.edu systemd-udevd[3683871]: link_config: could not get ethtool features for vethd9e5130
Jul 26 01:17:09 sentry-docker00.cs.umd.edu systemd-udevd[3683871]: Could not set offload features of vethd9e5130: No such device
Jul 26 01:17:09 sentry-docker00.cs.umd.edu systemd-udevd[3683940]: Could not generate persistent MAC address for vethb5b20ce: No such file or directory
Jul 26 01:17:09 sentry-docker00.cs.umd.edu systemd-udevd[3683941]: Could not generate persistent MAC address for vetha6078ce: No such file or directory
Jul 26 01:17:09 sentry-docker00.cs.umd.edu systemd-udevd[3683950]: Could not generate persistent MAC address for veth812bf59: No such file or directory
Jul 26 01:17:09 sentry-docker00.cs.umd.edu systemd-udevd[3683959]: Could not generate persistent MAC address for vethc65d946: No such file or directory
Jul 26 01:17:09 sentry-docker00.cs.umd.edu systemd-udevd[3683969]: Could not generate persistent MAC address for vethc485ec5: No such file or directory
Jul 26 01:17:09 sentry-docker00.cs.umd.edu systemd-udevd[3683968]: Could not generate persistent MAC address for vethdabd1d5: No such file or directory
Jul 26 01:17:09 sentry-docker00.cs.umd.edu systemd-udevd[3683987]: Could not generate persistent MAC address for vethee63b02: No such file or directory
Jul 26 01:17:09 sentry-docker00.cs.umd.edu systemd-udevd[3683994]: Could not generate persistent MAC address for veth9e929b0: No such file or directory
Jul 26 01:28:33 sentry-docker00.cs.umd.edu systemd-udevd[3690370]: Could not generate persistent MAC address for vetha91c4e1: No such file or directory
Jul 26 01:28:33 sentry-docker00.cs.umd.edu systemd-udevd[3690371]: Could not generate persistent MAC address for veth9032f45: No such file or directory
Jul 26 01:37:17 sentry-docker00.cs.umd.edu systemd-udevd[3693559]: link_config: could not get ethtool features for vethc65d946
Jul 26 01:37:17 sentry-docker00.cs.umd.edu systemd-udevd[3693559]: Could not set offload features of vethc65d946: No such device
Jul 26 01:37:17 sentry-docker00.cs.umd.edu systemd-udevd[3693585]: Could not generate persistent MAC address for veth9ee6ea1: No such file or directory
Jul 26 01:37:17 sentry-docker00.cs.umd.edu systemd-udevd[3693586]: Could not generate persistent MAC address for vethe39b621: No such file or directory
Jul 26 01:37:17 sentry-docker00.cs.umd.edu systemd-udevd[3693604]: Could not generate persistent MAC address for vethf6323d7: No such file or directory
Jul 26 01:37:17 sentry-docker00.cs.umd.edu systemd-udevd[3693594]: Could not generate persistent MAC address for veth30708a1: No such file or directory
Jul 26 01:37:17 sentry-docker00.cs.umd.edu systemd-udevd[3693601]: Could not generate persistent MAC address for vethbdbb404: No such file or directory
Jul 26 01:37:17 sentry-docker00.cs.umd.edu systemd-udevd[3693610]: Could not generate persistent MAC address for veth391e317: No such file or directory
Jul 26 01:37:17 sentry-docker00.cs.umd.edu systemd-udevd[3693615]: Could not generate persistent MAC address for veth5b12989: No such file or directory
Jul 26 01:37:17 sentry-docker00.cs.umd.edu systemd-udevd[3693616]: Could not generate persistent MAC address for veth4e6948b: No such file or directory
Jul 26 01:48:37 sentry-docker00.cs.umd.edu systemd-udevd[3699774]: link_config: could not get ethtool features for vetha91c4e1
Jul 26 01:48:37 sentry-docker00.cs.umd.edu systemd-udevd[3699774]: Could not set offload features of vetha91c4e1: No such device
Jul 26 01:48:37 sentry-docker00.cs.umd.edu systemd-udevd[3699792]: Could not generate persistent MAC address for vethd08bff0: No such file or directory
Jul 26 01:48:37 sentry-docker00.cs.umd.edu systemd-udevd[3699793]: Could not generate persistent MAC address for veth6a3fe80: No such file or directory
... 10 more distinct messages not shown
== strawberry (2 distinct, 8 total) ==
Jul 26 01:09:44 strawberry udisksd[1067]: Error performing housekeeping for drive /org/freedesktop/UDisks2/drives/ST2000DM001_1CH164_W1E8J5KJ: Error updating SMART data: Error sending ATA command CHECK POWER MODE: Unexpected sense data returned:#0120000: 00 00 00 00 00 00 00 00 00 00 00 00 00 00 00 00 ................#0120010: 00 00 00 00 00 00 00 00 00 00 00 00 00 00 00 00 ................#012 (g-io-error-quark, 0) [x6]
Jul 26 01:34:42 strawberry smartd[5314]: Device: /dev/sda [SAT], failed to read SMART Attribute Data [x2]
== submit26-b9-2 (10 distinct, 14 total) ==
Jul 26 01:12:49 submit26-b9-2 setroubleshoot[209896]: SELinux is preventing /usr/bin/python3.9 from create access on the directory /(null). For complete SELinux messages run: sealert -l d506243c-d61e-48f3-b42a-4592c913deb0 [x2]
Jul 26 01:12:49 submit26-b9-2 setroubleshoot[209896]: SELinux is preventing /usr/bin/python3.9 from add_name access on the directory /(null). For complete SELinux messages run: sealert -l 3b4752ac-1b9a-4af9-a05b-32e4c2eb13ab [x2]
Jul 26 01:12:49 submit26-b9-2 setroubleshoot[209896]: SELinux is preventing /usr/bin/python3.9 from create access on the file /(null). For complete SELinux messages run: sealert -l 29e5adbd-4381-4467-b40d-a2219101e096
Jul 26 01:12:49 submit26-b9-2 setroubleshoot[209896]: SELinux is preventing /usr/bin/python3.9 from open access on the file /tmp/libdnf.5iD7C1/repodata/repomd.xml. For complete SELinux messages run: sealert -l 1b38f2ec-01ce-4343-8059-ba7494ecc5c4
Jul 26 01:12:49 submit26-b9-2 setroubleshoot[209896]: SELinux is preventing /usr/bin/python3.9 from setattr access on the file repomd.xml. For complete SELinux messages run: sealert -l e5f9af40-1f63-4924-b012-27ab2a7b2266
Jul 26 01:12:49 submit26-b9-2 setroubleshoot[209896]: SELinux is preventing /usr/bin/python3.9 from read access on the directory libdnf.5iD7C1. For complete SELinux messages run: sealert -l 5c54db87-54a3-4a7c-97b4-b5c48d6c3543
Jul 26 01:12:49 submit26-b9-2 setroubleshoot[209896]: SELinux is preventing /usr/bin/python3.9 from remove_name access on the directory repomd.xml. For complete SELinux messages run: sealert -l 63cd60e1-1e61-4276-afea-dd8526ffe8b2 [x2]
Jul 26 01:12:49 submit26-b9-2 setroubleshoot[209896]: SELinux is preventing /usr/bin/python3.9 from unlink access on the file repomd.xml. For complete SELinux messages run: sealert -l 81c7e9ec-e023-4c6d-b1ad-c02a242e655e
Jul 26 01:12:49 submit26-b9-2 setroubleshoot[209896]: SELinux is preventing /usr/bin/python3.9 from rmdir access on the directory repodata. For complete SELinux messages run: sealert -l 6ae9a597-e123-4d74-8eec-a8ebe0f5e4d0 [x2]
Jul 26 01:12:49 submit26-b9-2 setroubleshoot[209896]: SELinux is preventing /usr/bin/python3.9 from read access on the directory libdnf.VQIlbu. For complete SELinux messages run: sealert -l 5c54db87-54a3-4a7c-97b4-b5c48d6c3543
== submit26-b9-3 (9 distinct, 9 total) ==
Jul 26 01:20:35 submit26-b9-3 setroubleshoot[596709]: SELinux is preventing /usr/bin/python3.9 from create access on the directory /(null). For complete SELinux messages run: sealert -l 5b912a44-22fd-4560-b201-2a4e289b73f5
Jul 26 01:20:35 submit26-b9-3 setroubleshoot[596709]: SELinux is preventing /usr/bin/python3.9 from add_name access on the directory /(null). For complete SELinux messages run: sealert -l 7f1df1e4-725e-4953-98eb-1079f908f543
Jul 26 01:20:35 submit26-b9-3 setroubleshoot[596709]: SELinux is preventing /usr/bin/python3.9 from create access on the file /(null). For complete SELinux messages run: sealert -l 40b8852a-f77b-44b4-affe-5f11fa33de43
Jul 26 01:20:35 submit26-b9-3 setroubleshoot[596709]: SELinux is preventing /usr/bin/python3.9 from open access on the file /tmp/libdnf.qlZUdc/repodata/repomd.xml. For complete SELinux messages run: sealert -l 45a8019e-f6b5-4baa-92c1-862594b40d46
Jul 26 01:20:35 submit26-b9-3 setroubleshoot[596709]: SELinux is preventing /usr/bin/python3.9 from setattr access on the file repomd.xml. For complete SELinux messages run: sealert -l e9f0bfff-7784-4126-baa4-2bb06da56591
Jul 26 01:20:35 submit26-b9-3 setroubleshoot[596709]: SELinux is preventing /usr/bin/python3.9 from read access on the directory libdnf.qlZUdc. For complete SELinux messages run: sealert -l 0b17cc3d-cdc6-4fe2-a11f-3892e7c41dc7
Jul 26 01:20:35 submit26-b9-3 setroubleshoot[596709]: SELinux is preventing /usr/bin/python3.9 from remove_name access on the directory repomd.xml. For complete SELinux messages run: sealert -l 10e38c64-b65f-4cdd-901e-4375652d9a42
Jul 26 01:20:35 submit26-b9-3 setroubleshoot[596709]: SELinux is preventing /usr/bin/python3.9 from unlink access on the file repomd.xml. For complete SELinux messages run: sealert -l 7fd9cf72-ef38-48e1-b6aa-b571b26a7b22
Jul 26 01:20:35 submit26-b9-3 setroubleshoot[596709]: SELinux is preventing /usr/bin/python3.9 from rmdir access on the directory repodata. For complete SELinux messages run: sealert -l b9b11116-89bd-4a3c-980c-1d422c5dcee4
== submit26-clnb9 (9 distinct, 9 total) ==
Jul 26 01:31:52 submit26-clnb9 setroubleshoot[1320529]: SELinux is preventing /usr/bin/python3.9 from create access on the directory /(null). For complete SELinux messages run: sealert -l 6783ed2b-5ae4-42b5-975a-4bf50eec4658
Jul 26 01:31:52 submit26-clnb9 setroubleshoot[1320529]: SELinux is preventing /usr/bin/python3.9 from add_name access on the directory /(null). For complete SELinux messages run: sealert -l 9e7fa955-cc30-4804-ac8c-e1779e85946c
Jul 26 01:31:53 submit26-clnb9 setroubleshoot[1320529]: SELinux is preventing /usr/bin/python3.9 from create access on the file /(null). For complete SELinux messages run: sealert -l 69bfa6e3-089c-40ff-9563-fd30787d0774
Jul 26 01:31:53 submit26-clnb9 setroubleshoot[1320529]: SELinux is preventing /usr/bin/python3.9 from open access on the file /tmp/libdnf.QaYbUH/repodata/repomd.xml. For complete SELinux messages run: sealert -l 001acdb5-31ef-4e52-b10b-90f467a89ddc
Jul 26 01:31:53 submit26-clnb9 setroubleshoot[1320529]: SELinux is preventing /usr/bin/python3.9 from setattr access on the file repomd.xml. For complete SELinux messages run: sealert -l edacddcf-16ed-4dc3-8d82-7c597d5dee23
Jul 26 01:31:53 submit26-clnb9 setroubleshoot[1320529]: SELinux is preventing /usr/bin/python3.9 from read access on the directory libdnf.QaYbUH. For complete SELinux messages run: sealert -l 62b3782e-4730-4488-8178-94dafe9b552c
Jul 26 01:31:53 submit26-clnb9 setroubleshoot[1320529]: SELinux is preventing /usr/bin/python3.9 from remove_name access on the directory repomd.xml. For complete SELinux messages run: sealert -l 81cb3698-78f8-440a-8e3c-e5d1041e6b78
Jul 26 01:31:53 submit26-clnb9 setroubleshoot[1320529]: SELinux is preventing /usr/bin/python3.9 from unlink access on the file repomd.xml. For complete SELinux messages run: sealert -l 792b472a-115c-4799-9805-fc7436f916b9
Jul 26 01:31:53 submit26-clnb9 setroubleshoot[1320529]: SELinux is preventing /usr/bin/python3.9 from rmdir access on the directory repodata. For complete SELinux messages run: sealert -l 15c83a86-837b-41e2-b662-b39cd4e361cb
== zfs00.cs.umd.edu (1 distinct, 3 total) ==
Jul 26 01:18:58 zfs00.cs.umd.edu rsyslogd: imrelp[2514]: error 'server closed relp session, session broken', object 'lstn 2514: conn to clt 10.227.96.13/irb2156.csdips.umd.edu' - input may not work as intended [v8.2604.0 try https://www.rsyslog.com/e/2353 ] [x3]
1
0
Command: /usr/local/sbin/syslog-digest.py
Time : 0.5937s
Status : exited 0
Output :
Syslog digest — 2026-07-26 01:05 EDT
Processed 4,779 lines, filtered 3,765 (78%). 1,014 unknown (218 distinct) from 41 host(s).
== abuse (1 distinct, 349 total) ==
Jul 26 00:05:06 abuse rsyslogd[21745]: imjournal: open() failed for path: '/var/lib/rsyslog/imjournal.state.tmp': Input/output error [v8.2404.0 try https://www.rsyslog.com/e/2433 ] [x349]
== alec.cs.umd.edu (3 distinct, 62 total) ==
Jul 26 00:05:31 alec.cs.umd.edu setroubleshoot[3099883]: failed to retrieve rpm info for path '/run/netns/netns-9dfd0347-71eb-5698-085c-c769043aa5c3': [x12]
Jul 26 00:05:32 alec.cs.umd.edu sedispatch[1526]: AVC Message regarding setroubleshoot, ignoring message [x24]
Jul 26 00:05:32 alec.cs.umd.edu setroubleshoot[3099883]: SELinux is preventing /usr/bin/df from getattr access on the file /run/netns/netns-9dfd0347-71eb-5698-085c-c769043aa5c3. For complete SELinux messages run: sealert -l 23f93208-3063-4aac-b78a-bb0fcb40740c [x26]
== b0b02.cs.umd.edu (1 distinct, 1 total) ==
Jul 26 00:55:15 b0b02.cs.umd.edu rustdesk[599721]: cannot open display:
== bac102 (67 distinct, 68 total) ==
Jul 30 02:21:38 bac102 (da-udp.*)[405392]: amanda-udp-restart.service: Failed at step EXEC spawning /usr/bin/systemctl restart amanda-udp.*: No such file or directory
Jul 30 02:21:38 bac102 systemd-coredump[405412]: Process 850 (systemd-journal) of user 0 dumped core. [x2]
Jul 30 02:21:38 bac102 systemd-coredump[405412]: Coredump diverted to /var/lib/systemd/coredump/core.systemd-journal.0.2cd2228ba8a74be4b7e32f78f6572196.850.1785392496000000.zst
Jul 30 02:21:38 bac102 systemd-coredump[405412]: Module /usr/lib/systemd/systemd-journald from rpm systemd-257-23.el10_2.2.aarch64
Jul 30 02:21:38 bac102 systemd-coredump[405412]: Module libzstd.so.1 from rpm zstd-1.5.5-9.el10.aarch64
Jul 30 02:21:38 bac102 systemd-coredump[405412]: Module libcap-ng.so.0 from rpm libcap-ng-0.8.4-6.el10.aarch64
Jul 30 02:21:38 bac102 systemd-coredump[405412]: Module libeconf.so.0 from rpm libeconf-0.6.2-4.el10.aarch64
Jul 30 02:21:38 bac102 systemd-coredump[405412]: Module libz.so.1 from rpm zlib-ng-2.2.3-3.el10_1.aarch64
Jul 30 02:21:38 bac102 systemd-coredump[405412]: Module libattr.so.1 from rpm attr-2.5.2-5.el10.aarch64
Jul 30 02:21:38 bac102 systemd-coredump[405412]: Module libpcre2-8.so.0 from rpm pcre2-10.44-1.el10.3.aarch64
Jul 30 02:21:38 bac102 systemd-coredump[405412]: Module libseccomp.so.2 from rpm libseccomp-2.5.6-1.el10.aarch64
Jul 30 02:21:38 bac102 systemd-coredump[405412]: Module libpam.so.0 from rpm pam-1.6.1-9.el10.aarch64
Jul 30 02:21:38 bac102 systemd-coredump[405412]: Module libcrypto.so.3 from rpm openssl-3.5.5-4.el10_2.aarch64
Jul 30 02:21:38 bac102 systemd-coredump[405412]: Module libmount.so.1 from rpm util-linux-2.40.2-18.el10.aarch64
Jul 30 02:21:38 bac102 systemd-coredump[405412]: Module libcrypt.so.2 from rpm libxcrypt-4.4.36-10.el10.aarch64
Jul 30 02:21:38 bac102 systemd-coredump[405412]: Module libcap.so.2 from rpm libcap-2.69-7.el10_2.1.aarch64
Jul 30 02:21:38 bac102 systemd-coredump[405412]: Module libblkid.so.1 from rpm util-linux-2.40.2-18.el10.aarch64
Jul 30 02:21:38 bac102 systemd-coredump[405412]: Module libacl.so.1 from rpm acl-2.3.2-4.el10.aarch64
Jul 30 02:21:38 bac102 systemd-coredump[405412]: Module libselinux.so.1 from rpm libselinux-3.10-1.el10.aarch64
Jul 30 02:21:38 bac102 systemd-coredump[405412]: Module libsystemd-shared-257-23.el10_2.2.so from rpm systemd-257-23.el10_2.2.aarch64
Jul 30 02:21:38 bac102 systemd-coredump[405412]: Stack trace of thread 850:
Jul 30 02:21:38 bac102 systemd-coredump[405412]: #0 0x0000aaaabbf9cdb0 snprintf_ok.lto_priv.1 (/usr/lib/systemd/systemd-journald + 0xcdb0)
Jul 30 02:21:38 bac102 systemd-coredump[405412]: #1 0x0000aaaabbfa3cb8 server_read_dev_kmsg (/usr/lib/systemd/systemd-journald + 0x13cb8)
Jul 30 02:21:38 bac102 systemd-coredump[405412]: #2 0x0000ffff84c297c4 source_dispatch (libsystemd-shared-257-23.el10_2.2.so + 0x2997c4)
Jul 30 02:21:38 bac102 systemd-coredump[405412]: #3 0x0000ffff84c29b7c sd_event_dispatch (libsystemd-shared-257-23.el10_2.2.so + 0x299b7c)
Jul 30 02:21:38 bac102 systemd-coredump[405412]: #4 0x0000ffff84c2ca68 sd_event_run (libsystemd-shared-257-23.el10_2.2.so + 0x29ca68)
Jul 30 02:21:38 bac102 systemd-coredump[405412]: #5 0x0000aaaabbf97cc0 main (/usr/lib/systemd/systemd-journald + 0x7cc0)
Jul 30 02:21:38 bac102 systemd-coredump[405412]: #6 0x0000ffff8475611c __libc_start_call_main (libc.so.6 + 0x2611c)
Jul 30 02:21:38 bac102 systemd-coredump[405412]: #7 0x0000ffff847561fc __libc_start_main@@GLIBC_2.34 (libc.so.6 + 0x261fc)
Jul 30 02:21:38 bac102 systemd-coredump[405412]: #8 0x0000aaaabbf98270 _start (/usr/lib/systemd/systemd-journald + 0x8270)
... 37 more distinct messages not shown
== cheezit.cs.umd.edu (11 distinct, 13 total) ==
Jul 26 00:25:19 cheezit.cs.umd.edu setroubleshoot[1882415]: failed to retrieve rpm info for path '/var/log/falconctl.log':
Jul 26 00:25:20 cheezit.cs.umd.edu setroubleshoot[1882415]: SELinux is preventing /opt/CrowdStrike/falconctl18708 from append access on the file /var/log/falconctl.log. For complete SELinux messages run: sealert -l 63f66d53-fcfc-44da-a79e-c789b1ce2ce8
Jul 26 00:25:22 cheezit.cs.umd.edu setroubleshoot[1882415]: SELinux is preventing /opt/CrowdStrike/falconctl18708 from write access on the file falconstore. For complete SELinux messages run: sealert -l 386506af-597f-4357-89de-bc382f369a6e
Jul 26 00:25:33 cheezit.cs.umd.edu setroubleshoot[1882866]: failed to retrieve rpm info for path '/var/lib/sss/pipes/nss': [x2]
Jul 26 00:25:34 cheezit.cs.umd.edu setroubleshoot[1882866]: SELinux is preventing /usr/bin/lsof from write access on the sock_file /var/lib/sss/pipes/nss. For complete SELinux messages run: sealert -l f570494d-54d2-4dac-97e2-28395659abf1 [x2]
Jul 26 00:25:34 cheezit.cs.umd.edu setroubleshoot[1882866]: SELinux is preventing /usr/bin/lsof from write access on the sock_file socket. For complete SELinux messages run: sealert -l 9ff2383b-9e1d-44ff-b8ae-af91637450ae
Jul 26 00:26:14 cheezit.cs.umd.edu setroubleshoot[1883303]: SELinux is preventing /usr/bin/python3.9 from read access on the file /etc/selinux/targeted/contexts/files/file_contexts.subs_dist. For complete SELinux messages run: sealert -l 679eb260-cf5d-4783-99f4-ce308edb3295
Jul 26 00:26:14 cheezit.cs.umd.edu setroubleshoot[1883303]: SELinux is preventing /usr/bin/python3.9 from open access on the file /etc/selinux/targeted/contexts/files/file_contexts.subs_dist. For complete SELinux messages run: sealert -l 77caba8a-5cd0-4e18-b188-6e35c461772d
Jul 26 00:26:14 cheezit.cs.umd.edu setroubleshoot[1883303]: SELinux is preventing /usr/bin/python3.9 from read access on the file /etc/selinux/targeted/contexts/files/file_contexts.subs. For complete SELinux messages run: sealert -l d9c6dd0d-0a34-4430-a5ff-e985c55cb064
Jul 26 00:26:14 cheezit.cs.umd.edu setroubleshoot[1883303]: SELinux is preventing /usr/bin/python3.9 from open access on the file /etc/selinux/targeted/contexts/files/file_contexts.subs. For complete SELinux messages run: sealert -l 8edbce57-8212-4ac8-af50-3fe403231eda
Jul 26 00:26:14 cheezit.cs.umd.edu setroubleshoot[1883303]: SELinux is preventing /usr/bin/python3.9 from map access on the file /etc/selinux/targeted/contexts/files/file_contexts.bin. For complete SELinux messages run: sealert -l 4a0cbe3b-6f49-4c7e-95c6-380f7aef806e
== contest (1 distinct, 33 total) ==
Jul 26 00:06:11 contest goferd[1007]: [ERROR][worker-0] gofer.messaging.adapter.connect:33 - connect: proton+amqps://satellite8.cs.umd.edu:5647, failed: Connection amqps://satellite8.cs.umd.edu:5647 disconnected: Condition('proton.pythonio', 'Connection refused to all addresses') [x33]
== csfw00a (1 distinct, 244 total) ==
Jul 26 00:04:45 csfw00a kernel: bnxt_en 0000:09:00.0 eth3: NIC Link is Down [x244]
== cskayako (4 distinct, 4 total) ==
Jul 26 00:30:35 cskayako setroubleshoot[642061]: SELinux is preventing /usr/bin/php from add_name access on the directory /var/www/html/(null). For complete SELinux messages run: sealert -l 5239c113-abc1-4953-a9c0-21d695a0d1bb
Jul 26 00:30:35 cskayako setroubleshoot[642061]: SELinux is preventing /usr/bin/php from create access on the file /var/www/html/(null). For complete SELinux messages run: sealert -l cacf8f36-45b0-4374-9a33-d15de767aae7
Jul 26 00:30:35 cskayako setroubleshoot[642061]: failed to retrieve rpm info for path '/var/www/html/__swift/logs/log.cache_26_Jul_2026_bfa1415284.txt':
Jul 26 00:30:35 cskayako setroubleshoot[642061]: SELinux is preventing /usr/sbin/sendmail.postfix from append access on the file /var/www/html/__swift/logs/log.cache_26_Jul_2026_bfa1415284.txt. For complete SELinux messages run: sealert -l c566b62c-2773-4bf0-808b-10f832f1eafb
== forge00 (1 distinct, 1 total) ==
Jul 26 00:29:39 forge00 (httpd)[455618]: httpd.service: Referenced but unset environment variable evaluates to an empty string: OPTIONS
== grades01.cs.umd.edu (3 distinct, 4 total) ==
Jul 26 00:10:14 grades01.cs.umd.edu systemd[1]: New main PID 12278 does not belong to service, and PID file is not owned by root. Refusing. [x2]
Jul 26 00:10:38 grades01.cs.umd.edu systemd[1]: Daemon never wrote its PID file. Failing.
Jul 26 00:10:53 grades01.cs.umd.edu systemd[1]: pmlogger.service: Supervising process 19887 which is not our child. We'll most likely not notice when it exits.
== idm00 (1 distinct, 1 total) ==
Jul 26 00:51:06 idm00 named[1455]: client @0x7f33042401c8 10.73.240.42#54523: update '73.10.in-addr.arpa/IN' denied
== idmp0 (1 distinct, 1 total) ==
Jul 26 00:34:56 idmp0 named[5198]: client @0x7f991808dbf8 10.73.240.43#51898: update '73.10.in-addr.arpa/IN' denied
== irb2156 (8 distinct, 19 total) ==
Jul 26 00:10:21 irb2156 gcr-prompter[842822]: cannot open display: :1 [x2]
Jul 26 00:10:21 irb2156 gnome-keyring-d[165848]: couldn't create system prompt: GDBus.Error:org.freedesktop.DBus.Error.NameHasNoOwner: Could not activate remote peer 'org.gnome.keyring.SystemPrompter': unit failed [x2]
Jul 26 00:13:53 irb2156 systemd-resolved[3520]: Using degraded feature set TCP instead of UDP for DNS server 128.8.74.3.
Jul 26 00:23:39 irb2156 setroubleshoot[844662]: failed to retrieve rpm info for path '/var/lib/sss/pipes/nss': [x4]
Jul 26 00:23:39 irb2156 setroubleshoot[844662]: SELinux is preventing /usr/bin/python3.12 from write access on the sock_file /var/lib/sss/pipes/nss. For complete SELinux messages run: sealert -l abc2274b-d33a-4914-8e4c-19cb26848a77 [x7]
Jul 26 00:24:13 irb2156 setroubleshoot[845452]: failed to retrieve rpm info for path '/var/log/falconctl.log':
Jul 26 00:24:14 irb2156 setroubleshoot[845452]: SELinux is preventing /opt/CrowdStrike/falconctl18708 from append access on the file /var/log/falconctl.log. For complete SELinux messages run: sealert -l 378093ff-b0d9-4ff5-9972-cb081e35f744
Jul 26 00:24:14 irb2156 setroubleshoot[845452]: SELinux is preventing /opt/CrowdStrike/falconctl18708 from write access on the file falconstore. For complete SELinux messages run: sealert -l cf3d4d4a-e5a2-4542-9fc5-dbd87dc3c82b
== itmon00 (3 distinct, 4 total) ==
Jul 26 00:10:12 itmon00 systemd[1]: New main PID 16527 does not belong to service, and PID file is not owned by root. Refusing. [x2]
Jul 26 00:10:34 itmon00 systemd[1]: Daemon never wrote its PID file. Failing.
Jul 26 00:10:47 itmon00 systemd[1]: pmlogger.service: Supervising process 23629 which is not our child. We'll most likely not notice when it exits.
== itmon02 (2 distinct, 48 total) ==
Jul 26 00:07:54 itmon02 sshd[1834]: error: beginning MaxStartups throttling [x47]
Jul 26 00:40:56 itmon02 (httpd)[3954450]: httpd.service: Referenced but unset environment variable evaluates to an empty string: OPTIONS
== jaws.cs.umd.edu (4 distinct, 5 total) ==
Jul 26 00:34:14 jaws.cs.umd.edu systemd-coredump[1772411]: Process 1772394 (podman) of user 981 dumped core.#012#012Stack trace of thread 1772394:#012#0 0x000055978826546e internal/runtime/syscall/linux.Syscall6 (podman + 0x48b46e)#012#1 0x00005597883450a6 syscall.Syscall (podman + 0x56b0a6)#012#2 0x0000559788345c50 syscall.Syscall.abi0 (podman + 0x56bc50)#012#3 0x00005597884afc2e github.com/containers/podman/vendor/golang.org/x/sys/unix.OpenTree (podman + 0x6d5c2e)#012#4 0x0000559788b08f4b github.com/containers/podman/vendor/github.com/cyphar/filepath-securejoin/p… (podman + 0xd2ef4b)#012#5 0x0000559788b08e54 github.com/containers/podman/vendor/github.com/cyphar/filepath-securejoin/p… (podman + 0xd2ee54)#012#6 0x00005597882f8dcc sync.(*Once).doSlow (podman + 0x51edcc)#012#7 0x00005597882f8cf9 sync.(*Once).Do (podman + 0x51ecf9)#012#8 0x0000559788b08d
c5 github.com/containers/podman/vendor/github.com/cyphar/filepath-securejoin/p… (podman + 0xd2edc5)#012#9 0x0000559788b0a3e2 github.com/containers/podman/vendor/github.com/cyphar/filepath-securejoin/p… (podman + 0xd303e2)#012#10 0x0000559788b0a7f3 github.com/containers/podman/vendor/github.com/cyphar/filepath-securejoin/p… (podman + 0xd307f3)#012#11 0x0000559788b0991c github.com/containers/podman/vendor/github.com/cyphar/filepath-securejoin/p… (podman + 0xd2f91c)#012#12 0x0000559788b09358 github.com/containers/podman/vendor/github.com/cyphar/filepath-securejoin/p… (podman + 0xd2f358)#012#13 0x00005597882f8dcc sync.(*Once).doSlow (podman + 0x51edcc)#012#14 0x00005597882f8cf9 sync.(*Once).D
o (podman + 0x51ecf9)#012#15 0x0000559788b092c5 github.com/containers/podman/vendor/github.com/cyphar/filepath-securejoin/p… (podman + 0xd2f2c5)#012#16 0x0000559788b0a79a github.com/containers/podman/vendor/github.com/cyphar/filepath-securejoin/p… (podman + 0xd3079a)#012#17 0x0000559788b1134e github.com/containers/podman/vendor/github.com/opencontainers/selinux/go-se… (podman + 0xd3734e)#012#18 0x0000559788b11838 github.com/containers/podman/vendor/github.com/opencontainers/selinux/go-se… (podman + 0xd37838)#012#19 0x0000559788b105df github.com/containers/podman/vendor/github.com/opencontainers/selinux/go-se… (podman + 0xd365df)#012#20 0x0000559788b10873 github.com/containers/podman/vendor/github.com/opencontainers/selinux/go-se… (podman + 0xd36873)#012#21 0x000
0559788d08f4b github.com/containers/podman/vendor/go.podman.io/common/pkg/config.defaultC… (podman + 0xf2ef4b)#012#22 0x0000559788d0c912 github.com/containers/podman/vendor/go.podman.io/common/pkg/config.newLocked (podman + 0xf32912)#012#23 0x0000559788d0c605 github.com/containers/podman/vendor/go.podman.io/common/pkg/config.New (podman + 0xf32605)#012#24 0x000055978947ffd3 github.com/containers/podman/cmd/podman/registry.newPodmanConfig (podman + 0x16a5fd3)#012#25 0x00005597882f8dcc sync.(*Once).doSlow (podman + 0x51edcc)#012#26 0x00005597894a0c50 github.com/containers/podman/cmd/podman/common.init (podman + 0x16c6c50)#012#27 0x00005597882bea57 runtime.doInit1 (podman + 0x4e4a57)#012#28 0x00005597882aef90 runtime.main (podman + 0x4d4f90)#012#29 0x00005597882eeee1 runtime.goexit.abi0 (podman + 0x514ee1)#012ELF object binary architecture: AMD x86-64
Jul 26 00:34:15 jaws.cs.umd.edu systemd-coredump[1772437]: Process 1772420 (podman) of user 981 dumped core.#012#012Stack trace of thread 1772420:#012#0 0x000055a17d08946e internal/runtime/syscall/linux.Syscall6 (podman + 0x48b46e)#012#1 0x000055a17d1690a6 syscall.Syscall (podman + 0x56b0a6)#012#2 0x000055a17d169c50 syscall.Syscall.abi0 (podman + 0x56bc50)#012#3 0x000055a17d2d3c2e github.com/containers/podman/vendor/golang.org/x/sys/unix.OpenTree (podman + 0x6d5c2e)#012#4 0x000055a17d92cf4b github.com/containers/podman/vendor/github.com/cyphar/filepath-securejoin/p… (podman + 0xd2ef4b)#012#5 0x000055a17d92ce54 github.com/containers/podman/vendor/github.com/cyphar/filepath-securejoin/p… (podman + 0xd2ee54)#012#6 0x000055a17d11cdcc sync.(*Once).doSlow (podman + 0x51edcc)#012#7 0x000055a17d11ccf9 sync.(*Once).Do (podman + 0x51ecf9)#012#8 0x000055a17d92cd
c5 github.com/containers/podman/vendor/github.com/cyphar/filepath-securejoin/p… (podman + 0xd2edc5)#012#9 0x000055a17d92e3e2 github.com/containers/podman/vendor/github.com/cyphar/filepath-securejoin/p… (podman + 0xd303e2)#012#10 0x000055a17d92e7f3 github.com/containers/podman/vendor/github.com/cyphar/filepath-securejoin/p… (podman + 0xd307f3)#012#11 0x000055a17d92d91c github.com/containers/podman/vendor/github.com/cyphar/filepath-securejoin/p… (podman + 0xd2f91c)#012#12 0x000055a17d92d358 github.com/containers/podman/vendor/github.com/cyphar/filepath-securejoin/p… (podman + 0xd2f358)#012#13 0x000055a17d11cdcc sync.(*Once).doSlow (podman + 0x51edcc)#012#14 0x000055a17d11ccf9 sync.(*Once).D
o (podman + 0x51ecf9)#012#15 0x000055a17d92d2c5 github.com/containers/podman/vendor/github.com/cyphar/filepath-securejoin/p… (podman + 0xd2f2c5)#012#16 0x000055a17d92e79a github.com/containers/podman/vendor/github.com/cyphar/filepath-securejoin/p… (podman + 0xd3079a)#012#17 0x000055a17d93534e github.com/containers/podman/vendor/github.com/opencontainers/selinux/go-se… (podman + 0xd3734e)#012#18 0x000055a17d935838 github.com/containers/podman/vendor/github.com/opencontainers/selinux/go-se… (podman + 0xd37838)#012#19 0x000055a17d9345df github.com/containers/podman/vendor/github.com/opencontainers/selinux/go-se… (podman + 0xd365df)#012#20 0x000055a17d934873 github.com/containers/podman/vendor/github.com/opencontainers/selinux/go-se… (podman + 0xd36873)#012#21 0x000
055a17db2cf4b github.com/containers/podman/vendor/go.podman.io/common/pkg/config.defaultC… (podman + 0xf2ef4b)#012#22 0x000055a17db30912 github.com/containers/podman/vendor/go.podman.io/common/pkg/config.newLocked (podman + 0xf32912)#012#23 0x000055a17db30605 github.com/containers/podman/vendor/go.podman.io/common/pkg/config.New (podman + 0xf32605)#012#24 0x000055a17e2a3fd3 github.com/containers/podman/cmd/podman/registry.newPodmanConfig (podman + 0x16a5fd3)#012#25 0x000055a17d11cdcc sync.(*Once).doSlow (podman + 0x51edcc)#012#26 0x000055a17e2c4c50 github.com/containers/podman/cmd/podman/common.init (podman + 0x16c6c50)#012#27 0x000055a17d0e2a57 runtime.doInit1 (podman + 0x4e4a57)#012#28 0x000055a17d0d2f90 runtime.main (podman + 0x4d4f90)#012#29 0x000055a17d112ee1 runtime.goexit.abi0 (podman + 0x514ee1)#012ELF object binary architecture: AMD x86-64
Jul 26 00:34:15 jaws.cs.umd.edu setroubleshoot[1772410]: SELinux is preventing /usr/bin/podman from using the nnp_transition access on a process. For complete SELinux messages run: sealert -l 3c7643bc-dd69-4695-b48c-7d780b62b6cf [x2]
Jul 26 00:34:16 jaws.cs.umd.edu systemd-coredump[1772460]: Process 1772453 (podman) of user 981 dumped core.#012#012Stack trace of thread 1772453:#012#0 0x00005626a95df46e internal/runtime/syscall/linux.Syscall6 (podman + 0x48b46e)#012#1 0x00005626a96bf0a6 syscall.Syscall (podman + 0x56b0a6)#012#2 0x00005626a96bfc50 syscall.Syscall.abi0 (podman + 0x56bc50)#012#3 0x00005626a9829c2e github.com/containers/podman/vendor/golang.org/x/sys/unix.OpenTree (podman + 0x6d5c2e)#012#4 0x00005626a9e82f4b github.com/containers/podman/vendor/github.com/cyphar/filepath-securejoin/p… (podman + 0xd2ef4b)#012#5 0x00005626a9e82e54 github.com/containers/podman/vendor/github.com/cyphar/filepath-securejoin/p… (podman + 0xd2ee54)#012#6 0x00005626a9672dcc sync.(*Once).doSlow (podman + 0x51edcc)#012#7 0x00005626a9672cf9 sync.(*Once).Do (podman + 0x51ecf9)#012#8 0x00005626a9e82d
c5 github.com/containers/podman/vendor/github.com/cyphar/filepath-securejoin/p… (podman + 0xd2edc5)#012#9 0x00005626a9e843e2 github.com/containers/podman/vendor/github.com/cyphar/filepath-securejoin/p… (podman + 0xd303e2)#012#10 0x00005626a9e847f3 github.com/containers/podman/vendor/github.com/cyphar/filepath-securejoin/p… (podman + 0xd307f3)#012#11 0x00005626a9e8391c github.com/containers/podman/vendor/github.com/cyphar/filepath-securejoin/p… (podman + 0xd2f91c)#012#12 0x00005626a9e83358 github.com/containers/podman/vendor/github.com/cyphar/filepath-securejoin/p… (podman + 0xd2f358)#012#13 0x00005626a9672dcc sync.(*Once).doSlow (podman + 0x51edcc)#012#14 0x00005626a9672cf9 sync.(*Once).D
o (podman + 0x51ecf9)#012#15 0x00005626a9e832c5 github.com/containers/podman/vendor/github.com/cyphar/filepath-securejoin/p… (podman + 0xd2f2c5)#012#16 0x00005626a9e8479a github.com/containers/podman/vendor/github.com/cyphar/filepath-securejoin/p… (podman + 0xd3079a)#012#17 0x00005626a9e8b34e github.com/containers/podman/vendor/github.com/opencontainers/selinux/go-se… (podman + 0xd3734e)#012#18 0x00005626a9e8b838 github.com/containers/podman/vendor/github.com/opencontainers/selinux/go-se… (podman + 0xd37838)#012#19 0x00005626a9e8a5df github.com/containers/podman/vendor/github.com/opencontainers/selinux/go-se… (podman + 0xd365df)#012#20 0x00005626a9e8a873 github.com/containers/podman/vendor/github.com/opencontainers/selinux/go-se… (podman + 0xd36873)#012#21 0x000
05626aa082f4b github.com/containers/podman/vendor/go.podman.io/common/pkg/config.defaultC… (podman + 0xf2ef4b)#012#22 0x00005626aa086912 github.com/containers/podman/vendor/go.podman.io/common/pkg/config.newLocked (podman + 0xf32912)#012#23 0x00005626aa086605 github.com/containers/podman/vendor/go.podman.io/common/pkg/config.New (podman + 0xf32605)#012#24 0x00005626aa7f9fd3 github.com/containers/podman/cmd/podman/registry.newPodmanConfig (podman + 0x16a5fd3)#012#25 0x00005626a9672dcc sync.(*Once).doSlow (podman + 0x51edcc)#012#26 0x00005626aa81ac50 github.com/containers/podman/cmd/podman/common.init (podman + 0x16c6c50)#012#27 0x00005626a9638a57 runtime.doInit1 (podman + 0x4e4a57)#012#28 0x00005626a9628f90 runtime.main (podman + 0x4d4f90)#012#29 0x00005626a9668ee1 runtime.goexit.abi0 (podman + 0x514ee1)#012ELF object binary architecture: AMD x86-64
== jubjub.cs.umd.edu (3 distinct, 4 total) ==
Jul 26 00:10:11 jubjub.cs.umd.edu systemd[1]: New main PID 3110048 does not belong to service, and PID file is not owned by root. Refusing. [x2]
Jul 26 00:10:30 jubjub.cs.umd.edu systemd[1]: Daemon never wrote its PID file. Failing.
Jul 26 00:10:38 jubjub.cs.umd.edu systemd[1]: pmlogger.service: Supervising process 3117535 which is not our child. We'll most likely not notice when it exits.
== mirrors.cs.umd.edu (3 distinct, 4 total) ==
Jul 26 00:10:26 mirrors.cs.umd.edu systemd[1]: New main PID 6884 does not belong to service, and PID file is not owned by root. Refusing. [x2]
Jul 26 00:10:31 mirrors.cs.umd.edu systemd[1]: Daemon never wrote its PID file. Failing.
Jul 26 00:10:42 mirrors.cs.umd.edu systemd[1]: pmlogger.service: Supervising process 13758 which is not our child. We'll most likely not notice when it exits.
== misty.cs.umd.edu (3 distinct, 4 total) ==
Jul 26 00:10:15 misty.cs.umd.edu systemd[1]: New main PID 1236 does not belong to service, and PID file is not owned by root. Refusing. [x2]
Jul 26 00:10:35 misty.cs.umd.edu systemd[1]: Daemon never wrote its PID file. Failing.
Jul 26 00:10:51 misty.cs.umd.edu systemd[1]: pmlogger.service: Supervising process 9158 which is not our child. We'll most likely not notice when it exits.
== munin (1 distinct, 1 total) ==
Jul 26 00:27:04 munin (httpd)[978792]: httpd.service: Referenced but unset environment variable evaluates to an empty string: OPTIONS
== netbox (1 distinct, 1 total) ==
Jul 26 00:49:29 netbox (httpd)[338568]: httpd.service: Referenced but unset environment variable evaluates to an empty string: OPTIONS
== netman.cs.umd.edu (3 distinct, 3 total) ==
Jul 26 00:29:57 netman.cs.umd.edu setroubleshoot[1101378]: SELinux is preventing /usr/bin/gpg from read access on the file gpg.conf. For complete SELinux messages run: sealert -l 019ad1da-a874-4814-8037-3b3e5f413ad2
Jul 26 00:29:58 netman.cs.umd.edu setroubleshoot[1101378]: SELinux is preventing /usr/bin/gpg from open access on the file /root/.gnupg/gpg.conf. For complete SELinux messages run: sealert -l cb54177e-d44c-46a1-b246-5c0bbb8343be
Jul 26 00:30:07 netman.cs.umd.edu setroubleshoot[1101378]: SELinux is preventing /usr/bin/gpg from getattr access on the file /root/.gnupg/gpg.conf. For complete SELinux messages run: sealert -l fbba2e30-b7ab-491c-9ec6-f553e9ef72af
== networkvm01.cs.umd.edu (9 distinct, 9 total) ==
Jul 26 00:23:37 networkvm01.cs.umd.edu setroubleshoot[3218027]: SELinux is preventing /usr/bin/gpg from write access on the directory /(null). For complete SELinux messages run: sealert -l 8ead1354-ae8a-4a17-bb3f-146ebf6c892c
Jul 26 00:23:37 networkvm01.cs.umd.edu setroubleshoot[3218027]: SELinux is preventing /usr/bin/gpg from add_name access on the directory /(null). For complete SELinux messages run: sealert -l f9b51e91-5dbc-455f-88c2-f0746a2f0f4c
Jul 26 00:23:37 networkvm01.cs.umd.edu setroubleshoot[3218027]: SELinux is preventing /usr/bin/gpg from create access on the file /(null). For complete SELinux messages run: sealert -l af0a60e6-c449-4bdd-bfb8-c69b58472884
Jul 26 00:23:37 networkvm01.cs.umd.edu setroubleshoot[3218027]: SELinux is preventing /usr/bin/gpg from link access on the file /(null). For complete SELinux messages run: sealert -l 3df452f6-4d9e-4e38-946b-ea8e1edd356c
Jul 26 00:23:37 networkvm01.cs.umd.edu setroubleshoot[3218027]: SELinux is preventing /usr/bin/gpg from remove_name access on the directory .#lk0x000055d92e5a7ed0.networkvm01.cs.umd.edu.3218026x. For complete SELinux messages run: sealert -l fcac71c9-c7c0-45a9-9dc2-a8dcbeccfc75
Jul 26 00:23:37 networkvm01.cs.umd.edu setroubleshoot[3218027]: SELinux is preventing /usr/bin/gpg from unlink access on the file .#lk0x000055d92e5a7ed0.networkvm01.cs.umd.edu.3218026x. For complete SELinux messages run: sealert -l a672ebb7-fa69-419c-b1f0-fb386b8b48a6
Jul 26 00:23:37 networkvm01.cs.umd.edu setroubleshoot[3218027]: SELinux is preventing /usr/bin/gpg from write access on the directory /(null). For complete SELinux messages run: sealert -l fec9104e-d27a-4fd4-9872-6b17088c2951
Jul 26 00:23:37 networkvm01.cs.umd.edu setroubleshoot[3218027]: SELinux is preventing /usr/bin/gpg from add_name access on the directory /(null). For complete SELinux messages run: sealert -l 26718b2a-493d-457d-818c-244bd8d4ec9d
Jul 26 00:23:38 networkvm01.cs.umd.edu setroubleshoot[3218027]: SELinux is preventing /usr/bin/gpg from remove_name access on the directory .#lk0x000055cdd30b5ee0.networkvm01.cs.umd.edu.3218044x. For complete SELinux messages run: sealert -l 80e6efe4-93f3-4219-8132-b2b52db1f517
== newhonors2 (1 distinct, 24 total) ==
Jul 26 00:13:03 newhonors2 dhcpcd[288346]: dhcpcd is not running [x24]
== openrepo (1 distinct, 1 total) ==
Jul 26 00:48:27 openrepo (nin-node)[4162295]: munin-node.service: Referenced but unset environment variable evaluates to an empty string: DAEMON_ARGS
== outbound00.cs.umd.edu (1 distinct, 6 total) ==
Jul 26 00:09:09 outbound00.cs.umd.edu python3[3805521]: ldapdb [x6]
== outbound01.cs.umd.edu (1 distinct, 6 total) ==
Jul 26 00:13:06 outbound01.cs.umd.edu python3[1835160]: ldapdb [x6]
== sentry-docker00.cs.umd.edu (40 distinct, 40 total) ==
Jul 26 00:08:08 sentry-docker00.cs.umd.edu systemd-udevd[3652018]: link_config: could not get ethtool features for veth6169915
Jul 26 00:08:08 sentry-docker00.cs.umd.edu systemd-udevd[3652018]: Could not set offload features of veth6169915: No such device
Jul 26 00:08:08 sentry-docker00.cs.umd.edu systemd-udevd[3652092]: Could not generate persistent MAC address for veth9e847c1: No such file or directory
Jul 26 00:08:08 sentry-docker00.cs.umd.edu systemd-udevd[3652093]: Could not generate persistent MAC address for veth4ea1f24: No such file or directory
Jul 26 00:16:44 sentry-docker00.cs.umd.edu systemd-udevd[3655608]: link_config: could not get ethtool features for veth0ebd2b3
Jul 26 00:16:44 sentry-docker00.cs.umd.edu systemd-udevd[3655608]: Could not set offload features of veth0ebd2b3: No such device
Jul 26 00:16:44 sentry-docker00.cs.umd.edu systemd-udevd[3655630]: Could not generate persistent MAC address for veth2cf54b3: No such file or directory
Jul 26 00:16:44 sentry-docker00.cs.umd.edu systemd-udevd[3655631]: Could not generate persistent MAC address for veth0d944c8: No such file or directory
Jul 26 00:16:44 sentry-docker00.cs.umd.edu systemd-udevd[3655634]: Could not generate persistent MAC address for vethab7b2c2: No such file or directory
Jul 26 00:16:44 sentry-docker00.cs.umd.edu systemd-udevd[3655635]: Could not generate persistent MAC address for vethd5270a5: No such file or directory
Jul 26 00:16:44 sentry-docker00.cs.umd.edu systemd-udevd[3655658]: Could not generate persistent MAC address for veth4904dfa: No such file or directory
Jul 26 00:16:44 sentry-docker00.cs.umd.edu systemd-udevd[3655660]: Could not generate persistent MAC address for veth12d5714: No such file or directory
Jul 26 00:16:44 sentry-docker00.cs.umd.edu systemd-udevd[3655683]: Could not generate persistent MAC address for vetha0551a6: No such file or directory
Jul 26 00:16:44 sentry-docker00.cs.umd.edu systemd-udevd[3655660]: Could not generate persistent MAC address for vethfd9e962: No such file or directory
Jul 26 00:28:16 sentry-docker00.cs.umd.edu systemd-udevd[3661849]: Could not generate persistent MAC address for vethd5bb28a: No such file or directory
Jul 26 00:28:16 sentry-docker00.cs.umd.edu systemd-udevd[3661850]: Could not generate persistent MAC address for vethef19009: No such file or directory
Jul 26 00:36:52 sentry-docker00.cs.umd.edu systemd-udevd[3665062]: link_config: could not get ethtool features for veth4904dfa
Jul 26 00:36:52 sentry-docker00.cs.umd.edu systemd-udevd[3665062]: Could not set offload features of veth4904dfa: No such device
Jul 26 00:36:52 sentry-docker00.cs.umd.edu systemd-udevd[3665089]: Could not generate persistent MAC address for veth29266b6: No such file or directory
Jul 26 00:36:52 sentry-docker00.cs.umd.edu systemd-udevd[3665090]: Could not generate persistent MAC address for veth313e270: No such file or directory
Jul 26 00:36:52 sentry-docker00.cs.umd.edu systemd-udevd[3665093]: Could not generate persistent MAC address for vetha0dac93: No such file or directory
Jul 26 00:36:52 sentry-docker00.cs.umd.edu systemd-udevd[3665094]: Could not generate persistent MAC address for veth86fbd89: No such file or directory
Jul 26 00:36:52 sentry-docker00.cs.umd.edu systemd-udevd[3665102]: Could not generate persistent MAC address for veth3f45867: No such file or directory
Jul 26 00:36:52 sentry-docker00.cs.umd.edu systemd-udevd[3665097]: Could not generate persistent MAC address for veth6c9f059: No such file or directory
Jul 26 00:36:52 sentry-docker00.cs.umd.edu systemd-udevd[3665119]: Could not generate persistent MAC address for veth5ef1f77: No such file or directory
Jul 26 00:36:52 sentry-docker00.cs.umd.edu systemd-udevd[3665120]: Could not generate persistent MAC address for veth5cd1173: No such file or directory
Jul 26 00:48:24 sentry-docker00.cs.umd.edu systemd-udevd[3671266]: link_config: could not get ethtool features for vethd5bb28a
Jul 26 00:48:24 sentry-docker00.cs.umd.edu systemd-udevd[3671266]: Could not set offload features of vethd5bb28a: No such device
Jul 26 00:48:24 sentry-docker00.cs.umd.edu systemd-udevd[3671283]: Could not generate persistent MAC address for veth3e398ff: No such file or directory
Jul 26 00:48:24 sentry-docker00.cs.umd.edu systemd-udevd[3671284]: Could not generate persistent MAC address for veth49e4e5a: No such file or directory
... 10 more distinct messages not shown
== soul (2 distinct, 2 total) ==
Jul 26 00:49:14 soul krb5_child[1858129]: Client 'admin(a)UMD.EDU' not found in Kerberos database
Jul 26 00:49:25 soul sshd-session[1858132]: error: Protocol major versions differ: 2 vs. 1
== strawberry (3 distinct, 9 total) ==
Jul 26 00:09:44 strawberry udisksd[1067]: Error performing housekeeping for drive /org/freedesktop/UDisks2/drives/ST2000DM001_1CH164_W1E8J5KJ: Error updating SMART data: Error sending ATA command CHECK POWER MODE: Unexpected sense data returned:#0120000: 00 00 00 00 00 00 00 00 00 00 00 00 00 00 00 00 ................#0120010: 00 00 00 00 00 00 00 00 00 00 00 00 00 00 00 00 ................#012 (g-io-error-quark, 0) [x6]
Jul 26 00:34:42 strawberry smartd[5314]: Device: /dev/sda [SAT], failed to read SMART Attribute Data [x2]
Jul 26 01:04:42 strawberry smartd[5314]: Device: /dev/sda [SAT], not capable of Offline or Self-Testing.
== submit10-cln25 (3 distinct, 4 total) ==
Jul 26 00:10:11 submit10-cln25 systemd: New main PID 26016 does not belong to service, and PID file is not owned by root. Refusing. [x2]
Jul 26 00:10:30 submit10-cln25 systemd: Daemon never wrote its PID file. Failing.
Jul 26 00:10:36 submit10-cln25 systemd: pmlogger.service: Supervising process 464 which is not our child. We'll most likely not notice when it exits.
== submit26-b9-2 (1 distinct, 1 total) ==
Jul 26 00:38:06 submit26-b9-2 systemd[1]: user(a)1001.service: Main process exited, code=killed, status=9/KILL
== submit26-b9-4 (11 distinct, 14 total) ==
Jul 26 00:15:25 submit26-b9-4 setroubleshoot[212899]: SELinux is preventing /usr/bin/python3.9 from create access on the directory /(null). For complete SELinux messages run: sealert -l a4e66030-8621-4da9-bd27-5988bb1bf8ad
Jul 26 00:15:25 submit26-b9-4 setroubleshoot[212899]: SELinux is preventing /usr/bin/python3.9 from add_name access on the directory /(null). For complete SELinux messages run: sealert -l c055e37d-bbf5-4800-9083-d606f792c8c1
Jul 26 00:15:25 submit26-b9-4 setroubleshoot[212899]: SELinux is preventing /usr/bin/python3.9 from create access on the file /(null). For complete SELinux messages run: sealert -l e5bc3a56-6d6f-4776-954f-ddde1579648f [x2]
Jul 26 00:15:25 submit26-b9-4 setroubleshoot[212899]: SELinux is preventing /usr/bin/python3.9 from open access on the file /tmp/libdnf.TeWVBv/repodata/repomd.xml. For complete SELinux messages run: sealert -l a8ec5e1b-49f9-4fbc-a8ae-22e800f7abf2
Jul 26 00:15:25 submit26-b9-4 setroubleshoot[212899]: SELinux is preventing /usr/bin/python3.9 from setattr access on the file repomd.xml. For complete SELinux messages run: sealert -l 945db714-d0c0-4402-911e-932978b8b036 [x2]
Jul 26 00:15:25 submit26-b9-4 setroubleshoot[212899]: SELinux is preventing /usr/bin/python3.9 from read access on the directory libdnf.TeWVBv. For complete SELinux messages run: sealert -l 463998a0-fb0d-463c-82b1-471135710a14
Jul 26 00:15:25 submit26-b9-4 setroubleshoot[212899]: SELinux is preventing /usr/bin/python3.9 from remove_name access on the directory repomd.xml. For complete SELinux messages run: sealert -l 473d2e21-15d8-407a-a9ee-2b842607fa00
Jul 26 00:15:25 submit26-b9-4 setroubleshoot[212899]: SELinux is preventing /usr/bin/python3.9 from unlink access on the file repomd.xml. For complete SELinux messages run: sealert -l 80c54d4f-bf4b-4501-addb-1627383587d0 [x2]
Jul 26 00:15:25 submit26-b9-4 setroubleshoot[212899]: SELinux is preventing /usr/bin/python3.9 from rmdir access on the directory repodata. For complete SELinux messages run: sealert -l c63d3890-151e-49a0-83f0-3dfb69d051e5
Jul 26 00:15:25 submit26-b9-4 setroubleshoot[212899]: SELinux is preventing /usr/bin/python3.9 from open access on the file /tmp/libdnf.RWrXWK/repodata/repomd.xml. For complete SELinux messages run: sealert -l a8ec5e1b-49f9-4fbc-a8ae-22e800f7abf2
Jul 26 00:18:05 submit26-b9-4 systemd[1]: user(a)1001.service: Main process exited, code=killed, status=9/KILL
== teaching-awards (2 distinct, 2 total) ==
Jul 26 00:56:41 teaching-awards krb5_child[1270978]: Client 'admin(a)UMD.EDU' not found in Kerberos database
Jul 26 00:57:08 teaching-awards sshd-session[1270995]: error: Protocol major versions differ: 2 vs. 1
== tlsrpt (1 distinct, 1 total) ==
Jul 26 00:26:17 tlsrpt (httpd)[212445]: httpd.service: Referenced but unset environment variable evaluates to an empty string: OPTIONS
== tma-0 (3 distinct, 4 total) ==
Jul 26 00:10:13 tma-0 systemd[1]: New main PID 20824 does not belong to service, and PID file is not owned by root. Refusing. [x2]
Jul 26 00:10:30 tma-0 systemd[1]: Daemon never wrote its PID file. Failing.
Jul 26 00:10:38 tma-0 systemd[1]: pmlogger.service: Supervising process 28221 which is not our child. We'll most likely not notice when it exits.
== uffish.cs.umd.edu (3 distinct, 4 total) ==
Jul 26 00:10:13 uffish.cs.umd.edu systemd[1]: New main PID 2612233 does not belong to service, and PID file is not owned by root. Refusing. [x2]
Jul 26 00:10:35 uffish.cs.umd.edu systemd[1]: Daemon never wrote its PID file. Failing.
Jul 26 00:10:50 uffish.cs.umd.edu systemd[1]: pmlogger.service: Supervising process 2619751 which is not our child. We'll most likely not notice when it exits.
== updates00.cs.umd.edu (3 distinct, 4 total) ==
Jul 26 00:10:12 updates00.cs.umd.edu systemd[1]: New main PID 17575 does not belong to service, and PID file is not owned by root. Refusing. [x2]
Jul 26 00:10:30 updates00.cs.umd.edu systemd[1]: Daemon never wrote its PID file. Failing.
Jul 26 00:10:36 updates00.cs.umd.edu systemd[1]: pmlogger.service: Supervising process 24468 which is not our child. We'll most likely not notice when it exits.
== vacuum.cs.umd.edu (3 distinct, 4 total) ==
Jul 26 00:10:14 vacuum.cs.umd.edu systemd[1]: New main PID 16095 does not belong to service, and PID file is not owned by root. Refusing. [x2]
Jul 26 00:10:33 vacuum.cs.umd.edu systemd[1]: Daemon never wrote its PID file. Failing.
Jul 26 00:10:44 vacuum.cs.umd.edu systemd[1]: pmlogger.service: Supervising process 23335 which is not our child. We'll most likely not notice when it exits.
== whiffle.cs.umd.edu (3 distinct, 4 total) ==
Jul 26 00:10:13 whiffle.cs.umd.edu systemd[1]: New main PID 2466221 does not belong to service, and PID file is not owned by root. Refusing. [x2]
Jul 26 00:10:33 whiffle.cs.umd.edu systemd[1]: Daemon never wrote its PID file. Failing.
Jul 26 00:10:46 whiffle.cs.umd.edu systemd[1]: pmlogger.service: Supervising process 2473425 which is not our child. We'll most likely not notice when it exits.
== zfs00.cs.umd.edu (1 distinct, 1 total) ==
Jul 26 00:30:41 zfs00.cs.umd.edu rsyslogd: imrelp[2514]: error 'error when receiving data, session broken', object 'lstn 2514: conn to clt 10.73.255.10/frozone.cs.umd.edu' - input may not work as intended [v8.2604.0 try https://www.rsyslog.com/e/2353 ]
1
0
Command: /usr/local/sbin/syslog-digest.py
Time : 0.5457s
Status : exited 0
Output :
Syslog digest — 2026-07-26 00:05 EDT
Processed 4,581 lines, filtered 3,681 (80%). 900 unknown (117 distinct) from 31 host(s).
== abuse (1 distinct, 346 total) ==
Jul 25 23:05:06 abuse rsyslogd[21745]: imjournal: open() failed for path: '/var/lib/rsyslog/imjournal.state.tmp': Input/output error [v8.2404.0 try https://www.rsyslog.com/e/2433 ] [x346]
== alec.cs.umd.edu (3 distinct, 59 total) ==
Jul 25 23:05:06 alec.cs.umd.edu setroubleshoot[3084939]: failed to retrieve rpm info for path '/run/netns/netns-9dfd0347-71eb-5698-085c-c769043aa5c3': [x12]
Jul 25 23:05:07 alec.cs.umd.edu sedispatch[1526]: AVC Message regarding setroubleshoot, ignoring message [x24]
Jul 25 23:05:07 alec.cs.umd.edu setroubleshoot[3084939]: SELinux is preventing /usr/bin/df from getattr access on the file /run/netns/netns-9dfd0347-71eb-5698-085c-c769043aa5c3. For complete SELinux messages run: sealert -l 23f93208-3063-4aac-b78a-bb0fcb40740c [x23]
== b0b02.cs.umd.edu (1 distinct, 1 total) ==
Jul 25 23:55:13 b0b02.cs.umd.edu rustdesk[583729]: cannot open display:
== biggulp.cs.umd.edu (10 distinct, 24 total) ==
Jul 25 23:09:29 biggulp.cs.umd.edu sshd-session[409454]: pam_access(sshd:auth): access denied for user `admin' from `27.79.40.150' [x3]
Jul 25 23:09:29 biggulp.cs.umd.edu krb5_child[409456]: Client 'admin(a)UMD.EDU' not found in Kerberos database [x7]
Jul 25 23:09:29 biggulp.cs.umd.edu sshd-session[409442]: error: PAM: System error for admin from 27.79.40.150 [x3]
Jul 25 23:31:33 biggulp.cs.umd.edu sshd-session[414690]: pam_access(sshd:auth): access denied for user `admin' from `171.231.176.161' [x3]
Jul 25 23:31:33 biggulp.cs.umd.edu sshd-session[414687]: error: PAM: System error for admin from 171.231.176.161 [x3]
Jul 25 23:35:46 biggulp.cs.umd.edu sshd-session[415381]: pam_access(sshd:auth): access denied for user `root' from `27.79.40.150'
Jul 25 23:35:49 biggulp.cs.umd.edu sshd-session[415376]: error: PAM: Authentication failure for root from 27.79.40.150
Jul 25 23:56:54 biggulp.cs.umd.edu sshd-session[419373]: pam_access(sshd:auth): access denied for user `admin' from `34.62.49.5'
Jul 25 23:56:54 biggulp.cs.umd.edu sshd-session[419371]: error: PAM: System error for admin from 34.62.49.5
Jul 25 23:57:05 biggulp.cs.umd.edu sshd-session[419381]: error: Protocol major versions differ: 2 vs. 1
== borogove.cs.umd.edu (2 distinct, 2 total) ==
Jul 26 00:00:06 borogove.cs.umd.edu rsyslogd[2038]: imfile: internal error? inotify provided watch descriptor 183 which we could not find in our tables - ignored [v8.2510.0-2.el9 try https://www.rsyslog.com/e/2175 ]
Jul 26 00:00:06 borogove.cs.umd.edu rsyslogd[2038]: imfile: internal error? inotify provided watch descriptor 181 which we could not find in our tables - ignored [v8.2510.0-2.el9 try https://www.rsyslog.com/e/2175 ]
== cheezit.cs.umd.edu (6 distinct, 7 total) ==
Jul 25 23:31:40 cheezit.cs.umd.edu sshd-session[1867777]: pam_access(sshd:auth): access denied for user `admin' from `34.76.95.196'
Jul 25 23:31:40 cheezit.cs.umd.edu krb5_child[1867779]: Client 'admin(a)UMD.EDU' not found in Kerberos database [x2]
Jul 25 23:31:40 cheezit.cs.umd.edu sshd-session[1867774]: error: PAM: System error for admin from 34.76.95.196
Jul 25 23:33:10 cheezit.cs.umd.edu sshd-session[1867894]: error: Protocol major versions differ: 2 vs. 1
Jul 25 23:36:16 cheezit.cs.umd.edu sshd-session[1868820]: pam_access(sshd:auth): access denied for user `admin' from `34.79.245.31'
Jul 25 23:36:16 cheezit.cs.umd.edu sshd-session[1868817]: error: PAM: System error for admin from 34.79.245.31
== contest (1 distinct, 34 total) ==
Jul 25 23:05:29 contest goferd[1007]: [ERROR][worker-0] gofer.messaging.adapter.connect:33 - connect: proton+amqps://satellite8.cs.umd.edu:5647, failed: Connection amqps://satellite8.cs.umd.edu:5647 disconnected: Condition('proton.pythonio', 'Connection refused to all addresses') [x34]
== csfw00a (1 distinct, 192 total) ==
Jul 25 23:04:32 csfw00a kernel: bnxt_en 0000:09:00.0 eth3: NIC Link is Down [x192]
== cskayako (2 distinct, 2 total) ==
Jul 26 00:00:02 cskayako setroubleshoot[638787]: failed to retrieve rpm info for path '/var/log/php82-fpm_error.log':
Jul 26 00:00:03 cskayako setroubleshoot[638787]: SELinux is preventing /opt/remi/php82/root/usr/sbin/php-fpm from open access on the file /var/log/php82-fpm_error.log. For complete SELinux messages run: sealert -l 0ba5d5da-2df6-4c48-bd39-9b458b25a6cc
== hackerman (7 distinct, 12 total) ==
Jul 25 23:19:01 hackerman gnome-software[2060381]: failed to commit changes to dconf: GDBus.Error:org.gtk.GDBus.UnmappedGError.Quark._g_2dfile_2derror_2dquark.Code2: Failed to create file “/adminhomes/sajith/.config/dconf/user.XTV5S3”: Permission denied
Jul 25 23:20:04 hackerman gnome-software[2060381]: can't reliably fixup error code 4 in domain g-io-error-quark: Not a directory [x4]
Jul 25 23:20:13 hackerman gnome-software[2060381]: Only 0 apps for recent list, hiding
Jul 25 23:20:28 hackerman gnome-software[2060381]: failed to commit changes to dconf: GDBus.Error:org.gtk.GDBus.UnmappedGError.Quark._g_2dfile_2derror_2dquark.Code2: Failed to create file “/adminhomes/sajith/.config/dconf/user.7VIBT3”: Permission denied
Jul 25 23:20:29 hackerman packagekitd[637750]: Failed to get cache filename for libreoffice [x2]
Jul 25 23:20:29 hackerman packagekitd[637750]: Failed to get cache filename for kernel [x2]
Jul 25 23:20:39 hackerman packagekitd[637750]: failed to parse public key for /etc/pki/rpm-gpg/RPM-GPG-KEY-PQC-redhat-release
== idm00 (2 distinct, 4 total) ==
Jul 25 23:51:06 idm00 named[1455]: client @0x7f331054a7b8 10.73.240.42#52292: update '73.10.in-addr.arpa/IN' denied
Jul 26 00:00:01 idm00 named[1455]: checkhints: unable to get root NS rrset from cache: not found [x3]
== idmh1 (1 distinct, 2 total) ==
Jul 26 00:00:00 idmh1 named[73276]: checkhints: unable to get root NS rrset from cache: not found [x2]
== idmp0 (2 distinct, 3 total) ==
Jul 25 23:34:56 idmp0 named[5198]: client @0x7f990400e5f8 10.73.240.43#52453: update '73.10.in-addr.arpa/IN' denied
Jul 26 00:00:01 idmp0 named[5198]: checkhints: unable to get root NS rrset from cache: not found [x2]
== idmv0 (1 distinct, 2 total) ==
Jul 26 00:00:01 idmv0 named[1889]: checkhints: unable to get root NS rrset from cache: not found [x2]
== itmon02 (1 distinct, 54 total) ==
Jul 25 23:07:48 itmon02 sshd[1834]: error: beginning MaxStartups throttling [x54]
== jaws.cs.umd.edu (2 distinct, 2 total) ==
Jul 26 00:00:03 jaws.cs.umd.edu setroubleshoot[1764376]: failed to retrieve rpm info for path '/var/log/php84-fpm_error.log':
Jul 26 00:00:06 jaws.cs.umd.edu setroubleshoot[1764376]: SELinux is preventing /opt/remi/php82/root/usr/sbin/php-fpm from open access on the file /var/log/php84-fpm_error.log. For complete SELinux messages run: sealert -l 437208fc-38c0-4c0e-84e9-08e0f801111e
== krispykreme.cs.umd.edu (11 distinct, 22 total) ==
Jul 25 23:09:15 krispykreme.cs.umd.edu sshd-session[3593652]: pam_access(sshd:auth): access denied for user `admin' from `27.79.40.150' [x3]
Jul 25 23:09:15 krispykreme.cs.umd.edu krb5_child[3593654]: Client 'admin(a)UMD.EDU' not found in Kerberos database [x5]
Jul 25 23:09:15 krispykreme.cs.umd.edu sshd-session[3593628]: error: PAM: System error for admin from 27.79.40.150 [x3]
Jul 25 23:13:17 krispykreme.cs.umd.edu sshd-session[3594579]: pam_access(sshd:auth): access denied for user `root' from `171.231.176.161'
Jul 25 23:13:30 krispykreme.cs.umd.edu sshd-session[3594516]: error: PAM: Authentication failure for root from 171.231.176.161
Jul 25 23:32:56 krispykreme.cs.umd.edu sshd-session[3600156]: pam_access(sshd:auth): access denied for user `admin' from `171.231.176.161' [x3]
Jul 25 23:32:56 krispykreme.cs.umd.edu sshd-session[3600153]: error: PAM: System error for admin from 171.231.176.161 [x2]
Jul 25 23:34:12 krispykreme.cs.umd.edu sshd-session[3600285]: pam_access(sshd:auth): access denied for user `root' from `27.79.40.150'
Jul 25 23:34:14 krispykreme.cs.umd.edu sshd-session[3600258]: error: PAM: Authentication failure for root from 27.79.40.150
Jul 26 00:00:34 krispykreme.cs.umd.edu sshd-session[3609051]: pam_access(sshd:auth): access denied for user `ftp' from `171.231.176.161'
Jul 26 00:00:36 krispykreme.cs.umd.edu sshd-session[3609045]: error: PAM: Authentication failure for ftp from 171.231.176.161
== matrix (7 distinct, 29 total) ==
Jul 25 23:10:21 matrix krb5_child[2326812]: Client 'admin(a)UMD.EDU' not found in Kerberos database [x16]
Jul 25 23:10:23 matrix sshd[2326747]: error: PAM: Authentication failure for admin from 171.231.176.161 [x3]
Jul 25 23:25:00 matrix sshd[2335613]: error: PAM: Authentication failure for admin from 34.22.137.187
Jul 25 23:25:17 matrix sshd[2336659]: error: Protocol major versions differ: 2 vs. 1
Jul 25 23:28:39 matrix sshd[2337778]: error: PAM: Authentication failure for root from 27.79.40.150 [x3]
Jul 25 23:31:40 matrix sshd[2340309]: error: PAM: Authentication failure for admin from 27.79.40.150 [x4]
Jul 26 00:00:03 matrix (nin-node)[2355575]: munin-node.service: Referenced but unset environment variable evaluates to an empty string: DAEMON_ARGS
== neo-gizmonic (1 distinct, 1 total) ==
Jul 26 00:00:14 neo-gizmonic (nin-node)[3676202]: munin-node.service: Referenced but unset environment variable evaluates to an empty string: DAEMON_ARGS
== neoavion (2 distinct, 2 total) ==
Jul 26 00:00:26 neoavion systemctl[1671817]: Warning: The unit file, source configuration file or drop-ins of munin-node.service changed on disk. Run 'systemctl daemon-reload' to reload units.
Jul 26 00:00:26 neoavion (nin-node)[1671823]: munin-node.service: Referenced but unset environment variable evaluates to an empty string: DAEMON_ARGS
== newhonors2 (2 distinct, 25 total) ==
Jul 25 23:13:02 newhonors2 dhcpcd[286213]: dhcpcd is not running [x24]
Jul 26 00:00:16 newhonors2 (nin-node)[287796]: munin-node.service: Referenced but unset environment variable evaluates to an empty string: DAEMON_ARGS
== openvox08-board (1 distinct, 1 total) ==
Jul 26 00:00:51 openvox08-board (httpd)[702914]: httpd.service: Referenced but unset environment variable evaluates to an empty string: OPTIONS
== outbound00.cs.umd.edu (1 distinct, 6 total) ==
Jul 25 23:09:09 outbound00.cs.umd.edu python3[3791448]: ldapdb [x6]
== outbound01.cs.umd.edu (3 distinct, 16 total) ==
Jul 25 23:11:28 outbound01.cs.umd.edu krb5_child[1820090]: Client 'admin(a)UMD.EDU' not found in Kerberos database [x9]
Jul 25 23:13:06 outbound01.cs.umd.edu python3[1820430]: ldapdb [x6]
Jul 25 23:19:55 outbound01.cs.umd.edu sshd-session[1821624]: error: Protocol major versions differ: 2 vs. 1
== sebatinsky.cs.umd.edu (1 distinct, 1 total) ==
Jul 25 23:35:57 sebatinsky.cs.umd.edu setroubleshoot[3574593]: SELinux is preventing /usr/sbin/pdns_server from name_bind access on the udp_socket port 18121. For complete SELinux messages run: sealert -l c4b69b27-6c9b-464f-ba75-93d6582c7cf2
== sentry-docker00.cs.umd.edu (38 distinct, 38 total) ==
Jul 25 23:07:43 sentry-docker00.cs.umd.edu systemd-udevd[3623073]: Could not generate persistent MAC address for veth113e15b: No such file or directory
Jul 25 23:07:43 sentry-docker00.cs.umd.edu systemd-udevd[3623074]: Could not generate persistent MAC address for vethf4f1daa: No such file or directory
Jul 25 23:16:19 sentry-docker00.cs.umd.edu systemd-udevd[3627235]: link_config: could not get ethtool features for vethab2b290
Jul 25 23:16:19 sentry-docker00.cs.umd.edu systemd-udevd[3627235]: Could not set offload features of vethab2b290: No such device
Jul 25 23:16:20 sentry-docker00.cs.umd.edu systemd-udevd[3627302]: Could not generate persistent MAC address for vetha85a4d7: No such file or directory
Jul 25 23:16:20 sentry-docker00.cs.umd.edu systemd-udevd[3627303]: Could not generate persistent MAC address for veth620ffaa: No such file or directory
Jul 25 23:16:20 sentry-docker00.cs.umd.edu systemd-udevd[3627306]: Could not generate persistent MAC address for veth24ac495: No such file or directory
Jul 25 23:16:20 sentry-docker00.cs.umd.edu systemd-udevd[3627307]: Could not generate persistent MAC address for veth952467b: No such file or directory
Jul 25 23:16:20 sentry-docker00.cs.umd.edu systemd-udevd[3627330]: Could not generate persistent MAC address for veth2c0c945: No such file or directory
Jul 25 23:16:20 sentry-docker00.cs.umd.edu systemd-udevd[3627331]: Could not generate persistent MAC address for veth68e7189: No such file or directory
Jul 25 23:16:20 sentry-docker00.cs.umd.edu systemd-udevd[3627349]: Could not generate persistent MAC address for veth010ca21: No such file or directory
Jul 25 23:16:20 sentry-docker00.cs.umd.edu systemd-udevd[3627355]: Could not generate persistent MAC address for veth540a949: No such file or directory
Jul 25 23:27:51 sentry-docker00.cs.umd.edu systemd-udevd[3632529]: Could not generate persistent MAC address for veth1beca83: No such file or directory
Jul 25 23:27:51 sentry-docker00.cs.umd.edu systemd-udevd[3632530]: Could not generate persistent MAC address for veth1d83151: No such file or directory
Jul 25 23:36:27 sentry-docker00.cs.umd.edu systemd-udevd[3636669]: link_config: could not get ethtool features for veth2c0c945
Jul 25 23:36:27 sentry-docker00.cs.umd.edu systemd-udevd[3636669]: Could not set offload features of veth2c0c945: No such device
Jul 25 23:36:27 sentry-docker00.cs.umd.edu systemd-udevd[3636707]: link_config: could not set ethtool features for vetha85a4d7
Jul 25 23:36:27 sentry-docker00.cs.umd.edu systemd-udevd[3636707]: Could not set offload features of vetha85a4d7: Operation not permitted
Jul 25 23:36:27 sentry-docker00.cs.umd.edu systemd-udevd[3636734]: Could not generate persistent MAC address for vethdf4b660: No such file or directory
Jul 25 23:36:27 sentry-docker00.cs.umd.edu systemd-udevd[3636735]: Could not generate persistent MAC address for veth419baf2: No such file or directory
Jul 25 23:36:27 sentry-docker00.cs.umd.edu systemd-udevd[3636738]: Could not generate persistent MAC address for veth5366a56: No such file or directory
Jul 25 23:36:27 sentry-docker00.cs.umd.edu systemd-udevd[3636739]: Could not generate persistent MAC address for vethb08fd32: No such file or directory
Jul 25 23:36:27 sentry-docker00.cs.umd.edu systemd-udevd[3636740]: Could not generate persistent MAC address for vethf668ebe: No such file or directory
Jul 25 23:36:27 sentry-docker00.cs.umd.edu systemd-udevd[3636752]: Could not generate persistent MAC address for veth18456e2: No such file or directory
Jul 25 23:36:28 sentry-docker00.cs.umd.edu systemd-udevd[3636764]: Could not generate persistent MAC address for veth526c829: No such file or directory
Jul 25 23:36:28 sentry-docker00.cs.umd.edu systemd-udevd[3636765]: Could not generate persistent MAC address for veth3d4560e: No such file or directory
Jul 25 23:48:00 sentry-docker00.cs.umd.edu systemd-udevd[3641933]: Could not generate persistent MAC address for veth6169915: No such file or directory
Jul 25 23:48:00 sentry-docker00.cs.umd.edu systemd-udevd[3641934]: Could not generate persistent MAC address for veth5519b87: No such file or directory
Jul 25 23:56:36 sentry-docker00.cs.umd.edu systemd-udevd[3646172]: link_config: could not get ethtool features for vethdf4b660
Jul 25 23:56:36 sentry-docker00.cs.umd.edu systemd-udevd[3646172]: Could not set offload features of vethdf4b660: No such device
... 8 more distinct messages not shown
== strawberry (2 distinct, 8 total) ==
Jul 25 23:09:44 strawberry udisksd[1067]: Error performing housekeeping for drive /org/freedesktop/UDisks2/drives/ST2000DM001_1CH164_W1E8J5KJ: Error updating SMART data: Error sending ATA command CHECK POWER MODE: Unexpected sense data returned:#0120000: 00 00 00 00 00 00 00 00 00 00 00 00 00 00 00 00 ................#0120010: 00 00 00 00 00 00 00 00 00 00 00 00 00 00 00 00 ................#012 (g-io-error-quark, 0) [x6]
Jul 25 23:34:42 strawberry smartd[5314]: Device: /dev/sda [SAT], failed to read SMART Attribute Data [x2]
== submit26-b9-2 (1 distinct, 1 total) ==
Jul 25 23:56:05 submit26-b9-2 systemd[1]: user(a)1001.service: Main process exited, code=killed, status=9/KILL
== tulgey.cs.umd.edu (2 distinct, 2 total) ==
Jul 26 00:00:03 tulgey.cs.umd.edu setroubleshoot[3839457]: failed to retrieve rpm info for path '/var/log/php74-fpm_error.log':
Jul 26 00:00:04 tulgey.cs.umd.edu setroubleshoot[3839457]: SELinux is preventing /opt/remi/php74/root/usr/sbin/php-fpm from open access on the file /var/log/php74-fpm_error.log. For complete SELinux messages run: sealert -l 3912ba6e-61a1-44ae-b56d-ee09e1c984b8
== wraith (1 distinct, 1 total) ==
Jul 26 00:00:32 wraith (nin-node)[557759]: munin-node.service: Referenced but unset environment variable evaluates to an empty string: DAEMON_ARGS
== zebatinsky.cs.umd.edu (1 distinct, 1 total) ==
Jul 26 00:00:57 zebatinsky.cs.umd.edu setroubleshoot[3313555]: SELinux is preventing pdns/comm-retre from using the execmem access on a process. For complete SELinux messages run: sealert -l 2a8c520a-a14b-4c88-afde-0cdf2724a845
1
0