Command: /usr/local/sbin/syslog-digest.py
Time : 0.1051s
Status : exited 0
Output :
Syslog digest — 2026-10-06 09:05 EDT
Processed 3,740 lines, filtered 1,515 (40%). 2,225 unknown (233 distinct) from 22 host(s).
== amoeba (27 distinct, 1849 total) ==
Oct 6 08:54:48 amoeba upowerd[1032]: treating change event as add on /sys/devices/pci0000:00/0000:00:14.0/usb1/1-10
Oct 6 08:54:48 amoeba upowerd[1032]: treating change event as add on /sys/devices/pci0000:00/0000:00:14.0/usb2/2-5
Oct 6 08:55:08 amoeba goa-identity-se[2241377]: GoaKerberosIdentityManager: Using polling for change notification for credential cache type 'KCM'
Oct 6 08:55:08 amoeba vmware-user.desktop[2241573]: vmware-user: could not open /proc/fs/vmblock/dev
Oct 6 08:55:08 amoeba gsd-usb-protect[2241530]: Failed to fetch USBGuard parameters: GDBus.Error:org.freedesktop.DBus.Error.ServiceUnknown: The name is not activatable
Oct 6 08:55:09 amoeba gnome-software[2241521]: Only 0 apps for recent list, hiding [x3]
Oct 6 08:55:10 amoeba gsd-color[2241469]: failed to connect to device: Failed to connect to missing device /org/freedesktop/ColorManager/devices/xrandr_Dell_Inc__DELL_U2718Q_4K8X78B30VWL_gdm_42
Oct 6 08:55:29 amoeba packagekitd[2241444]: Failed to get cache filename for gum
Oct 6 08:55:29 amoeba packagekitd[2241444]: Failed to get cache filename for ImageMagick
Oct 6 08:55:29 amoeba packagekitd[2241444]: Failed to get cache filename for ImageMagick-libs
Oct 6 08:55:29 amoeba packagekitd[2241444]: Failed to get cache filename for chromium [x2]
Oct 6 08:55:29 amoeba packagekitd[2241444]: Failed to get cache filename for chromium-common [x2]
Oct 6 08:55:29 amoeba packagekitd[2241444]: Failed to get cache filename for libavcodec-free
Oct 6 08:55:29 amoeba packagekitd[2241444]: Failed to get cache filename for libavformat-free
Oct 6 08:55:29 amoeba packagekitd[2241444]: Failed to get cache filename for libavutil-free
Oct 6 08:55:29 amoeba packagekitd[2241444]: Failed to get cache filename for libdav1d
Oct 6 08:55:29 amoeba packagekitd[2241444]: Failed to get cache filename for libswresample-free
Oct 6 08:55:29 amoeba packagekitd[2241444]: Failed to get cache filename for svt-av1-libs
Oct 6 08:55:29 amoeba packagekitd[2241444]: Failed to get cache filename for aribb24
Oct 6 08:55:29 amoeba packagekitd[2241444]: Failed to get cache filename for ffmpeg5-libavcodec-free
Oct 6 08:55:29 amoeba packagekitd[2241444]: Failed to get cache filename for ffmpeg5-libavformat-free
Oct 6 08:55:29 amoeba packagekitd[2241444]: Failed to get cache filename for ffmpeg5-libavutil-free
Oct 6 08:55:29 amoeba packagekitd[2241444]: Failed to get cache filename for ffmpeg5-libswresample-free
Oct 6 08:55:29 amoeba packagekitd[2241444]: Failed to get cache filename for intel-vpl-gpu-rt
Oct 6 08:55:29 amoeba packagekitd[2241444]: Failed to get cache filename for libaribcaption
Oct 6 08:55:29 amoeba packagekitd[2241444]: Failed to get cache filename for libvpl
Oct 6 08:56:40 amoeba packagekitd[2241444]: failed to parse public key for /etc/pki/rpm-gpg/RPM-GPG-KEY-PQC-redhat-release [x1819]
== b0b02.cs.umd.edu (1 distinct, 1 total) ==
Oct 6 08:15:57 b0b02.cs.umd.edu rustdesk[804306]: cannot open display:
== biggulp.cs.umd.edu (3 distinct, 4 total) ==
Oct 6 08:40:54 biggulp.cs.umd.edu sshd-session[2901597]: pam_access(sshd:auth): access denied for user `larry' from `71.191.93.172' [x2]
Oct 6 08:40:55 biggulp.cs.umd.edu sshd-session[2901597]: Error in Duo login for 'larry' from 71.191.93.172
Oct 6 08:40:55 biggulp.cs.umd.edu sshd-session[2901595]: error: PAM: Authentication failure for larry from 71.191.93.172
== cheezit.cs.umd.edu (3 distinct, 3 total) ==
Oct 6 08:51:42 cheezit.cs.umd.edu falcon-sensor-bpf[1347]: CrowdStrike(4): Could not retrieve DisableProxy value: c0000225
Oct 6 08:51:42 cheezit.cs.umd.edu falcon-sensor-bpf[1347]: CrowdStrike(4): ConnectWithProxy: Unable to get application proxy host from CsConfig: c0000225
Oct 6 09:02:46 cheezit.cs.umd.edu systemd[1]: insights-client.service: Start request repeated too quickly.
== emaar (1 distinct, 1 total) ==
Oct 6 08:43:19 emaar puppet-agent[2635994]: (Facter) invalid or malformed lldp data: MalformedDataError: no lldp interface data found
== hackerman (1 distinct, 1 total) ==
Oct 6 09:03:48 hackerman systemd[1]: insights-client.service: Start request repeated too quickly.
== idm00 (1 distinct, 1 total) ==
Oct 6 08:54:40 idm00 named[4166701]: client @0x7f119804e448 10.73.240.42#62013: update '73.10.in-addr.arpa/IN' denied
== idmp0 (1 distinct, 1 total) ==
Oct 6 08:39:23 idmp0 named[1598691]: client @0x7f2d14036638 10.73.240.43#54316: update '73.10.in-addr.arpa/IN' denied
== itmon02 (1 distinct, 3 total) ==
Oct 6 08:08:17 itmon02 sshd[805675]: error: beginning MaxStartups throttling [x3]
== jubjub.cs.umd.edu (44 distinct, 64 total) ==
Oct 6 09:04:05 jubjub.cs.umd.edu puppet-agent[267824]: : transaction-actions, product-id, search-disabled-repos,
Oct 6 09:04:05 jubjub.cs.umd.edu puppet-agent[267824]: : subscription-manager, versionlock
Oct 6 09:04:05 jubjub.cs.umd.edu puppet-agent[267824]: [x11]
Oct 6 09:04:05 jubjub.cs.umd.edu puppet-agent[267824]: Could not retrieve mirrorlist http://cdn.remirepo.net/enterprise/7/php84/mirror error was
Oct 6 09:04:05 jubjub.cs.umd.edu puppet-agent[267824]: 14: HTTP Error 403 - Forbidden
Oct 6 09:04:05 jubjub.cs.umd.edu puppet-agent[267824]: One of the configured repositories failed (Unknown),
Oct 6 09:04:05 jubjub.cs.umd.edu puppet-agent[267824]: 1. Contact the upstream for the repository and get them to fix the problem.
Oct 6 09:04:05 jubjub.cs.umd.edu puppet-agent[267824]: 2. Reconfigure the baseurl/etc. for the repository, to point to a working
Oct 6 09:04:05 jubjub.cs.umd.edu puppet-agent[267824]: upstream. This is most often useful if you are using a newer
Oct 6 09:04:05 jubjub.cs.umd.edu puppet-agent[267824]: distribution release than is supported by the repository (and the
Oct 6 09:04:05 jubjub.cs.umd.edu puppet-agent[267824]: packages for the previous distribution release still work).
Oct 6 09:04:05 jubjub.cs.umd.edu puppet-agent[267824]: 3. Run the command with the repository temporarily disabled
Oct 6 09:04:05 jubjub.cs.umd.edu puppet-agent[267824]: will then just ignore the repository until you permanently enable it
Oct 6 09:04:05 jubjub.cs.umd.edu puppet-agent[267824]: again or use --enablerepo for temporary usage:
Oct 6 09:04:05 jubjub.cs.umd.edu puppet-agent[267824]: or
Oct 6 09:04:05 jubjub.cs.umd.edu puppet-agent[267824]: subscription-manager repos --disable=<repoid>
Oct 6 09:04:05 jubjub.cs.umd.edu puppet-agent[267824]: 5. Configure the failing repository to be skipped, if it is unavailable.
Oct 6 09:04:05 jubjub.cs.umd.edu puppet-agent[267824]: slower). If it is a very temporary problem though, this is often a nice
Oct 6 09:04:05 jubjub.cs.umd.edu puppet-agent[267824]: compromise:
Oct 6 09:04:05 jubjub.cs.umd.edu puppet-agent[267824]: Cannot find a valid baseurl for repo: remi-php84
Oct 6 09:04:05 jubjub.cs.umd.edu puppet-agent[267824]: Uploading Enabled Repositories Report
Oct 6 09:04:05 jubjub.cs.umd.edu puppet-agent[267824]: Unable to upload Enabled Repositories Report
Oct 6 09:04:05 jubjub.cs.umd.edu puppet-agent[267824]: (/Stage[main]/Puppet::Agent::Install/Package[openvox-agent]/ensure) : transaction-actions, product-id, search-disabled-repos,
Oct 6 09:04:05 jubjub.cs.umd.edu puppet-agent[267824]: (/Stage[main]/Puppet::Agent::Install/Package[openvox-agent]/ensure) : subscription-manager, versionlock
Oct 6 09:04:05 jubjub.cs.umd.edu puppet-agent[267824]: (/Stage[main]/Puppet::Agent::Install/Package[openvox-agent]/ensure) [x11]
Oct 6 09:04:05 jubjub.cs.umd.edu puppet-agent[267824]: (/Stage[main]/Puppet::Agent::Install/Package[openvox-agent]/ensure) Could not retrieve mirrorlist http://cdn.remirepo.net/enterprise/7/php84/mirror error was
Oct 6 09:04:05 jubjub.cs.umd.edu puppet-agent[267824]: (/Stage[main]/Puppet::Agent::Install/Package[openvox-agent]/ensure) 14: HTTP Error 403 - Forbidden
Oct 6 09:04:05 jubjub.cs.umd.edu puppet-agent[267824]: (/Stage[main]/Puppet::Agent::Install/Package[openvox-agent]/ensure) One of the configured repositories failed (Unknown),
Oct 6 09:04:05 jubjub.cs.umd.edu puppet-agent[267824]: (/Stage[main]/Puppet::Agent::Install/Package[openvox-agent]/ensure) 1. Contact the upstream for the repository and get them to fix the problem.
Oct 6 09:04:05 jubjub.cs.umd.edu puppet-agent[267824]: (/Stage[main]/Puppet::Agent::Install/Package[openvox-agent]/ensure) 2. Reconfigure the baseurl/etc. for the repository, to point to a working
... 14 more distinct messages not shown
== munin (2 distinct, 6 total) ==
Oct 6 08:08:29 munin sudo[669408]: pam_systemd(sudo:session): Failed to stat() runtime directory '/run/user/0': No such file or directory [x3]
Oct 6 08:08:29 munin sudo[669408]: pam_systemd(sudo:session): Not setting $XDG_RUNTIME_DIR, as the directory is not in order. [x3]
== newhonors2 (1 distinct, 24 total) ==
Oct 6 08:13:03 newhonors2 dhcpcd[3631879]: dhcpcd is not running [x24]
== ntop00 (93 distinct, 93 total) ==
Oct 6 08:05:07 ntop00 sfacctd[1075592]: INFO ( m1/mysql ): *** Purging cache - END (PID: 4042, QN: 3515/3515, ET: 6) ***
Oct 6 08:08:01 ntop00 nfacctd[1075699]: INFO ( p1/print ): *** Purging cache - START (PID: 4043) ***
Oct 6 08:08:01 ntop00 nfacctd[1075699]: INFO ( p1/print ): *** Purging cache - END (PID: 4043, QN: 75/75, ET: 0) ***
Oct 6 08:08:01 ntop00 sfacctd[1075592]: INFO ( p1/print ): *** Purging cache - START (PID: 4043) ***
Oct 6 08:08:01 ntop00 sfacctd[1075592]: INFO ( p1/print ): *** Purging cache - END (PID: 4043, QN: 3359/3359, ET: 0) ***
Oct 6 08:10:01 ntop00 sfacctd[1075592]: INFO ( m1/mysql ): *** Purging cache - START (PID: 4044) ***
Oct 6 08:10:01 ntop00 nfacctd[1075699]: INFO ( m1/mysql ): *** Purging cache - START (PID: 4044) ***
Oct 6 08:10:01 ntop00 nfacctd[1075699]: INFO ( m1/mysql ): *** Purging cache - END (PID: 4044, QN: 58/58, ET: 0) ***
Oct 6 08:10:07 ntop00 sfacctd[1075592]: INFO ( m1/mysql ): *** Purging cache - END (PID: 4044, QN: 3458/3458, ET: 6) ***
Oct 6 08:13:01 ntop00 sfacctd[1075592]: INFO ( p1/print ): *** Purging cache - START (PID: 4045) ***
Oct 6 08:13:01 ntop00 sfacctd[1075592]: INFO ( p1/print ): *** Purging cache - END (PID: 4045, QN: 3666/3666, ET: 0) ***
Oct 6 08:13:01 ntop00 nfacctd[1075699]: INFO ( p1/print ): *** Purging cache - START (PID: 4045) ***
Oct 6 08:13:01 ntop00 nfacctd[1075699]: INFO ( p1/print ): *** Purging cache - END (PID: 4045, QN: 49/49, ET: 0) ***
Oct 6 08:15:01 ntop00 sfacctd[1075592]: INFO ( m1/mysql ): *** Purging cache - START (PID: 4046) ***
Oct 6 08:15:01 ntop00 nfacctd[1075699]: INFO ( m1/mysql ): *** Purging cache - START (PID: 4046) ***
Oct 6 08:15:01 ntop00 nfacctd[1075699]: INFO ( m1/mysql ): *** Purging cache - END (PID: 4046, QN: 64/64, ET: 0) ***
Oct 6 08:15:08 ntop00 sfacctd[1075592]: INFO ( m1/mysql ): *** Purging cache - END (PID: 4046, QN: 3866/3866, ET: 7) ***
Oct 6 08:18:01 ntop00 sfacctd[1075592]: INFO ( p1/print ): *** Purging cache - START (PID: 4047) ***
Oct 6 08:18:01 ntop00 sfacctd[1075592]: INFO ( p1/print ): *** Purging cache - END (PID: 4047, QN: 3664/3664, ET: 0) ***
Oct 6 08:18:01 ntop00 nfacctd[1075699]: INFO ( p1/print ): *** Purging cache - START (PID: 4047) ***
Oct 6 08:18:01 ntop00 nfacctd[1075699]: INFO ( p1/print ): *** Purging cache - END (PID: 4047, QN: 67/67, ET: 0) ***
Oct 6 08:20:01 ntop00 sfacctd[1075592]: INFO ( m1/mysql ): *** Purging cache - START (PID: 4048) ***
Oct 6 08:20:01 ntop00 nfacctd[1075699]: INFO ( m1/mysql ): *** Purging cache - START (PID: 4048) ***
Oct 6 08:20:01 ntop00 nfacctd[1075699]: INFO ( m1/mysql ): *** Purging cache - END (PID: 4048, QN: 68/68, ET: 0) ***
Oct 6 08:20:07 ntop00 sfacctd[1075592]: INFO ( m1/mysql ): *** Purging cache - END (PID: 4048, QN: 3698/3698, ET: 6) ***
Oct 6 08:23:01 ntop00 sfacctd[1075592]: INFO ( p1/print ): *** Purging cache - START (PID: 4049) ***
Oct 6 08:23:01 ntop00 sfacctd[1075592]: INFO ( p1/print ): *** Purging cache - END (PID: 4049, QN: 3818/3818, ET: 0) ***
Oct 6 08:23:01 ntop00 nfacctd[1075699]: INFO ( p1/print ): *** Purging cache - START (PID: 4049) ***
Oct 6 08:23:01 ntop00 nfacctd[1075699]: INFO ( p1/print ): *** Purging cache - END (PID: 4049, QN: 59/59, ET: 0) ***
Oct 6 08:25:01 ntop00 sfacctd[1075592]: INFO ( m1/mysql ): *** Purging cache - START (PID: 4050) ***
... 63 more distinct messages not shown
== outbound00.cs.umd.edu (1 distinct, 6 total) ==
Oct 6 08:09:09 outbound00.cs.umd.edu python3[3269472]: ldapdb [x6]
== outbound01.cs.umd.edu (1 distinct, 6 total) ==
Oct 6 08:13:06 outbound01.cs.umd.edu python3[1343714]: ldapdb [x6]
== portal (1 distinct, 79 total) ==
Oct 6 08:05:16 portal setroubleshoot[1425082]: SELinux is preventing /usr/local/bin/traefik from connectto access on the unix_stream_socket /run/podman/podman.sock. For complete SELinux messages run: sealert -l e0a307a3-2c22-4320-8f9d-6a166c45222d [x79]
== sentry-docker00.cs.umd.edu (32 distinct, 32 total) ==
Oct 6 08:14:44 sentry-docker00.cs.umd.edu systemd-udevd[2479514]: Could not generate persistent MAC address for veth525ab47: No such file or directory
Oct 6 08:14:44 sentry-docker00.cs.umd.edu systemd-udevd[2479515]: Could not generate persistent MAC address for veth3a58b97: No such file or directory
Oct 6 08:14:44 sentry-docker00.cs.umd.edu systemd-udevd[2479518]: Could not generate persistent MAC address for veth29d6617: No such file or directory
Oct 6 08:14:44 sentry-docker00.cs.umd.edu systemd-udevd[2479519]: Could not generate persistent MAC address for vethb8996a3: No such file or directory
Oct 6 08:14:44 sentry-docker00.cs.umd.edu systemd-udevd[2479540]: Could not generate persistent MAC address for vethd97ca64: No such file or directory
Oct 6 08:14:44 sentry-docker00.cs.umd.edu systemd-udevd[2479527]: Could not generate persistent MAC address for vethb529f3f: No such file or directory
Oct 6 08:14:44 sentry-docker00.cs.umd.edu systemd-udevd[2479515]: Could not generate persistent MAC address for veth3be5c12: No such file or directory
Oct 6 08:14:44 sentry-docker00.cs.umd.edu systemd-udevd[2479532]: Could not generate persistent MAC address for vethc2df36c: No such file or directory
Oct 6 08:14:44 sentry-docker00.cs.umd.edu systemd-udevd[2479594]: Could not generate persistent MAC address for vethbadbe65: No such file or directory
Oct 6 08:14:44 sentry-docker00.cs.umd.edu systemd-udevd[2479596]: Could not generate persistent MAC address for veth4462f6f: No such file or directory
Oct 6 08:34:53 sentry-docker00.cs.umd.edu systemd-udevd[2488920]: Could not generate persistent MAC address for vetha647842: No such file or directory
Oct 6 08:34:53 sentry-docker00.cs.umd.edu systemd-udevd[2488921]: Could not generate persistent MAC address for vethba1b343: No such file or directory
Oct 6 08:34:53 sentry-docker00.cs.umd.edu systemd-udevd[2488924]: Could not generate persistent MAC address for veth6032152: No such file or directory
Oct 6 08:34:53 sentry-docker00.cs.umd.edu systemd-udevd[2488925]: Could not generate persistent MAC address for veth47a7a3c: No such file or directory
Oct 6 08:34:53 sentry-docker00.cs.umd.edu systemd-udevd[2488944]: Could not generate persistent MAC address for veth0f4f03b: No such file or directory
Oct 6 08:34:53 sentry-docker00.cs.umd.edu systemd-udevd[2488933]: Could not generate persistent MAC address for veth506788f: No such file or directory
Oct 6 08:34:53 sentry-docker00.cs.umd.edu systemd-udevd[2488931]: Could not generate persistent MAC address for veth4944544: No such file or directory
Oct 6 08:34:53 sentry-docker00.cs.umd.edu systemd-udevd[2488939]: Could not generate persistent MAC address for veth2ce7454: No such file or directory
Oct 6 08:34:53 sentry-docker00.cs.umd.edu systemd-udevd[2488928]: Could not generate persistent MAC address for vethfa7a7fe: No such file or directory
Oct 6 08:34:53 sentry-docker00.cs.umd.edu systemd-udevd[2488941]: Could not generate persistent MAC address for vethe37442d: No such file or directory
Oct 6 08:55:01 sentry-docker00.cs.umd.edu systemd-udevd[2499713]: link_config: could not get ethtool features for vethfa7a7fe
Oct 6 08:55:01 sentry-docker00.cs.umd.edu systemd-udevd[2499713]: Could not set offload features of vethfa7a7fe: No such device
Oct 6 08:55:01 sentry-docker00.cs.umd.edu systemd-udevd[2499780]: Could not generate persistent MAC address for veth75e68a8: No such file or directory
Oct 6 08:55:01 sentry-docker00.cs.umd.edu systemd-udevd[2499781]: Could not generate persistent MAC address for veth3108ba1: No such file or directory
Oct 6 08:55:01 sentry-docker00.cs.umd.edu systemd-udevd[2499784]: Could not generate persistent MAC address for veth5eead4d: No such file or directory
Oct 6 08:55:01 sentry-docker00.cs.umd.edu systemd-udevd[2499785]: Could not generate persistent MAC address for vethacd7345: No such file or directory
Oct 6 08:55:01 sentry-docker00.cs.umd.edu systemd-udevd[2499791]: Could not generate persistent MAC address for vethd2dba2f: No such file or directory
Oct 6 08:55:01 sentry-docker00.cs.umd.edu systemd-udevd[2499800]: Could not generate persistent MAC address for veth773cbae: No such file or directory
Oct 6 08:55:01 sentry-docker00.cs.umd.edu systemd-udevd[2499812]: Could not generate persistent MAC address for veth59ee0e3: No such file or directory
Oct 6 08:55:01 sentry-docker00.cs.umd.edu systemd-udevd[2499814]: Could not generate persistent MAC address for veth40f12ca: No such file or directory
... 2 more distinct messages not shown
== smokeping-slave (1 distinct, 1 total) ==
Oct 6 08:58:18 smokeping-slave nologin[3808083]: Attempted login by UNKNOWN (UID: 65534) on UNKNOWN
== strawberry (7 distinct, 38 total) ==
Oct 6 08:07:04 strawberry kernel: I/O error, dev sda, sector 206848 op 0x0:(READ) flags 0x80700 phys_seg 1 prio class 2 [x6]
Oct 6 08:07:04 strawberry kernel: I/O error, dev sda, sector 206848 op 0x0:(READ) flags 0x0 phys_seg 1 prio class 2 [x6]
Oct 6 08:07:04 strawberry kernel: Buffer I/O error on dev sda2, logical block 0, async page read [x6]
Oct 6 08:07:04 strawberry kernel: I/O error, dev sda, sector 2048 op 0x0:(READ) flags 0x80700 phys_seg 1 prio class 2 [x6]
Oct 6 08:07:04 strawberry kernel: I/O error, dev sda, sector 2048 op 0x0:(READ) flags 0x0 phys_seg 1 prio class 2 [x6]
Oct 6 08:07:04 strawberry kernel: Buffer I/O error on dev sda1, logical block 0, async page read [x6]
Oct 6 08:34:42 strawberry smartd[5314]: Device: /dev/sda [SAT], failed to read SMART Attribute Data [x2]
== submit26-b9-f2 (1 distinct, 1 total) ==
Oct 6 08:55:07 submit26-b9-f2 systemd[1]: user(a)1001.service: Main process exited, code=killed, status=9/KILL
== submit26-b9-f3 (1 distinct, 2 total) ==
Oct 6 08:14:06 submit26-b9-f3 systemd[1]: user(a)1001.service: Main process exited, code=killed, status=9/KILL [x2]
== submit26-b9-fclone (9 distinct, 9 total) ==
Oct 6 08:22:03 submit26-b9-fclone setroubleshoot[1103304]: SELinux is preventing /usr/bin/python3.9 from create access on the directory /(null). For complete SELinux messages run: sealert -l 9355d9d9-a311-48d2-bd37-6c0f6947dfff
Oct 6 08:22:03 submit26-b9-fclone setroubleshoot[1103304]: SELinux is preventing /usr/bin/python3.9 from add_name access on the directory /(null). For complete SELinux messages run: sealert -l cc4658d7-9db1-405d-9eee-de0ccee5857f
Oct 6 08:22:03 submit26-b9-fclone setroubleshoot[1103304]: SELinux is preventing /usr/bin/python3.9 from create access on the file /(null). For complete SELinux messages run: sealert -l 568a2429-0b1b-49df-af41-49b5cd298ae8
Oct 6 08:22:03 submit26-b9-fclone setroubleshoot[1103304]: SELinux is preventing /usr/bin/python3.9 from open access on the file /tmp/libdnf.b7CzEh/repodata/repomd.xml. For complete SELinux messages run: sealert -l 03e2f521-0e7c-481f-8e92-0602c6adeedc
Oct 6 08:22:04 submit26-b9-fclone setroubleshoot[1103304]: SELinux is preventing /usr/bin/python3.9 from setattr access on the file repomd.xml. For complete SELinux messages run: sealert -l 0d6b7b1f-ebe3-4beb-915a-b06b63bf2566
Oct 6 08:22:04 submit26-b9-fclone setroubleshoot[1103304]: SELinux is preventing /usr/bin/python3.9 from read access on the directory libdnf.b7CzEh. For complete SELinux messages run: sealert -l 887adbf9-2bb9-4009-b800-36ddf9ba0db5
Oct 6 08:22:04 submit26-b9-fclone setroubleshoot[1103304]: SELinux is preventing /usr/bin/python3.9 from remove_name access on the directory repomd.xml. For complete SELinux messages run: sealert -l 092e0644-8373-4017-b77f-1afa6c6da4ac
Oct 6 08:22:04 submit26-b9-fclone setroubleshoot[1103304]: SELinux is preventing /usr/bin/python3.9 from unlink access on the file repomd.xml. For complete SELinux messages run: sealert -l ce429a92-56de-4de1-b859-cbfb69ae123c
Oct 6 08:22:04 submit26-b9-fclone setroubleshoot[1103304]: SELinux is preventing /usr/bin/python3.9 from rmdir access on the directory repodata. For complete SELinux messages run: sealert -l 99b886eb-497b-406d-8206-afe76a1086b4
1
0
Command: /usr/local/sbin/syslog-digest.py
Time : 0.0471s
Status : exited 0
Output :
Syslog digest — 2026-10-06 08:05 EDT
Processed 1,916 lines, filtered 1,512 (78%). 404 unknown (193 distinct) from 18 host(s).
== b0b02.cs.umd.edu (2 distinct, 2 total) ==
Oct 6 07:15:53 b0b02.cs.umd.edu rustdesk[789400]: cannot open display:
Oct 6 07:41:40 b0b02.cs.umd.edu systemd[1]: insights-client.service: Start request repeated too quickly.
== biggulp.cs.umd.edu (1 distinct, 1 total) ==
Oct 6 07:51:01 biggulp.cs.umd.edu sshd-session[2892076]: error: send_error: write: Connection reset by peer
== cheezit.cs.umd.edu (1 distinct, 3 total) ==
Oct 6 07:23:21 cheezit.cs.umd.edu sshd-session[2570202]: error: PAM: Authentication failure for kcobbina from 10.206.2.55 [x3]
== hazfs.cs.umd.edu (11 distinct, 66 total) ==
Oct 6 07:33:03 hazfs.cs.umd.edu snmpd[1431]: send response: Failure in sendto [x6]
Oct 6 07:33:03 hazfs.cs.umd.edu snmpd[1431]: -- NET-SNMP-EXTEND-MIB::nsExtendStatus."userweb" [x6]
Oct 6 07:33:03 hazfs.cs.umd.edu snmpd[1431]: -- NET-SNMP-EXTEND-MIB::nsExtendStatus."zfslist" [x6]
Oct 6 07:33:03 hazfs.cs.umd.edu snmpd[1431]: -- NET-SNMP-EXTEND-MIB::nsExtendStatus."userhome" [x6]
Oct 6 07:33:03 hazfs.cs.umd.edu snmpd[1431]: -- NET-SNMP-EXTEND-MIB::nsExtendOutput1Line."userweb" [x6]
Oct 6 07:33:03 hazfs.cs.umd.edu snmpd[1431]: -- NET-SNMP-EXTEND-MIB::nsExtendOutput1Line."zfslist" [x6]
Oct 6 07:33:03 hazfs.cs.umd.edu snmpd[1431]: -- NET-SNMP-EXTEND-MIB::nsExtendOutput1Line."userhome" [x6]
Oct 6 07:33:03 hazfs.cs.umd.edu snmpd[1431]: -- NET-SNMP-EXTEND-MIB::nsExtendOutputFull."userweb" [x6]
Oct 6 07:33:03 hazfs.cs.umd.edu snmpd[1431]: -- NET-SNMP-EXTEND-MIB::nsExtendOutputFull."zfslist" [x6]
Oct 6 07:33:03 hazfs.cs.umd.edu snmpd[1431]: -- NET-SNMP-EXTEND-MIB::nsExtendOutputFull."userhome" [x6]
Oct 6 07:33:03 hazfs.cs.umd.edu snmpd[1431]: -- NET-SNMP-EXTEND-MIB::nsExtendOutNumLines."userweb" [x6]
== idm00 (1 distinct, 1 total) ==
Oct 6 07:54:40 idm00 named[4166701]: client @0x7f119801e238 10.73.240.42#53447: update '73.10.in-addr.arpa/IN' denied
== idmp0 (1 distinct, 1 total) ==
Oct 6 07:39:23 idmp0 named[1598691]: client @0x7f2d200347e8 10.73.240.43#49564: update '73.10.in-addr.arpa/IN' denied
== irb2156 (15 distinct, 15 total) ==
Oct 6 07:09:11 irb2156 systemd[1]: insights-client.service: Start request repeated too quickly.
Oct 6 07:29:24 irb2156 systemd-resolved[3579]: Using degraded feature set TCP instead of UDP for DNS server 128.8.76.3.
Oct 6 08:03:09 irb2156 packagekitd[1456483]: Failed to get cache filename for libvirt-daemon-driver-storage
Oct 6 08:03:09 irb2156 packagekitd[1456483]: Failed to get cache filename for libvirt-daemon-kvm
Oct 6 08:03:09 irb2156 packagekitd[1456483]: Failed to get cache filename for vim-X11
Oct 6 08:03:09 irb2156 packagekitd[1456483]: Failed to get cache filename for vim-common
Oct 6 08:03:09 irb2156 packagekitd[1456483]: Failed to get cache filename for vim-enhanced
Oct 6 08:03:09 irb2156 packagekitd[1456483]: Failed to get cache filename for xxd
Oct 6 08:03:09 irb2156 packagekitd[1456483]: Failed to get cache filename for gnutls-dane
Oct 6 08:03:09 irb2156 packagekitd[1456483]: Failed to get cache filename for gnutls-utils
Oct 6 08:03:09 irb2156 packagekitd[1456483]: Failed to get cache filename for vim-data
Oct 6 08:03:09 irb2156 packagekitd[1456483]: Failed to get cache filename for vim-filesystem
Oct 6 08:03:09 irb2156 packagekitd[1456483]: Failed to get cache filename for vim-minimal
Oct 6 08:03:09 irb2156 packagekitd[1456483]: Failed to get cache filename for gnutls
Oct 6 08:03:09 irb2156 packagekitd[1456483]: Failed to get cache filename for kernel
== itmon02 (1 distinct, 3 total) ==
Oct 6 07:23:18 itmon02 sshd[805675]: error: beginning MaxStartups throttling [x3]
== munin (2 distinct, 16 total) ==
Oct 6 07:08:45 munin sudo[647027]: pam_systemd(sudo:session): Failed to stat() runtime directory '/run/user/0': No such file or directory [x8]
Oct 6 07:08:45 munin sudo[647027]: pam_systemd(sudo:session): Not setting $XDG_RUNTIME_DIR, as the directory is not in order. [x8]
== newhonors2 (1 distinct, 24 total) ==
Oct 6 07:13:02 newhonors2 dhcpcd[3630055]: dhcpcd is not running [x24]
== ntop00 (96 distinct, 96 total) ==
Oct 6 07:05:06 ntop00 sfacctd[1075592]: INFO ( m1/mysql ): *** Purging cache - END (PID: 4018, QN: 3542/3542, ET: 5) ***
Oct 6 07:08:01 ntop00 sfacctd[1075592]: INFO ( p1/print ): *** Purging cache - START (PID: 4019) ***
Oct 6 07:08:01 ntop00 sfacctd[1075592]: INFO ( p1/print ): *** Purging cache - END (PID: 4019, QN: 3887/3887, ET: 0) ***
Oct 6 07:08:01 ntop00 nfacctd[1075699]: INFO ( p1/print ): *** Purging cache - START (PID: 4019) ***
Oct 6 07:08:01 ntop00 nfacctd[1075699]: INFO ( p1/print ): *** Purging cache - END (PID: 4019, QN: 63/63, ET: 0) ***
Oct 6 07:10:01 ntop00 sfacctd[1075592]: INFO ( m1/mysql ): *** Purging cache - START (PID: 4020) ***
Oct 6 07:10:01 ntop00 nfacctd[1075699]: INFO ( m1/mysql ): *** Purging cache - START (PID: 4020) ***
Oct 6 07:10:01 ntop00 nfacctd[1075699]: INFO ( m1/mysql ): *** Purging cache - END (PID: 4020, QN: 56/56, ET: 0) ***
Oct 6 07:10:08 ntop00 sfacctd[1075592]: INFO ( m1/mysql ): *** Purging cache - END (PID: 4020, QN: 4093/4093, ET: 7) ***
Oct 6 07:13:01 ntop00 sfacctd[1075592]: INFO ( p1/print ): *** Purging cache - START (PID: 4021) ***
Oct 6 07:13:01 ntop00 sfacctd[1075592]: INFO ( p1/print ): *** Purging cache - END (PID: 4021, QN: 4455/4455, ET: 0) ***
Oct 6 07:13:01 ntop00 nfacctd[1075699]: INFO ( p1/print ): *** Purging cache - START (PID: 4021) ***
Oct 6 07:13:01 ntop00 nfacctd[1075699]: INFO ( p1/print ): *** Purging cache - END (PID: 4021, QN: 56/56, ET: 0) ***
Oct 6 07:15:01 ntop00 sfacctd[1075592]: INFO ( m1/mysql ): *** Purging cache - START (PID: 4022) ***
Oct 6 07:15:01 ntop00 nfacctd[1075699]: INFO ( m1/mysql ): *** Purging cache - START (PID: 4022) ***
Oct 6 07:15:01 ntop00 nfacctd[1075699]: INFO ( m1/mysql ): *** Purging cache - END (PID: 4022, QN: 54/54, ET: 0) ***
Oct 6 07:15:09 ntop00 sfacctd[1075592]: INFO ( m1/mysql ): *** Purging cache - END (PID: 4022, QN: 4631/4631, ET: 8) ***
Oct 6 07:18:01 ntop00 sfacctd[1075592]: INFO ( p1/print ): *** Purging cache - START (PID: 4023) ***
Oct 6 07:18:01 ntop00 sfacctd[1075592]: INFO ( p1/print ): *** Purging cache - END (PID: 4023, QN: 4745/4745, ET: 0) ***
Oct 6 07:18:01 ntop00 nfacctd[1075699]: INFO ( p1/print ): *** Purging cache - START (PID: 4023) ***
Oct 6 07:18:01 ntop00 nfacctd[1075699]: INFO ( p1/print ): *** Purging cache - END (PID: 4023, QN: 55/55, ET: 0) ***
Oct 6 07:20:01 ntop00 sfacctd[1075592]: INFO ( m1/mysql ): *** Purging cache - START (PID: 4024) ***
Oct 6 07:20:01 ntop00 nfacctd[1075699]: INFO ( m1/mysql ): *** Purging cache - START (PID: 4024) ***
Oct 6 07:20:01 ntop00 nfacctd[1075699]: INFO ( m1/mysql ): *** Purging cache - END (PID: 4024, QN: 63/63, ET: 0) ***
Oct 6 07:20:08 ntop00 sfacctd[1075592]: INFO ( m1/mysql ): *** Purging cache - END (PID: 4024, QN: 4487/4487, ET: 7) ***
Oct 6 07:23:01 ntop00 sfacctd[1075592]: INFO ( p1/print ): *** Purging cache - START (PID: 4025) ***
Oct 6 07:23:01 ntop00 sfacctd[1075592]: INFO ( p1/print ): *** Purging cache - END (PID: 4025, QN: 4415/4415, ET: 0) ***
Oct 6 07:23:01 ntop00 nfacctd[1075699]: INFO ( p1/print ): *** Purging cache - START (PID: 4025) ***
Oct 6 07:23:01 ntop00 nfacctd[1075699]: INFO ( p1/print ): *** Purging cache - END (PID: 4025, QN: 54/54, ET: 0) ***
Oct 6 07:25:01 ntop00 sfacctd[1075592]: INFO ( m1/mysql ): *** Purging cache - START (PID: 4026) ***
... 66 more distinct messages not shown
== outbound00.cs.umd.edu (1 distinct, 6 total) ==
Oct 6 07:09:09 outbound00.cs.umd.edu python3[3255602]: ldapdb [x6]
== outbound01.cs.umd.edu (1 distinct, 6 total) ==
Oct 6 07:13:06 outbound01.cs.umd.edu python3[1329853]: ldapdb [x6]
== portal (1 distinct, 73 total) ==
Oct 6 07:05:40 portal setroubleshoot[1412308]: SELinux is preventing /usr/local/bin/traefik from connectto access on the unix_stream_socket /run/podman/podman.sock. For complete SELinux messages run: sealert -l e0a307a3-2c22-4320-8f9d-6a166c45222d [x73]
== quiss (12 distinct, 14 total) ==
Oct 6 07:08:40 quiss gnome-software[191719]: failed to get featured apps: no apps to show
Oct 6 07:08:40 quiss gnome-software[191719]: Only 0 apps for curated list, hiding
Oct 6 07:08:40 quiss gnome-software[191719]: Only 0 apps for recent list, hiding
Oct 6 07:08:47 quiss packagekitd[3188823]: Failed to get cache filename for perl [x2]
Oct 6 07:08:47 quiss packagekitd[3188823]: Failed to get cache filename for vim-common
Oct 6 07:08:47 quiss packagekitd[3188823]: Failed to get cache filename for vim-enhanced
Oct 6 07:08:47 quiss packagekitd[3188823]: Failed to get cache filename for xxd
Oct 6 07:08:47 quiss packagekitd[3188823]: Failed to get cache filename for vim-data
Oct 6 07:08:47 quiss packagekitd[3188823]: Failed to get cache filename for vim-filesystem
Oct 6 07:08:47 quiss packagekitd[3188823]: Failed to get cache filename for vim-minimal
Oct 6 07:08:47 quiss packagekitd[3188823]: Failed to get cache filename for gnutls
Oct 6 07:08:47 quiss packagekitd[3188823]: Failed to get cache filename for kernel [x2]
== sentry-docker00.cs.umd.edu (38 distinct, 38 total) ==
Oct 6 07:14:19 sentry-docker00.cs.umd.edu systemd-udevd[2451397]: link_config: could not get ethtool features for vethec3ea28
Oct 6 07:14:19 sentry-docker00.cs.umd.edu systemd-udevd[2451397]: Could not set offload features of vethec3ea28: No such device
Oct 6 07:14:19 sentry-docker00.cs.umd.edu systemd-udevd[2451398]: link_config: could not set ethtool features for veth65278ca
Oct 6 07:14:19 sentry-docker00.cs.umd.edu systemd-udevd[2451398]: Could not set offload features of veth65278ca: Operation not permitted
Oct 6 07:14:19 sentry-docker00.cs.umd.edu systemd-udevd[2451430]: Could not generate persistent MAC address for vethac09242: No such file or directory
Oct 6 07:14:19 sentry-docker00.cs.umd.edu systemd-udevd[2451431]: Could not generate persistent MAC address for veth647f6d3: No such file or directory
Oct 6 07:14:19 sentry-docker00.cs.umd.edu systemd-udevd[2451434]: Could not generate persistent MAC address for vethc2e49ad: No such file or directory
Oct 6 07:14:19 sentry-docker00.cs.umd.edu systemd-udevd[2451435]: Could not generate persistent MAC address for veth8d0f7de: No such file or directory
Oct 6 07:14:19 sentry-docker00.cs.umd.edu systemd-udevd[2451455]: Could not generate persistent MAC address for veth06101cc: No such file or directory
Oct 6 07:14:19 sentry-docker00.cs.umd.edu systemd-udevd[2451430]: Could not generate persistent MAC address for veth338ad79: No such file or directory
Oct 6 07:14:19 sentry-docker00.cs.umd.edu systemd-udevd[2451435]: Could not generate persistent MAC address for veth84572c3: No such file or directory
Oct 6 07:14:19 sentry-docker00.cs.umd.edu systemd-udevd[2451443]: Could not generate persistent MAC address for veth2017327: No such file or directory
Oct 6 07:14:19 sentry-docker00.cs.umd.edu systemd-udevd[2451537]: Could not generate persistent MAC address for vethd4f4646: No such file or directory
Oct 6 07:14:19 sentry-docker00.cs.umd.edu systemd-udevd[2451538]: Could not generate persistent MAC address for veth98353f4: No such file or directory
Oct 6 07:34:27 sentry-docker00.cs.umd.edu systemd-udevd[2460698]: link_config: could not get ethtool features for vethd4f4646
Oct 6 07:34:27 sentry-docker00.cs.umd.edu systemd-udevd[2460698]: Could not set offload features of vethd4f4646: No such device
Oct 6 07:34:28 sentry-docker00.cs.umd.edu systemd-udevd[2460790]: Could not generate persistent MAC address for vethddb65dd: No such file or directory
Oct 6 07:34:28 sentry-docker00.cs.umd.edu systemd-udevd[2460789]: Could not generate persistent MAC address for vethcad6f93: No such file or directory
Oct 6 07:34:28 sentry-docker00.cs.umd.edu systemd-udevd[2460793]: Could not generate persistent MAC address for veth8f4012d: No such file or directory
Oct 6 07:34:28 sentry-docker00.cs.umd.edu systemd-udevd[2460798]: Could not generate persistent MAC address for vethb12ea8a: No such file or directory
Oct 6 07:34:28 sentry-docker00.cs.umd.edu systemd-udevd[2460817]: Could not generate persistent MAC address for vethb3e1c4f: No such file or directory
Oct 6 07:34:28 sentry-docker00.cs.umd.edu systemd-udevd[2460818]: Could not generate persistent MAC address for vethc923c5e: No such file or directory
Oct 6 07:34:28 sentry-docker00.cs.umd.edu systemd-udevd[2460839]: Could not generate persistent MAC address for veth6a7b8cb: No such file or directory
Oct 6 07:34:28 sentry-docker00.cs.umd.edu systemd-udevd[2460842]: Could not generate persistent MAC address for veth4c13022: No such file or directory
Oct 6 07:34:28 sentry-docker00.cs.umd.edu systemd-udevd[2460836]: Could not generate persistent MAC address for veth18a48da: No such file or directory
Oct 6 07:34:28 sentry-docker00.cs.umd.edu systemd-udevd[2460827]: Could not generate persistent MAC address for vethb7e7fa8: No such file or directory
Oct 6 07:54:36 sentry-docker00.cs.umd.edu systemd-udevd[2470129]: link_config: could not get ethtool features for vethcad6f93
Oct 6 07:54:36 sentry-docker00.cs.umd.edu systemd-udevd[2470129]: Could not set offload features of vethcad6f93: No such device
Oct 6 07:54:36 sentry-docker00.cs.umd.edu systemd-udevd[2470161]: Could not generate persistent MAC address for veth2f530f9: No such file or directory
Oct 6 07:54:36 sentry-docker00.cs.umd.edu systemd-udevd[2470162]: Could not generate persistent MAC address for veth7053c9c: No such file or directory
... 8 more distinct messages not shown
== strawberry (7 distinct, 38 total) ==
Oct 6 07:07:04 strawberry kernel: I/O error, dev sda, sector 206848 op 0x0:(READ) flags 0x80700 phys_seg 1 prio class 2 [x6]
Oct 6 07:07:04 strawberry kernel: I/O error, dev sda, sector 206848 op 0x0:(READ) flags 0x0 phys_seg 1 prio class 2 [x6]
Oct 6 07:07:04 strawberry kernel: Buffer I/O error on dev sda2, logical block 0, async page read [x6]
Oct 6 07:07:04 strawberry kernel: I/O error, dev sda, sector 2048 op 0x0:(READ) flags 0x80700 phys_seg 1 prio class 2 [x6]
Oct 6 07:07:04 strawberry kernel: I/O error, dev sda, sector 2048 op 0x0:(READ) flags 0x0 phys_seg 1 prio class 2 [x6]
Oct 6 07:07:04 strawberry kernel: Buffer I/O error on dev sda1, logical block 0, async page read [x6]
Oct 6 07:34:42 strawberry smartd[5314]: Device: /dev/sda [SAT], failed to read SMART Attribute Data [x2]
== submit10-cln25 (1 distinct, 1 total) ==
Oct 6 07:37:00 submit10-cln25 systemd: Failed at step EXEC spawning /usr/local/bin/cronjob: No such file or directory
1
0
Command: /usr/local/sbin/syslog-digest.py
Time : 0.0490s
Status : exited 0
Output :
Syslog digest — 2026-10-06 07:05 EDT
Processed 2,056 lines, filtered 1,684 (81%). 372 unknown (201 distinct) from 26 host(s).
== abadi-computer (2 distinct, 2 total) ==
Oct 6 06:15:01 abadi-computer nologin[3608699]: Attempted login by UNKNOWN (UID: 65534) on UNKNOWN
Oct 6 06:15:01 abadi-computer pipewire[3608698]: mod.jackdbus-detect: Failed to receive jackdbus reply: org.freedesktop.DBus.Error.ServiceUnknown: The name org.jackaudio.service was not provided by any .service files
== b0b02.cs.umd.edu (1 distinct, 1 total) ==
Oct 6 06:15:50 b0b02.cs.umd.edu rustdesk[773317]: cannot open display:
== cheezit.cs.umd.edu (3 distinct, 3 total) ==
Oct 6 06:20:00 cheezit.cs.umd.edu sshd-session[2555800]: pam_access(sshd:auth): access denied for user `test1' from `77.83.36.166'
Oct 6 06:20:00 cheezit.cs.umd.edu krb5_child[2555803]: Client 'test1(a)UMD.EDU' not found in Kerberos database
Oct 6 06:20:00 cheezit.cs.umd.edu sshd-session[2555798]: error: PAM: System error for test1 from 77.83.36.166
== cmsc436-0101-redis (2 distinct, 2 total) ==
Oct 6 06:17:41 cmsc436-0101-redis krb5_child[16137]: Client 'test1(a)UMD.EDU' not found in Kerberos database
Oct 6 06:17:43 cmsc436-0101-redis sshd-session[16133]: error: PAM: Authentication failure for test1 from 77.83.36.166
== emaar (1 distinct, 1 total) ==
Oct 6 06:05:18 emaar systemd[1]: insights-client.service: Start request repeated too quickly.
== idm00 (1 distinct, 1 total) ==
Oct 6 06:54:40 idm00 named[4166701]: client @0x7f11a007b958 10.73.240.42#56015: update '73.10.in-addr.arpa/IN' denied
== idmp0 (1 distinct, 1 total) ==
Oct 6 06:39:23 idmp0 named[1598691]: client @0x7f2d4802e088 10.73.240.43#62845: update '73.10.in-addr.arpa/IN' denied
== inbound00.cs.umd.edu (2 distinct, 2 total) ==
Oct 6 06:07:26 inbound00.cs.umd.edu krb5_child[3421869]: Preauthentication failed
Oct 6 06:07:36 inbound00.cs.umd.edu systemd[1]: Configuration file /usr/lib/systemd/system/authentication_milter.service is marked executable. Please remove executable permission bits. Proceeding anyway.
== inbound01.cs.umd.edu (1 distinct, 1 total) ==
Oct 6 06:18:37 inbound01.cs.umd.edu systemd[1]: Configuration file /usr/lib/systemd/system/authentication_milter.service is marked executable. Please remove executable permission bits. Proceeding anyway.
== itmon02 (1 distinct, 5 total) ==
Oct 6 06:18:48 itmon02 sshd[805675]: error: beginning MaxStartups throttling [x5]
== kadath.cs.umd.edu (1 distinct, 1 total) ==
Oct 6 06:14:30 kadath.cs.umd.edu gnome-software[589638]: Only 0 apps for recent list, hiding
== librenms (1 distinct, 1 total) ==
Oct 6 06:48:17 librenms puppet-agent[837149]: The directory '/opt/librenms/rrd' contains 16523 entries, which exceeds the default soft limit 1000 and may cause excessive resource consumption and degraded performance. To remove this warning set a value for `max_files` parameter or consider using an alternate method to manage large directory trees
== munin (2 distinct, 30 total) ==
Oct 6 06:33:34 munin sudo[635440]: pam_systemd(sudo:session): Failed to stat() runtime directory '/run/user/0': No such file or directory [x15]
Oct 6 06:33:34 munin sudo[635440]: pam_systemd(sudo:session): Not setting $XDG_RUNTIME_DIR, as the directory is not in order. [x15]
== neodontcare.cs.umd.edu (6 distinct, 7 total) ==
Oct 6 06:14:49 neodontcare.cs.umd.edu gnome-software[10171]: Only 0 apps for recent list, hiding
Oct 6 06:14:58 neodontcare.cs.umd.edu packagekitd[1555610]: Failed to get cache filename for gnu-free-mono-fonts
Oct 6 06:14:58 neodontcare.cs.umd.edu packagekitd[1555610]: Failed to get cache filename for gnu-free-serif-fonts
Oct 6 06:14:59 neodontcare.cs.umd.edu packagekitd[1555610]: Failed to get cache filename for chromium
Oct 6 06:14:59 neodontcare.cs.umd.edu packagekitd[1555610]: Failed to get cache filename for chromium-common
Oct 6 06:15:05 neodontcare.cs.umd.edu packagekitd[1555610]: failed to parse public key for /etc/pki/rpm-gpg/RPM-GPG-KEY-PQC-redhat-release [x2]
== newhonors2 (1 distinct, 24 total) ==
Oct 6 06:13:03 newhonors2 dhcpcd[3628199]: dhcpcd is not running [x24]
== ntop00 (98 distinct, 98 total) ==
Oct 6 06:05:01 ntop00 nfacctd[1075699]: INFO ( m1/mysql ): *** Purging cache - START (PID: 3994) ***
Oct 6 06:05:01 ntop00 nfacctd[1075699]: INFO ( m1/mysql ): *** Purging cache - END (PID: 3994, QN: 53/53, ET: 0) ***
Oct 6 06:05:06 ntop00 sfacctd[1075592]: INFO ( m1/mysql ): *** Purging cache - END (PID: 3994, QN: 3414/3414, ET: 5) ***
Oct 6 06:08:01 ntop00 sfacctd[1075592]: INFO ( p1/print ): *** Purging cache - START (PID: 3995) ***
Oct 6 06:08:01 ntop00 sfacctd[1075592]: INFO ( p1/print ): *** Purging cache - END (PID: 3995, QN: 3225/3225, ET: 0) ***
Oct 6 06:08:01 ntop00 nfacctd[1075699]: INFO ( p1/print ): *** Purging cache - START (PID: 3995) ***
Oct 6 06:08:01 ntop00 nfacctd[1075699]: INFO ( p1/print ): *** Purging cache - END (PID: 3995, QN: 39/39, ET: 0) ***
Oct 6 06:10:01 ntop00 sfacctd[1075592]: INFO ( m1/mysql ): *** Purging cache - START (PID: 3996) ***
Oct 6 06:10:01 ntop00 nfacctd[1075699]: INFO ( m1/mysql ): *** Purging cache - START (PID: 3996) ***
Oct 6 06:10:01 ntop00 nfacctd[1075699]: INFO ( m1/mysql ): *** Purging cache - END (PID: 3996, QN: 48/48, ET: 0) ***
Oct 6 06:10:05 ntop00 sfacctd[1075592]: INFO ( m1/mysql ): *** Purging cache - END (PID: 3996, QN: 3285/3285, ET: 4) ***
Oct 6 06:13:01 ntop00 sfacctd[1075592]: INFO ( p1/print ): *** Purging cache - START (PID: 3997) ***
Oct 6 06:13:01 ntop00 sfacctd[1075592]: INFO ( p1/print ): *** Purging cache - END (PID: 3997, QN: 3540/3540, ET: 0) ***
Oct 6 06:13:01 ntop00 nfacctd[1075699]: INFO ( p1/print ): *** Purging cache - START (PID: 3997) ***
Oct 6 06:13:01 ntop00 nfacctd[1075699]: INFO ( p1/print ): *** Purging cache - END (PID: 3997, QN: 52/52, ET: 0) ***
Oct 6 06:15:01 ntop00 sfacctd[1075592]: INFO ( m1/mysql ): *** Purging cache - START (PID: 3998) ***
Oct 6 06:15:01 ntop00 nfacctd[1075699]: INFO ( m1/mysql ): *** Purging cache - START (PID: 3998) ***
Oct 6 06:15:01 ntop00 nfacctd[1075699]: INFO ( m1/mysql ): *** Purging cache - END (PID: 3998, QN: 52/52, ET: 0) ***
Oct 6 06:15:06 ntop00 sfacctd[1075592]: INFO ( m1/mysql ): *** Purging cache - END (PID: 3998, QN: 3639/3639, ET: 5) ***
Oct 6 06:18:01 ntop00 sfacctd[1075592]: INFO ( p1/print ): *** Purging cache - START (PID: 3999) ***
Oct 6 06:18:01 ntop00 sfacctd[1075592]: INFO ( p1/print ): *** Purging cache - END (PID: 3999, QN: 3677/3677, ET: 0) ***
Oct 6 06:18:01 ntop00 nfacctd[1075699]: INFO ( p1/print ): *** Purging cache - START (PID: 3999) ***
Oct 6 06:18:01 ntop00 nfacctd[1075699]: INFO ( p1/print ): *** Purging cache - END (PID: 3999, QN: 62/62, ET: 0) ***
Oct 6 06:20:01 ntop00 sfacctd[1075592]: INFO ( m1/mysql ): *** Purging cache - START (PID: 4000) ***
Oct 6 06:20:01 ntop00 nfacctd[1075699]: INFO ( m1/mysql ): *** Purging cache - START (PID: 4000) ***
Oct 6 06:20:01 ntop00 nfacctd[1075699]: INFO ( m1/mysql ): *** Purging cache - END (PID: 4000, QN: 68/68, ET: 0) ***
Oct 6 06:20:07 ntop00 sfacctd[1075592]: INFO ( m1/mysql ): *** Purging cache - END (PID: 4000, QN: 3899/3899, ET: 6) ***
Oct 6 06:23:01 ntop00 sfacctd[1075592]: INFO ( p1/print ): *** Purging cache - START (PID: 4001) ***
Oct 6 06:23:01 ntop00 sfacctd[1075592]: INFO ( p1/print ): *** Purging cache - END (PID: 4001, QN: 3865/3865, ET: 0) ***
Oct 6 06:23:01 ntop00 nfacctd[1075699]: INFO ( p1/print ): *** Purging cache - START (PID: 4001) ***
... 68 more distinct messages not shown
== orchids (7 distinct, 8 total) ==
Oct 6 06:11:31 orchids gnome-software[1516991]: Only 0 apps for recent list, hiding
Oct 6 06:11:38 orchids packagekitd[3414402]: Failed to get cache filename for chromium
Oct 6 06:11:38 orchids packagekitd[3414402]: Failed to get cache filename for chromium-common
Oct 6 06:11:38 orchids packagekitd[3414402]: Failed to get cache filename for libreoffice
Oct 6 06:11:38 orchids packagekitd[3414402]: Failed to get cache filename for cups-filesystem
Oct 6 06:11:38 orchids packagekitd[3414402]: Failed to get cache filename for kernel
Oct 6 06:11:44 orchids packagekitd[3414402]: failed to parse public key for /etc/pki/rpm-gpg/RPM-GPG-KEY-PQC-redhat-release [x2]
== outbound00.cs.umd.edu (1 distinct, 6 total) ==
Oct 6 06:09:09 outbound00.cs.umd.edu python3[3241550]: ldapdb [x6]
== outbound01.cs.umd.edu (1 distinct, 6 total) ==
Oct 6 06:13:06 outbound01.cs.umd.edu python3[1315966]: ldapdb [x6]
== portal (1 distinct, 68 total) ==
Oct 6 06:05:30 portal setroubleshoot[1399235]: SELinux is preventing /usr/local/bin/traefik from connectto access on the unix_stream_socket /run/podman/podman.sock. For complete SELinux messages run: sealert -l e0a307a3-2c22-4320-8f9d-6a166c45222d [x68]
== sentry-docker00.cs.umd.edu (36 distinct, 36 total) ==
Oct 6 06:13:54 sentry-docker00.cs.umd.edu systemd-udevd[2423222]: link_config: could not get ethtool features for vethcce9c4b
Oct 6 06:13:54 sentry-docker00.cs.umd.edu systemd-udevd[2423222]: Could not set offload features of vethcce9c4b: No such device
Oct 6 06:13:54 sentry-docker00.cs.umd.edu systemd-udevd[2423345]: Could not generate persistent MAC address for veth212b8ea: No such file or directory
Oct 6 06:13:54 sentry-docker00.cs.umd.edu systemd-udevd[2423346]: Could not generate persistent MAC address for vethf004f1b: No such file or directory
Oct 6 06:13:54 sentry-docker00.cs.umd.edu systemd-udevd[2423349]: Could not generate persistent MAC address for veth0f553b2: No such file or directory
Oct 6 06:13:54 sentry-docker00.cs.umd.edu systemd-udevd[2423365]: Could not generate persistent MAC address for vethe402514: No such file or directory
Oct 6 06:13:54 sentry-docker00.cs.umd.edu systemd-udevd[2423364]: Could not generate persistent MAC address for vetha74fd13: No such file or directory
Oct 6 06:13:54 sentry-docker00.cs.umd.edu systemd-udevd[2423368]: Could not generate persistent MAC address for veth401cf08: No such file or directory
Oct 6 06:13:54 sentry-docker00.cs.umd.edu systemd-udevd[2423376]: Could not generate persistent MAC address for veth535447a: No such file or directory
Oct 6 06:13:54 sentry-docker00.cs.umd.edu systemd-udevd[2423375]: Could not generate persistent MAC address for vethd73d9e1: No such file or directory
Oct 6 06:13:54 sentry-docker00.cs.umd.edu systemd-udevd[2423432]: Could not generate persistent MAC address for vethdb7ff13: No such file or directory
Oct 6 06:13:54 sentry-docker00.cs.umd.edu systemd-udevd[2423446]: Could not generate persistent MAC address for veth387094d: No such file or directory
Oct 6 06:34:03 sentry-docker00.cs.umd.edu systemd-udevd[2432683]: link_config: could not get ethtool features for vethd73d9e1
Oct 6 06:34:03 sentry-docker00.cs.umd.edu systemd-udevd[2432683]: Could not set offload features of vethd73d9e1: No such device
Oct 6 06:34:03 sentry-docker00.cs.umd.edu systemd-udevd[2432713]: Could not generate persistent MAC address for vethf16f045: No such file or directory
Oct 6 06:34:03 sentry-docker00.cs.umd.edu systemd-udevd[2432714]: Could not generate persistent MAC address for veth0cce2bc: No such file or directory
Oct 6 06:34:03 sentry-docker00.cs.umd.edu systemd-udevd[2432717]: Could not generate persistent MAC address for veth10a2e59: No such file or directory
Oct 6 06:34:03 sentry-docker00.cs.umd.edu systemd-udevd[2432718]: Could not generate persistent MAC address for vetha6dc30f: No such file or directory
Oct 6 06:34:03 sentry-docker00.cs.umd.edu systemd-udevd[2432734]: Could not generate persistent MAC address for vethe5bb157: No such file or directory
Oct 6 06:34:03 sentry-docker00.cs.umd.edu systemd-udevd[2432722]: Could not generate persistent MAC address for veth643c07a: No such file or directory
Oct 6 06:34:03 sentry-docker00.cs.umd.edu systemd-udevd[2432735]: Could not generate persistent MAC address for veth89020de: No such file or directory
Oct 6 06:34:03 sentry-docker00.cs.umd.edu systemd-udevd[2432728]: Could not generate persistent MAC address for veth0a4acfc: No such file or directory
Oct 6 06:34:03 sentry-docker00.cs.umd.edu systemd-udevd[2432726]: Could not generate persistent MAC address for veth99ee302: No such file or directory
Oct 6 06:34:03 sentry-docker00.cs.umd.edu systemd-udevd[2432722]: Could not generate persistent MAC address for veth7af1a03: No such file or directory
Oct 6 06:54:11 sentry-docker00.cs.umd.edu systemd-udevd[2441999]: link_config: could not get ethtool features for vethf16f045
Oct 6 06:54:11 sentry-docker00.cs.umd.edu systemd-udevd[2441999]: Could not set offload features of vethf16f045: No such device
Oct 6 06:54:11 sentry-docker00.cs.umd.edu systemd-udevd[2442039]: Could not generate persistent MAC address for veth5efd4e7: No such file or directory
Oct 6 06:54:11 sentry-docker00.cs.umd.edu systemd-udevd[2442040]: Could not generate persistent MAC address for vethba17f54: No such file or directory
Oct 6 06:54:11 sentry-docker00.cs.umd.edu systemd-udevd[2442058]: Could not generate persistent MAC address for veth6675eb8: No such file or directory
Oct 6 06:54:11 sentry-docker00.cs.umd.edu systemd-udevd[2442043]: Could not generate persistent MAC address for vethf7a7055: No such file or directory
... 6 more distinct messages not shown
== strawberry (9 distinct, 46 total) ==
Oct 6 06:07:04 strawberry kernel: I/O error, dev sda, sector 206848 op 0x0:(READ) flags 0x80700 phys_seg 1 prio class 2 [x7]
Oct 6 06:07:04 strawberry kernel: I/O error, dev sda, sector 206848 op 0x0:(READ) flags 0x0 phys_seg 1 prio class 2 [x7]
Oct 6 06:07:04 strawberry kernel: Buffer I/O error on dev sda2, logical block 0, async page read [x7]
Oct 6 06:07:04 strawberry kernel: I/O error, dev sda, sector 2048 op 0x0:(READ) flags 0x80700 phys_seg 1 prio class 2 [x7]
Oct 6 06:07:04 strawberry kernel: I/O error, dev sda, sector 2048 op 0x0:(READ) flags 0x0 phys_seg 1 prio class 2 [x7]
Oct 6 06:07:04 strawberry kernel: Buffer I/O error on dev sda1, logical block 0, async page read [x7]
Oct 6 06:31:01 strawberry nologin[259857]: Attempted login by UNKNOWN (UID: 65534) on UNKNOWN
Oct 6 06:31:01 strawberry pipewire[259856]: mod.jackdbus-detect: Failed to receive jackdbus reply: org.freedesktop.DBus.Error.ServiceUnknown: The name org.jackaudio.service was not provided by any .service files
Oct 6 06:34:42 strawberry smartd[5314]: Device: /dev/sda [SAT], failed to read SMART Attribute Data [x2]
== submit26-b9-f1 (9 distinct, 9 total) ==
Oct 6 06:26:01 submit26-b9-f1 setroubleshoot[1227750]: SELinux is preventing /usr/bin/python3.9 from create access on the directory /(null). For complete SELinux messages run: sealert -l 3ef7d677-731f-46bf-9c34-c2c55fea665c
Oct 6 06:26:01 submit26-b9-f1 setroubleshoot[1227750]: SELinux is preventing /usr/bin/python3.9 from add_name access on the directory /(null). For complete SELinux messages run: sealert -l aa60e26f-72e1-45f1-bc12-aa8b3b669e36
Oct 6 06:26:01 submit26-b9-f1 setroubleshoot[1227750]: SELinux is preventing /usr/bin/python3.9 from create access on the file /(null). For complete SELinux messages run: sealert -l d088fb43-23ee-4ae8-ae6a-5d1c041ee2d6
Oct 6 06:26:01 submit26-b9-f1 setroubleshoot[1227750]: SELinux is preventing /usr/bin/python3.9 from open access on the file /tmp/libdnf.uPgYWY/repodata/repomd.xml. For complete SELinux messages run: sealert -l 3b0d8c9a-6637-4d6e-a864-f1dd7c00377d
Oct 6 06:26:01 submit26-b9-f1 setroubleshoot[1227750]: SELinux is preventing /usr/bin/python3.9 from setattr access on the file repomd.xml. For complete SELinux messages run: sealert -l 0fd3339f-3ef2-45f3-9e58-65a58b42f3ee
Oct 6 06:26:01 submit26-b9-f1 setroubleshoot[1227750]: SELinux is preventing /usr/bin/python3.9 from read access on the directory libdnf.uPgYWY. For complete SELinux messages run: sealert -l 0d661d88-dc9e-469d-986b-52e29b353aa8
Oct 6 06:26:01 submit26-b9-f1 setroubleshoot[1227750]: SELinux is preventing /usr/bin/python3.9 from remove_name access on the directory repomd.xml. For complete SELinux messages run: sealert -l 405a8556-cf9f-4ef4-8525-0dca18d4259d
Oct 6 06:26:01 submit26-b9-f1 setroubleshoot[1227750]: SELinux is preventing /usr/bin/python3.9 from unlink access on the file repomd.xml. For complete SELinux messages run: sealert -l 3c38e23e-3631-4cb5-81c7-992675c836d9
Oct 6 06:26:01 submit26-b9-f1 setroubleshoot[1227750]: SELinux is preventing /usr/bin/python3.9 from rmdir access on the directory repodata. For complete SELinux messages run: sealert -l a070e9b5-2867-47d6-b2e3-3b7d99725848
== submit26-b9-f2 (9 distinct, 9 total) ==
Oct 6 06:06:55 submit26-b9-f2 setroubleshoot[328226]: SELinux is preventing /usr/bin/python3.9 from create access on the directory /(null). For complete SELinux messages run: sealert -l 0659d546-3107-4f75-b00f-008c85f41dc6
Oct 6 06:06:55 submit26-b9-f2 setroubleshoot[328226]: SELinux is preventing /usr/bin/python3.9 from add_name access on the directory /(null). For complete SELinux messages run: sealert -l 156d9270-3466-4356-b86f-1a128825961a
Oct 6 06:06:55 submit26-b9-f2 setroubleshoot[328226]: SELinux is preventing /usr/bin/python3.9 from create access on the file /(null). For complete SELinux messages run: sealert -l c8a40bf5-2fc4-46b3-b813-8592b3523339
Oct 6 06:06:55 submit26-b9-f2 setroubleshoot[328226]: SELinux is preventing /usr/bin/python3.9 from open access on the file /tmp/libdnf.EYawpx/repodata/repomd.xml. For complete SELinux messages run: sealert -l 7f4c3a8e-0f99-47c4-9baf-e1336fe24876
Oct 6 06:06:55 submit26-b9-f2 setroubleshoot[328226]: SELinux is preventing /usr/bin/python3.9 from setattr access on the file repomd.xml. For complete SELinux messages run: sealert -l 988123da-b724-4e6a-900c-33a2723fdaf1
Oct 6 06:06:55 submit26-b9-f2 setroubleshoot[328226]: SELinux is preventing /usr/bin/python3.9 from read access on the directory libdnf.EYawpx. For complete SELinux messages run: sealert -l ca585e2b-d50f-4264-8127-6b3fa04070c8
Oct 6 06:06:55 submit26-b9-f2 setroubleshoot[328226]: SELinux is preventing /usr/bin/python3.9 from remove_name access on the directory repomd.xml. For complete SELinux messages run: sealert -l 3a749560-1cec-40ca-a4dc-596841be3885
Oct 6 06:06:55 submit26-b9-f2 setroubleshoot[328226]: SELinux is preventing /usr/bin/python3.9 from unlink access on the file repomd.xml. For complete SELinux messages run: sealert -l 0aa52f08-94f8-474e-96d8-e818846941af
Oct 6 06:06:55 submit26-b9-f2 setroubleshoot[328226]: SELinux is preventing /usr/bin/python3.9 from rmdir access on the directory repodata. For complete SELinux messages run: sealert -l de019dc4-408f-439c-902a-676d18dfe8e7
== tlsrpt (1 distinct, 1 total) ==
Oct 6 06:38:03 tlsrpt (httpd)[3708285]: httpd.service: Referenced but unset environment variable evaluates to an empty string: OPTIONS
== wraith (3 distinct, 3 total) ==
Oct 6 07:01:33 wraith (smartd)[38230]: smartmontools.service: Referenced but unset environment variable evaluates to an empty string: smartd_opts
Oct 6 07:01:33 wraith (nin-node)[38242]: munin-node.service: Referenced but unset environment variable evaluates to an empty string: DAEMON_ARGS
Oct 6 07:01:34 wraith systemd[1]: resmon.service: Supervising process 38581 which is not our child. We'll most likely not notice when it exits.
1
0
Command: /usr/local/sbin/syslog-digest.py
Time : 0.0472s
Status : exited 0
Output :
Syslog digest — 2026-10-06 06:05 EDT
Processed 1,827 lines, filtered 1,459 (79%). 368 unknown (170 distinct) from 16 host(s).
== b0b02.cs.umd.edu (1 distinct, 1 total) ==
Oct 6 05:15:45 b0b02.cs.umd.edu rustdesk[757863]: cannot open display:
== grades01.cs.umd.edu (1 distinct, 1 total) ==
Oct 6 05:48:15 grades01.cs.umd.edu puppet-agent[2964]: The directory '/srv/grades' contains 2471 entries, which exceeds the default soft limit 1000 and may cause excessive resource consumption and degraded performance. To remove this warning set a value for `max_files` parameter or consider using an alternate method to manage large directory trees
== idm00 (1 distinct, 1 total) ==
Oct 6 05:54:40 idm00 named[4166701]: client @0x7f11a403a7a8 10.73.240.42#52060: update '73.10.in-addr.arpa/IN' denied
== idmp0 (1 distinct, 1 total) ==
Oct 6 05:39:24 idmp0 named[1598691]: client @0x7f2d2403ade8 10.73.240.43#65257: update '73.10.in-addr.arpa/IN' denied
== itmon02 (1 distinct, 4 total) ==
Oct 6 05:13:14 itmon02 sshd[805675]: error: beginning MaxStartups throttling [x4]
== munin (2 distinct, 58 total) ==
Oct 6 05:08:03 munin sudo[603514]: pam_systemd(sudo:session): Failed to stat() runtime directory '/run/user/0': No such file or directory [x29]
Oct 6 05:08:03 munin sudo[603514]: pam_systemd(sudo:session): Not setting $XDG_RUNTIME_DIR, as the directory is not in order. [x29]
== newhonors2 (1 distinct, 24 total) ==
Oct 6 05:13:03 newhonors2 dhcpcd[3626218]: dhcpcd is not running [x24]
== ntop00 (96 distinct, 96 total) ==
Oct 6 05:05:01 ntop00 nfacctd[1075699]: INFO ( m1/mysql ): *** Purging cache - START (PID: 3970) ***
Oct 6 05:05:01 ntop00 nfacctd[1075699]: INFO ( m1/mysql ): *** Purging cache - END (PID: 3970, QN: 62/62, ET: 0) ***
Oct 6 05:05:06 ntop00 sfacctd[1075592]: INFO ( m1/mysql ): *** Purging cache - END (PID: 3970, QN: 3836/3836, ET: 5) ***
Oct 6 05:08:01 ntop00 sfacctd[1075592]: INFO ( p1/print ): *** Purging cache - START (PID: 3971) ***
Oct 6 05:08:01 ntop00 sfacctd[1075592]: INFO ( p1/print ): *** Purging cache - END (PID: 3971, QN: 3998/3998, ET: 0) ***
Oct 6 05:08:01 ntop00 nfacctd[1075699]: INFO ( p1/print ): *** Purging cache - START (PID: 3971) ***
Oct 6 05:08:01 ntop00 nfacctd[1075699]: INFO ( p1/print ): *** Purging cache - END (PID: 3971, QN: 57/57, ET: 0) ***
Oct 6 05:10:01 ntop00 sfacctd[1075592]: INFO ( m1/mysql ): *** Purging cache - START (PID: 3972) ***
Oct 6 05:10:01 ntop00 nfacctd[1075699]: INFO ( m1/mysql ): *** Purging cache - START (PID: 3972) ***
Oct 6 05:10:01 ntop00 nfacctd[1075699]: INFO ( m1/mysql ): *** Purging cache - END (PID: 3972, QN: 52/52, ET: 0) ***
Oct 6 05:10:07 ntop00 sfacctd[1075592]: INFO ( m1/mysql ): *** Purging cache - END (PID: 3972, QN: 4036/4036, ET: 6) ***
Oct 6 05:13:01 ntop00 sfacctd[1075592]: INFO ( p1/print ): *** Purging cache - START (PID: 3973) ***
Oct 6 05:13:01 ntop00 sfacctd[1075592]: INFO ( p1/print ): *** Purging cache - END (PID: 3973, QN: 3992/3992, ET: 0) ***
Oct 6 05:13:01 ntop00 nfacctd[1075699]: INFO ( p1/print ): *** Purging cache - START (PID: 3973) ***
Oct 6 05:13:01 ntop00 nfacctd[1075699]: INFO ( p1/print ): *** Purging cache - END (PID: 3973, QN: 71/71, ET: 0) ***
Oct 6 05:15:01 ntop00 sfacctd[1075592]: INFO ( m1/mysql ): *** Purging cache - START (PID: 3974) ***
Oct 6 05:15:01 ntop00 nfacctd[1075699]: INFO ( m1/mysql ): *** Purging cache - START (PID: 3974) ***
Oct 6 05:15:01 ntop00 nfacctd[1075699]: INFO ( m1/mysql ): *** Purging cache - END (PID: 3974, QN: 79/79, ET: 0) ***
Oct 6 05:15:08 ntop00 sfacctd[1075592]: INFO ( m1/mysql ): *** Purging cache - END (PID: 3974, QN: 3991/3991, ET: 7) ***
Oct 6 05:18:01 ntop00 sfacctd[1075592]: INFO ( p1/print ): *** Purging cache - START (PID: 3975) ***
Oct 6 05:18:01 ntop00 sfacctd[1075592]: INFO ( p1/print ): *** Purging cache - END (PID: 3975, QN: 3949/3949, ET: 0) ***
Oct 6 05:18:01 ntop00 nfacctd[1075699]: INFO ( p1/print ): *** Purging cache - START (PID: 3975) ***
Oct 6 05:18:01 ntop00 nfacctd[1075699]: INFO ( p1/print ): *** Purging cache - END (PID: 3975, QN: 64/64, ET: 0) ***
Oct 6 05:20:01 ntop00 sfacctd[1075592]: INFO ( m1/mysql ): *** Purging cache - START (PID: 3976) ***
Oct 6 05:20:01 ntop00 nfacctd[1075699]: INFO ( m1/mysql ): *** Purging cache - START (PID: 3976) ***
Oct 6 05:20:01 ntop00 nfacctd[1075699]: INFO ( m1/mysql ): *** Purging cache - END (PID: 3976, QN: 66/66, ET: 0) ***
Oct 6 05:20:08 ntop00 sfacctd[1075592]: INFO ( m1/mysql ): *** Purging cache - END (PID: 3976, QN: 4128/4128, ET: 7) ***
Oct 6 05:23:01 ntop00 sfacctd[1075592]: INFO ( p1/print ): *** Purging cache - START (PID: 3977) ***
Oct 6 05:23:01 ntop00 sfacctd[1075592]: INFO ( p1/print ): *** Purging cache - END (PID: 3977, QN: 4530/4530, ET: 0) ***
Oct 6 05:23:01 ntop00 nfacctd[1075699]: INFO ( p1/print ): *** Purging cache - START (PID: 3977) ***
... 66 more distinct messages not shown
== outbound00.cs.umd.edu (1 distinct, 6 total) ==
Oct 6 05:09:09 outbound00.cs.umd.edu python3[3227711]: ldapdb [x6]
== outbound01.cs.umd.edu (2 distinct, 8 total) ==
Oct 6 05:08:12 outbound01.cs.umd.edu python3[1300240]: ldapdb [x7]
Oct 6 05:10:29 outbound01.cs.umd.edu systemd[1]: Configuration file /usr/lib/systemd/system/authentication_milter.service is marked executable. Please remove executable permission bits. Proceeding anyway.
== portal (1 distinct, 75 total) ==
Oct 6 05:05:18 portal setroubleshoot[1384750]: SELinux is preventing /usr/local/bin/traefik from connectto access on the unix_stream_socket /run/podman/podman.sock. For complete SELinux messages run: sealert -l e0a307a3-2c22-4320-8f9d-6a166c45222d [x75]
== sentry-docker00.cs.umd.edu (36 distinct, 36 total) ==
Oct 6 05:13:29 sentry-docker00.cs.umd.edu systemd-udevd[2394924]: link_config: could not get ethtool features for veth341ede2
Oct 6 05:13:29 sentry-docker00.cs.umd.edu systemd-udevd[2394924]: Could not set offload features of veth341ede2: No such device
Oct 6 05:13:29 sentry-docker00.cs.umd.edu systemd-udevd[2394961]: Could not generate persistent MAC address for veth9dc3b59: No such file or directory
Oct 6 05:13:29 sentry-docker00.cs.umd.edu systemd-udevd[2394962]: Could not generate persistent MAC address for veth59a47b3: No such file or directory
Oct 6 05:13:29 sentry-docker00.cs.umd.edu systemd-udevd[2394965]: Could not generate persistent MAC address for vethb9c62e1: No such file or directory
Oct 6 05:13:29 sentry-docker00.cs.umd.edu systemd-udevd[2394966]: Could not generate persistent MAC address for veth178d1e3: No such file or directory
Oct 6 05:13:29 sentry-docker00.cs.umd.edu systemd-udevd[2394966]: Could not generate persistent MAC address for vethd0402e3: No such file or directory
Oct 6 05:13:29 sentry-docker00.cs.umd.edu systemd-udevd[2394984]: Could not generate persistent MAC address for veth5931d9a: No such file or directory
Oct 6 05:13:29 sentry-docker00.cs.umd.edu systemd-udevd[2394966]: Could not generate persistent MAC address for veth6595b49: No such file or directory
Oct 6 05:13:29 sentry-docker00.cs.umd.edu systemd-udevd[2394978]: Could not generate persistent MAC address for veth60a226f: No such file or directory
Oct 6 05:13:29 sentry-docker00.cs.umd.edu systemd-udevd[2394984]: Could not generate persistent MAC address for vethb19532c: No such file or directory
Oct 6 05:13:29 sentry-docker00.cs.umd.edu systemd-udevd[2394962]: Could not generate persistent MAC address for veth379776e: No such file or directory
Oct 6 05:33:38 sentry-docker00.cs.umd.edu systemd-udevd[2404580]: link_config: could not get ethtool features for vethb19532c
Oct 6 05:33:38 sentry-docker00.cs.umd.edu systemd-udevd[2404580]: Could not set offload features of vethb19532c: No such device
Oct 6 05:33:38 sentry-docker00.cs.umd.edu systemd-udevd[2404610]: Could not generate persistent MAC address for vethaadda72: No such file or directory
Oct 6 05:33:38 sentry-docker00.cs.umd.edu systemd-udevd[2404611]: Could not generate persistent MAC address for veth1adeafa: No such file or directory
Oct 6 05:33:38 sentry-docker00.cs.umd.edu systemd-udevd[2404614]: Could not generate persistent MAC address for veth5853143: No such file or directory
Oct 6 05:33:38 sentry-docker00.cs.umd.edu systemd-udevd[2404626]: Could not generate persistent MAC address for veth347ef55: No such file or directory
Oct 6 05:33:38 sentry-docker00.cs.umd.edu systemd-udevd[2404616]: Could not generate persistent MAC address for veth4e4d43d: No such file or directory
Oct 6 05:33:38 sentry-docker00.cs.umd.edu systemd-udevd[2404629]: Could not generate persistent MAC address for veth0a181ab: No such file or directory
Oct 6 05:33:38 sentry-docker00.cs.umd.edu systemd-udevd[2404640]: Could not generate persistent MAC address for veth120b82d: No such file or directory
Oct 6 05:33:38 sentry-docker00.cs.umd.edu systemd-udevd[2404641]: Could not generate persistent MAC address for veth2f55936: No such file or directory
Oct 6 05:33:38 sentry-docker00.cs.umd.edu systemd-udevd[2404663]: Could not generate persistent MAC address for veth31a4206: No such file or directory
Oct 6 05:33:38 sentry-docker00.cs.umd.edu systemd-udevd[2404657]: Could not generate persistent MAC address for vethb3a7d51: No such file or directory
Oct 6 05:53:46 sentry-docker00.cs.umd.edu systemd-udevd[2413879]: link_config: could not get ethtool features for veth4e4d43d
Oct 6 05:53:46 sentry-docker00.cs.umd.edu systemd-udevd[2413879]: Could not set offload features of veth4e4d43d: No such device
Oct 6 05:53:46 sentry-docker00.cs.umd.edu systemd-udevd[2413956]: Could not generate persistent MAC address for veth0370c34: No such file or directory
Oct 6 05:53:46 sentry-docker00.cs.umd.edu systemd-udevd[2413957]: Could not generate persistent MAC address for veth79e730d: No such file or directory
Oct 6 05:53:46 sentry-docker00.cs.umd.edu systemd-udevd[2413960]: Could not generate persistent MAC address for veth653aca8: No such file or directory
Oct 6 05:53:46 sentry-docker00.cs.umd.edu systemd-udevd[2413961]: Could not generate persistent MAC address for veth47472f6: No such file or directory
... 6 more distinct messages not shown
== strawberry (7 distinct, 38 total) ==
Oct 6 05:07:03 strawberry kernel: I/O error, dev sda, sector 206848 op 0x0:(READ) flags 0x80700 phys_seg 1 prio class 2 [x6]
Oct 6 05:07:03 strawberry kernel: I/O error, dev sda, sector 206848 op 0x0:(READ) flags 0x0 phys_seg 1 prio class 2 [x6]
Oct 6 05:07:03 strawberry kernel: Buffer I/O error on dev sda2, logical block 0, async page read [x6]
Oct 6 05:07:03 strawberry kernel: I/O error, dev sda, sector 2048 op 0x0:(READ) flags 0x80700 phys_seg 1 prio class 2 [x6]
Oct 6 05:07:03 strawberry kernel: I/O error, dev sda, sector 2048 op 0x0:(READ) flags 0x0 phys_seg 1 prio class 2 [x6]
Oct 6 05:07:03 strawberry kernel: Buffer I/O error on dev sda1, logical block 0, async page read [x6]
Oct 6 05:34:42 strawberry smartd[5314]: Device: /dev/sda [SAT], failed to read SMART Attribute Data [x2]
== submit26-b9-f3 (9 distinct, 9 total) ==
Oct 6 05:06:48 submit26-b9-f3 setroubleshoot[1413772]: SELinux is preventing /usr/bin/python3.9 from create access on the directory /(null). For complete SELinux messages run: sealert -l a653b772-cbcd-438b-bae5-23c3dc69b31b
Oct 6 05:06:48 submit26-b9-f3 setroubleshoot[1413772]: SELinux is preventing /usr/bin/python3.9 from add_name access on the directory /(null). For complete SELinux messages run: sealert -l 3e904634-6caa-4202-8c92-f139db798859
Oct 6 05:06:48 submit26-b9-f3 setroubleshoot[1413772]: SELinux is preventing /usr/bin/python3.9 from create access on the file /(null). For complete SELinux messages run: sealert -l 580b20e4-ec2c-433d-905c-5bd417fba033
Oct 6 05:06:48 submit26-b9-f3 setroubleshoot[1413772]: SELinux is preventing /usr/bin/python3.9 from open access on the file /tmp/libdnf.bbSEOb/repodata/repomd.xml. For complete SELinux messages run: sealert -l 27f29d48-5e7c-4db7-b051-8ac055737d6f
Oct 6 05:06:48 submit26-b9-f3 setroubleshoot[1413772]: SELinux is preventing /usr/bin/python3.9 from setattr access on the file repomd.xml. For complete SELinux messages run: sealert -l bff72452-d40a-430b-9060-dd0a48f5b6ba
Oct 6 05:06:48 submit26-b9-f3 setroubleshoot[1413772]: SELinux is preventing /usr/bin/python3.9 from read access on the directory libdnf.bbSEOb. For complete SELinux messages run: sealert -l 9638d396-8ce5-4e6a-ae47-45cd3985e1cd
Oct 6 05:06:48 submit26-b9-f3 setroubleshoot[1413772]: SELinux is preventing /usr/bin/python3.9 from remove_name access on the directory repomd.xml. For complete SELinux messages run: sealert -l 6da64b94-7024-45a9-b8c2-3b9812517407
Oct 6 05:06:48 submit26-b9-f3 setroubleshoot[1413772]: SELinux is preventing /usr/bin/python3.9 from unlink access on the file repomd.xml. For complete SELinux messages run: sealert -l 64cbe179-abf1-4d5a-bade-bb164897ee65
Oct 6 05:06:48 submit26-b9-f3 setroubleshoot[1413772]: SELinux is preventing /usr/bin/python3.9 from rmdir access on the directory repodata. For complete SELinux messages run: sealert -l d2e35b1a-e27c-4f91-9217-2bb1204e1e68
== submit26-b9-f4 (9 distinct, 9 total) ==
Oct 6 05:24:52 submit26-b9-f4 setroubleshoot[4074795]: SELinux is preventing /usr/bin/python3.9 from create access on the directory /(null). For complete SELinux messages run: sealert -l ee160f23-b161-4f4a-9985-c4edfd3a5beb
Oct 6 05:24:52 submit26-b9-f4 setroubleshoot[4074795]: SELinux is preventing /usr/bin/python3.9 from add_name access on the directory /(null). For complete SELinux messages run: sealert -l 89a83821-4b24-4081-9973-0a79ca6ed5b4
Oct 6 05:24:52 submit26-b9-f4 setroubleshoot[4074795]: SELinux is preventing /usr/bin/python3.9 from create access on the file /(null). For complete SELinux messages run: sealert -l f73955d6-1416-45f9-bab6-ff1f3ea07e9d
Oct 6 05:24:52 submit26-b9-f4 setroubleshoot[4074795]: SELinux is preventing /usr/bin/python3.9 from open access on the file /tmp/libdnf.iBKFWB/repodata/repomd.xml. For complete SELinux messages run: sealert -l 9f8f24a0-8fb6-454d-a103-31a8f7a6efa0
Oct 6 05:24:52 submit26-b9-f4 setroubleshoot[4074795]: SELinux is preventing /usr/bin/python3.9 from setattr access on the file repomd.xml. For complete SELinux messages run: sealert -l 20293136-86a3-40ba-a651-cff48d36059e
Oct 6 05:24:52 submit26-b9-f4 setroubleshoot[4074795]: SELinux is preventing /usr/bin/python3.9 from read access on the directory libdnf.iBKFWB. For complete SELinux messages run: sealert -l 25f86b49-4ee7-4f60-ad1c-73a70032560c
Oct 6 05:24:52 submit26-b9-f4 setroubleshoot[4074795]: SELinux is preventing /usr/bin/python3.9 from remove_name access on the directory repomd.xml. For complete SELinux messages run: sealert -l eec250fb-073f-456d-93bc-f98776fd476d
Oct 6 05:24:52 submit26-b9-f4 setroubleshoot[4074795]: SELinux is preventing /usr/bin/python3.9 from unlink access on the file repomd.xml. For complete SELinux messages run: sealert -l c9209e04-a349-43d5-8cb2-3e303e48df74
Oct 6 05:24:52 submit26-b9-f4 setroubleshoot[4074795]: SELinux is preventing /usr/bin/python3.9 from rmdir access on the directory repodata. For complete SELinux messages run: sealert -l 3178d5f5-80e9-404b-92b7-9bef397a8915
== wraith (1 distinct, 1 total) ==
Oct 6 05:47:34 wraith kernel: set_capacity_and_notify: 29 callbacks suppressed
1
0
Command: /usr/local/sbin/syslog-digest.py
Time : 0.0464s
Status : exited 0
Output :
Syslog digest — 2026-10-06 05:05 EDT
Processed 1,777 lines, filtered 1,438 (80%). 339 unknown (199 distinct) from 16 host(s).
== b0b02.cs.umd.edu (1 distinct, 1 total) ==
Oct 6 04:15:41 b0b02.cs.umd.edu rustdesk[743042]: cannot open display:
== forge00 (1 distinct, 1 total) ==
Oct 6 04:09:02 forge00 (httpd)[2666566]: httpd.service: Referenced but unset environment variable evaluates to an empty string: OPTIONS
== galax (31 distinct, 31 total) ==
Oct 6 04:21:15 galax puppet-agent[3087412]: Could not update: Execution of '/usr/bin/apt-get -q -y -o DPkg::Options::=--force-confold --force-yes install choria=0.29.4+resolute' returned 100: W: --force-yes is deprecated, use one of the options starting with --allow instead.
Oct 6 04:21:15 galax puppet-agent[3087412]: E: dpkg was interrupted, you must manually run 'dpkg --configure -a' to correct the problem.
Oct 6 04:21:15 galax puppet-agent[3087412]: (/Stage[main]/Choria::Install/Package[choria]/ensure) change from 'absent' to '0.29.4+resolute' failed: Could not update: Execution of '/usr/bin/apt-get -q -y -o DPkg::Options::=--force-confold --force-yes install choria=0.29.4+resolute' returned 100: W: --force-yes is deprecated, use one of the options starting with --allow instead.
Oct 6 04:21:15 galax puppet-agent[3087412]: (/Stage[main]/Choria::Install/Package[choria]/ensure) E: dpkg was interrupted, you must manually run 'dpkg --configure -a' to correct the problem. (corrective)
Oct 6 04:21:15 galax puppet-agent[3087412]: (/Stage[main]/Choria::Config/File[/etc/choria]) Skipping because of failed dependencies
Oct 6 04:21:15 galax puppet-agent[3087412]: (/Stage[main]/Choria::Config/File[/etc/choria/policies]) Skipping because of failed dependencies
Oct 6 04:21:15 galax puppet-agent[3087412]: (/Stage[main]/Choria::Config/File[/etc/choria/policies/rego]) Skipping because of failed dependencies
Oct 6 04:21:15 galax puppet-agent[3087412]: (/Stage[main]/Choria::Config/File[/etc/choria/plugin.d]) Skipping because of failed dependencies
Oct 6 04:21:15 galax puppet-agent[3087412]: (/Stage[main]/Choria::Config/File[/etc/choria/overrides.json]) Skipping because of failed dependencies
Oct 6 04:21:15 galax puppet-agent[3087412]: (/Stage[main]/Choria::Config/File[/etc/choria/machine]) Skipping because of failed dependencies
Oct 6 04:21:15 galax puppet-agent[3087412]: (/Stage[main]/Choria::Config/File[/usr/bin/choria_mcollective_agent_compat.rb]) Skipping because of failed dependencies
Oct 6 04:21:15 galax puppet-agent[3087412]: (/Stage[main]/Choria::Config/File[/etc/choria/server.conf]) Skipping because of failed dependencies
Oct 6 04:21:15 galax puppet-agent[3087412]: (/Stage[main]/Mcollective::Config/File[/etc/choria/server.cfg]) Skipping because of failed dependencies
Oct 6 04:21:15 galax puppet-agent[3087412]: (/Stage[main]/Mcollective::Config/File[/etc/choria/client.cfg]) Skipping because of failed dependencies
Oct 6 04:21:15 galax puppet-agent[3087412]: (/Stage[main]/Mcollective::Config/File[/etc/choria/policies/choria_util.policy]) Skipping because of failed dependencies
Oct 6 04:21:15 galax puppet-agent[3087412]: (/Stage[main]/Mcollective::Config/File[/etc/choria/policies/rpcutil.policy]) Skipping because of failed dependencies
Oct 6 04:21:15 galax puppet-agent[3087412]: (/Stage[main]/Mcollective::Config/File[/etc/choria/policies/scout.policy]) Skipping because of failed dependencies
Oct 6 04:21:15 galax puppet-agent[3087412]: (/Stage[main]/Mcollective::Config/File[/etc/choria/policies/rego/default.rego]) Skipping because of failed dependencies
Oct 6 04:21:17 galax puppet-agent[3087412]: (/Stage[main]/Choria::Config/Concat[/etc/choria/policies/groups]/Concat_file[/etc/choria/policies/groups]) Skipping because of failed dependencies
Oct 6 04:21:17 galax puppet-agent[3087412]: (/Stage[main]/Choria::Config/Concat[/etc/choria/policies/groups]/File[/etc/choria/policies/groups]) Skipping because of failed dependencies
Oct 6 04:21:17 galax puppet-agent[3087412]: (/Stage[main]/Mcollective::Config/Mcollective::Config_file[/etc/choria/client.conf]/File[/etc/choria/client.conf]) Skipping because of failed dependencies
Oct 6 04:21:17 galax puppet-agent[3087412]: (/Stage[main]/Mcollective::Config/Mcollective::Config_file[/etc/choria/choria-shim.cfg]/File[/etc/choria/choria-shim.cfg]) Skipping because of failed dependencies
Oct 6 04:21:17 galax puppet-agent[3087412]: (/Stage[main]/Mcollective::Facts/Exec[mcollective_facts_yaml_refresh]) Skipping because of failed dependencies
Oct 6 04:21:17 galax puppet-agent[3087412]: (/Stage[main]/Mcollective_agent_puppet/Mcollective::Module_plugin[mcollective_agent_puppet]/File[/etc/choria/policies/puppet.policy]) Skipping because of failed dependencies
Oct 6 04:21:17 galax puppet-agent[3087412]: (/Stage[main]/Mcollective_agent_service/Mcollective::Module_plugin[mcollective_agent_service]/File[/etc/choria/policies/service.policy]) Skipping because of failed dependencies
Oct 6 04:21:17 galax puppet-agent[3087412]: (/Stage[main]/Mcollective_agent_package/Mcollective::Module_plugin[mcollective_agent_package]/File[/etc/choria/policies/package.policy]) Skipping because of failed dependencies
Oct 6 04:21:17 galax puppet-agent[3087412]: (/Stage[main]/Mcollective_agent_filemgr/Mcollective::Module_plugin[mcollective_agent_filemgr]/File[/etc/choria/policies/filemgr.policy]) Skipping because of failed dependencies
Oct 6 04:21:17 galax puppet-agent[3087412]: (/Stage[main]/Mcollective_choria/Mcollective::Module_plugin[mcollective_choria]/Mcollective::Config_file[/etc/choria/plugin.d/choria.cfg]/File[/etc/choria/plugin.d/choria.cfg]) Skipping because of failed dependencies
Oct 6 04:21:17 galax puppet-agent[3087412]: (/Stage[main]/Mcollective_agent_puppet/Mcollective::Module_plugin[mcollective_agent_puppet]/Mcollective::Config_file[/etc/choria/plugin.d/puppet.cfg]/File[/etc/choria/plugin.d/puppet.cfg]) Skipping because of failed dependencies
Oct 6 04:21:17 galax puppet-agent[3087412]: (/Stage[main]/Mcollective_util_actionpolicy/Mcollective::Module_plugin[mcollective_util_actionpolicy]/Mcollective::Config_file[/etc/choria/plugin.d/actionpolicy.cfg]/File[/etc/choria/plugin.d/actionpolicy.cfg]) Skipping because of failed dependencies
... 1 more distinct messages not shown
== idm00 (1 distinct, 1 total) ==
Oct 6 04:54:40 idm00 named[4166701]: client @0x7f11980497e8 10.73.240.42#52741: update '73.10.in-addr.arpa/IN' denied
== idmp0 (1 distinct, 1 total) ==
Oct 6 04:39:24 idmp0 named[1598691]: client @0x7f2d4002f658 10.73.240.43#64323: update '73.10.in-addr.arpa/IN' denied
== itmon02 (1 distinct, 1 total) ==
Oct 6 05:02:56 itmon02 sshd[805675]: error: beginning MaxStartups throttling
== matrix (9 distinct, 10 total) ==
Oct 6 04:43:45 matrix systemd[1]: networkd-dispatcher.service: Got notification message from PID 3629950, but reception only permitted for main PID 720
Oct 6 04:43:53 matrix systemd[1]: networkd-dispatcher.service: Got notification message from PID 3630046, but reception only permitted for main PID 720
Oct 6 04:43:53 matrix networkctl[3630057]: Interface "veth7e563b3" not found.
Oct 6 04:43:53 matrix systemd[1]: networkd-dispatcher.service: Got notification message from PID 3630115, but reception only permitted for main PID 720
Oct 6 04:43:53 matrix systemd[1]: networkd-dispatcher.service: Got notification message from PID 3630127, but reception only permitted for main PID 720
Oct 6 04:47:25 matrix systemd[1]: networkd-dispatcher.service: Got notification message from PID 3632281, but reception only permitted for main PID 720
Oct 6 04:47:25 matrix systemd[1]: networkd-dispatcher.service: Got notification message from PID 3632287, but reception only permitted for main PID 720
Oct 6 04:47:25 matrix networkctl[3632298]: Interface "vethc1d888e" not found.
Oct 6 04:47:25 matrix systemd[1]: networkd-dispatcher.service: Got notification message from PID 3632298, but reception only permitted for main PID 720 [x2]
== munin (2 distinct, 6 total) ==
Oct 6 04:28:04 munin sudo[589559]: pam_systemd(sudo:session): Failed to stat() runtime directory '/run/user/0': No such file or directory [x3]
Oct 6 04:28:04 munin sudo[589559]: pam_systemd(sudo:session): Not setting $XDG_RUNTIME_DIR, as the directory is not in order. [x3]
== newhonors2 (1 distinct, 24 total) ==
Oct 6 04:13:02 newhonors2 dhcpcd[3624350]: dhcpcd is not running [x24]
== ntop00 (96 distinct, 96 total) ==
Oct 6 04:05:01 ntop00 nfacctd[1075699]: INFO ( m1/mysql ): *** Purging cache - START (PID: 3946) ***
Oct 6 04:05:01 ntop00 nfacctd[1075699]: INFO ( m1/mysql ): *** Purging cache - END (PID: 3946, QN: 55/55, ET: 0) ***
Oct 6 04:05:07 ntop00 sfacctd[1075592]: INFO ( m1/mysql ): *** Purging cache - END (PID: 3946, QN: 3885/3885, ET: 6) ***
Oct 6 04:08:01 ntop00 sfacctd[1075592]: INFO ( p1/print ): *** Purging cache - START (PID: 3947) ***
Oct 6 04:08:01 ntop00 sfacctd[1075592]: INFO ( p1/print ): *** Purging cache - END (PID: 3947, QN: 3618/3618, ET: 0) ***
Oct 6 04:08:01 ntop00 nfacctd[1075699]: INFO ( p1/print ): *** Purging cache - START (PID: 3947) ***
Oct 6 04:08:01 ntop00 nfacctd[1075699]: INFO ( p1/print ): *** Purging cache - END (PID: 3947, QN: 40/40, ET: 0) ***
Oct 6 04:10:01 ntop00 sfacctd[1075592]: INFO ( m1/mysql ): *** Purging cache - START (PID: 3948) ***
Oct 6 04:10:01 ntop00 nfacctd[1075699]: INFO ( m1/mysql ): *** Purging cache - START (PID: 3948) ***
Oct 6 04:10:01 ntop00 nfacctd[1075699]: INFO ( m1/mysql ): *** Purging cache - END (PID: 3948, QN: 43/43, ET: 0) ***
Oct 6 04:10:06 ntop00 sfacctd[1075592]: INFO ( m1/mysql ): *** Purging cache - END (PID: 3948, QN: 3592/3592, ET: 5) ***
Oct 6 04:13:01 ntop00 sfacctd[1075592]: INFO ( p1/print ): *** Purging cache - START (PID: 3949) ***
Oct 6 04:13:01 ntop00 sfacctd[1075592]: INFO ( p1/print ): *** Purging cache - END (PID: 3949, QN: 3701/3701, ET: 0) ***
Oct 6 04:13:01 ntop00 nfacctd[1075699]: INFO ( p1/print ): *** Purging cache - START (PID: 3949) ***
Oct 6 04:13:01 ntop00 nfacctd[1075699]: INFO ( p1/print ): *** Purging cache - END (PID: 3949, QN: 50/50, ET: 0) ***
Oct 6 04:15:01 ntop00 sfacctd[1075592]: INFO ( m1/mysql ): *** Purging cache - START (PID: 3950) ***
Oct 6 04:15:01 ntop00 nfacctd[1075699]: INFO ( m1/mysql ): *** Purging cache - START (PID: 3950) ***
Oct 6 04:15:01 ntop00 nfacctd[1075699]: INFO ( m1/mysql ): *** Purging cache - END (PID: 3950, QN: 61/61, ET: 0) ***
Oct 6 04:15:07 ntop00 sfacctd[1075592]: INFO ( m1/mysql ): *** Purging cache - END (PID: 3950, QN: 3748/3748, ET: 6) ***
Oct 6 04:18:01 ntop00 sfacctd[1075592]: INFO ( p1/print ): *** Purging cache - START (PID: 3951) ***
Oct 6 04:18:01 ntop00 sfacctd[1075592]: INFO ( p1/print ): *** Purging cache - END (PID: 3951, QN: 3698/3698, ET: 0) ***
Oct 6 04:18:01 ntop00 nfacctd[1075699]: INFO ( p1/print ): *** Purging cache - START (PID: 3951) ***
Oct 6 04:18:01 ntop00 nfacctd[1075699]: INFO ( p1/print ): *** Purging cache - END (PID: 3951, QN: 66/66, ET: 0) ***
Oct 6 04:20:01 ntop00 sfacctd[1075592]: INFO ( m1/mysql ): *** Purging cache - START (PID: 3952) ***
Oct 6 04:20:01 ntop00 nfacctd[1075699]: INFO ( m1/mysql ): *** Purging cache - START (PID: 3952) ***
Oct 6 04:20:02 ntop00 nfacctd[1075699]: INFO ( m1/mysql ): *** Purging cache - END (PID: 3952, QN: 60/60, ET: 1) ***
Oct 6 04:20:07 ntop00 sfacctd[1075592]: INFO ( m1/mysql ): *** Purging cache - END (PID: 3952, QN: 3692/3692, ET: 6) ***
Oct 6 04:23:01 ntop00 sfacctd[1075592]: INFO ( p1/print ): *** Purging cache - START (PID: 3953) ***
Oct 6 04:23:01 ntop00 sfacctd[1075592]: INFO ( p1/print ): *** Purging cache - END (PID: 3953, QN: 3720/3720, ET: 0) ***
Oct 6 04:23:01 ntop00 nfacctd[1075699]: INFO ( p1/print ): *** Purging cache - START (PID: 3953) ***
... 66 more distinct messages not shown
== outbound00.cs.umd.edu (1 distinct, 6 total) ==
Oct 6 04:09:08 outbound00.cs.umd.edu python3[3213869]: ldapdb [x6]
== outbound01.cs.umd.edu (1 distinct, 6 total) ==
Oct 6 04:13:06 outbound01.cs.umd.edu python3[1287229]: ldapdb [x6]
== portal (1 distinct, 72 total) ==
Oct 6 04:05:29 portal setroubleshoot[1371517]: SELinux is preventing /usr/local/bin/traefik from connectto access on the unix_stream_socket /run/podman/podman.sock. For complete SELinux messages run: sealert -l e0a307a3-2c22-4320-8f9d-6a166c45222d [x72]
== sentry-docker00.cs.umd.edu (36 distinct, 36 total) ==
Oct 6 04:13:04 sentry-docker00.cs.umd.edu systemd-udevd[2366794]: link_config: could not get ethtool features for veth3319461
Oct 6 04:13:04 sentry-docker00.cs.umd.edu systemd-udevd[2366794]: Could not set offload features of veth3319461: No such device
Oct 6 04:13:04 sentry-docker00.cs.umd.edu systemd-udevd[2366827]: Could not generate persistent MAC address for veth61e75e8: No such file or directory
Oct 6 04:13:04 sentry-docker00.cs.umd.edu systemd-udevd[2366828]: Could not generate persistent MAC address for veth483b21c: No such file or directory
Oct 6 04:13:04 sentry-docker00.cs.umd.edu systemd-udevd[2366831]: Could not generate persistent MAC address for veth10966db: No such file or directory
Oct 6 04:13:04 sentry-docker00.cs.umd.edu systemd-udevd[2366832]: Could not generate persistent MAC address for veth81e7996: No such file or directory
Oct 6 04:13:04 sentry-docker00.cs.umd.edu systemd-udevd[2366855]: Could not generate persistent MAC address for vethbbb1d9e: No such file or directory
Oct 6 04:13:04 sentry-docker00.cs.umd.edu systemd-udevd[2366856]: Could not generate persistent MAC address for veth3607667: No such file or directory
Oct 6 04:13:04 sentry-docker00.cs.umd.edu systemd-udevd[2366872]: Could not generate persistent MAC address for veth92ff3bb: No such file or directory
Oct 6 04:13:04 sentry-docker00.cs.umd.edu systemd-udevd[2366874]: Could not generate persistent MAC address for vethae13976: No such file or directory
Oct 6 04:13:04 sentry-docker00.cs.umd.edu systemd-udevd[2366856]: Could not generate persistent MAC address for veth42b2967: No such file or directory
Oct 6 04:13:04 sentry-docker00.cs.umd.edu systemd-udevd[2366880]: Could not generate persistent MAC address for vethb128cb7: No such file or directory
Oct 6 04:33:13 sentry-docker00.cs.umd.edu systemd-udevd[2376174]: link_config: could not get ethtool features for vethae13976
Oct 6 04:33:13 sentry-docker00.cs.umd.edu systemd-udevd[2376174]: Could not set offload features of vethae13976: No such device
Oct 6 04:33:13 sentry-docker00.cs.umd.edu systemd-udevd[2376210]: Could not generate persistent MAC address for veth58b1522: No such file or directory
Oct 6 04:33:13 sentry-docker00.cs.umd.edu systemd-udevd[2376211]: Could not generate persistent MAC address for veth8620813: No such file or directory
Oct 6 04:33:13 sentry-docker00.cs.umd.edu systemd-udevd[2376214]: Could not generate persistent MAC address for vethcfa7c63: No such file or directory
Oct 6 04:33:13 sentry-docker00.cs.umd.edu systemd-udevd[2376215]: Could not generate persistent MAC address for veth8872634: No such file or directory
Oct 6 04:33:13 sentry-docker00.cs.umd.edu systemd-udevd[2376220]: Could not generate persistent MAC address for veth7285b0f: No such file or directory
Oct 6 04:33:13 sentry-docker00.cs.umd.edu systemd-udevd[2376237]: Could not generate persistent MAC address for vetha682b72: No such file or directory
Oct 6 04:33:13 sentry-docker00.cs.umd.edu systemd-udevd[2376240]: Could not generate persistent MAC address for veth1f9568f: No such file or directory
Oct 6 04:33:13 sentry-docker00.cs.umd.edu systemd-udevd[2376241]: Could not generate persistent MAC address for veth9d1dece: No such file or directory
Oct 6 04:33:13 sentry-docker00.cs.umd.edu systemd-udevd[2376244]: Could not generate persistent MAC address for veth2ef5786: No such file or directory
Oct 6 04:33:13 sentry-docker00.cs.umd.edu systemd-udevd[2376245]: Could not generate persistent MAC address for vethca99faf: No such file or directory
Oct 6 04:53:21 sentry-docker00.cs.umd.edu systemd-udevd[2385549]: link_config: could not get ethtool features for veth58b1522
Oct 6 04:53:21 sentry-docker00.cs.umd.edu systemd-udevd[2385549]: Could not set offload features of veth58b1522: No such device
Oct 6 04:53:21 sentry-docker00.cs.umd.edu systemd-udevd[2385580]: Could not generate persistent MAC address for veth8b8108d: No such file or directory
Oct 6 04:53:21 sentry-docker00.cs.umd.edu systemd-udevd[2385581]: Could not generate persistent MAC address for veth34be981: No such file or directory
Oct 6 04:53:21 sentry-docker00.cs.umd.edu systemd-udevd[2385584]: Could not generate persistent MAC address for veth0796a74: No such file or directory
Oct 6 04:53:21 sentry-docker00.cs.umd.edu systemd-udevd[2385585]: Could not generate persistent MAC address for veth45335d9: No such file or directory
... 6 more distinct messages not shown
== strawberry (7 distinct, 38 total) ==
Oct 6 04:07:03 strawberry kernel: I/O error, dev sda, sector 206848 op 0x0:(READ) flags 0x80700 phys_seg 1 prio class 2 [x6]
Oct 6 04:07:03 strawberry kernel: I/O error, dev sda, sector 206848 op 0x0:(READ) flags 0x0 phys_seg 1 prio class 2 [x6]
Oct 6 04:07:03 strawberry kernel: Buffer I/O error on dev sda2, logical block 0, async page read [x6]
Oct 6 04:07:03 strawberry kernel: I/O error, dev sda, sector 2048 op 0x0:(READ) flags 0x80700 phys_seg 1 prio class 2 [x6]
Oct 6 04:07:03 strawberry kernel: I/O error, dev sda, sector 2048 op 0x0:(READ) flags 0x0 phys_seg 1 prio class 2 [x6]
Oct 6 04:07:03 strawberry kernel: Buffer I/O error on dev sda1, logical block 0, async page read [x6]
Oct 6 04:34:42 strawberry smartd[5314]: Device: /dev/sda [SAT], failed to read SMART Attribute Data [x2]
== submit26-b9-fclone (9 distinct, 9 total) ==
Oct 6 04:22:03 submit26-b9-fclone setroubleshoot[1093608]: SELinux is preventing /usr/bin/python3.9 from create access on the directory /(null). For complete SELinux messages run: sealert -l 9355d9d9-a311-48d2-bd37-6c0f6947dfff
Oct 6 04:22:03 submit26-b9-fclone setroubleshoot[1093608]: SELinux is preventing /usr/bin/python3.9 from add_name access on the directory /(null). For complete SELinux messages run: sealert -l cc4658d7-9db1-405d-9eee-de0ccee5857f
Oct 6 04:22:03 submit26-b9-fclone setroubleshoot[1093608]: SELinux is preventing /usr/bin/python3.9 from create access on the file /(null). For complete SELinux messages run: sealert -l 568a2429-0b1b-49df-af41-49b5cd298ae8
Oct 6 04:22:03 submit26-b9-fclone setroubleshoot[1093608]: SELinux is preventing /usr/bin/python3.9 from open access on the file /tmp/libdnf.HNwgNX/repodata/repomd.xml. For complete SELinux messages run: sealert -l 03e2f521-0e7c-481f-8e92-0602c6adeedc
Oct 6 04:22:03 submit26-b9-fclone setroubleshoot[1093608]: SELinux is preventing /usr/bin/python3.9 from setattr access on the file repomd.xml. For complete SELinux messages run: sealert -l 0d6b7b1f-ebe3-4beb-915a-b06b63bf2566
Oct 6 04:22:03 submit26-b9-fclone setroubleshoot[1093608]: SELinux is preventing /usr/bin/python3.9 from read access on the directory libdnf.HNwgNX. For complete SELinux messages run: sealert -l 887adbf9-2bb9-4009-b800-36ddf9ba0db5
Oct 6 04:22:03 submit26-b9-fclone setroubleshoot[1093608]: SELinux is preventing /usr/bin/python3.9 from remove_name access on the directory repomd.xml. For complete SELinux messages run: sealert -l 092e0644-8373-4017-b77f-1afa6c6da4ac
Oct 6 04:22:03 submit26-b9-fclone setroubleshoot[1093608]: SELinux is preventing /usr/bin/python3.9 from unlink access on the file repomd.xml. For complete SELinux messages run: sealert -l ce429a92-56de-4de1-b859-cbfb69ae123c
Oct 6 04:22:03 submit26-b9-fclone setroubleshoot[1093608]: SELinux is preventing /usr/bin/python3.9 from rmdir access on the directory repodata. For complete SELinux messages run: sealert -l 99b886eb-497b-406d-8206-afe76a1086b4
1
0
Command: /usr/local/sbin/syslog-digest.py
Time : 0.0445s
Status : exited 0
Output :
Syslog digest — 2026-10-06 04:05 EDT
Processed 1,685 lines, filtered 1,373 (81%). 312 unknown (157 distinct) from 15 host(s).
== b0b02.cs.umd.edu (1 distinct, 1 total) ==
Oct 6 03:15:37 b0b02.cs.umd.edu rustdesk[727427]: cannot open display:
== idm00 (1 distinct, 1 total) ==
Oct 6 03:54:40 idm00 named[4166701]: client @0x7f11a93f3e08 10.73.240.42#64329: update '73.10.in-addr.arpa/IN' denied
== idmp0 (1 distinct, 1 total) ==
Oct 6 03:39:24 idmp0 named[1598691]: client @0x7f2d2c011658 10.73.240.43#56547: update '73.10.in-addr.arpa/IN' denied
== itmon02 (2 distinct, 6 total) ==
Oct 6 03:15:03 itmon02 (httpd)[2435244]: httpd.service: Referenced but unset environment variable evaluates to an empty string: OPTIONS
Oct 6 03:18:18 itmon02 sshd[805675]: error: beginning MaxStartups throttling [x5]
== kadath.cs.umd.edu (1 distinct, 1 total) ==
Oct 6 03:47:30 kadath.cs.umd.edu puppet-agent[1010154]: (Facter) invalid or malformed lldp data: MalformedDataError: no lldp interface data found
== librenms (1 distinct, 1 total) ==
Oct 6 03:47:03 librenms (httpd)[680454]: httpd.service: Referenced but unset environment variable evaluates to an empty string: OPTIONS
== munin (2 distinct, 16 total) ==
Oct 6 03:13:52 munin sudo[562233]: pam_systemd(sudo:session): Failed to stat() runtime directory '/run/user/0': No such file or directory [x8]
Oct 6 03:13:52 munin sudo[562233]: pam_systemd(sudo:session): Not setting $XDG_RUNTIME_DIR, as the directory is not in order. [x8]
== netbox (1 distinct, 1 total) ==
Oct 6 03:08:03 netbox (httpd)[2102111]: httpd.service: Referenced but unset environment variable evaluates to an empty string: OPTIONS
== newhonors2 (1 distinct, 24 total) ==
Oct 6 03:13:03 newhonors2 dhcpcd[3622506]: dhcpcd is not running [x24]
== ntop00 (97 distinct, 97 total) ==
Oct 6 03:05:01 ntop00 sfacctd[1075592]: INFO ( m1/mysql ): *** Purging cache - START (PID: 3922) ***
Oct 6 03:05:01 ntop00 nfacctd[1075699]: INFO ( m1/mysql ): *** Purging cache - START (PID: 3922) ***
Oct 6 03:05:01 ntop00 nfacctd[1075699]: INFO ( m1/mysql ): *** Purging cache - END (PID: 3922, QN: 54/54, ET: 0) ***
Oct 6 03:05:06 ntop00 sfacctd[1075592]: INFO ( m1/mysql ): *** Purging cache - END (PID: 3922, QN: 3138/3138, ET: 5) ***
Oct 6 03:08:01 ntop00 sfacctd[1075592]: INFO ( p1/print ): *** Purging cache - START (PID: 3923) ***
Oct 6 03:08:01 ntop00 sfacctd[1075592]: INFO ( p1/print ): *** Purging cache - END (PID: 3923, QN: 3024/3024, ET: 0) ***
Oct 6 03:08:01 ntop00 nfacctd[1075699]: INFO ( p1/print ): *** Purging cache - START (PID: 3923) ***
Oct 6 03:08:01 ntop00 nfacctd[1075699]: INFO ( p1/print ): *** Purging cache - END (PID: 3923, QN: 63/63, ET: 0) ***
Oct 6 03:10:01 ntop00 sfacctd[1075592]: INFO ( m1/mysql ): *** Purging cache - START (PID: 3924) ***
Oct 6 03:10:01 ntop00 nfacctd[1075699]: INFO ( m1/mysql ): *** Purging cache - START (PID: 3924) ***
Oct 6 03:10:01 ntop00 nfacctd[1075699]: INFO ( m1/mysql ): *** Purging cache - END (PID: 3924, QN: 65/65, ET: 0) ***
Oct 6 03:10:06 ntop00 sfacctd[1075592]: INFO ( m1/mysql ): *** Purging cache - END (PID: 3924, QN: 2922/2922, ET: 5) ***
Oct 6 03:13:01 ntop00 sfacctd[1075592]: INFO ( p1/print ): *** Purging cache - START (PID: 3925) ***
Oct 6 03:13:01 ntop00 sfacctd[1075592]: INFO ( p1/print ): *** Purging cache - END (PID: 3925, QN: 2724/2724, ET: 0) ***
Oct 6 03:13:01 ntop00 nfacctd[1075699]: INFO ( p1/print ): *** Purging cache - START (PID: 3925) ***
Oct 6 03:13:01 ntop00 nfacctd[1075699]: INFO ( p1/print ): *** Purging cache - END (PID: 3925, QN: 66/66, ET: 0) ***
Oct 6 03:15:01 ntop00 sfacctd[1075592]: INFO ( m1/mysql ): *** Purging cache - START (PID: 3926) ***
Oct 6 03:15:01 ntop00 nfacctd[1075699]: INFO ( m1/mysql ): *** Purging cache - START (PID: 3926) ***
Oct 6 03:15:02 ntop00 nfacctd[1075699]: INFO ( m1/mysql ): *** Purging cache - END (PID: 3926, QN: 70/70, ET: 1) ***
Oct 6 03:15:04 ntop00 sfacctd[1075592]: INFO ( m1/mysql ): *** Purging cache - END (PID: 3926, QN: 2457/2457, ET: 3) ***
Oct 6 03:18:01 ntop00 sfacctd[1075592]: INFO ( p1/print ): *** Purging cache - START (PID: 3927) ***
Oct 6 03:18:01 ntop00 sfacctd[1075592]: INFO ( p1/print ): *** Purging cache - END (PID: 3927, QN: 2528/2528, ET: 0) ***
Oct 6 03:18:01 ntop00 nfacctd[1075699]: INFO ( p1/print ): *** Purging cache - START (PID: 3927) ***
Oct 6 03:18:01 ntop00 nfacctd[1075699]: INFO ( p1/print ): *** Purging cache - END (PID: 3927, QN: 67/67, ET: 0) ***
Oct 6 03:20:01 ntop00 nfacctd[1075699]: INFO ( m1/mysql ): *** Purging cache - START (PID: 3928) ***
Oct 6 03:20:01 ntop00 nfacctd[1075699]: INFO ( m1/mysql ): *** Purging cache - END (PID: 3928, QN: 56/56, ET: 0) ***
Oct 6 03:20:01 ntop00 sfacctd[1075592]: INFO ( m1/mysql ): *** Purging cache - START (PID: 3928) ***
Oct 6 03:20:05 ntop00 sfacctd[1075592]: INFO ( m1/mysql ): *** Purging cache - END (PID: 3928, QN: 2708/2708, ET: 4) ***
Oct 6 03:23:01 ntop00 sfacctd[1075592]: INFO ( p1/print ): *** Purging cache - START (PID: 3929) ***
Oct 6 03:23:01 ntop00 nfacctd[1075699]: INFO ( p1/print ): *** Purging cache - START (PID: 3929) ***
... 67 more distinct messages not shown
== outbound00.cs.umd.edu (2 distinct, 8 total) ==
Oct 6 03:09:09 outbound00.cs.umd.edu python3[3199262]: ldapdb [x7]
Oct 6 03:24:15 outbound00.cs.umd.edu systemd[1]: Configuration file /usr/lib/systemd/system/authentication_milter.service is marked executable. Please remove executable permission bits. Proceeding anyway.
== outbound01.cs.umd.edu (1 distinct, 6 total) ==
Oct 6 03:13:07 outbound01.cs.umd.edu python3[1273353]: ldapdb [x6]
== portal (1 distinct, 73 total) ==
Oct 6 03:05:28 portal setroubleshoot[1358310]: SELinux is preventing /usr/local/bin/traefik from connectto access on the unix_stream_socket /run/podman/podman.sock. For complete SELinux messages run: sealert -l e0a307a3-2c22-4320-8f9d-6a166c45222d [x73]
== sentry-docker00.cs.umd.edu (38 distinct, 38 total) ==
Oct 6 03:12:35 sentry-docker00.cs.umd.edu systemd-udevd[2338657]: link_config: could not get ethtool features for veth30c88fd
Oct 6 03:12:35 sentry-docker00.cs.umd.edu systemd-udevd[2338657]: Could not set offload features of veth30c88fd: No such device
Oct 6 03:12:36 sentry-docker00.cs.umd.edu systemd-udevd[2338690]: Could not generate persistent MAC address for veth9c691b4: No such file or directory
Oct 6 03:12:36 sentry-docker00.cs.umd.edu systemd-udevd[2338691]: Could not generate persistent MAC address for veth2d02a41: No such file or directory
Oct 6 03:12:36 sentry-docker00.cs.umd.edu systemd-udevd[2338694]: Could not generate persistent MAC address for veth9777a2a: No such file or directory
Oct 6 03:12:36 sentry-docker00.cs.umd.edu systemd-udevd[2338695]: Could not generate persistent MAC address for vethbd5f8d6: No such file or directory
Oct 6 03:12:36 sentry-docker00.cs.umd.edu systemd-udevd[2338718]: Could not generate persistent MAC address for veth3cd5c20: No such file or directory
Oct 6 03:12:36 sentry-docker00.cs.umd.edu systemd-udevd[2338719]: Could not generate persistent MAC address for veth9f6e15c: No such file or directory
Oct 6 03:12:36 sentry-docker00.cs.umd.edu systemd-udevd[2338737]: Could not generate persistent MAC address for veth752924a: No such file or directory
Oct 6 03:12:36 sentry-docker00.cs.umd.edu systemd-udevd[2338736]: Could not generate persistent MAC address for veth911c506: No such file or directory
Oct 6 03:12:36 sentry-docker00.cs.umd.edu systemd-udevd[2338718]: Could not generate persistent MAC address for veth48ac885: No such file or directory
Oct 6 03:12:36 sentry-docker00.cs.umd.edu systemd-udevd[2338748]: Could not generate persistent MAC address for veth5919d3e: No such file or directory
Oct 6 03:32:48 sentry-docker00.cs.umd.edu systemd-udevd[2348098]: link_config: could not get ethtool features for veth9777a2a
Oct 6 03:32:48 sentry-docker00.cs.umd.edu systemd-udevd[2348098]: Could not set offload features of veth9777a2a: No such device
Oct 6 03:32:48 sentry-docker00.cs.umd.edu systemd-udevd[2348103]: link_config: could not get ethtool features for veth9c691b4
Oct 6 03:32:48 sentry-docker00.cs.umd.edu systemd-udevd[2348103]: Could not set offload features of veth9c691b4: No such device
Oct 6 03:32:48 sentry-docker00.cs.umd.edu systemd-udevd[2348136]: Could not generate persistent MAC address for veth3fe4b3d: No such file or directory
Oct 6 03:32:48 sentry-docker00.cs.umd.edu systemd-udevd[2348137]: Could not generate persistent MAC address for vethba3ebef: No such file or directory
Oct 6 03:32:48 sentry-docker00.cs.umd.edu systemd-udevd[2348140]: Could not generate persistent MAC address for veth03182f6: No such file or directory
Oct 6 03:32:48 sentry-docker00.cs.umd.edu systemd-udevd[2348141]: Could not generate persistent MAC address for veth3d0b92d: No such file or directory
Oct 6 03:32:48 sentry-docker00.cs.umd.edu systemd-udevd[2348158]: Could not generate persistent MAC address for veth6c24c41: No such file or directory
Oct 6 03:32:48 sentry-docker00.cs.umd.edu systemd-udevd[2348144]: Could not generate persistent MAC address for vethdc392ab: No such file or directory
Oct 6 03:32:48 sentry-docker00.cs.umd.edu systemd-udevd[2348158]: Could not generate persistent MAC address for vetha6b6ef0: No such file or directory
Oct 6 03:32:48 sentry-docker00.cs.umd.edu systemd-udevd[2348152]: Could not generate persistent MAC address for vethbc70cd1: No such file or directory
Oct 6 03:32:48 sentry-docker00.cs.umd.edu systemd-udevd[2348233]: Could not generate persistent MAC address for veth02f28c1: No such file or directory
Oct 6 03:32:48 sentry-docker00.cs.umd.edu systemd-udevd[2348234]: Could not generate persistent MAC address for vethfad4446: No such file or directory
Oct 6 03:52:56 sentry-docker00.cs.umd.edu systemd-udevd[2357351]: link_config: could not get ethtool features for veth03182f6
Oct 6 03:52:56 sentry-docker00.cs.umd.edu systemd-udevd[2357351]: Could not set offload features of veth03182f6: No such device
Oct 6 03:52:56 sentry-docker00.cs.umd.edu systemd-udevd[2357470]: Could not generate persistent MAC address for veth2c0b9a0: No such file or directory
Oct 6 03:52:56 sentry-docker00.cs.umd.edu systemd-udevd[2357471]: Could not generate persistent MAC address for veth6423169: No such file or directory
... 8 more distinct messages not shown
== strawberry (7 distinct, 38 total) ==
Oct 6 03:07:03 strawberry kernel: I/O error, dev sda, sector 206848 op 0x0:(READ) flags 0x80700 phys_seg 1 prio class 2 [x6]
Oct 6 03:07:03 strawberry kernel: I/O error, dev sda, sector 206848 op 0x0:(READ) flags 0x0 phys_seg 1 prio class 2 [x6]
Oct 6 03:07:03 strawberry kernel: Buffer I/O error on dev sda2, logical block 0, async page read [x6]
Oct 6 03:07:03 strawberry kernel: I/O error, dev sda, sector 2048 op 0x0:(READ) flags 0x80700 phys_seg 1 prio class 2 [x6]
Oct 6 03:07:03 strawberry kernel: I/O error, dev sda, sector 2048 op 0x0:(READ) flags 0x0 phys_seg 1 prio class 2 [x6]
Oct 6 03:07:03 strawberry kernel: Buffer I/O error on dev sda1, logical block 0, async page read [x6]
Oct 6 03:34:42 strawberry smartd[5314]: Device: /dev/sda [SAT], failed to read SMART Attribute Data [x2]
1
0
Command: /usr/local/sbin/syslog-digest.py
Time : 0.0497s
Status : exited 0
Output :
Syslog digest — 2026-10-06 03:05 EDT
Processed 2,972 lines, filtered 2,633 (88%). 339 unknown (183 distinct) from 20 host(s).
== atif01.cs.umd.edu (4 distinct, 4 total) ==
Oct 6 02:21:40 atif01.cs.umd.edu kernel: net_ratelimit: 11 callbacks suppressed
Oct 6 02:21:57 atif01.cs.umd.edu kernel: net_ratelimit: 21 callbacks suppressed
Oct 6 02:22:41 atif01.cs.umd.edu kernel: net_ratelimit: 10 callbacks suppressed
Oct 6 02:58:08 atif01.cs.umd.edu kernel: nfsd: peername failed (err 107)!
== b0b02.cs.umd.edu (1 distinct, 1 total) ==
Oct 6 02:15:33 b0b02.cs.umd.edu rustdesk[712712]: cannot open display:
== cheezit.cs.umd.edu (1 distinct, 1 total) ==
Oct 6 02:05:13 cheezit.cs.umd.edu sshd-session[2497627]: error: Protocol major versions differ: 2 vs. 1
== idm00 (1 distinct, 1 total) ==
Oct 6 02:54:40 idm00 named[4166701]: client @0x7f11980497e8 10.73.240.42#61016: update '73.10.in-addr.arpa/IN' denied
== idmp0 (1 distinct, 1 total) ==
Oct 6 02:39:24 idmp0 named[1598691]: client @0x7f2d1c04f628 10.73.240.43#61193: update '73.10.in-addr.arpa/IN' denied
== inbound00.cs.umd.edu (2 distinct, 2 total) ==
Oct 6 02:37:34 inbound00.cs.umd.edu krb5_child[3371881]: Client 'admin(a)UMD.EDU' not found in Kerberos database
Oct 6 02:37:59 inbound00.cs.umd.edu sshd-session[3371971]: error: Protocol major versions differ: 2 vs. 1
== itmon02 (1 distinct, 8 total) ==
Oct 6 02:13:08 itmon02 sshd[805675]: error: beginning MaxStartups throttling [x8]
== munin (2 distinct, 12 total) ==
Oct 6 02:38:43 munin sudo[550637]: pam_systemd(sudo:session): Failed to stat() runtime directory '/run/user/0': No such file or directory [x6]
Oct 6 02:38:43 munin sudo[550637]: pam_systemd(sudo:session): Not setting $XDG_RUNTIME_DIR, as the directory is not in order. [x6]
== netman.cs.umd.edu (2 distinct, 5 total) ==
Oct 6 02:27:11 netman.cs.umd.edu krb5_child[853848]: Client 'admin(a)UMD.EDU' not found in Kerberos database [x4]
Oct 6 02:27:18 netman.cs.umd.edu sshd[853845]: error: PAM: Authentication failure for admin from 35.205.144.81
== newhonors2 (1 distinct, 24 total) ==
Oct 6 02:13:03 newhonors2 dhcpcd[3620659]: dhcpcd is not running [x24]
== ntop00 (95 distinct, 95 total) ==
Oct 6 02:05:01 ntop00 nfacctd[1075699]: INFO ( m1/mysql ): *** Purging cache - START (PID: 3898) ***
Oct 6 02:05:01 ntop00 nfacctd[1075699]: INFO ( m1/mysql ): *** Purging cache - END (PID: 3898, QN: 67/67, ET: 0) ***
Oct 6 02:05:05 ntop00 sfacctd[1075592]: INFO ( m1/mysql ): *** Purging cache - END (PID: 3898, QN: 2903/2903, ET: 4) ***
Oct 6 02:08:01 ntop00 sfacctd[1075592]: INFO ( p1/print ): *** Purging cache - START (PID: 3899) ***
Oct 6 02:08:01 ntop00 sfacctd[1075592]: INFO ( p1/print ): *** Purging cache - END (PID: 3899, QN: 3347/3347, ET: 0) ***
Oct 6 02:08:01 ntop00 nfacctd[1075699]: INFO ( p1/print ): *** Purging cache - START (PID: 3899) ***
Oct 6 02:08:01 ntop00 nfacctd[1075699]: INFO ( p1/print ): *** Purging cache - END (PID: 3899, QN: 81/81, ET: 0) ***
Oct 6 02:10:01 ntop00 sfacctd[1075592]: INFO ( m1/mysql ): *** Purging cache - START (PID: 3900) ***
Oct 6 02:10:01 ntop00 nfacctd[1075699]: INFO ( m1/mysql ): *** Purging cache - START (PID: 3900) ***
Oct 6 02:10:02 ntop00 nfacctd[1075699]: INFO ( m1/mysql ): *** Purging cache - END (PID: 3900, QN: 83/83, ET: 1) ***
Oct 6 02:10:07 ntop00 sfacctd[1075592]: INFO ( m1/mysql ): *** Purging cache - END (PID: 3900, QN: 4181/4181, ET: 6) ***
Oct 6 02:13:01 ntop00 sfacctd[1075592]: INFO ( p1/print ): *** Purging cache - START (PID: 3901) ***
Oct 6 02:13:01 ntop00 sfacctd[1075592]: INFO ( p1/print ): *** Purging cache - END (PID: 3901, QN: 3968/3968, ET: 0) ***
Oct 6 02:13:01 ntop00 nfacctd[1075699]: INFO ( p1/print ): *** Purging cache - START (PID: 3901) ***
Oct 6 02:13:01 ntop00 nfacctd[1075699]: INFO ( p1/print ): *** Purging cache - END (PID: 3901, QN: 76/76, ET: 0) ***
Oct 6 02:15:01 ntop00 nfacctd[1075699]: INFO ( m1/mysql ): *** Purging cache - START (PID: 3902) ***
Oct 6 02:15:01 ntop00 nfacctd[1075699]: INFO ( m1/mysql ): *** Purging cache - END (PID: 3902, QN: 79/79, ET: 0) ***
Oct 6 02:15:01 ntop00 sfacctd[1075592]: INFO ( m1/mysql ): *** Purging cache - START (PID: 3902) ***
Oct 6 02:15:06 ntop00 sfacctd[1075592]: INFO ( m1/mysql ): *** Purging cache - END (PID: 3902, QN: 3414/3414, ET: 5) ***
Oct 6 02:18:01 ntop00 nfacctd[1075699]: INFO ( p1/print ): *** Purging cache - START (PID: 3903) ***
Oct 6 02:18:01 ntop00 nfacctd[1075699]: INFO ( p1/print ): *** Purging cache - END (PID: 3903, QN: 88/88, ET: 0) ***
Oct 6 02:18:01 ntop00 sfacctd[1075592]: INFO ( p1/print ): *** Purging cache - START (PID: 3903) ***
Oct 6 02:18:01 ntop00 sfacctd[1075592]: INFO ( p1/print ): *** Purging cache - END (PID: 3903, QN: 3443/3443, ET: 0) ***
Oct 6 02:20:01 ntop00 nfacctd[1075699]: INFO ( m1/mysql ): *** Purging cache - START (PID: 3904) ***
Oct 6 02:20:01 ntop00 sfacctd[1075592]: INFO ( m1/mysql ): *** Purging cache - START (PID: 3904) ***
Oct 6 02:20:01 ntop00 nfacctd[1075699]: INFO ( m1/mysql ): *** Purging cache - END (PID: 3904, QN: 75/75, ET: 0) ***
Oct 6 02:20:06 ntop00 sfacctd[1075592]: INFO ( m1/mysql ): *** Purging cache - END (PID: 3904, QN: 3653/3653, ET: 5) ***
Oct 6 02:23:01 ntop00 sfacctd[1075592]: INFO ( p1/print ): *** Purging cache - START (PID: 3905) ***
Oct 6 02:23:01 ntop00 sfacctd[1075592]: INFO ( p1/print ): *** Purging cache - END (PID: 3905, QN: 3654/3654, ET: 0) ***
Oct 6 02:23:01 ntop00 nfacctd[1075699]: INFO ( p1/print ): *** Purging cache - START (PID: 3905) ***
... 65 more distinct messages not shown
== outbound00.cs.umd.edu (2 distinct, 7 total) ==
Oct 6 02:09:09 outbound00.cs.umd.edu python3[3184474]: ldapdb [x6]
Oct 6 02:30:16 outbound00.cs.umd.edu krb5_child[3189914]: Client 'admin(a)UMD.EDU' not found in Kerberos database
== outbound01.cs.umd.edu (4 distinct, 9 total) ==
Oct 6 02:13:06 outbound01.cs.umd.edu python3[1258760]: ldapdb [x6]
Oct 6 02:19:04 outbound01.cs.umd.edu krb5_child[1259865]: Client 'admin(a)UMD.EDU' not found in Kerberos database
Oct 6 02:19:30 outbound01.cs.umd.edu sshd-session[1259942]: error: Protocol major versions differ: 2 vs. 1
Oct 6 02:23:31 outbound01.cs.umd.edu sshd-session[1260935]: fatal: userauth_pubkey: parse publickey packet: incomplete message [preauth]
== portal (1 distinct, 73 total) ==
Oct 6 02:05:07 portal setroubleshoot[1344665]: SELinux is preventing /usr/local/bin/traefik from connectto access on the unix_stream_socket /run/podman/podman.sock. For complete SELinux messages run: sealert -l e0a307a3-2c22-4320-8f9d-6a166c45222d [x73]
== sentry-docker00.cs.umd.edu (36 distinct, 36 total) ==
Oct 6 02:12:10 sentry-docker00.cs.umd.edu systemd-udevd[2310023]: link_config: could not get ethtool features for veth1e41acc
Oct 6 02:12:10 sentry-docker00.cs.umd.edu systemd-udevd[2310023]: Could not set offload features of veth1e41acc: No such device
Oct 6 02:12:10 sentry-docker00.cs.umd.edu systemd-udevd[2310057]: Could not generate persistent MAC address for veth018cbe6: No such file or directory
Oct 6 02:12:10 sentry-docker00.cs.umd.edu systemd-udevd[2310058]: Could not generate persistent MAC address for veth1282126: No such file or directory
Oct 6 02:12:10 sentry-docker00.cs.umd.edu systemd-udevd[2310061]: Could not generate persistent MAC address for veth397b34b: No such file or directory
Oct 6 02:12:10 sentry-docker00.cs.umd.edu systemd-udevd[2310062]: Could not generate persistent MAC address for veth2fdd443: No such file or directory
Oct 6 02:12:10 sentry-docker00.cs.umd.edu systemd-udevd[2310077]: Could not generate persistent MAC address for veth0d40047: No such file or directory
Oct 6 02:12:10 sentry-docker00.cs.umd.edu systemd-udevd[2310072]: Could not generate persistent MAC address for veth0b69993: No such file or directory
Oct 6 02:12:10 sentry-docker00.cs.umd.edu systemd-udevd[2310072]: Could not generate persistent MAC address for veth0ac93e5: No such file or directory
Oct 6 02:12:10 sentry-docker00.cs.umd.edu systemd-udevd[2310077]: Could not generate persistent MAC address for veth6554465: No such file or directory
Oct 6 02:12:10 sentry-docker00.cs.umd.edu systemd-udevd[2310090]: Could not generate persistent MAC address for veth85c566d: No such file or directory
Oct 6 02:12:10 sentry-docker00.cs.umd.edu systemd-udevd[2310094]: Could not generate persistent MAC address for veth600e1c4: No such file or directory
Oct 6 02:32:19 sentry-docker00.cs.umd.edu systemd-udevd[2319541]: link_config: could not get ethtool features for veth0d40047
Oct 6 02:32:19 sentry-docker00.cs.umd.edu systemd-udevd[2319541]: Could not set offload features of veth0d40047: No such device
Oct 6 02:32:19 sentry-docker00.cs.umd.edu systemd-udevd[2319567]: Could not generate persistent MAC address for veth3aef7c6: No such file or directory
Oct 6 02:32:19 sentry-docker00.cs.umd.edu systemd-udevd[2319568]: Could not generate persistent MAC address for vethaf38be3: No such file or directory
Oct 6 02:32:19 sentry-docker00.cs.umd.edu systemd-udevd[2319571]: Could not generate persistent MAC address for veth1bd2652: No such file or directory
Oct 6 02:32:19 sentry-docker00.cs.umd.edu systemd-udevd[2319572]: Could not generate persistent MAC address for vethefd4aaa: No such file or directory
Oct 6 02:32:19 sentry-docker00.cs.umd.edu systemd-udevd[2319594]: Could not generate persistent MAC address for veth1929537: No such file or directory
Oct 6 02:32:19 sentry-docker00.cs.umd.edu systemd-udevd[2319588]: Could not generate persistent MAC address for veth413a44a: No such file or directory
Oct 6 02:32:19 sentry-docker00.cs.umd.edu systemd-udevd[2319597]: Could not generate persistent MAC address for veth2425641: No such file or directory
Oct 6 02:32:19 sentry-docker00.cs.umd.edu systemd-udevd[2319598]: Could not generate persistent MAC address for vethd972b2a: No such file or directory
Oct 6 02:32:19 sentry-docker00.cs.umd.edu systemd-udevd[2319650]: Could not generate persistent MAC address for vethda61ff6: No such file or directory
Oct 6 02:32:19 sentry-docker00.cs.umd.edu systemd-udevd[2319651]: Could not generate persistent MAC address for vethca651e0: No such file or directory
Oct 6 02:52:27 sentry-docker00.cs.umd.edu systemd-udevd[2329236]: link_config: could not get ethtool features for veth1bd2652
Oct 6 02:52:27 sentry-docker00.cs.umd.edu systemd-udevd[2329236]: Could not set offload features of veth1bd2652: No such device
Oct 6 02:52:27 sentry-docker00.cs.umd.edu systemd-udevd[2329270]: Could not generate persistent MAC address for veth71fdee4: No such file or directory
Oct 6 02:52:27 sentry-docker00.cs.umd.edu systemd-udevd[2329271]: Could not generate persistent MAC address for vethef69eaa: No such file or directory
Oct 6 02:52:27 sentry-docker00.cs.umd.edu systemd-udevd[2329274]: Could not generate persistent MAC address for veth46b6bc6: No such file or directory
Oct 6 02:52:27 sentry-docker00.cs.umd.edu systemd-udevd[2329275]: Could not generate persistent MAC address for veth00c0d5d: No such file or directory
... 6 more distinct messages not shown
== strawberry (7 distinct, 38 total) ==
Oct 6 02:07:04 strawberry kernel: I/O error, dev sda, sector 206848 op 0x0:(READ) flags 0x80700 phys_seg 1 prio class 2 [x6]
Oct 6 02:07:04 strawberry kernel: I/O error, dev sda, sector 206848 op 0x0:(READ) flags 0x0 phys_seg 1 prio class 2 [x6]
Oct 6 02:07:04 strawberry kernel: Buffer I/O error on dev sda2, logical block 0, async page read [x6]
Oct 6 02:07:04 strawberry kernel: I/O error, dev sda, sector 2048 op 0x0:(READ) flags 0x80700 phys_seg 1 prio class 2 [x6]
Oct 6 02:07:04 strawberry kernel: I/O error, dev sda, sector 2048 op 0x0:(READ) flags 0x0 phys_seg 1 prio class 2 [x6]
Oct 6 02:07:04 strawberry kernel: Buffer I/O error on dev sda1, logical block 0, async page read [x6]
Oct 6 02:34:42 strawberry smartd[5314]: Device: /dev/sda [SAT], failed to read SMART Attribute Data [x2]
== submit26-b9-f1 (9 distinct, 9 total) ==
Oct 6 02:26:01 submit26-b9-f1 setroubleshoot[1216869]: SELinux is preventing /usr/bin/python3.9 from create access on the directory /(null). For complete SELinux messages run: sealert -l 3ef7d677-731f-46bf-9c34-c2c55fea665c
Oct 6 02:26:01 submit26-b9-f1 setroubleshoot[1216869]: SELinux is preventing /usr/bin/python3.9 from add_name access on the directory /(null). For complete SELinux messages run: sealert -l aa60e26f-72e1-45f1-bc12-aa8b3b669e36
Oct 6 02:26:01 submit26-b9-f1 setroubleshoot[1216869]: SELinux is preventing /usr/bin/python3.9 from create access on the file /(null). For complete SELinux messages run: sealert -l d088fb43-23ee-4ae8-ae6a-5d1c041ee2d6
Oct 6 02:26:01 submit26-b9-f1 setroubleshoot[1216869]: SELinux is preventing /usr/bin/python3.9 from open access on the file /tmp/libdnf.m9zjnj/repodata/repomd.xml. For complete SELinux messages run: sealert -l 3b0d8c9a-6637-4d6e-a864-f1dd7c00377d
Oct 6 02:26:01 submit26-b9-f1 setroubleshoot[1216869]: SELinux is preventing /usr/bin/python3.9 from setattr access on the file repomd.xml. For complete SELinux messages run: sealert -l 0fd3339f-3ef2-45f3-9e58-65a58b42f3ee
Oct 6 02:26:01 submit26-b9-f1 setroubleshoot[1216869]: SELinux is preventing /usr/bin/python3.9 from read access on the directory libdnf.m9zjnj. For complete SELinux messages run: sealert -l 0d661d88-dc9e-469d-986b-52e29b353aa8
Oct 6 02:26:01 submit26-b9-f1 setroubleshoot[1216869]: SELinux is preventing /usr/bin/python3.9 from remove_name access on the directory repomd.xml. For complete SELinux messages run: sealert -l 405a8556-cf9f-4ef4-8525-0dca18d4259d
Oct 6 02:26:01 submit26-b9-f1 setroubleshoot[1216869]: SELinux is preventing /usr/bin/python3.9 from unlink access on the file repomd.xml. For complete SELinux messages run: sealert -l 3c38e23e-3631-4cb5-81c7-992675c836d9
Oct 6 02:26:01 submit26-b9-f1 setroubleshoot[1216869]: SELinux is preventing /usr/bin/python3.9 from rmdir access on the directory repodata. For complete SELinux messages run: sealert -l a070e9b5-2867-47d6-b2e3-3b7d99725848
== submit26-b9-f2 (9 distinct, 9 total) ==
Oct 6 02:06:55 submit26-b9-f2 setroubleshoot[315358]: SELinux is preventing /usr/bin/python3.9 from create access on the directory /(null). For complete SELinux messages run: sealert -l 0659d546-3107-4f75-b00f-008c85f41dc6
Oct 6 02:06:55 submit26-b9-f2 setroubleshoot[315358]: SELinux is preventing /usr/bin/python3.9 from add_name access on the directory /(null). For complete SELinux messages run: sealert -l 156d9270-3466-4356-b86f-1a128825961a
Oct 6 02:06:55 submit26-b9-f2 setroubleshoot[315358]: SELinux is preventing /usr/bin/python3.9 from create access on the file /(null). For complete SELinux messages run: sealert -l c8a40bf5-2fc4-46b3-b813-8592b3523339
Oct 6 02:06:55 submit26-b9-f2 setroubleshoot[315358]: SELinux is preventing /usr/bin/python3.9 from open access on the file /tmp/libdnf.iBryuT/repodata/repomd.xml. For complete SELinux messages run: sealert -l 7f4c3a8e-0f99-47c4-9baf-e1336fe24876
Oct 6 02:06:55 submit26-b9-f2 setroubleshoot[315358]: SELinux is preventing /usr/bin/python3.9 from setattr access on the file repomd.xml. For complete SELinux messages run: sealert -l 988123da-b724-4e6a-900c-33a2723fdaf1
Oct 6 02:06:55 submit26-b9-f2 setroubleshoot[315358]: SELinux is preventing /usr/bin/python3.9 from read access on the directory libdnf.iBryuT. For complete SELinux messages run: sealert -l ca585e2b-d50f-4264-8127-6b3fa04070c8
Oct 6 02:06:55 submit26-b9-f2 setroubleshoot[315358]: SELinux is preventing /usr/bin/python3.9 from remove_name access on the directory repomd.xml. For complete SELinux messages run: sealert -l 3a749560-1cec-40ca-a4dc-596841be3885
Oct 6 02:06:55 submit26-b9-f2 setroubleshoot[315358]: SELinux is preventing /usr/bin/python3.9 from unlink access on the file repomd.xml. For complete SELinux messages run: sealert -l 0aa52f08-94f8-474e-96d8-e818846941af
Oct 6 02:06:55 submit26-b9-f2 setroubleshoot[315358]: SELinux is preventing /usr/bin/python3.9 from rmdir access on the directory repodata. For complete SELinux messages run: sealert -l de019dc4-408f-439c-902a-676d18dfe8e7
== submit26-b9-f4 (1 distinct, 1 total) ==
Oct 6 02:08:51 submit26-b9-f4 systemd[1]: user(a)1001.service: Main process exited, code=killed, status=9/KILL
== wraith (3 distinct, 3 total) ==
Oct 6 02:18:31 wraith kernel: hrtimer: interrupt took 2836 ns
Oct 6 02:34:24 wraith kernel: workqueue: i915_hpd_poll_init_work [i915] hogged CPU for >10000us 1027 times, consider switching to WQ_UNBOUND
Oct 6 02:35:47 wraith kernel: workqueue: output_poll_execute hogged CPU for >10000us 1027 times, consider switching to WQ_UNBOUND
1
0
Command: /usr/local/sbin/syslog-digest.py
Time : 0.0514s
Status : exited 0
Output :
Syslog digest — 2026-10-06 02:05 EDT
Processed 2,547 lines, filtered 2,127 (83%). 420 unknown (195 distinct) from 23 host(s).
== b0b02.cs.umd.edu (1 distinct, 1 total) ==
Oct 6 01:15:30 b0b02.cs.umd.edu rustdesk[697588]: cannot open display:
== biggulp.cs.umd.edu (3 distinct, 3 total) ==
Oct 6 01:21:28 biggulp.cs.umd.edu sshd-session[2818782]: pam_access(sshd:auth): access denied for user `admin' from `207.175.247.91'
Oct 6 01:21:28 biggulp.cs.umd.edu krb5_child[2818784]: Client 'admin(a)UMD.EDU' not found in Kerberos database
Oct 6 01:21:28 biggulp.cs.umd.edu sshd-session[2818780]: error: PAM: System error for admin from 207.175.247.91
== cheezit.cs.umd.edu (3 distinct, 3 total) ==
Oct 6 02:04:16 cheezit.cs.umd.edu sshd-session[2497560]: pam_access(sshd:auth): access denied for user `admin' from `34.53.176.236'
Oct 6 02:04:16 cheezit.cs.umd.edu krb5_child[2497566]: Client 'admin(a)UMD.EDU' not found in Kerberos database
Oct 6 02:04:16 cheezit.cs.umd.edu sshd-session[2497558]: error: PAM: System error for admin from 34.53.176.236
== cmsc436-0101-redis (3 distinct, 3 total) ==
Oct 6 01:05:47 cmsc436-0101-redis krb5_child[4568]: Client 'admin(a)UMD.EDU' not found in Kerberos database
Oct 6 01:05:48 cmsc436-0101-redis sshd-session[4564]: error: PAM: Authentication failure for admin from 34.62.218.88
Oct 6 01:05:51 cmsc436-0101-redis sshd-session[4570]: error: Protocol major versions differ: 2 vs. 1
== hazfs.cs.umd.edu (11 distinct, 66 total) ==
Oct 6 01:28:16 hazfs.cs.umd.edu snmpd[1431]: send response: Failure in sendto [x6]
Oct 6 01:28:16 hazfs.cs.umd.edu snmpd[1431]: -- NET-SNMP-EXTEND-MIB::nsExtendStatus."userweb" [x6]
Oct 6 01:28:16 hazfs.cs.umd.edu snmpd[1431]: -- NET-SNMP-EXTEND-MIB::nsExtendStatus."zfslist" [x6]
Oct 6 01:28:16 hazfs.cs.umd.edu snmpd[1431]: -- NET-SNMP-EXTEND-MIB::nsExtendStatus."userhome" [x6]
Oct 6 01:28:16 hazfs.cs.umd.edu snmpd[1431]: -- NET-SNMP-EXTEND-MIB::nsExtendOutput1Line."userweb" [x6]
Oct 6 01:28:16 hazfs.cs.umd.edu snmpd[1431]: -- NET-SNMP-EXTEND-MIB::nsExtendOutput1Line."zfslist" [x6]
Oct 6 01:28:16 hazfs.cs.umd.edu snmpd[1431]: -- NET-SNMP-EXTEND-MIB::nsExtendOutput1Line."userhome" [x6]
Oct 6 01:28:16 hazfs.cs.umd.edu snmpd[1431]: -- NET-SNMP-EXTEND-MIB::nsExtendOutputFull."userweb" [x6]
Oct 6 01:28:16 hazfs.cs.umd.edu snmpd[1431]: -- NET-SNMP-EXTEND-MIB::nsExtendOutputFull."zfslist" [x6]
Oct 6 01:28:16 hazfs.cs.umd.edu snmpd[1431]: -- NET-SNMP-EXTEND-MIB::nsExtendOutputFull."userhome" [x6]
Oct 6 01:28:16 hazfs.cs.umd.edu snmpd[1431]: -- NET-SNMP-EXTEND-MIB::nsExtendOutNumLines."userweb" [x6]
== idm00 (1 distinct, 1 total) ==
Oct 6 01:54:40 idm00 named[4166701]: client @0x7f11986d6658 10.73.240.42#50259: update '73.10.in-addr.arpa/IN' denied
== idmp0 (1 distinct, 1 total) ==
Oct 6 01:39:24 idmp0 named[1598691]: client @0x7f2d3c06efd8 10.73.240.43#52011: update '73.10.in-addr.arpa/IN' denied
== inbound00.cs.umd.edu (1 distinct, 6 total) ==
Oct 6 01:34:52 inbound00.cs.umd.edu cockpit-ws[3356914]: /usr/share/cockpit/static/login.js/favicon.ico: Failed to open file “/usr/share/cockpit/static/login.js/favicon.ico”: open() failed: Not a directory [x6]
== inbound01.cs.umd.edu (2 distinct, 5 total) ==
Oct 6 01:30:46 inbound01.cs.umd.edu krb5_child[1371092]: Client 'admin(a)UMD.EDU' not found in Kerberos database
Oct 6 01:34:50 inbound01.cs.umd.edu cockpit-ws[1371836]: /usr/share/cockpit/static/login.js/favicon.ico: Failed to open file “/usr/share/cockpit/static/login.js/favicon.ico”: open() failed: Not a directory [x4]
== itmon02 (1 distinct, 3 total) ==
Oct 6 01:13:05 itmon02 sshd[805675]: error: beginning MaxStartups throttling [x3]
== krispykreme.cs.umd.edu (1 distinct, 1 total) ==
Oct 6 01:33:12 krispykreme.cs.umd.edu sshd-session[2463151]: error: send_error: write: Connection reset by peer
== munin (2 distinct, 16 total) ==
Oct 6 01:23:25 munin sudo[522529]: pam_systemd(sudo:session): Failed to stat() runtime directory '/run/user/0': No such file or directory [x8]
Oct 6 01:23:25 munin sudo[522529]: pam_systemd(sudo:session): Not setting $XDG_RUNTIME_DIR, as the directory is not in order. [x8]
== newhonors2 (1 distinct, 24 total) ==
Oct 6 01:13:03 newhonors2 dhcpcd[3618787]: dhcpcd is not running [x24]
== ntop00 (94 distinct, 94 total) ==
Oct 6 01:05:05 ntop00 sfacctd[1075592]: INFO ( m1/mysql ): *** Purging cache - END (PID: 3874, QN: 2932/2932, ET: 4) ***
Oct 6 01:08:01 ntop00 sfacctd[1075592]: INFO ( p1/print ): *** Purging cache - START (PID: 3875) ***
Oct 6 01:08:01 ntop00 sfacctd[1075592]: INFO ( p1/print ): *** Purging cache - END (PID: 3875, QN: 2885/2885, ET: 0) ***
Oct 6 01:08:01 ntop00 nfacctd[1075699]: INFO ( p1/print ): *** Purging cache - START (PID: 3875) ***
Oct 6 01:08:01 ntop00 nfacctd[1075699]: INFO ( p1/print ): *** Purging cache - END (PID: 3875, QN: 67/67, ET: 0) ***
Oct 6 01:10:01 ntop00 sfacctd[1075592]: INFO ( m1/mysql ): *** Purging cache - START (PID: 3876) ***
Oct 6 01:10:01 ntop00 nfacctd[1075699]: INFO ( m1/mysql ): *** Purging cache - START (PID: 3876) ***
Oct 6 01:10:01 ntop00 nfacctd[1075699]: INFO ( m1/mysql ): *** Purging cache - END (PID: 3876, QN: 59/59, ET: 0) ***
Oct 6 01:10:05 ntop00 sfacctd[1075592]: INFO ( m1/mysql ): *** Purging cache - END (PID: 3876, QN: 2920/2920, ET: 4) ***
Oct 6 01:13:01 ntop00 sfacctd[1075592]: INFO ( p1/print ): *** Purging cache - START (PID: 3877) ***
Oct 6 01:13:01 ntop00 sfacctd[1075592]: INFO ( p1/print ): *** Purging cache - END (PID: 3877, QN: 2815/2815, ET: 0) ***
Oct 6 01:13:01 ntop00 nfacctd[1075699]: INFO ( p1/print ): *** Purging cache - START (PID: 3877) ***
Oct 6 01:13:01 ntop00 nfacctd[1075699]: INFO ( p1/print ): *** Purging cache - END (PID: 3877, QN: 61/61, ET: 0) ***
Oct 6 01:15:01 ntop00 sfacctd[1075592]: INFO ( m1/mysql ): *** Purging cache - START (PID: 3878) ***
Oct 6 01:15:01 ntop00 nfacctd[1075699]: INFO ( m1/mysql ): *** Purging cache - START (PID: 3878) ***
Oct 6 01:15:02 ntop00 nfacctd[1075699]: INFO ( m1/mysql ): *** Purging cache - END (PID: 3878, QN: 66/66, ET: 1) ***
Oct 6 01:15:05 ntop00 sfacctd[1075592]: INFO ( m1/mysql ): *** Purging cache - END (PID: 3878, QN: 2733/2733, ET: 4) ***
Oct 6 01:18:01 ntop00 sfacctd[1075592]: INFO ( p1/print ): *** Purging cache - START (PID: 3879) ***
Oct 6 01:18:01 ntop00 sfacctd[1075592]: INFO ( p1/print ): *** Purging cache - END (PID: 3879, QN: 2699/2699, ET: 0) ***
Oct 6 01:18:01 ntop00 nfacctd[1075699]: INFO ( p1/print ): *** Purging cache - START (PID: 3879) ***
Oct 6 01:18:01 ntop00 nfacctd[1075699]: INFO ( p1/print ): *** Purging cache - END (PID: 3879, QN: 68/68, ET: 0) ***
Oct 6 01:20:01 ntop00 nfacctd[1075699]: INFO ( m1/mysql ): *** Purging cache - START (PID: 3880) ***
Oct 6 01:20:01 ntop00 nfacctd[1075699]: INFO ( m1/mysql ): *** Purging cache - END (PID: 3880, QN: 68/68, ET: 0) ***
Oct 6 01:20:01 ntop00 sfacctd[1075592]: INFO ( m1/mysql ): *** Purging cache - START (PID: 3880) ***
Oct 6 01:20:06 ntop00 sfacctd[1075592]: INFO ( m1/mysql ): *** Purging cache - END (PID: 3880, QN: 2811/2811, ET: 5) ***
Oct 6 01:23:01 ntop00 nfacctd[1075699]: INFO ( p1/print ): *** Purging cache - START (PID: 3881) ***
Oct 6 01:23:01 ntop00 nfacctd[1075699]: INFO ( p1/print ): *** Purging cache - END (PID: 3881, QN: 72/72, ET: 0) ***
Oct 6 01:23:01 ntop00 sfacctd[1075592]: INFO ( p1/print ): *** Purging cache - START (PID: 3881) ***
Oct 6 01:23:01 ntop00 sfacctd[1075592]: INFO ( p1/print ): *** Purging cache - END (PID: 3881, QN: 2959/2959, ET: 0) ***
Oct 6 01:25:01 ntop00 sfacctd[1075592]: INFO ( m1/mysql ): *** Purging cache - START (PID: 3882) ***
... 64 more distinct messages not shown
== outbound00.cs.umd.edu (2 distinct, 11 total) ==
Oct 6 01:09:08 outbound00.cs.umd.edu python3[3170132]: ldapdb [x6]
Oct 6 01:31:39 outbound00.cs.umd.edu cockpit-ws[3175757]: /usr/share/cockpit/static/login.js/favicon.ico: Failed to open file “/usr/share/cockpit/static/login.js/favicon.ico”: open() failed: Not a directory [x5]
== outbound01.cs.umd.edu (2 distinct, 10 total) ==
Oct 6 01:13:06 outbound01.cs.umd.edu python3[1244338]: ldapdb [x6]
Oct 6 01:55:36 outbound01.cs.umd.edu cockpit-ws[1253921]: /usr/share/cockpit/static/login.js/favicon.ico: Failed to open file “/usr/share/cockpit/static/login.js/favicon.ico”: open() failed: Not a directory [x4]
== portal (1 distinct, 69 total) ==
Oct 6 01:05:07 portal setroubleshoot[1331198]: SELinux is preventing /usr/local/bin/traefik from connectto access on the unix_stream_socket /run/podman/podman.sock. For complete SELinux messages run: sealert -l e0a307a3-2c22-4320-8f9d-6a166c45222d [x69]
== sentry-docker00.cs.umd.edu (36 distinct, 36 total) ==
Oct 6 01:11:45 sentry-docker00.cs.umd.edu systemd-udevd[2281645]: link_config: could not set ethtool features for veth5b70c0c
Oct 6 01:11:45 sentry-docker00.cs.umd.edu systemd-udevd[2281645]: Could not set offload features of veth5b70c0c: Operation not permitted
Oct 6 01:11:46 sentry-docker00.cs.umd.edu systemd-udevd[2281678]: Could not generate persistent MAC address for veth2414c73: No such file or directory
Oct 6 01:11:46 sentry-docker00.cs.umd.edu systemd-udevd[2281679]: Could not generate persistent MAC address for vethde22e0d: No such file or directory
Oct 6 01:11:46 sentry-docker00.cs.umd.edu systemd-udevd[2281682]: Could not generate persistent MAC address for veth88f392e: No such file or directory
Oct 6 01:11:46 sentry-docker00.cs.umd.edu systemd-udevd[2281683]: Could not generate persistent MAC address for vethedd13ae: No such file or directory
Oct 6 01:11:46 sentry-docker00.cs.umd.edu systemd-udevd[2281699]: Could not generate persistent MAC address for veth7db88c1: No such file or directory
Oct 6 01:11:46 sentry-docker00.cs.umd.edu systemd-udevd[2281694]: Could not generate persistent MAC address for vethefa3404: No such file or directory
Oct 6 01:11:46 sentry-docker00.cs.umd.edu systemd-udevd[2281683]: Could not generate persistent MAC address for veth6b5082d: No such file or directory
Oct 6 01:11:46 sentry-docker00.cs.umd.edu systemd-udevd[2281694]: Could not generate persistent MAC address for veth035bfe7: No such file or directory
Oct 6 01:11:46 sentry-docker00.cs.umd.edu systemd-udevd[2281694]: Could not generate persistent MAC address for vethfb34b82: No such file or directory
Oct 6 01:11:46 sentry-docker00.cs.umd.edu systemd-udevd[2281699]: Could not generate persistent MAC address for veth223dc93: No such file or directory
Oct 6 01:31:54 sentry-docker00.cs.umd.edu systemd-udevd[2291265]: link_config: could not get ethtool features for veth88f392e
Oct 6 01:31:54 sentry-docker00.cs.umd.edu systemd-udevd[2291265]: Could not set offload features of veth88f392e: No such device
Oct 6 01:31:54 sentry-docker00.cs.umd.edu systemd-udevd[2291297]: Could not generate persistent MAC address for vethd8ab886: No such file or directory
Oct 6 01:31:54 sentry-docker00.cs.umd.edu systemd-udevd[2291298]: Could not generate persistent MAC address for veth046b249: No such file or directory
Oct 6 01:31:54 sentry-docker00.cs.umd.edu systemd-udevd[2291301]: Could not generate persistent MAC address for veth6b90280: No such file or directory
Oct 6 01:31:54 sentry-docker00.cs.umd.edu systemd-udevd[2291302]: Could not generate persistent MAC address for veth8df7a5a: No such file or directory
Oct 6 01:31:54 sentry-docker00.cs.umd.edu systemd-udevd[2291312]: Could not generate persistent MAC address for veth7990272: No such file or directory
Oct 6 01:31:54 sentry-docker00.cs.umd.edu systemd-udevd[2291308]: Could not generate persistent MAC address for veth953e14d: No such file or directory
Oct 6 01:31:54 sentry-docker00.cs.umd.edu systemd-udevd[2291327]: Could not generate persistent MAC address for vethc9c06e3: No such file or directory
Oct 6 01:31:54 sentry-docker00.cs.umd.edu systemd-udevd[2291328]: Could not generate persistent MAC address for veth2bcdc5f: No such file or directory
Oct 6 01:31:54 sentry-docker00.cs.umd.edu systemd-udevd[2291346]: Could not generate persistent MAC address for veth73f77b5: No such file or directory
Oct 6 01:31:54 sentry-docker00.cs.umd.edu systemd-udevd[2291336]: Could not generate persistent MAC address for veth4efc2d2: No such file or directory
Oct 6 01:52:02 sentry-docker00.cs.umd.edu systemd-udevd[2300668]: link_config: could not get ethtool features for veth6b90280
Oct 6 01:52:02 sentry-docker00.cs.umd.edu systemd-udevd[2300668]: Could not set offload features of veth6b90280: No such device
Oct 6 01:52:02 sentry-docker00.cs.umd.edu systemd-udevd[2300689]: Could not generate persistent MAC address for vethc4765e1: No such file or directory
Oct 6 01:52:02 sentry-docker00.cs.umd.edu systemd-udevd[2300690]: Could not generate persistent MAC address for vethd5d3f31: No such file or directory
Oct 6 01:52:02 sentry-docker00.cs.umd.edu systemd-udevd[2300708]: Could not generate persistent MAC address for veth3f3132e: No such file or directory
Oct 6 01:52:02 sentry-docker00.cs.umd.edu systemd-udevd[2300696]: Could not generate persistent MAC address for vethe5ee417: No such file or directory
... 6 more distinct messages not shown
== strawberry (7 distinct, 38 total) ==
Oct 6 01:07:04 strawberry kernel: I/O error, dev sda, sector 206848 op 0x0:(READ) flags 0x80700 phys_seg 1 prio class 2 [x6]
Oct 6 01:07:04 strawberry kernel: I/O error, dev sda, sector 206848 op 0x0:(READ) flags 0x0 phys_seg 1 prio class 2 [x6]
Oct 6 01:07:04 strawberry kernel: Buffer I/O error on dev sda2, logical block 0, async page read [x6]
Oct 6 01:07:04 strawberry kernel: I/O error, dev sda, sector 2048 op 0x0:(READ) flags 0x80700 phys_seg 1 prio class 2 [x6]
Oct 6 01:07:04 strawberry kernel: I/O error, dev sda, sector 2048 op 0x0:(READ) flags 0x0 phys_seg 1 prio class 2 [x6]
Oct 6 01:07:04 strawberry kernel: Buffer I/O error on dev sda1, logical block 0, async page read [x6]
Oct 6 01:34:42 strawberry smartd[5314]: Device: /dev/sda [SAT], failed to read SMART Attribute Data [x2]
== submit26-b9-f1 (1 distinct, 2 total) ==
Oct 6 01:21:47 submit26-b9-f1 systemd[1]: user(a)1001.service: Main process exited, code=killed, status=9/KILL [x2]
== submit26-b9-f2 (1 distinct, 1 total) ==
Oct 6 01:27:14 submit26-b9-f2 systemd[1]: user(a)1001.service: Main process exited, code=killed, status=9/KILL
== submit26-b9-f3 (11 distinct, 17 total) ==
Oct 6 01:06:48 submit26-b9-f3 setroubleshoot[1397190]: SELinux is preventing /usr/bin/python3.9 from create access on the directory /(null). For complete SELinux messages run: sealert -l a653b772-cbcd-438b-bae5-23c3dc69b31b [x2]
Oct 6 01:06:48 submit26-b9-f3 setroubleshoot[1397190]: SELinux is preventing /usr/bin/python3.9 from add_name access on the directory /(null). For complete SELinux messages run: sealert -l 3e904634-6caa-4202-8c92-f139db798859 [x2]
Oct 6 01:06:48 submit26-b9-f3 setroubleshoot[1397190]: SELinux is preventing /usr/bin/python3.9 from create access on the file /(null). For complete SELinux messages run: sealert -l 580b20e4-ec2c-433d-905c-5bd417fba033
Oct 6 01:06:48 submit26-b9-f3 setroubleshoot[1397190]: SELinux is preventing /usr/bin/python3.9 from open access on the file /tmp/libdnf.mDnSgk/repodata/repomd.xml. For complete SELinux messages run: sealert -l 27f29d48-5e7c-4db7-b051-8ac055737d6f
Oct 6 01:06:48 submit26-b9-f3 setroubleshoot[1397190]: SELinux is preventing /usr/bin/python3.9 from setattr access on the file repomd.xml. For complete SELinux messages run: sealert -l bff72452-d40a-430b-9060-dd0a48f5b6ba
Oct 6 01:06:48 submit26-b9-f3 setroubleshoot[1397190]: SELinux is preventing /usr/bin/python3.9 from read access on the directory libdnf.mDnSgk. For complete SELinux messages run: sealert -l 9638d396-8ce5-4e6a-ae47-45cd3985e1cd
Oct 6 01:06:48 submit26-b9-f3 setroubleshoot[1397190]: SELinux is preventing /usr/bin/python3.9 from remove_name access on the directory repomd.xml. For complete SELinux messages run: sealert -l 6da64b94-7024-45a9-b8c2-3b9812517407 [x2]
Oct 6 01:06:48 submit26-b9-f3 setroubleshoot[1397190]: SELinux is preventing /usr/bin/python3.9 from unlink access on the file repomd.xml. For complete SELinux messages run: sealert -l 64cbe179-abf1-4d5a-bade-bb164897ee65
Oct 6 01:06:48 submit26-b9-f3 setroubleshoot[1397190]: SELinux is preventing /usr/bin/python3.9 from rmdir access on the directory repodata. For complete SELinux messages run: sealert -l d2e35b1a-e27c-4f91-9217-2bb1204e1e68 [x2]
Oct 6 01:06:48 submit26-b9-f3 setroubleshoot[1397190]: SELinux is preventing /usr/bin/python3.9 from read access on the directory libdnf.FQl3BD. For complete SELinux messages run: sealert -l 9638d396-8ce5-4e6a-ae47-45cd3985e1cd
Oct 6 01:20:04 submit26-b9-f3 systemd[1]: user(a)1001.service: Main process exited, code=killed, status=9/KILL [x3]
== submit26-b9-f4 (9 distinct, 9 total) ==
Oct 6 01:24:53 submit26-b9-f4 setroubleshoot[4062079]: SELinux is preventing /usr/bin/python3.9 from create access on the directory /(null). For complete SELinux messages run: sealert -l ee160f23-b161-4f4a-9985-c4edfd3a5beb
Oct 6 01:24:54 submit26-b9-f4 setroubleshoot[4062079]: SELinux is preventing /usr/bin/python3.9 from add_name access on the directory /(null). For complete SELinux messages run: sealert -l 89a83821-4b24-4081-9973-0a79ca6ed5b4
Oct 6 01:24:54 submit26-b9-f4 setroubleshoot[4062079]: SELinux is preventing /usr/bin/python3.9 from create access on the file /(null). For complete SELinux messages run: sealert -l f73955d6-1416-45f9-bab6-ff1f3ea07e9d
Oct 6 01:24:54 submit26-b9-f4 setroubleshoot[4062079]: SELinux is preventing /usr/bin/python3.9 from open access on the file /tmp/libdnf.GgHwGN/repodata/repomd.xml. For complete SELinux messages run: sealert -l 9f8f24a0-8fb6-454d-a103-31a8f7a6efa0
Oct 6 01:24:54 submit26-b9-f4 setroubleshoot[4062079]: SELinux is preventing /usr/bin/python3.9 from setattr access on the file repomd.xml. For complete SELinux messages run: sealert -l 20293136-86a3-40ba-a651-cff48d36059e
Oct 6 01:24:54 submit26-b9-f4 setroubleshoot[4062079]: SELinux is preventing /usr/bin/python3.9 from read access on the directory libdnf.GgHwGN. For complete SELinux messages run: sealert -l 25f86b49-4ee7-4f60-ad1c-73a70032560c
Oct 6 01:24:54 submit26-b9-f4 setroubleshoot[4062079]: SELinux is preventing /usr/bin/python3.9 from remove_name access on the directory repomd.xml. For complete SELinux messages run: sealert -l eec250fb-073f-456d-93bc-f98776fd476d
Oct 6 01:24:54 submit26-b9-f4 setroubleshoot[4062079]: SELinux is preventing /usr/bin/python3.9 from unlink access on the file repomd.xml. For complete SELinux messages run: sealert -l c9209e04-a349-43d5-8cb2-3e303e48df74
Oct 6 01:24:54 submit26-b9-f4 setroubleshoot[4062079]: SELinux is preventing /usr/bin/python3.9 from rmdir access on the directory repodata. For complete SELinux messages run: sealert -l 3178d5f5-80e9-404b-92b7-9bef397a8915
1
0
Command: /usr/local/sbin/syslog-digest.py
Time : 0.0538s
Status : exited 0
Output :
Syslog digest — 2026-10-06 01:05 EDT
Processed 2,712 lines, filtered 2,282 (84%). 430 unknown (201 distinct) from 29 host(s).
== abuse (3 distinct, 4 total) ==
Oct 6 00:10:14 abuse systemd[1]: New main PID 369 does not belong to service, and PID file is not owned by root. Refusing. [x2]
Oct 6 00:10:33 abuse systemd[1]: Daemon never wrote its PID file. Failing.
Oct 6 00:10:43 abuse systemd[1]: pmlogger.service: Supervising process 7885 which is not our child. We'll most likely not notice when it exits.
== b0b02.cs.umd.edu (1 distinct, 1 total) ==
Oct 6 00:15:29 b0b02.cs.umd.edu rustdesk[682088]: cannot open display:
== biggulp.cs.umd.edu (1 distinct, 1 total) ==
Oct 6 00:25:35 biggulp.cs.umd.edu pcp[2802787]: pmlogger_daily failed - see /var/log/pcp/pmlogger/pmlogger_daily-K.log
== gle-dind04 (2 distinct, 2 total) ==
Oct 6 00:32:49 gle-dind04 lldpd[1171]: unable to send packet on real device for veth09ccb9c: No such device or address
Oct 6 00:39:01 gle-dind04 lldpd[1171]: unable to send packet on real device for veth1b34747: No such device or address
== grades01.cs.umd.edu (3 distinct, 4 total) ==
Oct 6 00:10:14 grades01.cs.umd.edu systemd[1]: New main PID 27696 does not belong to service, and PID file is not owned by root. Refusing. [x2]
Oct 6 00:10:34 grades01.cs.umd.edu systemd[1]: Daemon never wrote its PID file. Failing.
Oct 6 00:10:49 grades01.cs.umd.edu systemd[1]: pmlogger.service: Supervising process 2997 which is not our child. We'll most likely not notice when it exits.
== idm00 (1 distinct, 1 total) ==
Oct 6 00:54:40 idm00 named[4166701]: client @0x7f11a93f8418 10.73.240.42#63775: update '73.10.in-addr.arpa/IN' denied
== idmp0 (1 distinct, 1 total) ==
Oct 6 00:39:24 idmp0 named[1598691]: client @0x7f2d38010098 10.73.240.43#57847: update '73.10.in-addr.arpa/IN' denied
== itmon02 (1 distinct, 8 total) ==
Oct 6 00:13:07 itmon02 sshd[805675]: error: beginning MaxStartups throttling [x8]
== jubjub.cs.umd.edu (3 distinct, 4 total) ==
Oct 6 00:10:11 jubjub.cs.umd.edu systemd[1]: New main PID 151396 does not belong to service, and PID file is not owned by root. Refusing. [x2]
Oct 6 00:10:32 jubjub.cs.umd.edu systemd[1]: Daemon never wrote its PID file. Failing.
Oct 6 00:10:40 jubjub.cs.umd.edu systemd[1]: pmlogger.service: Supervising process 158783 which is not our child. We'll most likely not notice when it exits.
== misty.cs.umd.edu (3 distinct, 4 total) ==
Oct 6 00:10:15 misty.cs.umd.edu systemd[1]: New main PID 15610 does not belong to service, and PID file is not owned by root. Refusing. [x2]
Oct 6 00:10:35 misty.cs.umd.edu systemd[1]: Daemon never wrote its PID file. Failing.
Oct 6 00:10:51 misty.cs.umd.edu systemd[1]: pmlogger.service: Supervising process 22819 which is not our child. We'll most likely not notice when it exits.
== munin (2 distinct, 70 total) ==
Oct 6 00:13:08 munin sudo[496922]: pam_systemd(sudo:session): Failed to stat() runtime directory '/run/user/0': No such file or directory [x35]
Oct 6 00:13:08 munin sudo[496922]: pam_systemd(sudo:session): Not setting $XDG_RUNTIME_DIR, as the directory is not in order. [x35]
== newhonors2 (1 distinct, 24 total) ==
Oct 6 00:13:02 newhonors2 dhcpcd[3616949]: dhcpcd is not running [x24]
== ntop00 (99 distinct, 99 total) ==
Oct 6 00:05:01 ntop00 sfacctd[1075592]: INFO ( m1/mysql ): *** Purging cache - START (PID: 3850) ***
Oct 6 00:05:01 ntop00 nfacctd[1075699]: INFO ( m1/mysql ): *** Purging cache - START (PID: 3850) ***
Oct 6 00:05:01 ntop00 nfacctd[1075699]: INFO ( m1/mysql ): *** Purging cache - END (PID: 3850, QN: 58/58, ET: 0) ***
Oct 6 00:05:05 ntop00 sfacctd[1075592]: INFO ( m1/mysql ): *** Purging cache - END (PID: 3850, QN: 3051/3051, ET: 4) ***
Oct 6 00:08:01 ntop00 sfacctd[1075592]: INFO ( p1/print ): *** Purging cache - START (PID: 3851) ***
Oct 6 00:08:01 ntop00 sfacctd[1075592]: INFO ( p1/print ): *** Purging cache - END (PID: 3851, QN: 3327/3327, ET: 0) ***
Oct 6 00:08:01 ntop00 nfacctd[1075699]: INFO ( p1/print ): *** Purging cache - START (PID: 3851) ***
Oct 6 00:08:01 ntop00 nfacctd[1075699]: INFO ( p1/print ): *** Purging cache - END (PID: 3851, QN: 59/59, ET: 0) ***
Oct 6 00:10:01 ntop00 sfacctd[1075592]: INFO ( m1/mysql ): *** Purging cache - START (PID: 3852) ***
Oct 6 00:10:01 ntop00 nfacctd[1075699]: INFO ( m1/mysql ): *** Purging cache - START (PID: 3852) ***
Oct 6 00:10:02 ntop00 nfacctd[1075699]: INFO ( m1/mysql ): *** Purging cache - END (PID: 3852, QN: 67/67, ET: 1) ***
Oct 6 00:10:07 ntop00 sfacctd[1075592]: INFO ( m1/mysql ): *** Purging cache - END (PID: 3852, QN: 3636/3636, ET: 6) ***
Oct 6 00:13:01 ntop00 sfacctd[1075592]: INFO ( p1/print ): *** Purging cache - START (PID: 3853) ***
Oct 6 00:13:01 ntop00 sfacctd[1075592]: INFO ( p1/print ): *** Purging cache - END (PID: 3853, QN: 3956/3956, ET: 0) ***
Oct 6 00:13:01 ntop00 nfacctd[1075699]: INFO ( p1/print ): *** Purging cache - START (PID: 3853) ***
Oct 6 00:13:01 ntop00 nfacctd[1075699]: INFO ( p1/print ): *** Purging cache - END (PID: 3853, QN: 77/77, ET: 0) ***
Oct 6 00:15:01 ntop00 sfacctd[1075592]: INFO ( m1/mysql ): *** Purging cache - START (PID: 3854) ***
Oct 6 00:15:01 ntop00 nfacctd[1075699]: INFO ( m1/mysql ): *** Purging cache - START (PID: 3854) ***
Oct 6 00:15:02 ntop00 nfacctd[1075699]: INFO ( m1/mysql ): *** Purging cache - END (PID: 3854, QN: 83/83, ET: 1) ***
Oct 6 00:15:07 ntop00 sfacctd[1075592]: INFO ( m1/mysql ): *** Purging cache - END (PID: 3854, QN: 3901/3901, ET: 6) ***
Oct 6 00:18:01 ntop00 sfacctd[1075592]: INFO ( p1/print ): *** Purging cache - START (PID: 3855) ***
Oct 6 00:18:01 ntop00 sfacctd[1075592]: INFO ( p1/print ): *** Purging cache - END (PID: 3855, QN: 3941/3941, ET: 0) ***
Oct 6 00:18:01 ntop00 nfacctd[1075699]: INFO ( p1/print ): *** Purging cache - START (PID: 3855) ***
Oct 6 00:18:01 ntop00 nfacctd[1075699]: INFO ( p1/print ): *** Purging cache - END (PID: 3855, QN: 89/89, ET: 0) ***
Oct 6 00:20:01 ntop00 nfacctd[1075699]: INFO ( m1/mysql ): *** Purging cache - START (PID: 3856) ***
Oct 6 00:20:01 ntop00 sfacctd[1075592]: INFO ( m1/mysql ): *** Purging cache - START (PID: 3856) ***
Oct 6 00:20:01 ntop00 nfacctd[1075699]: INFO ( m1/mysql ): *** Purging cache - END (PID: 3856, QN: 89/89, ET: 0) ***
Oct 6 00:20:07 ntop00 sfacctd[1075592]: INFO ( m1/mysql ): *** Purging cache - END (PID: 3856, QN: 3939/3939, ET: 6) ***
Oct 6 00:23:01 ntop00 nfacctd[1075699]: INFO ( p1/print ): *** Purging cache - START (PID: 3857) ***
Oct 6 00:23:01 ntop00 nfacctd[1075699]: INFO ( p1/print ): *** Purging cache - END (PID: 3857, QN: 75/75, ET: 0) ***
... 69 more distinct messages not shown
== openrepo (1 distinct, 1 total) ==
Oct 6 00:35:53 openrepo (nin-node)[989371]: munin-node.service: Referenced but unset environment variable evaluates to an empty string: DAEMON_ARGS
== outbound00.cs.umd.edu (1 distinct, 6 total) ==
Oct 6 00:09:09 outbound00.cs.umd.edu python3[3155701]: ldapdb [x6]
== outbound01.cs.umd.edu (1 distinct, 6 total) ==
Oct 6 00:13:07 outbound01.cs.umd.edu python3[1230457]: ldapdb [x6]
== portal (1 distinct, 76 total) ==
Oct 6 00:05:51 portal setroubleshoot[1317890]: SELinux is preventing /usr/local/bin/traefik from connectto access on the unix_stream_socket /run/podman/podman.sock. For complete SELinux messages run: sealert -l e0a307a3-2c22-4320-8f9d-6a166c45222d [x76]
== sentry-docker00.cs.umd.edu (38 distinct, 38 total) ==
Oct 6 00:11:20 sentry-docker00.cs.umd.edu systemd-udevd[2253604]: link_config: could not get ethtool features for veth35f01bb
Oct 6 00:11:20 sentry-docker00.cs.umd.edu systemd-udevd[2253604]: Could not set offload features of veth35f01bb: No such device
Oct 6 00:11:20 sentry-docker00.cs.umd.edu systemd-udevd[2253633]: Could not generate persistent MAC address for veth0643bda: No such file or directory
Oct 6 00:11:20 sentry-docker00.cs.umd.edu systemd-udevd[2253634]: Could not generate persistent MAC address for vethce1a7aa: No such file or directory
Oct 6 00:11:20 sentry-docker00.cs.umd.edu systemd-udevd[2253652]: Could not generate persistent MAC address for vethb8179ca: No such file or directory
Oct 6 00:11:20 sentry-docker00.cs.umd.edu systemd-udevd[2253659]: Could not generate persistent MAC address for veth5933ec2: No such file or directory
Oct 6 00:11:20 sentry-docker00.cs.umd.edu systemd-udevd[2253647]: Could not generate persistent MAC address for veth3891ffe: No such file or directory
Oct 6 00:11:20 sentry-docker00.cs.umd.edu systemd-udevd[2253644]: Could not generate persistent MAC address for veth4bd88b0: No such file or directory
Oct 6 00:11:21 sentry-docker00.cs.umd.edu systemd-udevd[2253634]: Could not generate persistent MAC address for veth4f819d6: No such file or directory
Oct 6 00:11:21 sentry-docker00.cs.umd.edu systemd-udevd[2253654]: Could not generate persistent MAC address for veth44577fa: No such file or directory
Oct 6 00:11:21 sentry-docker00.cs.umd.edu systemd-udevd[2253647]: Could not generate persistent MAC address for veth4564f70: No such file or directory
Oct 6 00:11:21 sentry-docker00.cs.umd.edu systemd-udevd[2253646]: Could not generate persistent MAC address for vethc9a92e6: No such file or directory
Oct 6 00:31:29 sentry-docker00.cs.umd.edu systemd-udevd[2262921]: link_config: could not get ethtool features for veth4f819d6
Oct 6 00:31:29 sentry-docker00.cs.umd.edu systemd-udevd[2262921]: Could not set offload features of veth4f819d6: No such device
Oct 6 00:31:29 sentry-docker00.cs.umd.edu systemd-udevd[2262986]: Could not generate persistent MAC address for vetha3fdc0d: No such file or directory
Oct 6 00:31:29 sentry-docker00.cs.umd.edu systemd-udevd[2262987]: Could not generate persistent MAC address for vethe0d949e: No such file or directory
Oct 6 00:31:29 sentry-docker00.cs.umd.edu systemd-udevd[2262990]: Could not generate persistent MAC address for vethcf29c6c: No such file or directory
Oct 6 00:31:29 sentry-docker00.cs.umd.edu systemd-udevd[2262991]: Could not generate persistent MAC address for veth1548401: No such file or directory
Oct 6 00:31:29 sentry-docker00.cs.umd.edu systemd-udevd[2262990]: Could not generate persistent MAC address for vethf48680d: No such file or directory
Oct 6 00:31:29 sentry-docker00.cs.umd.edu systemd-udevd[2262999]: Could not generate persistent MAC address for veth09d9c8a: No such file or directory
Oct 6 00:31:29 sentry-docker00.cs.umd.edu systemd-udevd[2263016]: Could not generate persistent MAC address for vethdf5d724: No such file or directory
Oct 6 00:31:29 sentry-docker00.cs.umd.edu systemd-udevd[2263017]: Could not generate persistent MAC address for veth7f2b7f3: No such file or directory
Oct 6 00:31:29 sentry-docker00.cs.umd.edu systemd-udevd[2263047]: Could not generate persistent MAC address for vetha6e494f: No such file or directory
Oct 6 00:31:29 sentry-docker00.cs.umd.edu systemd-udevd[2263052]: Could not generate persistent MAC address for veth13a0477: No such file or directory
Oct 6 00:51:37 sentry-docker00.cs.umd.edu systemd-udevd[2272202]: link_config: could not get ethtool features for vetha6e494f
Oct 6 00:51:37 sentry-docker00.cs.umd.edu systemd-udevd[2272202]: Could not set offload features of vetha6e494f: No such device
Oct 6 00:51:37 sentry-docker00.cs.umd.edu systemd-udevd[2272202]: link_config: could not get ethtool features for vethdf5d724
Oct 6 00:51:37 sentry-docker00.cs.umd.edu systemd-udevd[2272202]: Could not set offload features of vethdf5d724: No such device
Oct 6 00:51:37 sentry-docker00.cs.umd.edu systemd-udevd[2272324]: Could not generate persistent MAC address for veth389275a: No such file or directory
Oct 6 00:51:37 sentry-docker00.cs.umd.edu systemd-udevd[2272325]: Could not generate persistent MAC address for vethde97cda: No such file or directory
... 8 more distinct messages not shown
== soul (2 distinct, 2 total) ==
Oct 6 00:18:01 soul krb5_child[3148004]: Client 'admin(a)UMD.EDU' not found in Kerberos database
Oct 6 00:18:53 soul sshd-session[3148047]: error: Protocol major versions differ: 2 vs. 1
== strawberry (8 distinct, 39 total) ==
Oct 6 00:07:04 strawberry kernel: I/O error, dev sda, sector 206848 op 0x0:(READ) flags 0x80700 phys_seg 1 prio class 2 [x6]
Oct 6 00:07:04 strawberry kernel: I/O error, dev sda, sector 206848 op 0x0:(READ) flags 0x0 phys_seg 1 prio class 2 [x6]
Oct 6 00:07:04 strawberry kernel: Buffer I/O error on dev sda2, logical block 0, async page read [x6]
Oct 6 00:07:04 strawberry kernel: I/O error, dev sda, sector 2048 op 0x0:(READ) flags 0x80700 phys_seg 1 prio class 2 [x6]
Oct 6 00:07:04 strawberry kernel: I/O error, dev sda, sector 2048 op 0x0:(READ) flags 0x0 phys_seg 1 prio class 2 [x6]
Oct 6 00:07:04 strawberry kernel: Buffer I/O error on dev sda1, logical block 0, async page read [x6]
Oct 6 00:34:42 strawberry smartd[5314]: Device: /dev/sda [SAT], failed to read SMART Attribute Data [x2]
Oct 6 01:04:42 strawberry smartd[5314]: Device: /dev/sda [SAT], not capable of Offline or Self-Testing.
== submit10-cln25 (3 distinct, 4 total) ==
Oct 6 00:10:11 submit10-cln25 systemd: New main PID 10958 does not belong to service, and PID file is not owned by root. Refusing. [x2]
Oct 6 00:10:29 submit10-cln25 systemd: Daemon never wrote its PID file. Failing.
Oct 6 00:10:35 submit10-cln25 systemd: pmlogger.service: Supervising process 17862 which is not our child. We'll most likely not notice when it exits.
== submit26-b9-f1 (1 distinct, 4 total) ==
Oct 6 00:22:50 submit26-b9-f1 systemd[1]: user(a)1001.service: Main process exited, code=killed, status=9/KILL [x4]
== submit26-b9-f2 (1 distinct, 1 total) ==
Oct 6 01:03:58 submit26-b9-f2 systemd[1]: user(a)1001.service: Main process exited, code=killed, status=9/KILL
== submit26-b9-fclone (9 distinct, 12 total) ==
Oct 6 00:22:03 submit26-b9-fclone setroubleshoot[1083789]: SELinux is preventing /usr/bin/python3.9 from create access on the directory /(null). For complete SELinux messages run: sealert -l 9355d9d9-a311-48d2-bd37-6c0f6947dfff
Oct 6 00:22:03 submit26-b9-fclone setroubleshoot[1083789]: SELinux is preventing /usr/bin/python3.9 from add_name access on the directory /(null). For complete SELinux messages run: sealert -l cc4658d7-9db1-405d-9eee-de0ccee5857f
Oct 6 00:22:03 submit26-b9-fclone setroubleshoot[1083789]: SELinux is preventing /usr/bin/python3.9 from create access on the file /(null). For complete SELinux messages run: sealert -l 568a2429-0b1b-49df-af41-49b5cd298ae8 [x2]
Oct 6 00:22:03 submit26-b9-fclone setroubleshoot[1083789]: SELinux is preventing /usr/bin/python3.9 from open access on the file /tmp/libdnf.Z2hQgl/repodata/repomd.xml. For complete SELinux messages run: sealert -l 03e2f521-0e7c-481f-8e92-0602c6adeedc [x2]
Oct 6 00:22:03 submit26-b9-fclone setroubleshoot[1083789]: SELinux is preventing /usr/bin/python3.9 from setattr access on the file repomd.xml. For complete SELinux messages run: sealert -l 0d6b7b1f-ebe3-4beb-915a-b06b63bf2566 [x2]
Oct 6 00:22:03 submit26-b9-fclone setroubleshoot[1083789]: SELinux is preventing /usr/bin/python3.9 from read access on the directory libdnf.Z2hQgl. For complete SELinux messages run: sealert -l 887adbf9-2bb9-4009-b800-36ddf9ba0db5
Oct 6 00:22:03 submit26-b9-fclone setroubleshoot[1083789]: SELinux is preventing /usr/bin/python3.9 from remove_name access on the directory repomd.xml. For complete SELinux messages run: sealert -l 092e0644-8373-4017-b77f-1afa6c6da4ac
Oct 6 00:22:03 submit26-b9-fclone setroubleshoot[1083789]: SELinux is preventing /usr/bin/python3.9 from unlink access on the file repomd.xml. For complete SELinux messages run: sealert -l ce429a92-56de-4de1-b859-cbfb69ae123c
Oct 6 00:22:03 submit26-b9-fclone setroubleshoot[1083789]: SELinux is preventing /usr/bin/python3.9 from rmdir access on the directory repodata. For complete SELinux messages run: sealert -l 99b886eb-497b-406d-8206-afe76a1086b4
== teaching-awards (2 distinct, 2 total) ==
Oct 6 00:29:20 teaching-awards krb5_child[2369584]: Client 'admin(a)UMD.EDU' not found in Kerberos database
Oct 6 00:29:39 teaching-awards sshd-session[2369599]: error: Protocol major versions differ: 2 vs. 1
== tma-0 (3 distinct, 4 total) ==
Oct 6 00:10:13 tma-0 systemd[1]: New main PID 28941 does not belong to service, and PID file is not owned by root. Refusing. [x2]
Oct 6 00:10:30 tma-0 systemd[1]: Daemon never wrote its PID file. Failing.
Oct 6 00:10:38 tma-0 systemd[1]: pmlogger.service: Supervising process 3560 which is not our child. We'll most likely not notice when it exits.
== uffish.cs.umd.edu (3 distinct, 4 total) ==
Oct 6 00:10:13 uffish.cs.umd.edu systemd[1]: New main PID 2445127 does not belong to service, and PID file is not owned by root. Refusing. [x2]
Oct 6 00:10:33 uffish.cs.umd.edu systemd[1]: Daemon never wrote its PID file. Failing.
Oct 6 00:10:50 uffish.cs.umd.edu systemd[1]: pmlogger.service: Supervising process 2452502 which is not our child. We'll most likely not notice when it exits.
== vacuum.cs.umd.edu (3 distinct, 4 total) ==
Oct 6 00:10:14 vacuum.cs.umd.edu systemd[1]: New main PID 2211 does not belong to service, and PID file is not owned by root. Refusing. [x2]
Oct 6 00:10:33 vacuum.cs.umd.edu systemd[1]: Daemon never wrote its PID file. Failing.
Oct 6 00:10:44 vacuum.cs.umd.edu systemd[1]: pmlogger.service: Supervising process 9606 which is not our child. We'll most likely not notice when it exits.
== whiffle.cs.umd.edu (3 distinct, 4 total) ==
Oct 6 00:10:13 whiffle.cs.umd.edu systemd[1]: New main PID 1932564 does not belong to service, and PID file is not owned by root. Refusing. [x2]
Oct 6 00:10:32 whiffle.cs.umd.edu systemd[1]: Daemon never wrote its PID file. Failing.
Oct 6 00:10:45 whiffle.cs.umd.edu systemd[1]: pmlogger.service: Supervising process 1939910 which is not our child. We'll most likely not notice when it exits.
1
0
Command: /usr/local/sbin/syslog-digest.py
Time : 0.0495s
Status : exited 0
Output :
Syslog digest — 2026-10-06 00:05 EDT
Processed 1,956 lines, filtered 1,543 (78%). 413 unknown (254 distinct) from 24 host(s).
== b0b02.cs.umd.edu (1 distinct, 1 total) ==
Oct 5 23:15:27 b0b02.cs.umd.edu rustdesk[666341]: cannot open display:
== biggulp.cs.umd.edu (1 distinct, 3 total) ==
Oct 5 23:53:49 biggulp.cs.umd.edu sshd-session[2794649]: error: send_error: write: Connection reset by peer [x3]
== gle-dind00.cs.umd.edu (44 distinct, 44 total) ==
Oct 5 23:05:33 gle-dind00.cs.umd.edu systemd-udevd[2340785]: Could not generate persistent MAC address for vethbd2bc6d: No such file or directory
Oct 5 23:05:33 gle-dind00.cs.umd.edu systemd-udevd[2340786]: Could not generate persistent MAC address for vethb3a33f5: No such file or directory
Oct 5 23:05:34 gle-dind00.cs.umd.edu systemd-udevd[2340889]: Could not generate persistent MAC address for vethfde59b4: No such file or directory
Oct 5 23:05:34 gle-dind00.cs.umd.edu systemd-udevd[2340890]: Could not generate persistent MAC address for veth1d391b7: No such file or directory
Oct 5 23:05:34 gle-dind00.cs.umd.edu systemd-udevd[2340989]: Could not generate persistent MAC address for vethc4ec21e: No such file or directory
Oct 5 23:05:34 gle-dind00.cs.umd.edu systemd-udevd[2340990]: Could not generate persistent MAC address for veth802bcbf: No such file or directory
Oct 5 23:05:35 gle-dind00.cs.umd.edu systemd-udevd[2341091]: Could not generate persistent MAC address for veth8c46348: No such file or directory
Oct 5 23:05:35 gle-dind00.cs.umd.edu systemd-udevd[2341092]: Could not generate persistent MAC address for vetheb421fd: No such file or directory
Oct 5 23:05:36 gle-dind00.cs.umd.edu systemd-udevd[2341181]: Could not generate persistent MAC address for veth54e020a: No such file or directory
Oct 5 23:05:36 gle-dind00.cs.umd.edu systemd-udevd[2341182]: Could not generate persistent MAC address for veth9ed592b: No such file or directory
Oct 5 23:05:54 gle-dind00.cs.umd.edu systemd-udevd[2341806]: Could not generate persistent MAC address for veth9b077c7: No such file or directory
Oct 5 23:05:54 gle-dind00.cs.umd.edu systemd-udevd[2341807]: Could not generate persistent MAC address for vethcc6bb16: No such file or directory
Oct 5 23:05:54 gle-dind00.cs.umd.edu systemd-udevd[2341904]: Could not generate persistent MAC address for veth3c7c92d: No such file or directory
Oct 5 23:05:54 gle-dind00.cs.umd.edu systemd-udevd[2341905]: Could not generate persistent MAC address for vethb297176: No such file or directory
Oct 5 23:05:56 gle-dind00.cs.umd.edu systemd-udevd[2342081]: Could not generate persistent MAC address for veth8550be6: No such file or directory
Oct 5 23:05:56 gle-dind00.cs.umd.edu systemd-udevd[2342082]: Could not generate persistent MAC address for vethf6d60cf: No such file or directory
Oct 5 23:05:57 gle-dind00.cs.umd.edu systemd-udevd[2342194]: Could not generate persistent MAC address for veth6b3d8ec: No such file or directory
Oct 5 23:05:57 gle-dind00.cs.umd.edu systemd-udevd[2342195]: Could not generate persistent MAC address for veth4bfce4d: No such file or directory
Oct 5 23:14:02 gle-dind00.cs.umd.edu systemd-udevd[2344183]: Could not generate persistent MAC address for veth8b50b38: No such file or directory
Oct 5 23:14:02 gle-dind00.cs.umd.edu systemd-udevd[2344184]: Could not generate persistent MAC address for vethbd3002d: No such file or directory
Oct 5 23:14:22 gle-dind00.cs.umd.edu systemd-udevd[2344338]: Could not generate persistent MAC address for veth4f507a6: No such file or directory
Oct 5 23:14:22 gle-dind00.cs.umd.edu systemd-udevd[2344339]: Could not generate persistent MAC address for vetha0a6462: No such file or directory
Oct 5 23:17:03 gle-dind00.cs.umd.edu systemd-udevd[2345069]: Could not generate persistent MAC address for veth4ca73b9: No such file or directory
Oct 5 23:17:03 gle-dind00.cs.umd.edu systemd-udevd[2345071]: Could not generate persistent MAC address for vethe0bfd70: No such file or directory
Oct 5 23:17:04 gle-dind00.cs.umd.edu systemd-udevd[2345205]: Could not generate persistent MAC address for vethd93425d: No such file or directory
Oct 5 23:17:04 gle-dind00.cs.umd.edu systemd-udevd[2345206]: Could not generate persistent MAC address for vethc0b36f8: No such file or directory
Oct 5 23:17:05 gle-dind00.cs.umd.edu systemd-udevd[2345310]: Could not generate persistent MAC address for veth47a41f7: No such file or directory
Oct 5 23:17:05 gle-dind00.cs.umd.edu systemd-udevd[2345311]: Could not generate persistent MAC address for veth705f64e: No such file or directory
Oct 5 23:17:06 gle-dind00.cs.umd.edu systemd-udevd[2345466]: Could not generate persistent MAC address for veth1023fea: No such file or directory
Oct 5 23:17:06 gle-dind00.cs.umd.edu systemd-udevd[2345467]: Could not generate persistent MAC address for veth342ee53: No such file or directory
... 14 more distinct messages not shown
== gle-dind02.cs.umd.edu (44 distinct, 44 total) ==
Oct 5 23:14:25 gle-dind02.cs.umd.edu systemd-udevd[1275273]: Could not generate persistent MAC address for vethfe38f61: No such file or directory
Oct 5 23:14:25 gle-dind02.cs.umd.edu systemd-udevd[1275274]: Could not generate persistent MAC address for veth8ebdd75: No such file or directory
Oct 5 23:14:26 gle-dind02.cs.umd.edu systemd-udevd[1275374]: Could not generate persistent MAC address for vethcf45c35: No such file or directory
Oct 5 23:14:26 gle-dind02.cs.umd.edu systemd-udevd[1275375]: Could not generate persistent MAC address for veth37d45c8: No such file or directory
Oct 5 23:14:27 gle-dind02.cs.umd.edu systemd-udevd[1275472]: Could not generate persistent MAC address for veth9fd3666: No such file or directory
Oct 5 23:14:27 gle-dind02.cs.umd.edu systemd-udevd[1275473]: Could not generate persistent MAC address for veth9494e23: No such file or directory
Oct 5 23:14:28 gle-dind02.cs.umd.edu systemd-udevd[1275571]: Could not generate persistent MAC address for veth2b5b4f7: No such file or directory
Oct 5 23:14:28 gle-dind02.cs.umd.edu systemd-udevd[1275572]: Could not generate persistent MAC address for veth9fc37ac: No such file or directory
Oct 5 23:14:29 gle-dind02.cs.umd.edu systemd-udevd[1275659]: Could not generate persistent MAC address for vethaba2c84: No such file or directory
Oct 5 23:14:29 gle-dind02.cs.umd.edu systemd-udevd[1275660]: Could not generate persistent MAC address for veth20d4b48: No such file or directory
Oct 5 23:14:47 gle-dind02.cs.umd.edu systemd-udevd[1275960]: Could not generate persistent MAC address for veth530c45a: No such file or directory
Oct 5 23:14:47 gle-dind02.cs.umd.edu systemd-udevd[1275961]: Could not generate persistent MAC address for veth901b79f: No such file or directory
Oct 5 23:14:47 gle-dind02.cs.umd.edu systemd-udevd[1276059]: Could not generate persistent MAC address for veth906a9bf: No such file or directory
Oct 5 23:14:47 gle-dind02.cs.umd.edu systemd-udevd[1276060]: Could not generate persistent MAC address for veth8dc9d91: No such file or directory
Oct 5 23:14:49 gle-dind02.cs.umd.edu systemd-udevd[1276239]: Could not generate persistent MAC address for vethdec6b31: No such file or directory
Oct 5 23:14:49 gle-dind02.cs.umd.edu systemd-udevd[1276238]: Could not generate persistent MAC address for veth21ceb8f: No such file or directory
Oct 5 23:14:51 gle-dind02.cs.umd.edu systemd-udevd[1276351]: Could not generate persistent MAC address for veth7d1ab74: No such file or directory
Oct 5 23:14:51 gle-dind02.cs.umd.edu systemd-udevd[1276352]: Could not generate persistent MAC address for veth2cae4c6: No such file or directory
Oct 5 23:22:57 gle-dind02.cs.umd.edu systemd-udevd[1278719]: Could not generate persistent MAC address for veth3a13522: No such file or directory
Oct 5 23:22:57 gle-dind02.cs.umd.edu systemd-udevd[1278720]: Could not generate persistent MAC address for vethf169892: No such file or directory
Oct 5 23:23:08 gle-dind02.cs.umd.edu systemd-udevd[1278872]: Could not generate persistent MAC address for vethc9cfe54: No such file or directory
Oct 5 23:23:08 gle-dind02.cs.umd.edu systemd-udevd[1278873]: Could not generate persistent MAC address for veth43b158d: No such file or directory
Oct 5 23:25:24 gle-dind02.cs.umd.edu systemd-udevd[1279491]: Could not generate persistent MAC address for veth88c922c: No such file or directory
Oct 5 23:25:24 gle-dind02.cs.umd.edu systemd-udevd[1279492]: Could not generate persistent MAC address for veth0379034: No such file or directory
Oct 5 23:25:25 gle-dind02.cs.umd.edu systemd-udevd[1279590]: Could not generate persistent MAC address for vethbe9a721: No such file or directory
Oct 5 23:25:25 gle-dind02.cs.umd.edu systemd-udevd[1279591]: Could not generate persistent MAC address for vethec46d5c: No such file or directory
Oct 5 23:25:26 gle-dind02.cs.umd.edu systemd-udevd[1279686]: Could not generate persistent MAC address for vethab42662: No such file or directory
Oct 5 23:25:26 gle-dind02.cs.umd.edu systemd-udevd[1279687]: Could not generate persistent MAC address for veth558fc7e: No such file or directory
Oct 5 23:25:27 gle-dind02.cs.umd.edu systemd-udevd[1279788]: Could not generate persistent MAC address for veth833d815: No such file or directory
Oct 5 23:25:27 gle-dind02.cs.umd.edu systemd-udevd[1279789]: Could not generate persistent MAC address for veth26412aa: No such file or directory
... 14 more distinct messages not shown
== gle-dind04 (5 distinct, 5 total) ==
Oct 5 23:09:53 gle-dind04 lldpd[1171]: unable to send packet on real device for veth23a0d88: No such device or address
Oct 5 23:15:32 gle-dind04 lldpd[1171]: unable to send packet on real device for veth80ca037: No such device or address
Oct 5 23:23:42 gle-dind04 lldpd[1171]: unable to send packet on real device for veth6190e39: No such device or address
Oct 5 23:24:45 gle-dind04 lldpd[1171]: unable to send packet on real device for veth18c29aa: No such device or address
Oct 5 23:56:56 gle-dind04 lldpd[1171]: unable to send packet on real device for veth5672179: No such device or address
== idm00 (1 distinct, 1 total) ==
Oct 5 23:54:39 idm00 named[4166701]: client @0x7f11a40356e8 10.73.240.42#52280: update '73.10.in-addr.arpa/IN' denied
== idmp0 (1 distinct, 1 total) ==
Oct 5 23:39:24 idmp0 named[1598691]: client @0x7f2d280427b8 10.73.240.43#55063: update '73.10.in-addr.arpa/IN' denied
== itmon02 (1 distinct, 1 total) ==
Oct 5 23:38:50 itmon02 sshd[805675]: error: beginning MaxStartups throttling
== krispykreme.cs.umd.edu (4 distinct, 4 total) ==
Oct 5 23:42:09 krispykreme.cs.umd.edu sshd-session[2431088]: pam_access(sshd:auth): access denied for user `admin' from `34.156.223.43'
Oct 5 23:42:10 krispykreme.cs.umd.edu krb5_child[2431090]: Client 'admin(a)UMD.EDU' not found in Kerberos database
Oct 5 23:42:10 krispykreme.cs.umd.edu sshd-session[2431086]: error: PAM: System error for admin from 34.156.223.43
Oct 5 23:42:48 krispykreme.cs.umd.edu sshd-session[2431178]: error: Protocol major versions differ: 2 vs. 1
== matrix (1 distinct, 1 total) ==
Oct 6 00:00:25 matrix (nin-node)[3464185]: munin-node.service: Referenced but unset environment variable evaluates to an empty string: DAEMON_ARGS
== munin (2 distinct, 14 total) ==
Oct 5 23:08:50 munin sudo[473389]: pam_systemd(sudo:session): Failed to stat() runtime directory '/run/user/0': No such file or directory [x7]
Oct 5 23:08:50 munin sudo[473389]: pam_systemd(sudo:session): Not setting $XDG_RUNTIME_DIR, as the directory is not in order. [x7]
== neo-gizmonic (1 distinct, 1 total) ==
Oct 6 00:00:01 neo-gizmonic (nin-node)[3641399]: munin-node.service: Referenced but unset environment variable evaluates to an empty string: DAEMON_ARGS
== neoavion (1 distinct, 1 total) ==
Oct 6 00:00:05 neoavion (nin-node)[2421854]: munin-node.service: Referenced but unset environment variable evaluates to an empty string: DAEMON_ARGS
== neodontcare.cs.umd.edu (1 distinct, 1 total) ==
Oct 6 00:00:02 neodontcare.cs.umd.edu setroubleshoot[1473068]: SELinux is preventing /opt/zoom/zoom from execmod access on the file /memfd:JITCode:QtQml (deleted). For complete SELinux messages run: sealert -l 631705d2-006f-45e9-8e2d-33f8bdbbe68e
== newhonors.cs.umd.edu (1 distinct, 1 total) ==
Oct 5 23:09:41 newhonors.cs.umd.edu systemd-tmpfiles: [/usr/lib/tmpfiles.d/var.conf:14] Duplicate line for path "/var/log", ignoring.
== newhonors2 (2 distinct, 25 total) ==
Oct 5 23:13:03 newhonors2 dhcpcd[3614905]: dhcpcd is not running [x24]
Oct 6 00:00:19 newhonors2 (nin-node)[3616420]: munin-node.service: Referenced but unset environment variable evaluates to an empty string: DAEMON_ARGS
== ntop00 (95 distinct, 95 total) ==
Oct 5 23:05:01 ntop00 nfacctd[1075699]: INFO ( m1/mysql ): *** Purging cache - START (PID: 3826) ***
Oct 5 23:05:01 ntop00 nfacctd[1075699]: INFO ( m1/mysql ): *** Purging cache - END (PID: 3826, QN: 74/74, ET: 0) ***
Oct 5 23:05:06 ntop00 sfacctd[1075592]: INFO ( m1/mysql ): *** Purging cache - END (PID: 3826, QN: 3018/3018, ET: 5) ***
Oct 5 23:08:01 ntop00 sfacctd[1075592]: INFO ( p1/print ): *** Purging cache - START (PID: 3827) ***
Oct 5 23:08:01 ntop00 sfacctd[1075592]: INFO ( p1/print ): *** Purging cache - END (PID: 3827, QN: 3141/3141, ET: 0) ***
Oct 5 23:08:01 ntop00 nfacctd[1075699]: INFO ( p1/print ): *** Purging cache - START (PID: 3827) ***
Oct 5 23:08:01 ntop00 nfacctd[1075699]: INFO ( p1/print ): *** Purging cache - END (PID: 3827, QN: 67/67, ET: 0) ***
Oct 5 23:10:01 ntop00 sfacctd[1075592]: INFO ( m1/mysql ): *** Purging cache - START (PID: 3828) ***
Oct 5 23:10:01 ntop00 nfacctd[1075699]: INFO ( m1/mysql ): *** Purging cache - START (PID: 3828) ***
Oct 5 23:10:01 ntop00 nfacctd[1075699]: INFO ( m1/mysql ): *** Purging cache - END (PID: 3828, QN: 52/52, ET: 0) ***
Oct 5 23:10:07 ntop00 sfacctd[1075592]: INFO ( m1/mysql ): *** Purging cache - END (PID: 3828, QN: 3144/3144, ET: 6) ***
Oct 5 23:13:01 ntop00 sfacctd[1075592]: INFO ( p1/print ): *** Purging cache - START (PID: 3829) ***
Oct 5 23:13:01 ntop00 sfacctd[1075592]: INFO ( p1/print ): *** Purging cache - END (PID: 3829, QN: 3685/3685, ET: 0) ***
Oct 5 23:13:01 ntop00 nfacctd[1075699]: INFO ( p1/print ): *** Purging cache - START (PID: 3829) ***
Oct 5 23:13:01 ntop00 nfacctd[1075699]: INFO ( p1/print ): *** Purging cache - END (PID: 3829, QN: 61/61, ET: 0) ***
Oct 5 23:15:01 ntop00 sfacctd[1075592]: INFO ( m1/mysql ): *** Purging cache - START (PID: 3830) ***
Oct 5 23:15:01 ntop00 nfacctd[1075699]: INFO ( m1/mysql ): *** Purging cache - START (PID: 3830) ***
Oct 5 23:15:02 ntop00 nfacctd[1075699]: INFO ( m1/mysql ): *** Purging cache - END (PID: 3830, QN: 67/67, ET: 1) ***
Oct 5 23:15:07 ntop00 sfacctd[1075592]: INFO ( m1/mysql ): *** Purging cache - END (PID: 3830, QN: 3967/3967, ET: 6) ***
Oct 5 23:18:01 ntop00 sfacctd[1075592]: INFO ( p1/print ): *** Purging cache - START (PID: 3831) ***
Oct 5 23:18:01 ntop00 sfacctd[1075592]: INFO ( p1/print ): *** Purging cache - END (PID: 3831, QN: 3754/3754, ET: 0) ***
Oct 5 23:18:01 ntop00 nfacctd[1075699]: INFO ( p1/print ): *** Purging cache - START (PID: 3831) ***
Oct 5 23:18:01 ntop00 nfacctd[1075699]: INFO ( p1/print ): *** Purging cache - END (PID: 3831, QN: 58/58, ET: 0) ***
Oct 5 23:20:01 ntop00 sfacctd[1075592]: INFO ( m1/mysql ): *** Purging cache - START (PID: 3832) ***
Oct 5 23:20:01 ntop00 nfacctd[1075699]: INFO ( m1/mysql ): *** Purging cache - START (PID: 3832) ***
Oct 5 23:20:02 ntop00 nfacctd[1075699]: INFO ( m1/mysql ): *** Purging cache - END (PID: 3832, QN: 57/57, ET: 1) ***
Oct 5 23:20:06 ntop00 sfacctd[1075592]: INFO ( m1/mysql ): *** Purging cache - END (PID: 3832, QN: 3638/3638, ET: 5) ***
Oct 5 23:23:01 ntop00 sfacctd[1075592]: INFO ( p1/print ): *** Purging cache - START (PID: 3833) ***
Oct 5 23:23:01 ntop00 sfacctd[1075592]: INFO ( p1/print ): *** Purging cache - END (PID: 3833, QN: 3340/3340, ET: 0) ***
Oct 5 23:23:02 ntop00 nfacctd[1075699]: INFO ( p1/print ): *** Purging cache - START (PID: 3833) ***
... 65 more distinct messages not shown
== outbound00.cs.umd.edu (1 distinct, 6 total) ==
Oct 5 23:09:09 outbound00.cs.umd.edu python3[3141632]: ldapdb [x6]
== outbound01.cs.umd.edu (1 distinct, 6 total) ==
Oct 5 23:13:06 outbound01.cs.umd.edu python3[1215742]: ldapdb [x6]
== portal (1 distinct, 82 total) ==
Oct 5 23:05:06 portal setroubleshoot[1303312]: SELinux is preventing /usr/local/bin/traefik from connectto access on the unix_stream_socket /run/podman/podman.sock. For complete SELinux messages run: sealert -l e0a307a3-2c22-4320-8f9d-6a166c45222d [x82]
== sebatinsky.cs.umd.edu (1 distinct, 1 total) ==
Oct 5 23:57:32 sebatinsky.cs.umd.edu kernel: hpet1: lost 1 rtc interrupts
== sentry-docker00.cs.umd.edu (36 distinct, 36 total) ==
Oct 5 23:10:55 sentry-docker00.cs.umd.edu systemd-udevd[2225171]: link_config: could not get ethtool features for vethd0e478c
Oct 5 23:10:55 sentry-docker00.cs.umd.edu systemd-udevd[2225171]: Could not set offload features of vethd0e478c: No such device
Oct 5 23:10:55 sentry-docker00.cs.umd.edu systemd-udevd[2225204]: Could not generate persistent MAC address for veth9f8f5ba: No such file or directory
Oct 5 23:10:55 sentry-docker00.cs.umd.edu systemd-udevd[2225205]: Could not generate persistent MAC address for vethf3df5d6: No such file or directory
Oct 5 23:10:56 sentry-docker00.cs.umd.edu systemd-udevd[2225208]: Could not generate persistent MAC address for veth5a6e43b: No such file or directory
Oct 5 23:10:56 sentry-docker00.cs.umd.edu systemd-udevd[2225209]: Could not generate persistent MAC address for vetheca2962: No such file or directory
Oct 5 23:10:56 sentry-docker00.cs.umd.edu systemd-udevd[2225231]: Could not generate persistent MAC address for veth9bd022d: No such file or directory
Oct 5 23:10:56 sentry-docker00.cs.umd.edu systemd-udevd[2225232]: Could not generate persistent MAC address for veth3424518: No such file or directory
Oct 5 23:10:56 sentry-docker00.cs.umd.edu systemd-udevd[2225250]: Could not generate persistent MAC address for vethc032c85: No such file or directory
Oct 5 23:10:56 sentry-docker00.cs.umd.edu systemd-udevd[2225243]: Could not generate persistent MAC address for veth40b49ab: No such file or directory
Oct 5 23:10:56 sentry-docker00.cs.umd.edu systemd-udevd[2225271]: Could not generate persistent MAC address for veth4a287cf: No such file or directory
Oct 5 23:10:56 sentry-docker00.cs.umd.edu systemd-udevd[2225272]: Could not generate persistent MAC address for vethd7caaff: No such file or directory
Oct 5 23:31:04 sentry-docker00.cs.umd.edu systemd-udevd[2234800]: link_config: could not get ethtool features for veth9bd022d
Oct 5 23:31:04 sentry-docker00.cs.umd.edu systemd-udevd[2234800]: Could not set offload features of veth9bd022d: No such device
Oct 5 23:31:04 sentry-docker00.cs.umd.edu systemd-udevd[2234852]: Could not generate persistent MAC address for veth5b4414e: No such file or directory
Oct 5 23:31:04 sentry-docker00.cs.umd.edu systemd-udevd[2234853]: Could not generate persistent MAC address for veth0489a8f: No such file or directory
Oct 5 23:31:04 sentry-docker00.cs.umd.edu systemd-udevd[2234856]: Could not generate persistent MAC address for veth56067bb: No such file or directory
Oct 5 23:31:04 sentry-docker00.cs.umd.edu systemd-udevd[2234857]: Could not generate persistent MAC address for veth8ec8370: No such file or directory
Oct 5 23:31:04 sentry-docker00.cs.umd.edu systemd-udevd[2234880]: Could not generate persistent MAC address for vethd413295: No such file or directory
Oct 5 23:31:04 sentry-docker00.cs.umd.edu systemd-udevd[2234882]: Could not generate persistent MAC address for veth1dec637: No such file or directory
Oct 5 23:31:04 sentry-docker00.cs.umd.edu systemd-udevd[2234899]: Could not generate persistent MAC address for veth3c35b03: No such file or directory
Oct 5 23:31:04 sentry-docker00.cs.umd.edu systemd-udevd[2234904]: Could not generate persistent MAC address for veth88bd933: No such file or directory
Oct 5 23:31:04 sentry-docker00.cs.umd.edu systemd-udevd[2234902]: Could not generate persistent MAC address for veth2026c0b: No such file or directory
Oct 5 23:31:04 sentry-docker00.cs.umd.edu systemd-udevd[2234904]: Could not generate persistent MAC address for veth1f947f5: No such file or directory
Oct 5 23:51:12 sentry-docker00.cs.umd.edu systemd-udevd[2244215]: link_config: could not get ethtool features for veth56067bb
Oct 5 23:51:12 sentry-docker00.cs.umd.edu systemd-udevd[2244215]: Could not set offload features of veth56067bb: No such device
Oct 5 23:51:12 sentry-docker00.cs.umd.edu systemd-udevd[2244246]: Could not generate persistent MAC address for vethef75746: No such file or directory
Oct 5 23:51:12 sentry-docker00.cs.umd.edu systemd-udevd[2244247]: Could not generate persistent MAC address for vethc26c40d: No such file or directory
Oct 5 23:51:12 sentry-docker00.cs.umd.edu systemd-udevd[2244250]: Could not generate persistent MAC address for veth1e3567d: No such file or directory
Oct 5 23:51:12 sentry-docker00.cs.umd.edu systemd-udevd[2244251]: Could not generate persistent MAC address for vethc7a2552: No such file or directory
... 6 more distinct messages not shown
== strawberry (7 distinct, 38 total) ==
Oct 5 23:07:03 strawberry kernel: I/O error, dev sda, sector 206848 op 0x0:(READ) flags 0x80700 phys_seg 1 prio class 2 [x6]
Oct 5 23:07:03 strawberry kernel: I/O error, dev sda, sector 206848 op 0x0:(READ) flags 0x0 phys_seg 1 prio class 2 [x6]
Oct 5 23:07:03 strawberry kernel: Buffer I/O error on dev sda2, logical block 0, async page read [x6]
Oct 5 23:07:03 strawberry kernel: I/O error, dev sda, sector 2048 op 0x0:(READ) flags 0x80700 phys_seg 1 prio class 2 [x6]
Oct 5 23:07:03 strawberry kernel: I/O error, dev sda, sector 2048 op 0x0:(READ) flags 0x0 phys_seg 1 prio class 2 [x6]
Oct 5 23:07:03 strawberry kernel: Buffer I/O error on dev sda1, logical block 0, async page read [x6]
Oct 5 23:34:42 strawberry smartd[5314]: Device: /dev/sda [SAT], failed to read SMART Attribute Data [x2]
== wraith (1 distinct, 1 total) ==
Oct 6 00:00:11 wraith (nin-node)[18859]: munin-node.service: Referenced but unset environment variable evaluates to an empty string: DAEMON_ARGS
1
0