Command: /usr/local/sbin/syslog-digest.py
Time : 0.1442s
Status : exited 0
Output :
Syslog digest — 2026-10-07 05:05 EDT
Processed 5,121 lines, filtered 2,902 (56%). 2,219 unknown (167 distinct) from 20 host(s).
== abuse (1 distinct, 347 total) ==
Oct 7 04:05:20 abuse rsyslogd[1033]: imjournal: open() failed for path: '/var/lib/rsyslog/imjournal.state.tmp': Input/output error [v8.2404.0 try https://www.rsyslog.com/e/2433 ] [x347]
== b0b02.cs.umd.edu (1 distinct, 1 total) ==
Oct 7 04:17:07 b0b02.cs.umd.edu rustdesk[1108389]: cannot open display:
== forge00 (1 distinct, 1 total) ==
Oct 7 04:09:03 forge00 (httpd)[2819392]: httpd.service: Referenced but unset environment variable evaluates to an empty string: OPTIONS
== galax (31 distinct, 31 total) ==
Oct 7 04:21:21 galax puppet-agent[3386671]: Could not update: Execution of '/usr/bin/apt-get -q -y -o DPkg::Options::=--force-confold --force-yes install choria=0.29.4+resolute' returned 100: W: --force-yes is deprecated, use one of the options starting with --allow instead.
Oct 7 04:21:21 galax puppet-agent[3386671]: E: dpkg was interrupted, you must manually run 'dpkg --configure -a' to correct the problem.
Oct 7 04:21:21 galax puppet-agent[3386671]: (/Stage[main]/Choria::Install/Package[choria]/ensure) change from 'absent' to '0.29.4+resolute' failed: Could not update: Execution of '/usr/bin/apt-get -q -y -o DPkg::Options::=--force-confold --force-yes install choria=0.29.4+resolute' returned 100: W: --force-yes is deprecated, use one of the options starting with --allow instead.
Oct 7 04:21:21 galax puppet-agent[3386671]: (/Stage[main]/Choria::Install/Package[choria]/ensure) E: dpkg was interrupted, you must manually run 'dpkg --configure -a' to correct the problem. (corrective)
Oct 7 04:21:21 galax puppet-agent[3386671]: (/Stage[main]/Choria::Config/File[/etc/choria]) Skipping because of failed dependencies
Oct 7 04:21:21 galax puppet-agent[3386671]: (/Stage[main]/Choria::Config/File[/etc/choria/policies]) Skipping because of failed dependencies
Oct 7 04:21:21 galax puppet-agent[3386671]: (/Stage[main]/Choria::Config/File[/etc/choria/policies/rego]) Skipping because of failed dependencies
Oct 7 04:21:21 galax puppet-agent[3386671]: (/Stage[main]/Choria::Config/File[/etc/choria/plugin.d]) Skipping because of failed dependencies
Oct 7 04:21:21 galax puppet-agent[3386671]: (/Stage[main]/Choria::Config/File[/etc/choria/overrides.json]) Skipping because of failed dependencies
Oct 7 04:21:21 galax puppet-agent[3386671]: (/Stage[main]/Choria::Config/File[/etc/choria/machine]) Skipping because of failed dependencies
Oct 7 04:21:21 galax puppet-agent[3386671]: (/Stage[main]/Choria::Config/File[/usr/bin/choria_mcollective_agent_compat.rb]) Skipping because of failed dependencies
Oct 7 04:21:21 galax puppet-agent[3386671]: (/Stage[main]/Choria::Config/File[/etc/choria/server.conf]) Skipping because of failed dependencies
Oct 7 04:21:21 galax puppet-agent[3386671]: (/Stage[main]/Mcollective::Config/File[/etc/choria/server.cfg]) Skipping because of failed dependencies
Oct 7 04:21:21 galax puppet-agent[3386671]: (/Stage[main]/Mcollective::Config/File[/etc/choria/client.cfg]) Skipping because of failed dependencies
Oct 7 04:21:21 galax puppet-agent[3386671]: (/Stage[main]/Mcollective::Config/File[/etc/choria/policies/choria_util.policy]) Skipping because of failed dependencies
Oct 7 04:21:21 galax puppet-agent[3386671]: (/Stage[main]/Mcollective::Config/File[/etc/choria/policies/rpcutil.policy]) Skipping because of failed dependencies
Oct 7 04:21:21 galax puppet-agent[3386671]: (/Stage[main]/Mcollective::Config/File[/etc/choria/policies/scout.policy]) Skipping because of failed dependencies
Oct 7 04:21:21 galax puppet-agent[3386671]: (/Stage[main]/Mcollective::Config/File[/etc/choria/policies/rego/default.rego]) Skipping because of failed dependencies
Oct 7 04:21:22 galax puppet-agent[3386671]: (/Stage[main]/Choria::Config/Concat[/etc/choria/policies/groups]/Concat_file[/etc/choria/policies/groups]) Skipping because of failed dependencies
Oct 7 04:21:22 galax puppet-agent[3386671]: (/Stage[main]/Choria::Config/Concat[/etc/choria/policies/groups]/File[/etc/choria/policies/groups]) Skipping because of failed dependencies
Oct 7 04:21:22 galax puppet-agent[3386671]: (/Stage[main]/Mcollective::Config/Mcollective::Config_file[/etc/choria/client.conf]/File[/etc/choria/client.conf]) Skipping because of failed dependencies
Oct 7 04:21:22 galax puppet-agent[3386671]: (/Stage[main]/Mcollective::Config/Mcollective::Config_file[/etc/choria/choria-shim.cfg]/File[/etc/choria/choria-shim.cfg]) Skipping because of failed dependencies
Oct 7 04:21:22 galax puppet-agent[3386671]: (/Stage[main]/Mcollective::Facts/Exec[mcollective_facts_yaml_refresh]) Skipping because of failed dependencies
Oct 7 04:21:23 galax puppet-agent[3386671]: (/Stage[main]/Mcollective_agent_puppet/Mcollective::Module_plugin[mcollective_agent_puppet]/File[/etc/choria/policies/puppet.policy]) Skipping because of failed dependencies
Oct 7 04:21:23 galax puppet-agent[3386671]: (/Stage[main]/Mcollective_agent_service/Mcollective::Module_plugin[mcollective_agent_service]/File[/etc/choria/policies/service.policy]) Skipping because of failed dependencies
Oct 7 04:21:23 galax puppet-agent[3386671]: (/Stage[main]/Mcollective_agent_package/Mcollective::Module_plugin[mcollective_agent_package]/File[/etc/choria/policies/package.policy]) Skipping because of failed dependencies
Oct 7 04:21:23 galax puppet-agent[3386671]: (/Stage[main]/Mcollective_agent_filemgr/Mcollective::Module_plugin[mcollective_agent_filemgr]/File[/etc/choria/policies/filemgr.policy]) Skipping because of failed dependencies
Oct 7 04:21:23 galax puppet-agent[3386671]: (/Stage[main]/Mcollective_choria/Mcollective::Module_plugin[mcollective_choria]/Mcollective::Config_file[/etc/choria/plugin.d/choria.cfg]/File[/etc/choria/plugin.d/choria.cfg]) Skipping because of failed dependencies
Oct 7 04:21:23 galax puppet-agent[3386671]: (/Stage[main]/Mcollective_agent_puppet/Mcollective::Module_plugin[mcollective_agent_puppet]/Mcollective::Config_file[/etc/choria/plugin.d/puppet.cfg]/File[/etc/choria/plugin.d/puppet.cfg]) Skipping because of failed dependencies
Oct 7 04:21:23 galax puppet-agent[3386671]: (/Stage[main]/Mcollective_util_actionpolicy/Mcollective::Module_plugin[mcollective_util_actionpolicy]/Mcollective::Config_file[/etc/choria/plugin.d/actionpolicy.cfg]/File[/etc/choria/plugin.d/actionpolicy.cfg]) Skipping because of failed dependencies
... 1 more distinct messages not shown
== gle-dind04 (1 distinct, 1 total) ==
Oct 7 04:12:37 gle-dind04 lldpd[1171]: unable to send packet on real device for veth2c98a17: No such device or address
== idm00 (1 distinct, 1 total) ==
Oct 7 04:54:41 idm00 named[4166701]: client @0x7f11a0005288 10.73.240.42#54216: update '73.10.in-addr.arpa/IN' denied
== idmp0 (1 distinct, 1 total) ==
Oct 7 04:39:23 idmp0 named[1598691]: client @0x7f2d09240c38 10.73.240.43#57017: update '73.10.in-addr.arpa/IN' denied
== itmon02 (1 distinct, 3 total) ==
Oct 7 04:08:07 itmon02 sshd[805675]: error: beginning MaxStartups throttling [x3]
== munin (2 distinct, 28 total) ==
Oct 7 04:32:59 munin sudo[1111990]: pam_systemd(sudo:session): Failed to stat() runtime directory '/run/user/0': No such file or directory [x14]
Oct 7 04:32:59 munin sudo[1111990]: pam_systemd(sudo:session): Not setting $XDG_RUNTIME_DIR, as the directory is not in order. [x14]
== netman.cs.umd.edu (1 distinct, 2 total) ==
Oct 7 04:06:33 netman.cs.umd.edu krb5_child[202405]: Client 'admin(a)UMD.EDU' not found in Kerberos database [x2]
== newhonors2 (1 distinct, 24 total) ==
Oct 7 04:13:03 newhonors2 dhcpcd[3670169]: dhcpcd is not running [x24]
== ntop00 (96 distinct, 96 total) ==
Oct 7 04:05:06 ntop00 sfacctd[1075592]: INFO ( m1/mysql ): *** Purging cache - END (PID: 4522, QN: 3580/3580, ET: 5) ***
Oct 7 04:08:01 ntop00 sfacctd[1075592]: INFO ( p1/print ): *** Purging cache - START (PID: 4523) ***
Oct 7 04:08:01 ntop00 sfacctd[1075592]: INFO ( p1/print ): *** Purging cache - END (PID: 4523, QN: 3957/3957, ET: 0) ***
Oct 7 04:08:01 ntop00 nfacctd[1075699]: INFO ( p1/print ): *** Purging cache - START (PID: 4523) ***
Oct 7 04:08:01 ntop00 nfacctd[1075699]: INFO ( p1/print ): *** Purging cache - END (PID: 4523, QN: 72/72, ET: 0) ***
Oct 7 04:10:01 ntop00 sfacctd[1075592]: INFO ( m1/mysql ): *** Purging cache - START (PID: 4524) ***
Oct 7 04:10:01 ntop00 nfacctd[1075699]: INFO ( m1/mysql ): *** Purging cache - START (PID: 4524) ***
Oct 7 04:10:01 ntop00 nfacctd[1075699]: INFO ( m1/mysql ): *** Purging cache - END (PID: 4524, QN: 68/68, ET: 0) ***
Oct 7 04:10:07 ntop00 sfacctd[1075592]: INFO ( m1/mysql ): *** Purging cache - END (PID: 4524, QN: 3987/3987, ET: 6) ***
Oct 7 04:13:01 ntop00 nfacctd[1075699]: INFO ( p1/print ): *** Purging cache - START (PID: 4525) ***
Oct 7 04:13:01 ntop00 nfacctd[1075699]: INFO ( p1/print ): *** Purging cache - END (PID: 4525, QN: 51/51, ET: 0) ***
Oct 7 04:13:01 ntop00 sfacctd[1075592]: INFO ( p1/print ): *** Purging cache - START (PID: 4525) ***
Oct 7 04:13:01 ntop00 sfacctd[1075592]: INFO ( p1/print ): *** Purging cache - END (PID: 4525, QN: 3430/3430, ET: 0) ***
Oct 7 04:15:01 ntop00 sfacctd[1075592]: INFO ( m1/mysql ): *** Purging cache - START (PID: 4526) ***
Oct 7 04:15:01 ntop00 nfacctd[1075699]: INFO ( m1/mysql ): *** Purging cache - START (PID: 4526) ***
Oct 7 04:15:01 ntop00 nfacctd[1075699]: INFO ( m1/mysql ): *** Purging cache - END (PID: 4526, QN: 44/44, ET: 0) ***
Oct 7 04:15:06 ntop00 sfacctd[1075592]: INFO ( m1/mysql ): *** Purging cache - END (PID: 4526, QN: 3238/3238, ET: 5) ***
Oct 7 04:18:01 ntop00 sfacctd[1075592]: INFO ( p1/print ): *** Purging cache - START (PID: 4527) ***
Oct 7 04:18:01 ntop00 sfacctd[1075592]: INFO ( p1/print ): *** Purging cache - END (PID: 4527, QN: 3653/3653, ET: 0) ***
Oct 7 04:18:01 ntop00 nfacctd[1075699]: INFO ( p1/print ): *** Purging cache - START (PID: 4527) ***
Oct 7 04:18:01 ntop00 nfacctd[1075699]: INFO ( p1/print ): *** Purging cache - END (PID: 4527, QN: 46/46, ET: 0) ***
Oct 7 04:20:01 ntop00 sfacctd[1075592]: INFO ( m1/mysql ): *** Purging cache - START (PID: 4528) ***
Oct 7 04:20:01 ntop00 nfacctd[1075699]: INFO ( m1/mysql ): *** Purging cache - START (PID: 4528) ***
Oct 7 04:20:01 ntop00 nfacctd[1075699]: INFO ( m1/mysql ): *** Purging cache - END (PID: 4528, QN: 47/47, ET: 0) ***
Oct 7 04:20:07 ntop00 sfacctd[1075592]: INFO ( m1/mysql ): *** Purging cache - END (PID: 4528, QN: 3870/3870, ET: 6) ***
Oct 7 04:23:01 ntop00 sfacctd[1075592]: INFO ( p1/print ): *** Purging cache - START (PID: 4529) ***
Oct 7 04:23:01 ntop00 sfacctd[1075592]: INFO ( p1/print ): *** Purging cache - END (PID: 4529, QN: 3840/3840, ET: 0) ***
Oct 7 04:23:01 ntop00 nfacctd[1075699]: INFO ( p1/print ): *** Purging cache - START (PID: 4529) ***
Oct 7 04:23:01 ntop00 nfacctd[1075699]: INFO ( p1/print ): *** Purging cache - END (PID: 4529, QN: 65/65, ET: 0) ***
Oct 7 04:25:01 ntop00 sfacctd[1075592]: INFO ( m1/mysql ): *** Purging cache - START (PID: 4530) ***
... 66 more distinct messages not shown
== outbound00.cs.umd.edu (1 distinct, 6 total) ==
Oct 7 04:09:09 outbound00.cs.umd.edu python3[167431]: ldapdb [x6]
== outbound01.cs.umd.edu (1 distinct, 6 total) ==
Oct 7 04:13:06 outbound01.cs.umd.edu python3[1625294]: ldapdb [x6]
== portal (1 distinct, 76 total) ==
Oct 7 04:05:10 portal setroubleshoot[1686673]: SELinux is preventing /usr/local/bin/traefik from connectto access on the unix_stream_socket /run/podman/podman.sock. For complete SELinux messages run: sealert -l e0a307a3-2c22-4320-8f9d-6a166c45222d [x76]
== strawberry (7 distinct, 38 total) ==
Oct 7 04:07:03 strawberry kernel: I/O error, dev sda, sector 206848 op 0x0:(READ) flags 0x80700 phys_seg 1 prio class 2 [x6]
Oct 7 04:07:03 strawberry kernel: I/O error, dev sda, sector 206848 op 0x0:(READ) flags 0x0 phys_seg 1 prio class 2 [x6]
Oct 7 04:07:03 strawberry kernel: Buffer I/O error on dev sda2, logical block 0, async page read [x6]
Oct 7 04:07:03 strawberry kernel: I/O error, dev sda, sector 2048 op 0x0:(READ) flags 0x80700 phys_seg 1 prio class 2 [x6]
Oct 7 04:07:03 strawberry kernel: I/O error, dev sda, sector 2048 op 0x0:(READ) flags 0x0 phys_seg 1 prio class 2 [x6]
Oct 7 04:07:03 strawberry kernel: Buffer I/O error on dev sda1, logical block 0, async page read [x6]
Oct 7 04:34:42 strawberry smartd[5314]: Device: /dev/sda [SAT], failed to read SMART Attribute Data [x2]
== submit10-cln25 (5 distinct, 1539 total) ==
Oct 7 04:05:22 submit10-cln25 rsyslogd: file '/var/log/messages': open error: Input/output error [v8.24.0-57.el7_9.3 try http://www.rsyslog.com/e/2433 ] [x1200]
Oct 7 04:05:22 submit10-cln25 rsyslogd: imjournal: fopen() failed for path: '/var/lib/rsyslog/imjournal.state.tmp': Input/output error [v8.24.0-57.el7_9.3 try http://www.rsyslog.com/e/2013 ] [x334]
Oct 7 04:25:00 submit10-cln25 systemd: Failed at step USER spawning /usr/libexec/pcp/bin/pmlogger_check: Input/output error [x2]
Oct 7 04:28:00 submit10-cln25 systemd: Failed at step USER spawning /usr/libexec/pcp/bin/pmie_check: Input/output error [x2]
Oct 7 04:30:00 submit10-cln25 systemd: Failed at step USER spawning /usr/libexec/pcp/bin/pmlogger_daily: Input/output error
== submit26-b9-fclone (10 distinct, 14 total) ==
Oct 7 04:22:04 submit26-b9-fclone setroubleshoot[1151966]: SELinux is preventing /usr/bin/python3.9 from create access on the directory /(null). For complete SELinux messages run: sealert -l 9355d9d9-a311-48d2-bd37-6c0f6947dfff [x2]
Oct 7 04:22:04 submit26-b9-fclone setroubleshoot[1151966]: SELinux is preventing /usr/bin/python3.9 from add_name access on the directory /(null). For complete SELinux messages run: sealert -l cc4658d7-9db1-405d-9eee-de0ccee5857f [x2]
Oct 7 04:22:04 submit26-b9-fclone setroubleshoot[1151966]: SELinux is preventing /usr/bin/python3.9 from create access on the file /(null). For complete SELinux messages run: sealert -l 568a2429-0b1b-49df-af41-49b5cd298ae8
Oct 7 04:22:04 submit26-b9-fclone setroubleshoot[1151966]: SELinux is preventing /usr/bin/python3.9 from open access on the file /tmp/libdnf.zm81Yd/repodata/repomd.xml. For complete SELinux messages run: sealert -l 03e2f521-0e7c-481f-8e92-0602c6adeedc
Oct 7 04:22:04 submit26-b9-fclone setroubleshoot[1151966]: SELinux is preventing /usr/bin/python3.9 from setattr access on the file repomd.xml. For complete SELinux messages run: sealert -l 0d6b7b1f-ebe3-4beb-915a-b06b63bf2566
Oct 7 04:22:04 submit26-b9-fclone setroubleshoot[1151966]: SELinux is preventing /usr/bin/python3.9 from read access on the directory libdnf.zm81Yd. For complete SELinux messages run: sealert -l 887adbf9-2bb9-4009-b800-36ddf9ba0db5
Oct 7 04:22:04 submit26-b9-fclone setroubleshoot[1151966]: SELinux is preventing /usr/bin/python3.9 from remove_name access on the directory repomd.xml. For complete SELinux messages run: sealert -l 092e0644-8373-4017-b77f-1afa6c6da4ac [x2]
Oct 7 04:22:04 submit26-b9-fclone setroubleshoot[1151966]: SELinux is preventing /usr/bin/python3.9 from unlink access on the file repomd.xml. For complete SELinux messages run: sealert -l ce429a92-56de-4de1-b859-cbfb69ae123c
Oct 7 04:22:04 submit26-b9-fclone setroubleshoot[1151966]: SELinux is preventing /usr/bin/python3.9 from rmdir access on the directory repodata. For complete SELinux messages run: sealert -l 99b886eb-497b-406d-8206-afe76a1086b4 [x2]
Oct 7 04:22:04 submit26-b9-fclone setroubleshoot[1151966]: SELinux is preventing /usr/bin/python3.9 from read access on the directory libdnf.MFyMhH. For complete SELinux messages run: sealert -l 887adbf9-2bb9-4009-b800-36ddf9ba0db5
== teaching-awards (2 distinct, 2 total) ==
Oct 7 04:05:58 teaching-awards krb5_child[33594]: Client 'admin(a)UMD.EDU' not found in Kerberos database
Oct 7 04:06:12 teaching-awards sshd-session[33603]: error: Protocol major versions differ: 2 vs. 1
== wraith (2 distinct, 2 total) ==
Oct 7 04:10:24 wraith kernel: workqueue: i915_hpd_poll_init_work [i915] hogged CPU for >10000us 4099 times, consider switching to WQ_UNBOUND
Oct 7 04:11:47 wraith kernel: workqueue: output_poll_execute hogged CPU for >10000us 4099 times, consider switching to WQ_UNBOUND
1
0
Command: /usr/local/sbin/syslog-digest.py
Time : 0.1428s
Status : exited 0
Output :
Syslog digest — 2026-10-07 04:05 EDT
Processed 5,318 lines, filtered 3,151 (59%). 2,167 unknown (138 distinct) from 19 host(s).
== abuse (1 distinct, 346 total) ==
Oct 7 03:05:25 abuse rsyslogd[1033]: imjournal: open() failed for path: '/var/lib/rsyslog/imjournal.state.tmp': Input/output error [v8.2404.0 try https://www.rsyslog.com/e/2433 ] [x346]
== b0b02.cs.umd.edu (1 distinct, 1 total) ==
Oct 7 03:17:03 b0b02.cs.umd.edu rustdesk[1093127]: cannot open display:
== gle-dind04 (3 distinct, 3 total) ==
Oct 7 03:36:38 gle-dind04 falcon-sensor-bpf[1017]: CrowdStrike(4): Could not retrieve DisableProxy value: c0000225
Oct 7 03:36:38 gle-dind04 falcon-sensor-bpf[1017]: CrowdStrike(4): ConnectWithProxy: Unable to get application proxy host from CsConfig: c0000225
Oct 7 03:37:33 gle-dind04 lldpd[1171]: unable to send packet on real device for veth851aac5: No such device or address
== idm00 (1 distinct, 1 total) ==
Oct 7 03:54:41 idm00 named[4166701]: client @0x7f11a0064678 10.73.240.42#53781: update '73.10.in-addr.arpa/IN' denied
== idmp0 (1 distinct, 1 total) ==
Oct 7 03:39:23 idmp0 named[1598691]: client @0x7f2d2001fbb8 10.73.240.43#52502: update '73.10.in-addr.arpa/IN' denied
== itmon02 (2 distinct, 6 total) ==
Oct 7 03:08:14 itmon02 sshd[805675]: error: beginning MaxStartups throttling [x5]
Oct 7 03:15:02 itmon02 (httpd)[378381]: httpd.service: Referenced but unset environment variable evaluates to an empty string: OPTIONS
== kadath.cs.umd.edu (1 distinct, 1 total) ==
Oct 7 03:47:12 kadath.cs.umd.edu puppet-agent[114945]: (Facter) invalid or malformed lldp data: MalformedDataError: no lldp interface data found
== librenms (1 distinct, 1 total) ==
Oct 7 03:47:02 librenms (httpd)[1964809]: httpd.service: Referenced but unset environment variable evaluates to an empty string: OPTIONS
== munin (2 distinct, 4 total) ==
Oct 7 03:08:15 munin sudo[1081368]: pam_systemd(sudo:session): Failed to stat() runtime directory '/run/user/0': No such file or directory [x2]
Oct 7 03:08:15 munin sudo[1081368]: pam_systemd(sudo:session): Not setting $XDG_RUNTIME_DIR, as the directory is not in order. [x2]
== neoavion (3 distinct, 3 total) ==
Oct 7 03:34:38 neoavion (smartd)[86183]: smartmontools.service: Referenced but unset environment variable evaluates to an empty string: smartd_opts
Oct 7 03:34:38 neoavion (nin-node)[86195]: munin-node.service: Referenced but unset environment variable evaluates to an empty string: DAEMON_ARGS
Oct 7 03:34:39 neoavion systemd[1]: resmon.service: Supervising process 86418 which is not our child. We'll most likely not notice when it exits.
== netbox (1 distinct, 1 total) ==
Oct 7 03:08:02 netbox (httpd)[2240930]: httpd.service: Referenced but unset environment variable evaluates to an empty string: OPTIONS
== netman.cs.umd.edu (5 distinct, 11 total) ==
Oct 7 03:23:34 netman.cs.umd.edu krb5_child[189376]: Client 'admin(a)UMD.EDU' not found in Kerberos database [x6]
Oct 7 03:23:41 netman.cs.umd.edu sshd[189373]: error: PAM: Authentication failure for admin from 35.240.108.120
Oct 7 03:23:54 netman.cs.umd.edu sshd[189393]: error: Protocol major versions differ: 2 vs. 1
Oct 7 03:36:16 netman.cs.umd.edu systemd[1]: cgroup compatibility translation between legacy and unified hierarchy settings activated. See cgroup-compat debug messages for details.
Oct 7 04:03:10 netman.cs.umd.edu krb5_child[201146]: Preauthentication failed [x2]
== newhonors2 (1 distinct, 24 total) ==
Oct 7 03:13:03 newhonors2 dhcpcd[3668340]: dhcpcd is not running [x24]
== ntop00 (99 distinct, 99 total) ==
Oct 7 03:05:01 ntop00 sfacctd[1075592]: INFO ( m1/mysql ): *** Purging cache - START (PID: 4498) ***
Oct 7 03:05:01 ntop00 nfacctd[1075699]: INFO ( m1/mysql ): *** Purging cache - START (PID: 4498) ***
Oct 7 03:05:01 ntop00 nfacctd[1075699]: INFO ( m1/mysql ): *** Purging cache - END (PID: 4498, QN: 57/57, ET: 0) ***
Oct 7 03:05:09 ntop00 sfacctd[1075592]: INFO ( m1/mysql ): *** Purging cache - END (PID: 4498, QN: 4540/4540, ET: 8) ***
Oct 7 03:08:01 ntop00 sfacctd[1075592]: INFO ( p1/print ): *** Purging cache - START (PID: 4499) ***
Oct 7 03:08:01 ntop00 sfacctd[1075592]: INFO ( p1/print ): *** Purging cache - END (PID: 4499, QN: 4393/4393, ET: 0) ***
Oct 7 03:08:01 ntop00 nfacctd[1075699]: INFO ( p1/print ): *** Purging cache - START (PID: 4499) ***
Oct 7 03:08:01 ntop00 nfacctd[1075699]: INFO ( p1/print ): *** Purging cache - END (PID: 4499, QN: 62/62, ET: 0) ***
Oct 7 03:10:01 ntop00 sfacctd[1075592]: INFO ( m1/mysql ): *** Purging cache - START (PID: 4500) ***
Oct 7 03:10:01 ntop00 nfacctd[1075699]: INFO ( m1/mysql ): *** Purging cache - START (PID: 4500) ***
Oct 7 03:10:01 ntop00 nfacctd[1075699]: INFO ( m1/mysql ): *** Purging cache - END (PID: 4500, QN: 52/52, ET: 0) ***
Oct 7 03:10:08 ntop00 sfacctd[1075592]: INFO ( m1/mysql ): *** Purging cache - END (PID: 4500, QN: 4268/4268, ET: 7) ***
Oct 7 03:13:01 ntop00 sfacctd[1075592]: INFO ( p1/print ): *** Purging cache - START (PID: 4501) ***
Oct 7 03:13:01 ntop00 sfacctd[1075592]: INFO ( p1/print ): *** Purging cache - END (PID: 4501, QN: 5061/5061, ET: 0) ***
Oct 7 03:13:01 ntop00 nfacctd[1075699]: INFO ( p1/print ): *** Purging cache - START (PID: 4501) ***
Oct 7 03:13:01 ntop00 nfacctd[1075699]: INFO ( p1/print ): *** Purging cache - END (PID: 4501, QN: 43/43, ET: 0) ***
Oct 7 03:15:01 ntop00 nfacctd[1075699]: INFO ( m1/mysql ): *** Purging cache - START (PID: 4502) ***
Oct 7 03:15:01 ntop00 sfacctd[1075592]: INFO ( m1/mysql ): *** Purging cache - START (PID: 4502) ***
Oct 7 03:15:01 ntop00 nfacctd[1075699]: INFO ( m1/mysql ): *** Purging cache - END (PID: 4502, QN: 50/50, ET: 0) ***
Oct 7 03:15:09 ntop00 sfacctd[1075592]: INFO ( m1/mysql ): *** Purging cache - END (PID: 4502, QN: 5006/5006, ET: 8) ***
Oct 7 03:18:01 ntop00 sfacctd[1075592]: INFO ( p1/print ): *** Purging cache - START (PID: 4503) ***
Oct 7 03:18:01 ntop00 sfacctd[1075592]: INFO ( p1/print ): *** Purging cache - END (PID: 4503, QN: 4011/4011, ET: 0) ***
Oct 7 03:18:01 ntop00 nfacctd[1075699]: INFO ( p1/print ): *** Purging cache - START (PID: 4503) ***
Oct 7 03:18:01 ntop00 nfacctd[1075699]: INFO ( p1/print ): *** Purging cache - END (PID: 4503, QN: 42/42, ET: 0) ***
Oct 7 03:20:01 ntop00 sfacctd[1075592]: INFO ( m1/mysql ): *** Purging cache - START (PID: 4504) ***
Oct 7 03:20:01 ntop00 nfacctd[1075699]: INFO ( m1/mysql ): *** Purging cache - START (PID: 4504) ***
Oct 7 03:20:01 ntop00 nfacctd[1075699]: INFO ( m1/mysql ): *** Purging cache - END (PID: 4504, QN: 47/47, ET: 0) ***
Oct 7 03:20:07 ntop00 sfacctd[1075592]: INFO ( m1/mysql ): *** Purging cache - END (PID: 4504, QN: 3804/3804, ET: 6) ***
Oct 7 03:23:01 ntop00 sfacctd[1075592]: INFO ( p1/print ): *** Purging cache - START (PID: 4505) ***
Oct 7 03:23:01 ntop00 sfacctd[1075592]: INFO ( p1/print ): *** Purging cache - END (PID: 4505, QN: 3845/3845, ET: 0) ***
... 69 more distinct messages not shown
== outbound00.cs.umd.edu (2 distinct, 8 total) ==
Oct 7 03:09:09 outbound00.cs.umd.edu python3[152981]: ldapdb [x7]
Oct 7 03:24:20 outbound00.cs.umd.edu systemd[1]: Configuration file /usr/lib/systemd/system/authentication_milter.service is marked executable. Please remove executable permission bits. Proceeding anyway.
== outbound01.cs.umd.edu (1 distinct, 6 total) ==
Oct 7 03:13:06 outbound01.cs.umd.edu python3[1611443]: ldapdb [x6]
== portal (1 distinct, 74 total) ==
Oct 7 03:05:21 portal setroubleshoot[1674476]: SELinux is preventing /usr/local/bin/traefik from connectto access on the unix_stream_socket /run/podman/podman.sock. For complete SELinux messages run: sealert -l e0a307a3-2c22-4320-8f9d-6a166c45222d [x74]
== strawberry (7 distinct, 38 total) ==
Oct 7 03:07:03 strawberry kernel: I/O error, dev sda, sector 206848 op 0x0:(READ) flags 0x80700 phys_seg 1 prio class 2 [x6]
Oct 7 03:07:03 strawberry kernel: I/O error, dev sda, sector 206848 op 0x0:(READ) flags 0x0 phys_seg 1 prio class 2 [x6]
Oct 7 03:07:03 strawberry kernel: Buffer I/O error on dev sda2, logical block 0, async page read [x6]
Oct 7 03:07:03 strawberry kernel: I/O error, dev sda, sector 2048 op 0x0:(READ) flags 0x80700 phys_seg 1 prio class 2 [x6]
Oct 7 03:07:03 strawberry kernel: I/O error, dev sda, sector 2048 op 0x0:(READ) flags 0x0 phys_seg 1 prio class 2 [x6]
Oct 7 03:07:03 strawberry kernel: Buffer I/O error on dev sda1, logical block 0, async page read [x6]
Oct 7 03:34:42 strawberry smartd[5314]: Device: /dev/sda [SAT], failed to read SMART Attribute Data [x2]
== submit10-cln25 (5 distinct, 1539 total) ==
Oct 7 03:05:22 submit10-cln25 rsyslogd: file '/var/log/messages': open error: Input/output error [v8.24.0-57.el7_9.3 try http://www.rsyslog.com/e/2433 ] [x1200]
Oct 7 03:05:22 submit10-cln25 rsyslogd: imjournal: fopen() failed for path: '/var/lib/rsyslog/imjournal.state.tmp': Input/output error [v8.24.0-57.el7_9.3 try http://www.rsyslog.com/e/2013 ] [x334]
Oct 7 03:25:01 submit10-cln25 systemd: Failed at step USER spawning /usr/libexec/pcp/bin/pmlogger_check: Input/output error [x2]
Oct 7 03:28:01 submit10-cln25 systemd: Failed at step USER spawning /usr/libexec/pcp/bin/pmie_check: Input/output error [x2]
Oct 7 03:30:01 submit10-cln25 systemd: Failed at step USER spawning /usr/libexec/pcp/bin/pmlogger_daily: Input/output error
1
0
Command: /usr/local/sbin/syslog-digest.py
Time : 0.1459s
Status : exited 0
Output :
Syslog digest — 2026-10-07 03:05 EDT
Processed 5,729 lines, filtered 3,536 (61%). 2,193 unknown (146 distinct) from 20 host(s).
== abuse (1 distinct, 347 total) ==
Oct 7 02:05:25 abuse rsyslogd[1033]: imjournal: open() failed for path: '/var/lib/rsyslog/imjournal.state.tmp': Input/output error [v8.2404.0 try https://www.rsyslog.com/e/2433 ] [x347]
== b0b02.cs.umd.edu (1 distinct, 1 total) ==
Oct 7 02:17:00 b0b02.cs.umd.edu rustdesk[1078048]: cannot open display:
== gle-dind00.cs.umd.edu (4 distinct, 4 total) ==
Oct 7 02:12:47 gle-dind00.cs.umd.edu systemd-udevd[2717302]: Could not generate persistent MAC address for veth092a59c: No such file or directory
Oct 7 02:12:47 gle-dind00.cs.umd.edu systemd-udevd[2717303]: Could not generate persistent MAC address for veth8a7cc61: No such file or directory
Oct 7 02:13:09 gle-dind00.cs.umd.edu systemd-udevd[2717442]: Could not generate persistent MAC address for vethc9ade61: No such file or directory
Oct 7 02:13:09 gle-dind00.cs.umd.edu systemd-udevd[2717441]: Could not generate persistent MAC address for veth3c39830: No such file or directory
== gle-dind04 (1 distinct, 1 total) ==
Oct 7 02:11:09 gle-dind04 lldpd[1171]: unable to send packet on real device for vethb7517f1: No such device or address
== idm00 (1 distinct, 1 total) ==
Oct 7 02:54:41 idm00 named[4166701]: client @0x7f11a40736b8 10.73.240.42#51762: update '73.10.in-addr.arpa/IN' denied
== idmp0 (1 distinct, 1 total) ==
Oct 7 02:39:23 idmp0 named[1598691]: client @0x7f2d3400d5c8 10.73.240.43#49244: update '73.10.in-addr.arpa/IN' denied
== itmon02 (1 distinct, 1 total) ==
Oct 7 02:43:38 itmon02 sshd[805675]: error: beginning MaxStartups throttling
== munin (2 distinct, 28 total) ==
Oct 7 02:43:41 munin sudo[1072082]: pam_systemd(sudo:session): Failed to stat() runtime directory '/run/user/0': No such file or directory [x14]
Oct 7 02:43:41 munin sudo[1072082]: pam_systemd(sudo:session): Not setting $XDG_RUNTIME_DIR, as the directory is not in order. [x14]
== newhonors2 (1 distinct, 24 total) ==
Oct 7 02:13:03 newhonors2 dhcpcd[3665896]: dhcpcd is not running [x24]
== ntop00 (95 distinct, 95 total) ==
Oct 7 02:05:01 ntop00 nfacctd[1075699]: INFO ( m1/mysql ): *** Purging cache - START (PID: 4474) ***
Oct 7 02:05:01 ntop00 nfacctd[1075699]: INFO ( m1/mysql ): *** Purging cache - END (PID: 4474, QN: 60/60, ET: 0) ***
Oct 7 02:05:08 ntop00 sfacctd[1075592]: INFO ( m1/mysql ): *** Purging cache - END (PID: 4474, QN: 4198/4198, ET: 7) ***
Oct 7 02:08:01 ntop00 sfacctd[1075592]: INFO ( p1/print ): *** Purging cache - START (PID: 4475) ***
Oct 7 02:08:01 ntop00 sfacctd[1075592]: INFO ( p1/print ): *** Purging cache - END (PID: 4475, QN: 4868/4868, ET: 0) ***
Oct 7 02:08:01 ntop00 nfacctd[1075699]: INFO ( p1/print ): *** Purging cache - START (PID: 4475) ***
Oct 7 02:08:01 ntop00 nfacctd[1075699]: INFO ( p1/print ): *** Purging cache - END (PID: 4475, QN: 73/73, ET: 0) ***
Oct 7 02:10:01 ntop00 sfacctd[1075592]: INFO ( m1/mysql ): *** Purging cache - START (PID: 4476) ***
Oct 7 02:10:01 ntop00 nfacctd[1075699]: INFO ( m1/mysql ): *** Purging cache - START (PID: 4476) ***
Oct 7 02:10:01 ntop00 nfacctd[1075699]: INFO ( m1/mysql ): *** Purging cache - END (PID: 4476, QN: 64/64, ET: 0) ***
Oct 7 02:10:10 ntop00 sfacctd[1075592]: INFO ( m1/mysql ): *** Purging cache - END (PID: 4476, QN: 5160/5160, ET: 9) ***
Oct 7 02:13:01 ntop00 sfacctd[1075592]: INFO ( p1/print ): *** Purging cache - START (PID: 4477) ***
Oct 7 02:13:01 ntop00 sfacctd[1075592]: INFO ( p1/print ): *** Purging cache - END (PID: 4477, QN: 4994/4994, ET: 0) ***
Oct 7 02:13:01 ntop00 nfacctd[1075699]: INFO ( p1/print ): *** Purging cache - START (PID: 4477) ***
Oct 7 02:13:01 ntop00 nfacctd[1075699]: INFO ( p1/print ): *** Purging cache - END (PID: 4477, QN: 47/47, ET: 0) ***
Oct 7 02:15:01 ntop00 sfacctd[1075592]: INFO ( m1/mysql ): *** Purging cache - START (PID: 4478) ***
Oct 7 02:15:01 ntop00 nfacctd[1075699]: INFO ( m1/mysql ): *** Purging cache - START (PID: 4478) ***
Oct 7 02:15:01 ntop00 nfacctd[1075699]: INFO ( m1/mysql ): *** Purging cache - END (PID: 4478, QN: 51/51, ET: 0) ***
Oct 7 02:15:09 ntop00 sfacctd[1075592]: INFO ( m1/mysql ): *** Purging cache - END (PID: 4478, QN: 4819/4819, ET: 8) ***
Oct 7 02:18:01 ntop00 sfacctd[1075592]: INFO ( p1/print ): *** Purging cache - START (PID: 4479) ***
Oct 7 02:18:01 ntop00 sfacctd[1075592]: INFO ( p1/print ): *** Purging cache - END (PID: 4479, QN: 4962/4962, ET: 0) ***
Oct 7 02:18:01 ntop00 nfacctd[1075699]: INFO ( p1/print ): *** Purging cache - START (PID: 4479) ***
Oct 7 02:18:01 ntop00 nfacctd[1075699]: INFO ( p1/print ): *** Purging cache - END (PID: 4479, QN: 62/62, ET: 0) ***
Oct 7 02:20:01 ntop00 sfacctd[1075592]: INFO ( m1/mysql ): *** Purging cache - START (PID: 4480) ***
Oct 7 02:20:01 ntop00 nfacctd[1075699]: INFO ( m1/mysql ): *** Purging cache - START (PID: 4480) ***
Oct 7 02:20:01 ntop00 nfacctd[1075699]: INFO ( m1/mysql ): *** Purging cache - END (PID: 4480, QN: 72/72, ET: 0) ***
Oct 7 02:20:10 ntop00 sfacctd[1075592]: INFO ( m1/mysql ): *** Purging cache - END (PID: 4480, QN: 4994/4994, ET: 9) ***
Oct 7 02:23:01 ntop00 sfacctd[1075592]: INFO ( p1/print ): *** Purging cache - START (PID: 4481) ***
Oct 7 02:23:01 ntop00 sfacctd[1075592]: INFO ( p1/print ): *** Purging cache - END (PID: 4481, QN: 5217/5217, ET: 0) ***
Oct 7 02:23:01 ntop00 nfacctd[1075699]: INFO ( p1/print ): *** Purging cache - START (PID: 4481) ***
... 65 more distinct messages not shown
== outbound00.cs.umd.edu (1 distinct, 6 total) ==
Oct 7 02:09:09 outbound00.cs.umd.edu python3[139078]: ldapdb [x6]
== outbound01.cs.umd.edu (1 distinct, 6 total) ==
Oct 7 02:13:06 outbound01.cs.umd.edu python3[1597537]: ldapdb [x6]
== portal (1 distinct, 74 total) ==
Oct 7 02:05:27 portal setroubleshoot[1661678]: SELinux is preventing /usr/local/bin/traefik from connectto access on the unix_stream_socket /run/podman/podman.sock. For complete SELinux messages run: sealert -l e0a307a3-2c22-4320-8f9d-6a166c45222d [x74]
== strawberry (7 distinct, 38 total) ==
Oct 7 02:07:03 strawberry kernel: I/O error, dev sda, sector 206848 op 0x0:(READ) flags 0x80700 phys_seg 1 prio class 2 [x6]
Oct 7 02:07:03 strawberry kernel: I/O error, dev sda, sector 206848 op 0x0:(READ) flags 0x0 phys_seg 1 prio class 2 [x6]
Oct 7 02:07:03 strawberry kernel: Buffer I/O error on dev sda2, logical block 0, async page read [x6]
Oct 7 02:07:03 strawberry kernel: I/O error, dev sda, sector 2048 op 0x0:(READ) flags 0x80700 phys_seg 1 prio class 2 [x6]
Oct 7 02:07:03 strawberry kernel: I/O error, dev sda, sector 2048 op 0x0:(READ) flags 0x0 phys_seg 1 prio class 2 [x6]
Oct 7 02:07:03 strawberry kernel: Buffer I/O error on dev sda1, logical block 0, async page read [x6]
Oct 7 02:34:42 strawberry smartd[5314]: Device: /dev/sda [SAT], failed to read SMART Attribute Data [x2]
== submit10-cln25 (5 distinct, 1539 total) ==
Oct 7 02:05:22 submit10-cln25 rsyslogd: file '/var/log/messages': open error: Input/output error [v8.24.0-57.el7_9.3 try http://www.rsyslog.com/e/2433 ] [x1200]
Oct 7 02:05:22 submit10-cln25 rsyslogd: imjournal: fopen() failed for path: '/var/lib/rsyslog/imjournal.state.tmp': Input/output error [v8.24.0-57.el7_9.3 try http://www.rsyslog.com/e/2013 ] [x334]
Oct 7 02:25:01 submit10-cln25 systemd: Failed at step USER spawning /usr/libexec/pcp/bin/pmlogger_check: Input/output error [x2]
Oct 7 02:28:01 submit10-cln25 systemd: Failed at step USER spawning /usr/libexec/pcp/bin/pmie_check: Input/output error [x2]
Oct 7 02:30:01 submit10-cln25 systemd: Failed at step USER spawning /usr/libexec/pcp/bin/pmlogger_daily: Input/output error
== submit26-b9-3 (1 distinct, 4 total) ==
Sep 8 23:58:26 submit26-b9-3 systemd[1]: user(a)1001.service: Main process exited, code=killed, status=9/KILL [x4]
== submit26-b9-f1 (10 distinct, 10 total) ==
Oct 7 02:13:08 submit26-b9-f1 systemd[1]: user(a)1001.service: Main process exited, code=killed, status=9/KILL
Oct 7 02:26:01 submit26-b9-f1 setroubleshoot[1602933]: SELinux is preventing /usr/bin/python3.9 from create access on the directory /(null). For complete SELinux messages run: sealert -l 3ef7d677-731f-46bf-9c34-c2c55fea665c
Oct 7 02:26:01 submit26-b9-f1 setroubleshoot[1602933]: SELinux is preventing /usr/bin/python3.9 from add_name access on the directory /(null). For complete SELinux messages run: sealert -l aa60e26f-72e1-45f1-bc12-aa8b3b669e36
Oct 7 02:26:01 submit26-b9-f1 setroubleshoot[1602933]: SELinux is preventing /usr/bin/python3.9 from create access on the file /(null). For complete SELinux messages run: sealert -l d088fb43-23ee-4ae8-ae6a-5d1c041ee2d6
Oct 7 02:26:01 submit26-b9-f1 setroubleshoot[1602933]: SELinux is preventing /usr/bin/python3.9 from open access on the file /tmp/libdnf.9yIiju/repodata/repomd.xml. For complete SELinux messages run: sealert -l 3b0d8c9a-6637-4d6e-a864-f1dd7c00377d
Oct 7 02:26:01 submit26-b9-f1 setroubleshoot[1602933]: SELinux is preventing /usr/bin/python3.9 from setattr access on the file repomd.xml. For complete SELinux messages run: sealert -l 0fd3339f-3ef2-45f3-9e58-65a58b42f3ee
Oct 7 02:26:01 submit26-b9-f1 setroubleshoot[1602933]: SELinux is preventing /usr/bin/python3.9 from read access on the directory libdnf.9yIiju. For complete SELinux messages run: sealert -l 0d661d88-dc9e-469d-986b-52e29b353aa8
Oct 7 02:26:01 submit26-b9-f1 setroubleshoot[1602933]: SELinux is preventing /usr/bin/python3.9 from remove_name access on the directory repomd.xml. For complete SELinux messages run: sealert -l 405a8556-cf9f-4ef4-8525-0dca18d4259d
Oct 7 02:26:01 submit26-b9-f1 setroubleshoot[1602933]: SELinux is preventing /usr/bin/python3.9 from unlink access on the file repomd.xml. For complete SELinux messages run: sealert -l 3c38e23e-3631-4cb5-81c7-992675c836d9
Oct 7 02:26:01 submit26-b9-f1 setroubleshoot[1602933]: SELinux is preventing /usr/bin/python3.9 from rmdir access on the directory repodata. For complete SELinux messages run: sealert -l a070e9b5-2867-47d6-b2e3-3b7d99725848
== submit26-b9-f2 (10 distinct, 10 total) ==
Oct 7 02:06:55 submit26-b9-f2 setroubleshoot[699856]: SELinux is preventing /usr/bin/python3.9 from create access on the directory /(null). For complete SELinux messages run: sealert -l 0659d546-3107-4f75-b00f-008c85f41dc6
Oct 7 02:06:55 submit26-b9-f2 setroubleshoot[699856]: SELinux is preventing /usr/bin/python3.9 from add_name access on the directory /(null). For complete SELinux messages run: sealert -l 156d9270-3466-4356-b86f-1a128825961a
Oct 7 02:06:55 submit26-b9-f2 setroubleshoot[699856]: SELinux is preventing /usr/bin/python3.9 from create access on the file /(null). For complete SELinux messages run: sealert -l c8a40bf5-2fc4-46b3-b813-8592b3523339
Oct 7 02:06:55 submit26-b9-f2 setroubleshoot[699856]: SELinux is preventing /usr/bin/python3.9 from open access on the file /tmp/libdnf.UaEOa7/repodata/repomd.xml. For complete SELinux messages run: sealert -l 7f4c3a8e-0f99-47c4-9baf-e1336fe24876
Oct 7 02:06:55 submit26-b9-f2 setroubleshoot[699856]: SELinux is preventing /usr/bin/python3.9 from setattr access on the file repomd.xml. For complete SELinux messages run: sealert -l 988123da-b724-4e6a-900c-33a2723fdaf1
Oct 7 02:06:55 submit26-b9-f2 setroubleshoot[699856]: SELinux is preventing /usr/bin/python3.9 from read access on the directory libdnf.UaEOa7. For complete SELinux messages run: sealert -l ca585e2b-d50f-4264-8127-6b3fa04070c8
Oct 7 02:06:55 submit26-b9-f2 setroubleshoot[699856]: SELinux is preventing /usr/bin/python3.9 from remove_name access on the directory repomd.xml. For complete SELinux messages run: sealert -l 3a749560-1cec-40ca-a4dc-596841be3885
Oct 7 02:06:55 submit26-b9-f2 setroubleshoot[699856]: SELinux is preventing /usr/bin/python3.9 from unlink access on the file repomd.xml. For complete SELinux messages run: sealert -l 0aa52f08-94f8-474e-96d8-e818846941af
Oct 7 02:06:55 submit26-b9-f2 setroubleshoot[699856]: SELinux is preventing /usr/bin/python3.9 from rmdir access on the directory repodata. For complete SELinux messages run: sealert -l de019dc4-408f-439c-902a-676d18dfe8e7
Oct 7 02:13:11 submit26-b9-f2 systemd[1]: user(a)1001.service: Main process exited, code=killed, status=9/KILL
== submit26-b9-f3 (1 distinct, 2 total) ==
Oct 7 02:10:05 submit26-b9-f3 systemd[1]: user(a)1001.service: Main process exited, code=killed, status=9/KILL [x2]
== tma-0 (1 distinct, 1 total) ==
Oct 7 02:24:15 tma-0 sshd[9718]: error: PAM: Authentication failure for admin from 69.201.38.34.bc.googleusercontent.com
1
0
Command: /usr/local/sbin/syslog-digest.py
Time : 0.1675s
Status : exited 0
Output :
Syslog digest — 2026-10-07 02:05 EDT
Processed 6,347 lines, filtered 3,839 (60%). 2,508 unknown (350 distinct) from 29 host(s).
== abuse (1 distinct, 346 total) ==
Oct 7 01:05:25 abuse rsyslogd[1033]: imjournal: open() failed for path: '/var/lib/rsyslog/imjournal.state.tmp': Input/output error [v8.2404.0 try https://www.rsyslog.com/e/2433 ] [x346]
== b0b02.cs.umd.edu (1 distinct, 1 total) ==
Oct 7 01:16:56 b0b02.cs.umd.edu rustdesk[1062927]: cannot open display:
== cheezit.cs.umd.edu (4 distinct, 4 total) ==
Oct 7 01:22:30 cheezit.cs.umd.edu systemd[1]: cgroup compatibility translation between legacy and unified hierarchy settings activated. See cgroup-compat debug messages for details.
Oct 7 01:57:02 cheezit.cs.umd.edu sshd-session[205457]: pam_access(sshd:auth): access denied for user `admin' from `35.205.187.128'
Oct 7 01:57:02 cheezit.cs.umd.edu krb5_child[205459]: Client 'admin(a)UMD.EDU' not found in Kerberos database
Oct 7 01:57:02 cheezit.cs.umd.edu sshd-session[205455]: error: PAM: System error for admin from 35.205.187.128
== galax (1 distinct, 1 total) ==
Oct 7 02:01:23 galax kernel: rtw89_8922ae 0000:06:00.0: failed to wait RF DACK
== gle-dind00.cs.umd.edu (18 distinct, 18 total) ==
Oct 7 02:02:43 gle-dind00.cs.umd.edu systemd-udevd[2713512]: Could not generate persistent MAC address for vethf09fadb: No such file or directory
Oct 7 02:02:43 gle-dind00.cs.umd.edu systemd-udevd[2713511]: Could not generate persistent MAC address for veth4196631: No such file or directory
Oct 7 02:02:44 gle-dind00.cs.umd.edu systemd-udevd[2713633]: Could not generate persistent MAC address for veth2bcc55a: No such file or directory
Oct 7 02:02:44 gle-dind00.cs.umd.edu systemd-udevd[2713634]: Could not generate persistent MAC address for vethd46b365: No such file or directory
Oct 7 02:02:45 gle-dind00.cs.umd.edu systemd-udevd[2713731]: Could not generate persistent MAC address for veth5a21944: No such file or directory
Oct 7 02:02:45 gle-dind00.cs.umd.edu systemd-udevd[2713732]: Could not generate persistent MAC address for veth24ed5d9: No such file or directory
Oct 7 02:02:46 gle-dind00.cs.umd.edu systemd-udevd[2713833]: Could not generate persistent MAC address for veth2a661de: No such file or directory
Oct 7 02:02:46 gle-dind00.cs.umd.edu systemd-udevd[2713834]: Could not generate persistent MAC address for vethf824992: No such file or directory
Oct 7 02:02:47 gle-dind00.cs.umd.edu systemd-udevd[2713924]: Could not generate persistent MAC address for veth1f4e3f1: No such file or directory
Oct 7 02:02:47 gle-dind00.cs.umd.edu systemd-udevd[2713923]: Could not generate persistent MAC address for veth0ec2995: No such file or directory
Oct 7 02:03:05 gle-dind00.cs.umd.edu systemd-udevd[2714435]: Could not generate persistent MAC address for veth216aa53: No such file or directory
Oct 7 02:03:05 gle-dind00.cs.umd.edu systemd-udevd[2714436]: Could not generate persistent MAC address for vethe28f46f: No such file or directory
Oct 7 02:03:05 gle-dind00.cs.umd.edu systemd-udevd[2714542]: Could not generate persistent MAC address for veth8058cdc: No such file or directory
Oct 7 02:03:05 gle-dind00.cs.umd.edu systemd-udevd[2714543]: Could not generate persistent MAC address for veth7e4a15f: No such file or directory
Oct 7 02:03:07 gle-dind00.cs.umd.edu systemd-udevd[2714723]: Could not generate persistent MAC address for vethc69f599: No such file or directory
Oct 7 02:03:07 gle-dind00.cs.umd.edu systemd-udevd[2714724]: Could not generate persistent MAC address for vethb545200: No such file or directory
Oct 7 02:03:08 gle-dind00.cs.umd.edu systemd-udevd[2714831]: Could not generate persistent MAC address for veth9de2a2e: No such file or directory
Oct 7 02:03:08 gle-dind00.cs.umd.edu systemd-udevd[2714832]: Could not generate persistent MAC address for veth6d7576c: No such file or directory
== gle-dind01 (39 distinct, 47 total) ==
Oct 7 01:10:00 gle-dind01 puppet-agent[207880]: Red Hat Enterprise Linux 10 for x86_64 - AppStr 79 kB/s | 4.1 kB 00:00
Oct 7 01:10:00 gle-dind01 puppet-agent[207880]: Red Hat Enterprise Linux 10 for x86_64 - BaseOS 88 kB/s | 4.1 kB 00:00
Oct 7 01:10:00 gle-dind01 puppet-agent[207880]: Dependencies resolved.
Oct 7 01:10:00 gle-dind01 puppet-agent[207880]: ================================================================================ [x3]
Oct 7 01:10:00 gle-dind01 puppet-agent[207880]: Package Arch Version Repository Size
Oct 7 01:10:00 gle-dind01 puppet-agent[207880]: Upgrading:
Oct 7 01:10:00 gle-dind01 puppet-agent[207880]: gitlab-runner x86_64 19.2.6-1 runner_gitlab-runner 29 M
Oct 7 01:10:00 gle-dind01 puppet-agent[207880]: gitlab-runner-helper-images noarch 19.2.6-1 runner_gitlab-runner 513 M
Oct 7 01:10:00 gle-dind01 puppet-agent[207880]: [x3]
Oct 7 01:10:00 gle-dind01 puppet-agent[207880]: Transaction Summary
Oct 7 01:10:00 gle-dind01 puppet-agent[207880]: Upgrade 2 Packages
Oct 7 01:10:00 gle-dind01 puppet-agent[207880]: Total download size: 542 M
Oct 7 01:10:00 gle-dind01 puppet-agent[207880]: Downloading Packages:
Oct 7 01:10:00 gle-dind01 puppet-agent[207880]: (1/2): gitlab-runner-19.2.6-1.x86_64.rpm 24 MB/s | 29 MB 00:01
Oct 7 01:10:00 gle-dind01 puppet-agent[207880]: [MIRROR] gitlab-runner-helper-images-19.2.6-1.noarch.rpm: Curl error (23): Failed writing received data to disk/application for https://storage.googleapis.com/packages-ops/artifact/c5/8feea0a1c266e7da6a2…
0335aed3ad3b125e5cb2524e6f6a069d4ca4f8ec962dc88360dbf5b5154c6aadf2ebea5dae65d9605fe7fd1c34bb273ff8ddc7c033c6f78a7e317c8864bd6903820a9cea0bd0d6c8df2bdb [Failure writing output to destination, passed 16366 returned 0]
Oct 7 01:10:00 gle-dind01 puppet-agent[207880]: [FAILED] gitlab-runner-helper-images-19.2.6-1.noarch.rpm: Curl error (23): Failed writing received data to disk/application for https://storage.googleapis.com/packages-ops/artifact/c5/8feea0a1c266e7da6a2…
0335aed3ad3b125e5cb2524e6f6a069d4ca4f8ec962dc88360dbf5b5154c6aadf2ebea5dae65d9605fe7fd1c34bb273ff8ddc7c033c6f78a7e317c8864bd6903820a9cea0bd0d6c8df2bdb [Failure writing output to destination, passed 16366 returned 0]
Oct 7 01:10:00 gle-dind01 puppet-agent[207880]: The downloaded packages were saved in cache until the next successful transaction.
Oct 7 01:10:00 gle-dind01 puppet-agent[207880]: Error: Error downloading packages:
Oct 7 01:10:00 gle-dind01 puppet-agent[207880]: gitlab-runner-helper-images-19.2.6-1.noarch: Download failed: Curl error (23): Failed writing received data to disk/application for https://storage.googleapis.com/packages-ops/artifact/c5/8feea0a1c266e7da6a2…
383600335aed3ad3b125e5cb2524e6f6a069d4ca4f8ec962dc88360dbf5b5154c6aadf2ebea5dae65d9605fe7fd1c34bb273ff8ddc7c033c6f78a7e317c8864bd6903820a9cea0bd0d6c8df2bdb [Failure writing output to destination, passed 16366 returned 0]
Oct 7 01:10:00 gle-dind01 puppet-agent[207880]: (/Stage[main]/Profile::Gitlab_enterprise::Runner_dind/Package[gitlab-runner]/ensure) Red Hat Enterprise Linux 10 for x86_64 - AppStr 79 kB/s | 4.1 kB 00:00
Oct 7 01:10:00 gle-dind01 puppet-agent[207880]: (/Stage[main]/Profile::Gitlab_enterprise::Runner_dind/Package[gitlab-runner]/ensure) Red Hat Enterprise Linux 10 for x86_64 - BaseOS 88 kB/s | 4.1 kB 00:00
Oct 7 01:10:00 gle-dind01 puppet-agent[207880]: (/Stage[main]/Profile::Gitlab_enterprise::Runner_dind/Package[gitlab-runner]/ensure) Dependencies resolved.
Oct 7 01:10:00 gle-dind01 puppet-agent[207880]: (/Stage[main]/Profile::Gitlab_enterprise::Runner_dind/Package[gitlab-runner]/ensure) ================================================================================ [x3]
Oct 7 01:10:00 gle-dind01 puppet-agent[207880]: (/Stage[main]/Profile::Gitlab_enterprise::Runner_dind/Package[gitlab-runner]/ensure) Package Arch Version Repository Size
Oct 7 01:10:00 gle-dind01 puppet-agent[207880]: (/Stage[main]/Profile::Gitlab_enterprise::Runner_dind/Package[gitlab-runner]/ensure) Upgrading:
Oct 7 01:10:00 gle-dind01 puppet-agent[207880]: (/Stage[main]/Profile::Gitlab_enterprise::Runner_dind/Package[gitlab-runner]/ensure) gitlab-runner x86_64 19.2.6-1 runner_gitlab-runner 29 M
Oct 7 01:10:00 gle-dind01 puppet-agent[207880]: (/Stage[main]/Profile::Gitlab_enterprise::Runner_dind/Package[gitlab-runner]/ensure) gitlab-runner-helper-images noarch 19.2.6-1 runner_gitlab-runner 513 M
Oct 7 01:10:00 gle-dind01 puppet-agent[207880]: (/Stage[main]/Profile::Gitlab_enterprise::Runner_dind/Package[gitlab-runner]/ensure) [x3]
Oct 7 01:10:00 gle-dind01 puppet-agent[207880]: (/Stage[main]/Profile::Gitlab_enterprise::Runner_dind/Package[gitlab-runner]/ensure) Transaction Summary
Oct 7 01:10:00 gle-dind01 puppet-agent[207880]: (/Stage[main]/Profile::Gitlab_enterprise::Runner_dind/Package[gitlab-runner]/ensure) Upgrade 2 Packages
... 9 more distinct messages not shown
== gle-dind02.cs.umd.edu (61 distinct, 69 total) ==
Oct 7 01:10:51 gle-dind02.cs.umd.edu puppet-agent[1575824]: Red Hat Enterprise Linux 8 for x86_64 - AppStre 44 kB/s | 4.5 kB 00:00
Oct 7 01:10:51 gle-dind02.cs.umd.edu puppet-agent[1575824]: Red Hat CodeReady Linux Builder for RHEL 8 x86_ 88 kB/s | 4.5 kB 00:00
Oct 7 01:10:51 gle-dind02.cs.umd.edu puppet-agent[1575824]: Red Hat Enterprise Linux 8 for x86_64 - BaseOS 58 kB/s | 4.1 kB 00:00
Oct 7 01:10:51 gle-dind02.cs.umd.edu puppet-agent[1575824]: Dependencies resolved.
Oct 7 01:10:51 gle-dind02.cs.umd.edu puppet-agent[1575824]: ================================================================================ [x3]
Oct 7 01:10:51 gle-dind02.cs.umd.edu puppet-agent[1575824]: Package Arch Version Repository Size
Oct 7 01:10:51 gle-dind02.cs.umd.edu puppet-agent[1575824]: Upgrading:
Oct 7 01:10:51 gle-dind02.cs.umd.edu puppet-agent[1575824]: gitlab-runner x86_64 19.2.6-1 runner_gitlab-runner 29 M
Oct 7 01:10:51 gle-dind02.cs.umd.edu puppet-agent[1575824]: gitlab-runner-helper-images noarch 19.2.6-1 runner_gitlab-runner 513 M
Oct 7 01:10:51 gle-dind02.cs.umd.edu puppet-agent[1575824]: [x3]
Oct 7 01:10:51 gle-dind02.cs.umd.edu puppet-agent[1575824]: Transaction Summary
Oct 7 01:10:51 gle-dind02.cs.umd.edu puppet-agent[1575824]: Upgrade 2 Packages
Oct 7 01:10:51 gle-dind02.cs.umd.edu puppet-agent[1575824]: Total download size: 542 M
Oct 7 01:10:51 gle-dind02.cs.umd.edu puppet-agent[1575824]: Downloading Packages:
Oct 7 01:10:51 gle-dind02.cs.umd.edu puppet-agent[1575824]: [MIRROR] gitlab-runner-19.2.6-1.x86_64.rpm: Curl error (23): Failed writing received data to disk/application for https://storage.googleapis.com/packages-ops/artifact/37/bc9862e8616d49bca9b…
0f4d64c07f3e1a072aba91832e532156cf2920c09c9b5545476c382bad73b1fffb942092a0abbda76432f6ab17cc5245045d5d1267907e741cecb808224aacc04066ef [Failed writing body (4096 != 16384)]
Oct 7 01:10:51 gle-dind02.cs.umd.edu puppet-agent[1575824]: [FAILED] gitlab-runner-19.2.6-1.x86_64.rpm: Curl error (23): Failed writing received data to disk/application for https://storage.googleapis.com/packages-ops/artifact/37/bc9862e8616d49bca9b…
0f4d64c07f3e1a072aba91832e532156cf2920c09c9b5545476c382bad73b1fffb942092a0abbda76432f6ab17cc5245045d5d1267907e741cecb808224aacc04066ef [Failed writing body (4096 != 16384)]
Oct 7 01:10:51 gle-dind02.cs.umd.edu puppet-agent[1575824]: The downloaded packages were saved in cache until the next successful transaction.
Oct 7 01:10:51 gle-dind02.cs.umd.edu puppet-agent[1575824]: Error: Error downloading packages:
Oct 7 01:10:51 gle-dind02.cs.umd.edu puppet-agent[1575824]: gitlab-runner-19.2.6-1.x86_64: Download failed: Curl error (23): Failed writing received data to disk/application for https://storage.googleapis.com/packages-ops/artifact/37/bc9862e8616d49bca9b…
5e9680f4d64c07f3e1a072aba91832e532156cf2920c09c9b5545476c382bad73b1fffb942092a0abbda76432f6ab17cc5245045d5d1267907e741cecb808224aacc04066ef [Failed writing body (4096 != 16384)]
Oct 7 01:10:51 gle-dind02.cs.umd.edu puppet-agent[1575824]: (/Stage[main]/Profile::Gitlab_enterprise::Runner_dind/Package[gitlab-runner]/ensure) Red Hat Enterprise Linux 8 for x86_64 - AppStre 44 kB/s | 4.5 kB 00:00
Oct 7 01:10:51 gle-dind02.cs.umd.edu puppet-agent[1575824]: (/Stage[main]/Profile::Gitlab_enterprise::Runner_dind/Package[gitlab-runner]/ensure) Red Hat CodeReady Linux Builder for RHEL 8 x86_ 88 kB/s | 4.5 kB 00:00
Oct 7 01:10:51 gle-dind02.cs.umd.edu puppet-agent[1575824]: (/Stage[main]/Profile::Gitlab_enterprise::Runner_dind/Package[gitlab-runner]/ensure) Red Hat Enterprise Linux 8 for x86_64 - BaseOS 58 kB/s | 4.1 kB 00:00
Oct 7 01:10:51 gle-dind02.cs.umd.edu puppet-agent[1575824]: (/Stage[main]/Profile::Gitlab_enterprise::Runner_dind/Package[gitlab-runner]/ensure) Dependencies resolved.
Oct 7 01:10:51 gle-dind02.cs.umd.edu puppet-agent[1575824]: (/Stage[main]/Profile::Gitlab_enterprise::Runner_dind/Package[gitlab-runner]/ensure) ================================================================================ [x3]
Oct 7 01:10:51 gle-dind02.cs.umd.edu puppet-agent[1575824]: (/Stage[main]/Profile::Gitlab_enterprise::Runner_dind/Package[gitlab-runner]/ensure) Package Arch Version Repository Size
Oct 7 01:10:51 gle-dind02.cs.umd.edu puppet-agent[1575824]: (/Stage[main]/Profile::Gitlab_enterprise::Runner_dind/Package[gitlab-runner]/ensure) Upgrading:
Oct 7 01:10:51 gle-dind02.cs.umd.edu puppet-agent[1575824]: (/Stage[main]/Profile::Gitlab_enterprise::Runner_dind/Package[gitlab-runner]/ensure) gitlab-runner x86_64 19.2.6-1 runner_gitlab-runner 29 M
Oct 7 01:10:51 gle-dind02.cs.umd.edu puppet-agent[1575824]: (/Stage[main]/Profile::Gitlab_enterprise::Runner_dind/Package[gitlab-runner]/ensure) gitlab-runner-helper-images noarch 19.2.6-1 runner_gitlab-runner 513 M
Oct 7 01:10:51 gle-dind02.cs.umd.edu puppet-agent[1575824]: (/Stage[main]/Profile::Gitlab_enterprise::Runner_dind/Package[gitlab-runner]/ensure) [x3]
Oct 7 01:10:51 gle-dind02.cs.umd.edu puppet-agent[1575824]: (/Stage[main]/Profile::Gitlab_enterprise::Runner_dind/Package[gitlab-runner]/ensure) Transaction Summary
... 31 more distinct messages not shown
== gle-dind04 (6 distinct, 6 total) ==
Oct 7 01:30:47 gle-dind04 falcon-sensor-bpf[1017]: CrowdStrike(4): Could not retrieve DisableProxy value: c0000225
Oct 7 01:30:47 gle-dind04 falcon-sensor-bpf[1017]: CrowdStrike(4): ConnectWithProxy: Unable to get application proxy host from CsConfig: c0000225
Oct 7 01:31:24 gle-dind04 lldpd[1171]: unable to send packet on real device for veth00bbed0: No such device or address
Oct 7 02:01:24 gle-dind04 lldpd[1171]: unable to send packet on real device for vethfcbd2e1: No such device or address
Oct 7 02:01:47 gle-dind04 lldpd[1171]: unable to send packet on real device for veth5706041: No such device or address
Oct 7 02:02:06 gle-dind04 lldpd[1171]: unable to send packet on real device for vethc22c89f: No such device or address
== gle-omnibus00.cs.umd.edu (2 distinct, 2 total) ==
Oct 7 01:09:06 gle-omnibus00.cs.umd.edu falcon-sensor-bpf[933]: CrowdStrike(4): Could not retrieve DisableProxy value: c0000225
Oct 7 01:09:06 gle-omnibus00.cs.umd.edu falcon-sensor-bpf[933]: CrowdStrike(4): ConnectWithProxy: Unable to get application proxy host from CsConfig: c0000225
== hazfs.cs.umd.edu (11 distinct, 66 total) ==
Oct 7 01:32:26 hazfs.cs.umd.edu snmpd[1431]: send response: Failure in sendto [x6]
Oct 7 01:32:26 hazfs.cs.umd.edu snmpd[1431]: -- NET-SNMP-EXTEND-MIB::nsExtendStatus."userweb" [x6]
Oct 7 01:32:26 hazfs.cs.umd.edu snmpd[1431]: -- NET-SNMP-EXTEND-MIB::nsExtendStatus."zfslist" [x6]
Oct 7 01:32:26 hazfs.cs.umd.edu snmpd[1431]: -- NET-SNMP-EXTEND-MIB::nsExtendStatus."userhome" [x6]
Oct 7 01:32:26 hazfs.cs.umd.edu snmpd[1431]: -- NET-SNMP-EXTEND-MIB::nsExtendOutput1Line."userweb" [x6]
Oct 7 01:32:26 hazfs.cs.umd.edu snmpd[1431]: -- NET-SNMP-EXTEND-MIB::nsExtendOutput1Line."zfslist" [x6]
Oct 7 01:32:26 hazfs.cs.umd.edu snmpd[1431]: -- NET-SNMP-EXTEND-MIB::nsExtendOutput1Line."userhome" [x6]
Oct 7 01:32:26 hazfs.cs.umd.edu snmpd[1431]: -- NET-SNMP-EXTEND-MIB::nsExtendOutputFull."userweb" [x6]
Oct 7 01:32:26 hazfs.cs.umd.edu snmpd[1431]: -- NET-SNMP-EXTEND-MIB::nsExtendOutputFull."zfslist" [x6]
Oct 7 01:32:26 hazfs.cs.umd.edu snmpd[1431]: -- NET-SNMP-EXTEND-MIB::nsExtendOutputFull."userhome" [x6]
Oct 7 01:32:26 hazfs.cs.umd.edu snmpd[1431]: -- NET-SNMP-EXTEND-MIB::nsExtendOutNumLines."userweb" [x6]
== idm00 (1 distinct, 1 total) ==
Oct 7 01:54:41 idm00 named[4166701]: client @0x7f119804d6e8 10.73.240.42#56088: update '73.10.in-addr.arpa/IN' denied
== idmp0 (1 distinct, 1 total) ==
Oct 7 01:39:23 idmp0 named[1598691]: client @0x7f2d3c062278 10.73.240.43#60437: update '73.10.in-addr.arpa/IN' denied
== itmon02 (1 distinct, 1 total) ==
Oct 7 01:13:19 itmon02 sshd[805675]: error: beginning MaxStartups throttling
== jubjub.cs.umd.edu (63 distinct, 83 total) ==
Oct 7 01:14:13 jubjub.cs.umd.edu puppet-agent[476365]: : transaction-actions, product-id, search-disabled-repos,
Oct 7 01:14:13 jubjub.cs.umd.edu puppet-agent[476365]: : subscription-manager, versionlock
Oct 7 01:14:13 jubjub.cs.umd.edu puppet-agent[476365]: [x11]
Oct 7 01:14:13 jubjub.cs.umd.edu puppet-agent[476365]: Could not retrieve mirrorlist http://cdn.remirepo.net/enterprise/7/php84/mirror error was
Oct 7 01:14:13 jubjub.cs.umd.edu puppet-agent[476365]: 14: HTTP Error 403 - Forbidden
Oct 7 01:14:13 jubjub.cs.umd.edu puppet-agent[476365]: One of the configured repositories failed (Unknown),
Oct 7 01:14:13 jubjub.cs.umd.edu puppet-agent[476365]: 1. Contact the upstream for the repository and get them to fix the problem.
Oct 7 01:14:13 jubjub.cs.umd.edu puppet-agent[476365]: 2. Reconfigure the baseurl/etc. for the repository, to point to a working
Oct 7 01:14:13 jubjub.cs.umd.edu puppet-agent[476365]: upstream. This is most often useful if you are using a newer
Oct 7 01:14:13 jubjub.cs.umd.edu puppet-agent[476365]: distribution release than is supported by the repository (and the
Oct 7 01:14:13 jubjub.cs.umd.edu puppet-agent[476365]: packages for the previous distribution release still work).
Oct 7 01:14:13 jubjub.cs.umd.edu puppet-agent[476365]: 3. Run the command with the repository temporarily disabled
Oct 7 01:14:13 jubjub.cs.umd.edu puppet-agent[476365]: will then just ignore the repository until you permanently enable it
Oct 7 01:14:13 jubjub.cs.umd.edu puppet-agent[476365]: again or use --enablerepo for temporary usage:
Oct 7 01:14:13 jubjub.cs.umd.edu puppet-agent[476365]: or
Oct 7 01:14:13 jubjub.cs.umd.edu puppet-agent[476365]: subscription-manager repos --disable=<repoid>
Oct 7 01:14:13 jubjub.cs.umd.edu puppet-agent[476365]: 5. Configure the failing repository to be skipped, if it is unavailable.
Oct 7 01:14:13 jubjub.cs.umd.edu puppet-agent[476365]: slower). If it is a very temporary problem though, this is often a nice
Oct 7 01:14:13 jubjub.cs.umd.edu puppet-agent[476365]: compromise:
Oct 7 01:14:13 jubjub.cs.umd.edu puppet-agent[476365]: Cannot find a valid baseurl for repo: remi-php84
Oct 7 01:14:13 jubjub.cs.umd.edu puppet-agent[476365]: Uploading Enabled Repositories Report
Oct 7 01:14:13 jubjub.cs.umd.edu puppet-agent[476365]: Unable to upload Enabled Repositories Report
Oct 7 01:14:13 jubjub.cs.umd.edu puppet-agent[476365]: (/Stage[main]/Puppet::Agent::Install/Package[openvox-agent]/ensure) : transaction-actions, product-id, search-disabled-repos,
Oct 7 01:14:13 jubjub.cs.umd.edu puppet-agent[476365]: (/Stage[main]/Puppet::Agent::Install/Package[openvox-agent]/ensure) : subscription-manager, versionlock
Oct 7 01:14:13 jubjub.cs.umd.edu puppet-agent[476365]: (/Stage[main]/Puppet::Agent::Install/Package[openvox-agent]/ensure) [x11]
Oct 7 01:14:13 jubjub.cs.umd.edu puppet-agent[476365]: (/Stage[main]/Puppet::Agent::Install/Package[openvox-agent]/ensure) Could not retrieve mirrorlist http://cdn.remirepo.net/enterprise/7/php84/mirror error was
Oct 7 01:14:13 jubjub.cs.umd.edu puppet-agent[476365]: (/Stage[main]/Puppet::Agent::Install/Package[openvox-agent]/ensure) 14: HTTP Error 403 - Forbidden
Oct 7 01:14:13 jubjub.cs.umd.edu puppet-agent[476365]: (/Stage[main]/Puppet::Agent::Install/Package[openvox-agent]/ensure) One of the configured repositories failed (Unknown),
Oct 7 01:14:13 jubjub.cs.umd.edu puppet-agent[476365]: (/Stage[main]/Puppet::Agent::Install/Package[openvox-agent]/ensure) 1. Contact the upstream for the repository and get them to fix the problem.
Oct 7 01:14:13 jubjub.cs.umd.edu puppet-agent[476365]: (/Stage[main]/Puppet::Agent::Install/Package[openvox-agent]/ensure) 2. Reconfigure the baseurl/etc. for the repository, to point to a working
... 33 more distinct messages not shown
== munin (2 distinct, 38 total) ==
Oct 7 01:08:32 munin sudo[1038070]: pam_systemd(sudo:session): Failed to stat() runtime directory '/run/user/0': No such file or directory [x19]
Oct 7 01:08:32 munin sudo[1038070]: pam_systemd(sudo:session): Not setting $XDG_RUNTIME_DIR, as the directory is not in order. [x19]
== newhonors2 (1 distinct, 24 total) ==
Oct 7 01:13:02 newhonors2 dhcpcd[3664044]: dhcpcd is not running [x24]
== ntop00 (96 distinct, 96 total) ==
Oct 7 01:05:01 ntop00 nfacctd[1075699]: INFO ( m1/mysql ): *** Purging cache - START (PID: 4450) ***
Oct 7 01:05:01 ntop00 nfacctd[1075699]: INFO ( m1/mysql ): *** Purging cache - END (PID: 4450, QN: 52/52, ET: 0) ***
Oct 7 01:05:05 ntop00 sfacctd[1075592]: INFO ( m1/mysql ): *** Purging cache - END (PID: 4450, QN: 2407/2407, ET: 4) ***
Oct 7 01:08:01 ntop00 sfacctd[1075592]: INFO ( p1/print ): *** Purging cache - START (PID: 4451) ***
Oct 7 01:08:01 ntop00 sfacctd[1075592]: INFO ( p1/print ): *** Purging cache - END (PID: 4451, QN: 2556/2556, ET: 0) ***
Oct 7 01:08:01 ntop00 nfacctd[1075699]: INFO ( p1/print ): *** Purging cache - START (PID: 4451) ***
Oct 7 01:08:01 ntop00 nfacctd[1075699]: INFO ( p1/print ): *** Purging cache - END (PID: 4451, QN: 61/61, ET: 0) ***
Oct 7 01:10:01 ntop00 sfacctd[1075592]: INFO ( m1/mysql ): *** Purging cache - START (PID: 4452) ***
Oct 7 01:10:01 ntop00 nfacctd[1075699]: INFO ( m1/mysql ): *** Purging cache - START (PID: 4452) ***
Oct 7 01:10:01 ntop00 nfacctd[1075699]: INFO ( m1/mysql ): *** Purging cache - END (PID: 4452, QN: 56/56, ET: 0) ***
Oct 7 01:10:05 ntop00 sfacctd[1075592]: INFO ( m1/mysql ): *** Purging cache - END (PID: 4452, QN: 2607/2607, ET: 4) ***
Oct 7 01:13:01 ntop00 sfacctd[1075592]: INFO ( p1/print ): *** Purging cache - START (PID: 4453) ***
Oct 7 01:13:01 ntop00 sfacctd[1075592]: INFO ( p1/print ): *** Purging cache - END (PID: 4453, QN: 3057/3057, ET: 0) ***
Oct 7 01:13:01 ntop00 nfacctd[1075699]: INFO ( p1/print ): *** Purging cache - START (PID: 4453) ***
Oct 7 01:13:01 ntop00 nfacctd[1075699]: INFO ( p1/print ): *** Purging cache - END (PID: 4453, QN: 57/57, ET: 0) ***
Oct 7 01:15:01 ntop00 sfacctd[1075592]: INFO ( m1/mysql ): *** Purging cache - START (PID: 4454) ***
Oct 7 01:15:01 ntop00 nfacctd[1075699]: INFO ( m1/mysql ): *** Purging cache - START (PID: 4454) ***
Oct 7 01:15:01 ntop00 nfacctd[1075699]: INFO ( m1/mysql ): *** Purging cache - END (PID: 4454, QN: 58/58, ET: 0) ***
Oct 7 01:15:05 ntop00 sfacctd[1075592]: INFO ( m1/mysql ): *** Purging cache - END (PID: 4454, QN: 3059/3059, ET: 4) ***
Oct 7 01:18:01 ntop00 sfacctd[1075592]: INFO ( p1/print ): *** Purging cache - START (PID: 4455) ***
Oct 7 01:18:01 ntop00 sfacctd[1075592]: INFO ( p1/print ): *** Purging cache - END (PID: 4455, QN: 2498/2498, ET: 0) ***
Oct 7 01:18:01 ntop00 nfacctd[1075699]: INFO ( p1/print ): *** Purging cache - START (PID: 4455) ***
Oct 7 01:18:01 ntop00 nfacctd[1075699]: INFO ( p1/print ): *** Purging cache - END (PID: 4455, QN: 52/52, ET: 0) ***
Oct 7 01:20:01 ntop00 sfacctd[1075592]: INFO ( m1/mysql ): *** Purging cache - START (PID: 4456) ***
Oct 7 01:20:01 ntop00 nfacctd[1075699]: INFO ( m1/mysql ): *** Purging cache - START (PID: 4456) ***
Oct 7 01:20:01 ntop00 nfacctd[1075699]: INFO ( m1/mysql ): *** Purging cache - END (PID: 4456, QN: 54/54, ET: 0) ***
Oct 7 01:20:04 ntop00 sfacctd[1075592]: INFO ( m1/mysql ): *** Purging cache - END (PID: 4456, QN: 2358/2358, ET: 3) ***
Oct 7 01:23:01 ntop00 sfacctd[1075592]: INFO ( p1/print ): *** Purging cache - START (PID: 4457) ***
Oct 7 01:23:01 ntop00 sfacctd[1075592]: INFO ( p1/print ): *** Purging cache - END (PID: 4457, QN: 2618/2618, ET: 0) ***
Oct 7 01:23:01 ntop00 nfacctd[1075699]: INFO ( p1/print ): *** Purging cache - START (PID: 4457) ***
... 66 more distinct messages not shown
== openvox08-cmp0 (2 distinct, 3 total) ==
Oct 7 01:11:14 openvox08-cmp0 setroubleshoot[123699]: failed to retrieve rpm info for path '/dev/pts/1':
Oct 7 01:11:18 openvox08-cmp0 setroubleshoot[123699]: SELinux is preventing /usr/bin/who from getattr access on the chr_file /dev/pts/1. For complete SELinux messages run: sealert -l 3339fa05-becf-48e4-be60-ae2e0c9ae2fb [x2]
== outbound00.cs.umd.edu (1 distinct, 6 total) ==
Oct 7 01:09:09 outbound00.cs.umd.edu python3[125411]: ldapdb [x6]
== outbound01.cs.umd.edu (2 distinct, 7 total) ==
Oct 7 01:13:06 outbound01.cs.umd.edu python3[1583505]: ldapdb [x6]
Oct 7 01:52:03 outbound01.cs.umd.edu krb5_child[1592317]: Client 'admin(a)UMD.EDU' not found in Kerberos database
== portal (1 distinct, 78 total) ==
Oct 7 01:05:26 portal setroubleshoot[1649515]: SELinux is preventing /usr/local/bin/traefik from connectto access on the unix_stream_socket /run/podman/podman.sock. For complete SELinux messages run: sealert -l e0a307a3-2c22-4320-8f9d-6a166c45222d [x78]
== strawberry (7 distinct, 38 total) ==
Oct 7 01:07:04 strawberry kernel: I/O error, dev sda, sector 206848 op 0x0:(READ) flags 0x80700 phys_seg 1 prio class 2 [x6]
Oct 7 01:07:04 strawberry kernel: I/O error, dev sda, sector 206848 op 0x0:(READ) flags 0x0 phys_seg 1 prio class 2 [x6]
Oct 7 01:07:04 strawberry kernel: Buffer I/O error on dev sda2, logical block 0, async page read [x6]
Oct 7 01:07:04 strawberry kernel: I/O error, dev sda, sector 2048 op 0x0:(READ) flags 0x80700 phys_seg 1 prio class 2 [x6]
Oct 7 01:07:04 strawberry kernel: I/O error, dev sda, sector 2048 op 0x0:(READ) flags 0x0 phys_seg 1 prio class 2 [x6]
Oct 7 01:07:04 strawberry kernel: Buffer I/O error on dev sda1, logical block 0, async page read [x6]
Oct 7 01:34:42 strawberry smartd[5314]: Device: /dev/sda [SAT], failed to read SMART Attribute Data [x2]
== submit10-cln25 (5 distinct, 1539 total) ==
Oct 7 01:05:22 submit10-cln25 rsyslogd: file '/var/log/messages': open error: Input/output error [v8.24.0-57.el7_9.3 try http://www.rsyslog.com/e/2433 ] [x1200]
Oct 7 01:05:22 submit10-cln25 rsyslogd: imjournal: fopen() failed for path: '/var/lib/rsyslog/imjournal.state.tmp': Input/output error [v8.24.0-57.el7_9.3 try http://www.rsyslog.com/e/2013 ] [x334]
Oct 7 01:25:00 submit10-cln25 systemd: Failed at step USER spawning /usr/libexec/pcp/bin/pmlogger_check: Input/output error [x2]
Oct 7 01:28:00 submit10-cln25 systemd: Failed at step USER spawning /usr/libexec/pcp/bin/pmie_check: Input/output error [x2]
Oct 7 01:30:00 submit10-cln25 systemd: Failed at step USER spawning /usr/libexec/pcp/bin/pmlogger_daily: Input/output error
== submit26-b9-3 (1 distinct, 5 total) ==
Sep 8 23:19:21 submit26-b9-3 systemd[1]: user(a)1001.service: Main process exited, code=killed, status=9/KILL [x5]
== submit26-b9-f1 (1 distinct, 2 total) ==
Oct 7 01:31:03 submit26-b9-f1 systemd[1]: user(a)1001.service: Main process exited, code=killed, status=9/KILL [x2]
== submit26-b9-f2 (1 distinct, 2 total) ==
Oct 7 01:45:12 submit26-b9-f2 systemd[1]: user(a)1001.service: Main process exited, code=killed, status=9/KILL [x2]
== submit26-b9-f3 (10 distinct, 11 total) ==
Oct 7 01:06:48 submit26-b9-f3 setroubleshoot[1893610]: SELinux is preventing /usr/bin/python3.9 from create access on the directory /(null). For complete SELinux messages run: sealert -l a653b772-cbcd-438b-bae5-23c3dc69b31b
Oct 7 01:06:48 submit26-b9-f3 setroubleshoot[1893610]: SELinux is preventing /usr/bin/python3.9 from add_name access on the directory /(null). For complete SELinux messages run: sealert -l 3e904634-6caa-4202-8c92-f139db798859
Oct 7 01:06:49 submit26-b9-f3 setroubleshoot[1893610]: SELinux is preventing /usr/bin/python3.9 from create access on the file /(null). For complete SELinux messages run: sealert -l 580b20e4-ec2c-433d-905c-5bd417fba033
Oct 7 01:06:49 submit26-b9-f3 setroubleshoot[1893610]: SELinux is preventing /usr/bin/python3.9 from open access on the file /tmp/libdnf.45nP6L/repodata/repomd.xml. For complete SELinux messages run: sealert -l 27f29d48-5e7c-4db7-b051-8ac055737d6f
Oct 7 01:06:49 submit26-b9-f3 setroubleshoot[1893610]: SELinux is preventing /usr/bin/python3.9 from setattr access on the file repomd.xml. For complete SELinux messages run: sealert -l bff72452-d40a-430b-9060-dd0a48f5b6ba
Oct 7 01:06:49 submit26-b9-f3 setroubleshoot[1893610]: SELinux is preventing /usr/bin/python3.9 from read access on the directory libdnf.45nP6L. For complete SELinux messages run: sealert -l 9638d396-8ce5-4e6a-ae47-45cd3985e1cd
Oct 7 01:06:49 submit26-b9-f3 setroubleshoot[1893610]: SELinux is preventing /usr/bin/python3.9 from remove_name access on the directory repomd.xml. For complete SELinux messages run: sealert -l 6da64b94-7024-45a9-b8c2-3b9812517407
Oct 7 01:06:49 submit26-b9-f3 setroubleshoot[1893610]: SELinux is preventing /usr/bin/python3.9 from unlink access on the file repomd.xml. For complete SELinux messages run: sealert -l 64cbe179-abf1-4d5a-bade-bb164897ee65
Oct 7 01:06:49 submit26-b9-f3 setroubleshoot[1893610]: SELinux is preventing /usr/bin/python3.9 from rmdir access on the directory repodata. For complete SELinux messages run: sealert -l d2e35b1a-e27c-4f91-9217-2bb1204e1e68
Oct 7 01:35:55 submit26-b9-f3 systemd[1]: user(a)1001.service: Main process exited, code=killed, status=9/KILL [x2]
== submit26-b9-f4 (9 distinct, 12 total) ==
Oct 7 01:24:54 submit26-b9-f4 setroubleshoot[182475]: SELinux is preventing /usr/bin/python3.9 from create access on the directory /(null). For complete SELinux messages run: sealert -l ee160f23-b161-4f4a-9985-c4edfd3a5beb
Oct 7 01:24:54 submit26-b9-f4 setroubleshoot[182475]: SELinux is preventing /usr/bin/python3.9 from add_name access on the directory /(null). For complete SELinux messages run: sealert -l 89a83821-4b24-4081-9973-0a79ca6ed5b4
Oct 7 01:24:54 submit26-b9-f4 setroubleshoot[182475]: SELinux is preventing /usr/bin/python3.9 from create access on the file /(null). For complete SELinux messages run: sealert -l f73955d6-1416-45f9-bab6-ff1f3ea07e9d [x2]
Oct 7 01:24:54 submit26-b9-f4 setroubleshoot[182475]: SELinux is preventing /usr/bin/python3.9 from open access on the file /tmp/libdnf.p5zTge/repodata/repomd.xml. For complete SELinux messages run: sealert -l 9f8f24a0-8fb6-454d-a103-31a8f7a6efa0 [x2]
Oct 7 01:24:54 submit26-b9-f4 setroubleshoot[182475]: SELinux is preventing /usr/bin/python3.9 from setattr access on the file repomd.xml. For complete SELinux messages run: sealert -l 20293136-86a3-40ba-a651-cff48d36059e [x2]
Oct 7 01:24:54 submit26-b9-f4 setroubleshoot[182475]: SELinux is preventing /usr/bin/python3.9 from read access on the directory libdnf.p5zTge. For complete SELinux messages run: sealert -l 25f86b49-4ee7-4f60-ad1c-73a70032560c
Oct 7 01:24:54 submit26-b9-f4 setroubleshoot[182475]: SELinux is preventing /usr/bin/python3.9 from remove_name access on the directory repomd.xml. For complete SELinux messages run: sealert -l eec250fb-073f-456d-93bc-f98776fd476d
Oct 7 01:24:54 submit26-b9-f4 setroubleshoot[182475]: SELinux is preventing /usr/bin/python3.9 from unlink access on the file repomd.xml. For complete SELinux messages run: sealert -l c9209e04-a349-43d5-8cb2-3e303e48df74
Oct 7 01:24:54 submit26-b9-f4 setroubleshoot[182475]: SELinux is preventing /usr/bin/python3.9 from rmdir access on the directory repodata. For complete SELinux messages run: sealert -l 3178d5f5-80e9-404b-92b7-9bef397a8915
== syslog01 (1 distinct, 1 total) ==
Oct 7 01:45:39 syslog01 rsyslogd: imrelp[2514]: error 'error when receiving data, session broken', object 'lstn 2514: conn to clt 10.73.237.31/submit26-b9-3.cs.umd.edu' - input may not work as intended [v8.2510.0-5.el10 try https://www.rsyslog.com/e/2353 ]
1
0
Command: /usr/local/sbin/syslog-digest.py
Time : 0.2081s
Status : exited 0
Output :
Syslog digest — 2026-10-07 01:05 EDT
Processed 7,778 lines, filtered 4,141 (53%). 3,637 unknown (671 distinct) from 39 host(s).
== abuse (1 distinct, 348 total) ==
Oct 7 00:05:25 abuse rsyslogd[1033]: imjournal: open() failed for path: '/var/lib/rsyslog/imjournal.state.tmp': Input/output error [v8.2404.0 try https://www.rsyslog.com/e/2433 ] [x348]
== atif01.cs.umd.edu (1 distinct, 1 total) ==
Oct 7 01:01:39 atif01.cs.umd.edu kernel: net_ratelimit: 11 callbacks suppressed
== b0b02.cs.umd.edu (1 distinct, 1 total) ==
Oct 7 00:16:52 b0b02.cs.umd.edu rustdesk[1047790]: cannot open display:
== bachata (1 distinct, 1 total) ==
Oct 7 00:05:18 bachata kernel: clocksource: timekeeping watchdog on CPU0: kvm-clock retried 1 times before success
== biggulp.cs.umd.edu (1 distinct, 1 total) ==
Oct 7 00:25:36 biggulp.cs.umd.edu pcp[94905]: pmlogger_daily failed - see /var/log/pcp/pmlogger/pmlogger_daily-K.log
== cheezit.cs.umd.edu (1 distinct, 1 total) ==
Oct 7 00:25:27 cheezit.cs.umd.edu pcp[129563]: pmlogger_daily failed - see /var/log/pcp/pmlogger/pmlogger_daily-K.log
== cmsc436-0101-redis (3 distinct, 3 total) ==
Oct 7 00:43:57 cmsc436-0101-redis krb5_child[54162]: Client 'admin(a)UMD.EDU' not found in Kerberos database
Oct 7 00:43:59 cmsc436-0101-redis sshd-session[54158]: error: PAM: Authentication failure for admin from 34.38.237.125
Oct 7 00:44:28 cmsc436-0101-redis sshd-session[54169]: error: Protocol major versions differ: 2 vs. 1
== gle-dind00.cs.umd.edu (4 distinct, 4 total) ==
Oct 7 00:09:06 gle-dind00.cs.umd.edu systemd-udevd[2684618]: Could not generate persistent MAC address for vethafd079b: No such file or directory
Oct 7 00:09:06 gle-dind00.cs.umd.edu systemd-udevd[2684619]: Could not generate persistent MAC address for veth97d0592: No such file or directory
Oct 7 00:09:40 gle-dind00.cs.umd.edu systemd-udevd[2684777]: Could not generate persistent MAC address for vethb98d92b: No such file or directory
Oct 7 00:09:40 gle-dind00.cs.umd.edu systemd-udevd[2684778]: Could not generate persistent MAC address for vetha53e833: No such file or directory
== gle-omnibus00.cs.umd.edu (23 distinct, 31 total) ==
Oct 7 00:08:37 gle-omnibus00.cs.umd.edu falcon-sensor-bpf[935]: CrowdStrike(4): Could not retrieve DisableProxy value: c0000225 [x3]
Oct 7 00:08:37 gle-omnibus00.cs.umd.edu falcon-sensor-bpf[935]: CrowdStrike(4): ConnectWithProxy: Unable to get application proxy host from CsConfig: c0000225 [x3]
Oct 7 00:24:24 gle-omnibus00.cs.umd.edu sshd-session[1018549]: error: mm_reap: preauth child terminated by signal 15 [x4]
Oct 7 00:24:24 gle-omnibus00.cs.umd.edu kernel: sda1: Can't mount, would change RO state
Oct 7 00:24:25 gle-omnibus00.cs.umd.edu falcon-sensor-bpf[935]: CrowdStrike(4): SSLSocket Disconnected from Cloud. [x2]
Oct 7 00:24:47 gle-omnibus00.cs.umd.edu sshd-session[1436085]: pam_systemd(sshd:session): Failed to create session: Transaction for session-3198.scope/start is destructive (user.slice has 'stop' job queued, but 'start' is included in transaction).
Oct 7 00:25:44 gle-omnibus00.cs.umd.edu kernel: shpchp 0000:05:01.0: pci_hp_register failed with error -16
Oct 7 00:25:44 gle-omnibus00.cs.umd.edu kernel: shpchp 0000:05:01.0: Slot initialization failed
Oct 7 00:25:44 gle-omnibus00.cs.umd.edu kernel: shpchp 0000:05:02.0: pci_hp_register failed with error -16
Oct 7 00:25:44 gle-omnibus00.cs.umd.edu kernel: shpchp 0000:05:02.0: Slot initialization failed
Oct 7 00:25:44 gle-omnibus00.cs.umd.edu kernel: shpchp 0000:05:03.0: pci_hp_register failed with error -16
Oct 7 00:25:44 gle-omnibus00.cs.umd.edu kernel: shpchp 0000:05:03.0: Slot initialization failed
Oct 7 00:25:44 gle-omnibus00.cs.umd.edu kernel: shpchp 0000:05:04.0: pci_hp_register failed with error -16
Oct 7 00:25:44 gle-omnibus00.cs.umd.edu kernel: shpchp 0000:05:04.0: Slot initialization failed
Oct 7 00:25:45 gle-omnibus00.cs.umd.edu kernel: device-mapper: core: CONFIG_IMA_DISABLE_HTABLE is disabled. Duplicate IMA measurements will not be recorded in the IMA log.
Oct 7 00:25:45 gle-omnibus00.cs.umd.edu kernel: sd 1:0:0:1: Power-on or device reset occurred
Oct 7 00:25:45 gle-omnibus00.cs.umd.edu kernel: sd 0:0:0:0: Power-on or device reset occurred
Oct 7 00:25:47 gle-omnibus00.cs.umd.edu lvm[897]: PV /dev/sda2 online, VG rhel_gle-omnibus01 is complete.
Oct 7 00:25:48 gle-omnibus00.cs.umd.edu kernel: snd_hda_intel 0000:00:1b.0: no codecs found!
Oct 7 00:25:54 gle-omnibus00.cs.umd.edu kernel: block dm-0: the capability attribute has been deprecated.
Oct 7 00:29:25 gle-omnibus00.cs.umd.edu puppet-agent[8304]: Connection to https://openvox08-cmp2.cs.umd.edu:8140/puppet/v3 failed, trying next route: Request to https://openvox08-cmp2.cs.umd.edu:8140/puppet/v3 failed after 0.002 seconds: Failed to open TCP connection to openvox08-cmp2.cs.umd.edu:8140 (Connection refused - connect(2) for "openvox08-cmp2.cs.umd.edu" port 8140)
Oct 7 00:29:25 gle-omnibus00.cs.umd.edu puppet-agent[8304]: Wrapped exception:
Oct 7 00:29:25 gle-omnibus00.cs.umd.edu puppet-agent[8304]: Failed to open TCP connection to openvox08-cmp2.cs.umd.edu:8140 (Connection refused - connect(2) for "openvox08-cmp2.cs.umd.edu" port 8140)
== grades01.cs.umd.edu (3 distinct, 4 total) ==
Oct 7 00:10:13 grades01.cs.umd.edu systemd[1]: New main PID 29411 does not belong to service, and PID file is not owned by root. Refusing. [x2]
Oct 7 00:10:34 grades01.cs.umd.edu systemd[1]: Daemon never wrote its PID file. Failing.
Oct 7 00:10:49 grades01.cs.umd.edu systemd[1]: pmlogger.service: Supervising process 4408 which is not our child. We'll most likely not notice when it exits.
== idm00 (2 distinct, 2 total) ==
Oct 7 00:52:13 idm00 named[4166701]: client @0x7f11a4046478 10.73.245.12#55479: update '73.10.in-addr.arpa/IN' denied
Oct 7 00:54:41 idm00 named[4166701]: client @0x7f11a006bce8 10.73.240.42#54058: update '73.10.in-addr.arpa/IN' denied
== idmp0 (1 distinct, 1 total) ==
Oct 7 00:39:23 idmp0 named[1598691]: client @0x7f2d2c035088 10.73.240.43#55790: update '73.10.in-addr.arpa/IN' denied
== inbound01.cs.umd.edu (1 distinct, 1 total) ==
Oct 7 00:30:28 inbound01.cs.umd.edu krb5_child[1698322]: Client 'admin(a)UMD.EDU' not found in Kerberos database
== itmon02 (1 distinct, 6 total) ==
Oct 7 00:13:51 itmon02 sshd[805675]: error: beginning MaxStartups throttling [x6]
== jubjub.cs.umd.edu (3 distinct, 4 total) ==
Oct 7 00:10:11 jubjub.cs.umd.edu systemd[1]: New main PID 456813 does not belong to service, and PID file is not owned by root. Refusing. [x2]
Oct 7 00:10:31 jubjub.cs.umd.edu systemd[1]: Daemon never wrote its PID file. Failing.
Oct 7 00:10:39 jubjub.cs.umd.edu systemd[1]: pmlogger.service: Supervising process 464150 which is not our child. We'll most likely not notice when it exits.
== mashie (406 distinct, 928 total) ==
Oct 7 00:40:09 mashie kernel: blk_print_req_error: 16 callbacks suppressed
Oct 7 00:40:09 mashie kernel: I/O error, dev vda, sector 3170896128 op 0x0:(READ) flags 0x3000 phys_seg 1 prio class 0 [x4]
Oct 7 00:40:09 mashie kernel: EXT4-fs error: 3910 callbacks suppressed
Oct 7 00:40:09 mashie kernel: EXT4-fs error (device vda1): __ext4_get_inode_loc_noinmem:4810: inode #99283969: block 396361760: comm find: unable to read itable block [x10]
Oct 7 00:40:09 mashie kernel: I/O error, dev vda, sector 2048 op 0x1:(WRITE) flags 0x3800 phys_seg 1 prio class 0 [x61]
Oct 7 00:40:09 mashie kernel: buffer_io_error: 3910 callbacks suppressed
Oct 7 00:40:09 mashie kernel: Buffer I/O error on dev vda1, logical block 0, lost sync page write [x152]
Oct 7 00:40:09 mashie kernel: EXT4-fs: 7830 callbacks suppressed
Oct 7 00:40:09 mashie kernel: EXT4-fs (vda1): I/O error while writing superblock [x123]
Oct 7 00:40:09 mashie kernel: EXT4-fs warning: 603 callbacks suppressed
Oct 7 00:40:09 mashie kernel: EXT4-fs warning (device vda1): htree_dirblock_to_tree:1084: inode #17729319: lblock 0: comm find: error -5 reading directory block
Oct 7 00:40:09 mashie kernel: EXT4-fs warning (device vda1): htree_dirblock_to_tree:1084: inode #17729329: lblock 0: comm find: error -5 reading directory block
Oct 7 00:40:09 mashie kernel: EXT4-fs warning (device vda1): htree_dirblock_to_tree:1084: inode #17729331: lblock 0: comm find: error -5 reading directory block
Oct 7 00:40:09 mashie kernel: EXT4-fs warning (device vda1): htree_dirblock_to_tree:1084: inode #17729330: lblock 0: comm find: error -5 reading directory block
Oct 7 00:40:09 mashie kernel: EXT4-fs warning (device vda1): htree_dirblock_to_tree:1084: inode #17729327: lblock 0: comm find: error -5 reading directory block
Oct 7 00:40:09 mashie kernel: EXT4-fs warning (device vda1): htree_dirblock_to_tree:1084: inode #17729324: lblock 0: comm find: error -5 reading directory block
Oct 7 00:40:09 mashie kernel: EXT4-fs warning (device vda1): htree_dirblock_to_tree:1084: inode #17729325: lblock 0: comm find: error -5 reading directory block
Oct 7 00:40:09 mashie kernel: EXT4-fs warning (device vda1): htree_dirblock_to_tree:1084: inode #17729322: lblock 0: comm find: error -5 reading directory block
Oct 7 00:40:09 mashie kernel: EXT4-fs warning (device vda1): htree_dirblock_to_tree:1084: inode #17729323: lblock 0: comm find: error -5 reading directory block
Oct 7 00:40:09 mashie kernel: EXT4-fs warning (device vda1): htree_dirblock_to_tree:1084: inode #17729296: lblock 0: comm find: error -5 reading directory block
Oct 7 00:40:14 mashie kernel: blk_print_req_error: 229244 callbacks suppressed
Oct 7 00:40:14 mashie kernel: I/O error, dev vda, sector 3896519016 op 0x0:(READ) flags 0x80700 phys_seg 1 prio class 0 [x2]
Oct 7 00:40:14 mashie kernel: I/O error, dev vda, sector 3896519024 op 0x0:(READ) flags 0x3000 phys_seg 1 prio class 0 [x2]
Oct 7 00:40:14 mashie kernel: I/O error, dev vda, sector 3896519184 op 0x0:(READ) flags 0x80700 phys_seg 1 prio class 0
Oct 7 00:40:14 mashie kernel: EXT4-fs error: 34118 callbacks suppressed
Oct 7 00:40:14 mashie kernel: EXT4-fs error (device vda1): __ext4_get_inode_loc_noinmem:4810: inode #122020326: block 487064622: comm find: unable to read itable block [x2]
Oct 7 00:40:14 mashie kernel: buffer_io_error: 34117 callbacks suppressed
Oct 7 00:40:14 mashie kernel: EXT4-fs: 34926 callbacks suppressed
Oct 7 00:40:14 mashie kernel: I/O error, dev vda, sector 3896518928 op 0x0:(READ) flags 0x80700 phys_seg 9 prio class 0
Oct 7 00:40:14 mashie kernel: I/O error, dev vda, sector 3896519032 op 0x0:(READ) flags 0x80700 phys_seg 2 prio class 0
... 376 more distinct messages not shown
== mcstic (3 distinct, 6 total) ==
Oct 7 00:54:56 mcstic krb5_child[1629846]: Client 'admin(a)UMD.EDU' not found in Kerberos database [x4]
Oct 7 00:55:00 mcstic sshd[1629841]: error: PAM: Authentication failure for admin from 34.78.103.39
Oct 7 00:56:00 mcstic sshd[1630073]: error: Protocol major versions differ: 2 vs. 1
== misty.cs.umd.edu (3 distinct, 4 total) ==
Oct 7 00:10:15 misty.cs.umd.edu systemd[1]: New main PID 40586 does not belong to service, and PID file is not owned by root. Refusing. [x2]
Oct 7 00:10:35 misty.cs.umd.edu systemd[1]: Daemon never wrote its PID file. Failing.
Oct 7 00:10:50 misty.cs.umd.edu systemd[1]: pmlogger.service: Supervising process 7751 which is not our child. We'll most likely not notice when it exits.
== munin (2 distinct, 52 total) ==
Oct 7 00:08:03 munin sudo[1016601]: pam_systemd(sudo:session): Failed to stat() runtime directory '/run/user/0': No such file or directory [x26]
Oct 7 00:08:03 munin sudo[1016601]: pam_systemd(sudo:session): Not setting $XDG_RUNTIME_DIR, as the directory is not in order. [x26]
== newhonors2 (1 distinct, 24 total) ==
Oct 7 00:13:03 newhonors2 dhcpcd[3662203]: dhcpcd is not running [x24]
== ntop00 (96 distinct, 96 total) ==
Oct 7 00:05:01 ntop00 nfacctd[1075699]: INFO ( m1/mysql ): *** Purging cache - START (PID: 4426) ***
Oct 7 00:05:01 ntop00 nfacctd[1075699]: INFO ( m1/mysql ): *** Purging cache - END (PID: 4426, QN: 62/62, ET: 0) ***
Oct 7 00:05:04 ntop00 sfacctd[1075592]: INFO ( m1/mysql ): *** Purging cache - END (PID: 4426, QN: 2225/2225, ET: 3) ***
Oct 7 00:08:01 ntop00 nfacctd[1075699]: INFO ( p1/print ): *** Purging cache - START (PID: 4427) ***
Oct 7 00:08:01 ntop00 nfacctd[1075699]: INFO ( p1/print ): *** Purging cache - END (PID: 4427, QN: 66/66, ET: 0) ***
Oct 7 00:08:01 ntop00 sfacctd[1075592]: INFO ( p1/print ): *** Purging cache - START (PID: 4427) ***
Oct 7 00:08:01 ntop00 sfacctd[1075592]: INFO ( p1/print ): *** Purging cache - END (PID: 4427, QN: 2524/2524, ET: 0) ***
Oct 7 00:10:01 ntop00 sfacctd[1075592]: INFO ( m1/mysql ): *** Purging cache - START (PID: 4428) ***
Oct 7 00:10:01 ntop00 nfacctd[1075699]: INFO ( m1/mysql ): *** Purging cache - START (PID: 4428) ***
Oct 7 00:10:02 ntop00 nfacctd[1075699]: INFO ( m1/mysql ): *** Purging cache - END (PID: 4428, QN: 56/56, ET: 1) ***
Oct 7 00:10:05 ntop00 sfacctd[1075592]: INFO ( m1/mysql ): *** Purging cache - END (PID: 4428, QN: 2695/2695, ET: 4) ***
Oct 7 00:13:01 ntop00 sfacctd[1075592]: INFO ( p1/print ): *** Purging cache - START (PID: 4429) ***
Oct 7 00:13:01 ntop00 sfacctd[1075592]: INFO ( p1/print ): *** Purging cache - END (PID: 4429, QN: 2409/2409, ET: 0) ***
Oct 7 00:13:01 ntop00 nfacctd[1075699]: INFO ( p1/print ): *** Purging cache - START (PID: 4429) ***
Oct 7 00:13:01 ntop00 nfacctd[1075699]: INFO ( p1/print ): *** Purging cache - END (PID: 4429, QN: 58/58, ET: 0) ***
Oct 7 00:15:01 ntop00 sfacctd[1075592]: INFO ( m1/mysql ): *** Purging cache - START (PID: 4430) ***
Oct 7 00:15:01 ntop00 nfacctd[1075699]: INFO ( m1/mysql ): *** Purging cache - START (PID: 4430) ***
Oct 7 00:15:01 ntop00 nfacctd[1075699]: INFO ( m1/mysql ): *** Purging cache - END (PID: 4430, QN: 54/54, ET: 0) ***
Oct 7 00:15:04 ntop00 sfacctd[1075592]: INFO ( m1/mysql ): *** Purging cache - END (PID: 4430, QN: 2253/2253, ET: 3) ***
Oct 7 00:18:01 ntop00 sfacctd[1075592]: INFO ( p1/print ): *** Purging cache - START (PID: 4431) ***
Oct 7 00:18:01 ntop00 sfacctd[1075592]: INFO ( p1/print ): *** Purging cache - END (PID: 4431, QN: 2304/2304, ET: 0) ***
Oct 7 00:18:01 ntop00 nfacctd[1075699]: INFO ( p1/print ): *** Purging cache - START (PID: 4431) ***
Oct 7 00:18:01 ntop00 nfacctd[1075699]: INFO ( p1/print ): *** Purging cache - END (PID: 4431, QN: 53/53, ET: 0) ***
Oct 7 00:20:01 ntop00 sfacctd[1075592]: INFO ( m1/mysql ): *** Purging cache - START (PID: 4432) ***
Oct 7 00:20:01 ntop00 nfacctd[1075699]: INFO ( m1/mysql ): *** Purging cache - START (PID: 4432) ***
Oct 7 00:20:01 ntop00 nfacctd[1075699]: INFO ( m1/mysql ): *** Purging cache - END (PID: 4432, QN: 50/50, ET: 0) ***
Oct 7 00:20:04 ntop00 sfacctd[1075592]: INFO ( m1/mysql ): *** Purging cache - END (PID: 4432, QN: 2240/2240, ET: 3) ***
Oct 7 00:23:01 ntop00 sfacctd[1075592]: INFO ( p1/print ): *** Purging cache - START (PID: 4433) ***
Oct 7 00:23:01 ntop00 sfacctd[1075592]: INFO ( p1/print ): *** Purging cache - END (PID: 4433, QN: 2146/2146, ET: 0) ***
Oct 7 00:23:01 ntop00 nfacctd[1075699]: INFO ( p1/print ): *** Purging cache - START (PID: 4433) ***
... 66 more distinct messages not shown
== openrepo (1 distinct, 1 total) ==
Oct 7 00:34:27 openrepo (nin-node)[1119344]: munin-node.service: Referenced but unset environment variable evaluates to an empty string: DAEMON_ARGS
== openvox08-cmp2 (29 distinct, 369 total) ==
Oct 7 00:05:01 openvox08-cmp2 rsyslogd[983]: imjournal: open() failed for path: '/var/lib/rsyslog/imjournal.state.tmp': Input/output error [v8.2510.0-5.el10 try https://www.rsyslog.com/e/2433 ] [x335]
Oct 7 00:07:01 openvox08-cmp2 systemd[1]: plocate-updatedb.service: Failed to spawn 'start' task: Input/output error
Oct 7 00:28:56 openvox08-cmp2 sshd[3409265]: fatal: rexec of /usr/libexec/openssh/sshd-session failed: Input/output error [x3]
Oct 7 00:28:56 openvox08-cmp2 sshd[2602237]: error: ssh_msg_send: write: Broken pipe [x3]
Oct 7 00:28:56 openvox08-cmp2 sshd[2602237]: error: send_rexec_state: ssh_msg_send failed [x3]
Oct 7 00:28:56 openvox08-cmp2 rsyslogd[983]: file '/var/log/secure'[16] write error - see https://www.rsyslog.com/solving-rsyslog-write-errors/ for help OS error: Input/output error [v8.2510.0-5.el10 try https://www.rsyslog.com/e/2027 ]
Oct 7 00:28:56 openvox08-cmp2 rsyslogd[983]: file '/var/log/secure': open error: Input/output error [v8.2510.0-5.el10 try https://www.rsyslog.com/e/2433 ]
Oct 7 01:02:35 openvox08-cmp2 kernel: shpchp 0000:05:01.0: pci_hp_register failed with error -16
Oct 7 01:02:35 openvox08-cmp2 kernel: shpchp 0000:05:01.0: Slot initialization failed
Oct 7 01:02:35 openvox08-cmp2 kernel: shpchp 0000:05:02.0: pci_hp_register failed with error -16
Oct 7 01:02:35 openvox08-cmp2 kernel: shpchp 0000:05:02.0: Slot initialization failed
Oct 7 01:02:35 openvox08-cmp2 kernel: shpchp 0000:05:03.0: pci_hp_register failed with error -16
Oct 7 01:02:35 openvox08-cmp2 kernel: shpchp 0000:05:03.0: Slot initialization failed
Oct 7 01:02:35 openvox08-cmp2 kernel: shpchp 0000:05:04.0: pci_hp_register failed with error -16
Oct 7 01:02:35 openvox08-cmp2 kernel: shpchp 0000:05:04.0: Slot initialization failed
Oct 7 01:02:36 openvox08-cmp2 kernel: device-mapper: core: CONFIG_IMA_DISABLE_HTABLE is disabled. Duplicate IMA measurements will not be recorded in the IMA log.
Oct 7 01:02:36 openvox08-cmp2 kernel: sd 0:0:0:0: Power-on or device reset occurred
Oct 7 01:02:39 openvox08-cmp2 lvm[827]: PV /dev/sda3 online, VG rhel_openvox08-cmp00 is complete.
Oct 7 01:02:39 openvox08-cmp2 kernel: snd_hda_intel 0000:00:1b.0: no codecs found!
Oct 7 01:02:40 openvox08-cmp2 (lldpd)[936]: lldpd.service: Referenced but unset environment variable evaluates to an empty string: DAEMON_ARGS
Oct 7 01:02:42 openvox08-cmp2 kernel: block dm-0: the capability attribute has been deprecated.
Oct 7 01:02:50 openvox08-cmp2 irqbalance[909]: Cannot change IRQ 35 affinity: Permission denied
Oct 7 01:02:50 openvox08-cmp2 irqbalance[909]: IRQ 35 affinity is now unmanaged
Oct 7 01:02:50 openvox08-cmp2 irqbalance[909]: Cannot change IRQ 33 affinity: Permission denied
Oct 7 01:02:50 openvox08-cmp2 irqbalance[909]: IRQ 33 affinity is now unmanaged
Oct 7 01:02:50 openvox08-cmp2 irqbalance[909]: Cannot change IRQ 36 affinity: Permission denied
Oct 7 01:02:50 openvox08-cmp2 irqbalance[909]: IRQ 36 affinity is now unmanaged
Oct 7 01:04:40 openvox08-cmp2 irqbalance[909]: Cannot change IRQ 34 affinity: Permission denied
Oct 7 01:04:40 openvox08-cmp2 irqbalance[909]: IRQ 34 affinity is now unmanaged
== outbound00.cs.umd.edu (1 distinct, 6 total) ==
Oct 7 00:09:09 outbound00.cs.umd.edu python3[108795]: ldapdb [x6]
== outbound01.cs.umd.edu (1 distinct, 6 total) ==
Oct 7 00:13:07 outbound01.cs.umd.edu python3[1569587]: ldapdb [x6]
== portal (1 distinct, 80 total) ==
Oct 7 00:05:04 portal setroubleshoot[1636763]: SELinux is preventing /usr/local/bin/traefik from connectto access on the unix_stream_socket /run/podman/podman.sock. For complete SELinux messages run: sealert -l e0a307a3-2c22-4320-8f9d-6a166c45222d [x80]
== sebatinsky.cs.umd.edu (1 distinct, 1 total) ==
Oct 7 00:25:33 sebatinsky.cs.umd.edu kernel: hpet1: lost 12 rtc interrupts
== soul (2 distinct, 2 total) ==
Oct 7 00:45:25 soul krb5_child[3381284]: Client 'admin(a)UMD.EDU' not found in Kerberos database
Oct 7 00:45:46 soul sshd-session[3381424]: error: Protocol major versions differ: 2 vs. 1
== splunkforwarder.cs.umd.edu (38 distinct, 38 total) ==
Oct 7 00:50:15 splunkforwarder.cs.umd.edu kernel: ACPI: RSDP 00000000000f52b0 00014 (v00 BOCHS )
Oct 7 00:50:15 splunkforwarder.cs.umd.edu kernel: ACPI: RSDT 000000007ffe3b52 00034 (v01 BOCHS BXPC 00000001 BXPC 00000001)
Oct 7 00:50:15 splunkforwarder.cs.umd.edu kernel: ACPI: FACP 000000007ffe396c 00074 (v01 BOCHS BXPC 00000001 BXPC 00000001)
Oct 7 00:50:15 splunkforwarder.cs.umd.edu kernel: ACPI: DSDT 000000007ffdf040 0492C (v01 BOCHS BXPC 00000001 BXPC 00000001)
Oct 7 00:50:15 splunkforwarder.cs.umd.edu kernel: ACPI: FACS 000000007ffdf000 00040
Oct 7 00:50:15 splunkforwarder.cs.umd.edu kernel: ACPI: APIC 000000007ffe39e0 00080 (v03 BOCHS BXPC 00000001 BXPC 00000001)
Oct 7 00:50:15 splunkforwarder.cs.umd.edu kernel: ACPI: SSDT 000000007ffe3a60 000CA (v01 BOCHS VMGENID 00000001 BXPC 00000001)
Oct 7 00:50:15 splunkforwarder.cs.umd.edu kernel: ACPI: WAET 000000007ffe3b2a 00028 (v01 BOCHS BXPC 00000001 BXPC 00000001)
Oct 7 00:50:15 splunkforwarder.cs.umd.edu kernel: Zone ranges:
Oct 7 00:50:15 splunkforwarder.cs.umd.edu kernel: DMA [mem 0x00001000-0x00ffffff]
Oct 7 00:50:15 splunkforwarder.cs.umd.edu kernel: DMA32 [mem 0x01000000-0xffffffff]
Oct 7 00:50:15 splunkforwarder.cs.umd.edu kernel: Normal empty
Oct 7 00:50:15 splunkforwarder.cs.umd.edu kernel: Movable zone start for each node
Oct 7 00:50:15 splunkforwarder.cs.umd.edu kernel: Early memory node ranges
Oct 7 00:50:15 splunkforwarder.cs.umd.edu kernel: node 0: [mem 0x00001000-0x0009efff]
Oct 7 00:50:15 splunkforwarder.cs.umd.edu kernel: node 0: [mem 0x00100000-0x7ffd9fff]
Oct 7 00:50:15 splunkforwarder.cs.umd.edu kernel: Built 1 zonelists in Node order, mobility grouping on. Total pages: 515939
Oct 7 00:50:15 splunkforwarder.cs.umd.edu kernel: Policy zone: DMA32
Oct 7 00:50:15 splunkforwarder.cs.umd.edu kernel: ACPI: All ACPI Tables successfully acquired
Oct 7 00:50:15 splunkforwarder.cs.umd.edu kernel: ACPI: Enabled 3 GPEs in block 00 to 0F
Oct 7 00:50:15 splunkforwarder.cs.umd.edu kernel: acpi PNP0A03:00: fail to add MMCONFIG information, can't access extended PCI configuration space under this bridge.
Oct 7 00:50:15 splunkforwarder.cs.umd.edu kernel: ACPI: PCI Interrupt Link [LNKD] enabled at IRQ 11
Oct 7 00:50:15 splunkforwarder.cs.umd.edu kernel: Dquot-cache hash table entries: 512 (order 0, 4096 bytes)
Oct 7 00:50:16 splunkforwarder.cs.umd.edu kernel: ACPI: PCI Interrupt Link [LNKC] enabled at IRQ 10
Oct 7 00:50:16 splunkforwarder.cs.umd.edu kernel: ACPI: PCI Interrupt Link [LNKB] enabled at IRQ 10
Oct 7 00:50:16 splunkforwarder.cs.umd.edu kernel: ACPI: PCI Interrupt Link [LNKA] enabled at IRQ 11
Oct 7 00:50:22 splunkforwarder.cs.umd.edu systemd[1]: [/usr/lib/systemd/system/lldpd.service:16] Unknown lvalue 'ProtectKernelTunables' in section 'Service'
Oct 7 00:50:22 splunkforwarder.cs.umd.edu systemd[1]: [/usr/lib/systemd/system/lldpd.service:17] Unknown lvalue 'ProtectControlGroups' in section 'Service'
Oct 7 00:50:22 splunkforwarder.cs.umd.edu systemd[1]: [/usr/lib/systemd/system/lldpd.service:18] Unknown lvalue 'ProtectKernelModules' in section 'Service'
Oct 7 00:50:22 splunkforwarder.cs.umd.edu systemd[1]: Cannot add dependency job for unit mcollective.service, ignoring: Unit not found.
... 8 more distinct messages not shown
== strawberry (8 distinct, 39 total) ==
Oct 7 00:07:04 strawberry kernel: I/O error, dev sda, sector 206848 op 0x0:(READ) flags 0x80700 phys_seg 1 prio class 2 [x6]
Oct 7 00:07:04 strawberry kernel: I/O error, dev sda, sector 206848 op 0x0:(READ) flags 0x0 phys_seg 1 prio class 2 [x6]
Oct 7 00:07:04 strawberry kernel: Buffer I/O error on dev sda2, logical block 0, async page read [x6]
Oct 7 00:07:04 strawberry kernel: I/O error, dev sda, sector 2048 op 0x0:(READ) flags 0x80700 phys_seg 1 prio class 2 [x6]
Oct 7 00:07:04 strawberry kernel: I/O error, dev sda, sector 2048 op 0x0:(READ) flags 0x0 phys_seg 1 prio class 2 [x6]
Oct 7 00:07:04 strawberry kernel: Buffer I/O error on dev sda1, logical block 0, async page read [x6]
Oct 7 00:34:42 strawberry smartd[5314]: Device: /dev/sda [SAT], failed to read SMART Attribute Data [x2]
Oct 7 01:04:42 strawberry smartd[5314]: Device: /dev/sda [SAT], not capable of Offline or Self-Testing.
== submit10-cln25 (6 distinct, 1543 total) ==
Oct 7 00:05:22 submit10-cln25 rsyslogd: imjournal: fopen() failed for path: '/var/lib/rsyslog/imjournal.state.tmp': Input/output error [v8.24.0-57.el7_9.3 try http://www.rsyslog.com/e/2013 ] [x336]
Oct 7 00:05:22 submit10-cln25 rsyslogd: file '/var/log/messages': open error: Input/output error [v8.24.0-57.el7_9.3 try http://www.rsyslog.com/e/2433 ] [x1200]
Oct 7 00:08:00 submit10-cln25 systemd: Failed at step USER spawning /usr/libexec/pcp/bin/pmie_daily: Input/output error
Oct 7 00:10:00 submit10-cln25 systemd: Failed at step USER spawning /usr/libexec/pcp/bin/pmlogger_daily: Input/output error [x2]
Oct 7 00:25:00 submit10-cln25 systemd: Failed at step USER spawning /usr/libexec/pcp/bin/pmlogger_check: Input/output error [x2]
Oct 7 00:28:00 submit10-cln25 systemd: Failed at step USER spawning /usr/libexec/pcp/bin/pmie_check: Input/output error [x2]
== submit26-b9-f2 (1 distinct, 1 total) ==
Oct 7 00:23:12 submit26-b9-f2 systemd[1]: user(a)1001.service: Main process exited, code=killed, status=9/KILL
== submit26-b9-f3 (1 distinct, 1 total) ==
Oct 7 00:23:09 submit26-b9-f3 systemd[1]: user(a)1001.service: Main process exited, code=killed, status=9/KILL
== submit26-b9-f4 (1 distinct, 1 total) ==
Oct 7 00:15:07 submit26-b9-f4 systemd[1]: user(a)1001.service: Main process exited, code=killed, status=9/KILL
== submit26-b9-fclone (10 distinct, 14 total) ==
Oct 7 00:22:04 submit26-b9-fclone setroubleshoot[1142171]: SELinux is preventing /usr/bin/python3.9 from create access on the directory /(null). For complete SELinux messages run: sealert -l 9355d9d9-a311-48d2-bd37-6c0f6947dfff [x2]
Oct 7 00:22:04 submit26-b9-fclone setroubleshoot[1142171]: SELinux is preventing /usr/bin/python3.9 from add_name access on the directory /(null). For complete SELinux messages run: sealert -l cc4658d7-9db1-405d-9eee-de0ccee5857f [x2]
Oct 7 00:22:04 submit26-b9-fclone setroubleshoot[1142171]: SELinux is preventing /usr/bin/python3.9 from create access on the file /(null). For complete SELinux messages run: sealert -l 568a2429-0b1b-49df-af41-49b5cd298ae8
Oct 7 00:22:04 submit26-b9-fclone setroubleshoot[1142171]: SELinux is preventing /usr/bin/python3.9 from open access on the file /tmp/libdnf.dj5n8b/repodata/repomd.xml. For complete SELinux messages run: sealert -l 03e2f521-0e7c-481f-8e92-0602c6adeedc
Oct 7 00:22:04 submit26-b9-fclone setroubleshoot[1142171]: SELinux is preventing /usr/bin/python3.9 from setattr access on the file repomd.xml. For complete SELinux messages run: sealert -l 0d6b7b1f-ebe3-4beb-915a-b06b63bf2566
Oct 7 00:22:04 submit26-b9-fclone setroubleshoot[1142171]: SELinux is preventing /usr/bin/python3.9 from read access on the directory libdnf.dj5n8b. For complete SELinux messages run: sealert -l 887adbf9-2bb9-4009-b800-36ddf9ba0db5
Oct 7 00:22:04 submit26-b9-fclone setroubleshoot[1142171]: SELinux is preventing /usr/bin/python3.9 from remove_name access on the directory repomd.xml. For complete SELinux messages run: sealert -l 092e0644-8373-4017-b77f-1afa6c6da4ac [x2]
Oct 7 00:22:04 submit26-b9-fclone setroubleshoot[1142171]: SELinux is preventing /usr/bin/python3.9 from unlink access on the file repomd.xml. For complete SELinux messages run: sealert -l ce429a92-56de-4de1-b859-cbfb69ae123c
Oct 7 00:22:04 submit26-b9-fclone setroubleshoot[1142171]: SELinux is preventing /usr/bin/python3.9 from rmdir access on the directory repodata. For complete SELinux messages run: sealert -l 99b886eb-497b-406d-8206-afe76a1086b4 [x2]
Oct 7 00:22:04 submit26-b9-fclone setroubleshoot[1142171]: SELinux is preventing /usr/bin/python3.9 from read access on the directory libdnf.GJa92o. For complete SELinux messages run: sealert -l 887adbf9-2bb9-4009-b800-36ddf9ba0db5
== tma-0 (3 distinct, 4 total) ==
Oct 7 00:10:13 tma-0 systemd[1]: New main PID 7511 does not belong to service, and PID file is not owned by root. Refusing. [x2]
Oct 7 00:10:31 tma-0 systemd[1]: Daemon never wrote its PID file. Failing.
Oct 7 00:10:38 tma-0 systemd[1]: pmlogger.service: Supervising process 15130 which is not our child. We'll most likely not notice when it exits.
== uffish.cs.umd.edu (3 distinct, 4 total) ==
Oct 7 00:10:14 uffish.cs.umd.edu systemd[1]: New main PID 2729860 does not belong to service, and PID file is not owned by root. Refusing. [x2]
Oct 7 00:10:41 uffish.cs.umd.edu systemd[1]: Daemon never wrote its PID file. Failing.
Oct 7 00:10:56 uffish.cs.umd.edu systemd[1]: pmlogger.service: Supervising process 2737556 which is not our child. We'll most likely not notice when it exits.
== vacuum.cs.umd.edu (3 distinct, 4 total) ==
Oct 7 00:10:14 vacuum.cs.umd.edu systemd[1]: New main PID 20171 does not belong to service, and PID file is not owned by root. Refusing. [x2]
Oct 7 00:10:33 vacuum.cs.umd.edu systemd[1]: Daemon never wrote its PID file. Failing.
Oct 7 00:10:44 vacuum.cs.umd.edu systemd[1]: pmlogger.service: Supervising process 27283 which is not our child. We'll most likely not notice when it exits.
== whiffle.cs.umd.edu (3 distinct, 4 total) ==
Oct 7 00:10:12 whiffle.cs.umd.edu systemd[1]: New main PID 2213002 does not belong to service, and PID file is not owned by root. Refusing. [x2]
Oct 7 00:10:38 whiffle.cs.umd.edu systemd[1]: Daemon never wrote its PID file. Failing.
Oct 7 00:10:51 whiffle.cs.umd.edu systemd[1]: pmlogger.service: Supervising process 2220703 which is not our child. We'll most likely not notice when it exits.
1
0
Command: /usr/local/sbin/syslog-digest.py
Time : 0.2145s
Status : exited 0
Output :
Syslog digest — 2026-10-07 00:05 EDT
Processed 9,869 lines, filtered 6,887 (69%). 2,982 unknown (206 distinct) from 29 host(s).
== abuse (1 distinct, 346 total) ==
Oct 6 23:05:25 abuse rsyslogd[1033]: imjournal: open() failed for path: '/var/lib/rsyslog/imjournal.state.tmp': Input/output error [v8.2404.0 try https://www.rsyslog.com/e/2433 ] [x346]
== b0b02.cs.umd.edu (1 distinct, 1 total) ==
Oct 6 23:16:50 b0b02.cs.umd.edu rustdesk[1031750]: cannot open display:
== cheezit.cs.umd.edu (2 distinct, 4 total) ==
Oct 6 23:59:05 cheezit.cs.umd.edu sshd-session[106137]: pam_access(sshd:auth): access denied for user `larry' from `71.191.93.172' [x2]
Oct 6 23:59:54 cheezit.cs.umd.edu sshd-session[106190]: Failed Duo login for 'larry' from 71.191.93.172 [x2]
== gle-dind00.cs.umd.edu (40 distinct, 40 total) ==
Oct 6 23:43:02 gle-dind00.cs.umd.edu systemd-udevd[2675195]: Could not generate persistent MAC address for veth5a14d82: No such file or directory
Oct 6 23:43:02 gle-dind00.cs.umd.edu systemd-udevd[2675194]: Could not generate persistent MAC address for vethce76009: No such file or directory
Oct 6 23:43:02 gle-dind00.cs.umd.edu systemd-udevd[2675295]: Could not generate persistent MAC address for veth425f297: No such file or directory
Oct 6 23:43:02 gle-dind00.cs.umd.edu systemd-udevd[2675296]: Could not generate persistent MAC address for vethd44aee9: No such file or directory
Oct 6 23:43:03 gle-dind00.cs.umd.edu systemd-udevd[2675411]: Could not generate persistent MAC address for veth5fd978d: No such file or directory
Oct 6 23:43:03 gle-dind00.cs.umd.edu systemd-udevd[2675412]: Could not generate persistent MAC address for veth2e8f818: No such file or directory
Oct 6 23:43:04 gle-dind00.cs.umd.edu systemd-udevd[2675509]: Could not generate persistent MAC address for vethe6996c9: No such file or directory
Oct 6 23:43:04 gle-dind00.cs.umd.edu systemd-udevd[2675510]: Could not generate persistent MAC address for vethd54398e: No such file or directory
Oct 6 23:43:05 gle-dind00.cs.umd.edu systemd-udevd[2675597]: Could not generate persistent MAC address for veth5d77104: No such file or directory
Oct 6 23:43:05 gle-dind00.cs.umd.edu systemd-udevd[2675598]: Could not generate persistent MAC address for vethd31054a: No such file or directory
Oct 6 23:43:23 gle-dind00.cs.umd.edu systemd-udevd[2675933]: Could not generate persistent MAC address for vethf1827f4: No such file or directory
Oct 6 23:43:23 gle-dind00.cs.umd.edu systemd-udevd[2675934]: Could not generate persistent MAC address for vethd2fb864: No such file or directory
Oct 6 23:43:23 gle-dind00.cs.umd.edu systemd-udevd[2676032]: Could not generate persistent MAC address for veth72d0bac: No such file or directory
Oct 6 23:43:23 gle-dind00.cs.umd.edu systemd-udevd[2676033]: Could not generate persistent MAC address for veth2e9be99: No such file or directory
Oct 6 23:43:25 gle-dind00.cs.umd.edu systemd-udevd[2676206]: Could not generate persistent MAC address for veth0d22bac: No such file or directory
Oct 6 23:43:25 gle-dind00.cs.umd.edu systemd-udevd[2676207]: Could not generate persistent MAC address for veth603405d: No such file or directory
Oct 6 23:43:26 gle-dind00.cs.umd.edu systemd-udevd[2676322]: Could not generate persistent MAC address for veth661341a: No such file or directory
Oct 6 23:43:26 gle-dind00.cs.umd.edu systemd-udevd[2676323]: Could not generate persistent MAC address for veth692f1a1: No such file or directory
Oct 6 23:52:03 gle-dind00.cs.umd.edu systemd-udevd[2678685]: Could not generate persistent MAC address for vethc85bbf8: No such file or directory
Oct 6 23:52:03 gle-dind00.cs.umd.edu systemd-udevd[2678686]: Could not generate persistent MAC address for veth0a041fa: No such file or directory
Oct 6 23:52:20 gle-dind00.cs.umd.edu systemd-udevd[2678842]: Could not generate persistent MAC address for vethb4c5db1: No such file or directory
Oct 6 23:52:20 gle-dind00.cs.umd.edu systemd-udevd[2678843]: Could not generate persistent MAC address for veth23b1f16: No such file or directory
Oct 7 00:01:01 gle-dind00.cs.umd.edu systemd-udevd[2681345]: Could not generate persistent MAC address for veth9acd664: No such file or directory
Oct 7 00:01:01 gle-dind00.cs.umd.edu systemd-udevd[2681344]: Could not generate persistent MAC address for veth0fa1698: No such file or directory
Oct 7 00:01:02 gle-dind00.cs.umd.edu systemd-udevd[2681454]: Could not generate persistent MAC address for veth925b05e: No such file or directory
Oct 7 00:01:02 gle-dind00.cs.umd.edu systemd-udevd[2681455]: Could not generate persistent MAC address for vetha6ca83c: No such file or directory
Oct 7 00:01:02 gle-dind00.cs.umd.edu systemd-udevd[2681554]: Could not generate persistent MAC address for vethd1383e5: No such file or directory
Oct 7 00:01:02 gle-dind00.cs.umd.edu systemd-udevd[2681555]: Could not generate persistent MAC address for vethdb755ee: No such file or directory
Oct 7 00:01:03 gle-dind00.cs.umd.edu systemd-udevd[2681651]: Could not generate persistent MAC address for veth866e884: No such file or directory
Oct 7 00:01:03 gle-dind00.cs.umd.edu systemd-udevd[2681652]: Could not generate persistent MAC address for veth54ba11c: No such file or directory
... 10 more distinct messages not shown
== gle-dind02.cs.umd.edu (27 distinct, 27 total) ==
Oct 6 23:12:22 gle-dind02.cs.umd.edu systemd-udevd[1554083]: Could not generate persistent MAC address for veth345791e: No such file or directory
Oct 6 23:12:22 gle-dind02.cs.umd.edu systemd-udevd[1554082]: Could not generate persistent MAC address for veth6bdc005: No such file or directory
Oct 6 23:12:35 gle-dind02.cs.umd.edu systemd-udevd[1554199]: Could not generate persistent MAC address for vethfc5ddb1: No such file or directory
Oct 6 23:12:35 gle-dind02.cs.umd.edu systemd-udevd[1554200]: Could not generate persistent MAC address for veth7de4978: No such file or directory
Oct 6 23:27:58 gle-dind02.cs.umd.edu systemd-udevd[1557275]: Could not generate persistent MAC address for veth678a818: No such file or directory
Oct 6 23:27:58 gle-dind02.cs.umd.edu systemd-udevd[1557276]: Could not generate persistent MAC address for vethd029da8: No such file or directory
Oct 6 23:27:59 gle-dind02.cs.umd.edu systemd-udevd[1557374]: Could not generate persistent MAC address for vetha107fe2: No such file or directory
Oct 6 23:27:59 gle-dind02.cs.umd.edu systemd-udevd[1557375]: Could not generate persistent MAC address for veth8932a51: No such file or directory
Oct 6 23:28:00 gle-dind02.cs.umd.edu systemd-udevd[1557474]: Could not generate persistent MAC address for veth52a73e6: No such file or directory
Oct 6 23:28:00 gle-dind02.cs.umd.edu systemd-udevd[1557475]: Could not generate persistent MAC address for veth8e7675f: No such file or directory
Oct 6 23:28:01 gle-dind02.cs.umd.edu systemd-udevd[1557573]: Could not generate persistent MAC address for veth38a188b: No such file or directory
Oct 6 23:28:01 gle-dind02.cs.umd.edu systemd-udevd[1557574]: Could not generate persistent MAC address for vetha875185: No such file or directory
Oct 6 23:28:01 gle-dind02.cs.umd.edu systemd-udevd[1557664]: Could not generate persistent MAC address for veth248c12f: No such file or directory
Oct 6 23:28:01 gle-dind02.cs.umd.edu systemd-udevd[1557663]: Could not generate persistent MAC address for veth9da7d18: No such file or directory
Oct 6 23:28:19 gle-dind02.cs.umd.edu systemd-udevd[1557985]: Could not generate persistent MAC address for veth3df01bc: No such file or directory
Oct 6 23:28:19 gle-dind02.cs.umd.edu systemd-udevd[1557986]: Could not generate persistent MAC address for veth33794f4: No such file or directory
Oct 6 23:28:20 gle-dind02.cs.umd.edu systemd-udevd[1558083]: Could not generate persistent MAC address for veth51a4238: No such file or directory
Oct 6 23:28:20 gle-dind02.cs.umd.edu systemd-udevd[1558084]: Could not generate persistent MAC address for veth9dff63e: No such file or directory
Oct 6 23:28:22 gle-dind02.cs.umd.edu systemd-udevd[1558262]: Could not generate persistent MAC address for veth85bd5cb: No such file or directory
Oct 6 23:28:22 gle-dind02.cs.umd.edu systemd-udevd[1558263]: Could not generate persistent MAC address for veth89fa829: No such file or directory
Oct 6 23:28:23 gle-dind02.cs.umd.edu systemd-udevd[1558377]: Could not generate persistent MAC address for veth4990624: No such file or directory
Oct 6 23:28:23 gle-dind02.cs.umd.edu systemd-udevd[1558378]: Could not generate persistent MAC address for veth18ee865: No such file or directory
Oct 6 23:40:50 gle-dind02.cs.umd.edu systemd-udevd[1560817]: Could not generate persistent MAC address for vethc39232d: No such file or directory
Oct 6 23:40:50 gle-dind02.cs.umd.edu systemd-udevd[1560818]: Could not generate persistent MAC address for veth996b383: No such file or directory
Oct 6 23:41:02 gle-dind02.cs.umd.edu systemd-udevd[1561058]: Could not generate persistent MAC address for veth58841e7: No such file or directory
Oct 6 23:41:02 gle-dind02.cs.umd.edu systemd-udevd[1561059]: Could not generate persistent MAC address for veth50ef016: No such file or directory
Oct 6 23:41:03 gle-dind02.cs.umd.edu lldpd[973]: unable to send packet on real device for vetha875185: No such device or address
== gle-dind04 (1 distinct, 1 total) ==
Oct 6 23:40:00 gle-dind04 lldpd[1171]: unable to send packet on real device for vethf678c17: No such device or address
== hspc (1 distinct, 1 total) ==
Oct 7 00:00:03 hspc kernel: kauditd_printk_skb: 2 callbacks suppressed
== idm00 (1 distinct, 1 total) ==
Oct 6 23:54:40 idm00 named[4166701]: client @0x7f11a006bce8 10.73.240.42#56031: update '73.10.in-addr.arpa/IN' denied
== idmp0 (1 distinct, 1 total) ==
Oct 6 23:39:23 idmp0 named[1598691]: client @0x7f2d44011478 10.73.240.43#60639: update '73.10.in-addr.arpa/IN' denied
== itmon02 (1 distinct, 7 total) ==
Oct 6 23:08:44 itmon02 sshd[805675]: error: beginning MaxStartups throttling [x7]
== matrix (1 distinct, 1 total) ==
Oct 7 00:00:13 matrix (nin-node)[105343]: munin-node.service: Referenced but unset environment variable evaluates to an empty string: DAEMON_ARGS
== munin (2 distinct, 30 total) ==
Oct 6 23:08:50 munin sudo[994928]: pam_systemd(sudo:session): Failed to stat() runtime directory '/run/user/0': No such file or directory [x15]
Oct 6 23:08:50 munin sudo[994928]: pam_systemd(sudo:session): Not setting $XDG_RUNTIME_DIR, as the directory is not in order. [x15]
== neo-gizmonic (1 distinct, 1 total) ==
Oct 7 00:00:01 neo-gizmonic (nin-node)[3762087]: munin-node.service: Referenced but unset environment variable evaluates to an empty string: DAEMON_ARGS
== neoavion (1 distinct, 1 total) ==
Oct 7 00:00:10 neoavion (nin-node)[57813]: munin-node.service: Referenced but unset environment variable evaluates to an empty string: DAEMON_ARGS
== newhonors.cs.umd.edu (1 distinct, 1 total) ==
Oct 6 23:10:41 newhonors.cs.umd.edu systemd-tmpfiles: [/usr/lib/tmpfiles.d/var.conf:14] Duplicate line for path "/var/log", ignoring.
== newhonors2 (2 distinct, 25 total) ==
Oct 6 23:13:03 newhonors2 dhcpcd[3660172]: dhcpcd is not running [x24]
Oct 7 00:00:16 newhonors2 (nin-node)[3661676]: munin-node.service: Referenced but unset environment variable evaluates to an empty string: DAEMON_ARGS
== ntop00 (96 distinct, 96 total) ==
Oct 6 23:05:01 ntop00 nfacctd[1075699]: INFO ( m1/mysql ): *** Purging cache - START (PID: 4402) ***
Oct 6 23:05:02 ntop00 nfacctd[1075699]: INFO ( m1/mysql ): *** Purging cache - END (PID: 4402, QN: 67/67, ET: 1) ***
Oct 6 23:05:08 ntop00 sfacctd[1075592]: INFO ( m1/mysql ): *** Purging cache - END (PID: 4402, QN: 4922/4922, ET: 7) ***
Oct 6 23:08:01 ntop00 sfacctd[1075592]: INFO ( p1/print ): *** Purging cache - START (PID: 4403) ***
Oct 6 23:08:01 ntop00 sfacctd[1075592]: INFO ( p1/print ): *** Purging cache - END (PID: 4403, QN: 4693/4693, ET: 0) ***
Oct 6 23:08:01 ntop00 nfacctd[1075699]: INFO ( p1/print ): *** Purging cache - START (PID: 4403) ***
Oct 6 23:08:01 ntop00 nfacctd[1075699]: INFO ( p1/print ): *** Purging cache - END (PID: 4403, QN: 68/68, ET: 0) ***
Oct 6 23:10:01 ntop00 sfacctd[1075592]: INFO ( m1/mysql ): *** Purging cache - START (PID: 4404) ***
Oct 6 23:10:01 ntop00 nfacctd[1075699]: INFO ( m1/mysql ): *** Purging cache - START (PID: 4404) ***
Oct 6 23:10:01 ntop00 nfacctd[1075699]: INFO ( m1/mysql ): *** Purging cache - END (PID: 4404, QN: 67/67, ET: 0) ***
Oct 6 23:10:09 ntop00 sfacctd[1075592]: INFO ( m1/mysql ): *** Purging cache - END (PID: 4404, QN: 4512/4512, ET: 8) ***
Oct 6 23:13:01 ntop00 nfacctd[1075699]: INFO ( p1/print ): *** Purging cache - START (PID: 4405) ***
Oct 6 23:13:01 ntop00 nfacctd[1075699]: INFO ( p1/print ): *** Purging cache - END (PID: 4405, QN: 51/51, ET: 0) ***
Oct 6 23:13:01 ntop00 sfacctd[1075592]: INFO ( p1/print ): *** Purging cache - START (PID: 4405) ***
Oct 6 23:13:01 ntop00 sfacctd[1075592]: INFO ( p1/print ): *** Purging cache - END (PID: 4405, QN: 4620/4620, ET: 0) ***
Oct 6 23:15:01 ntop00 nfacctd[1075699]: INFO ( m1/mysql ): *** Purging cache - START (PID: 4406) ***
Oct 6 23:15:01 ntop00 sfacctd[1075592]: INFO ( m1/mysql ): *** Purging cache - START (PID: 4406) ***
Oct 6 23:15:01 ntop00 nfacctd[1075699]: INFO ( m1/mysql ): *** Purging cache - END (PID: 4406, QN: 52/52, ET: 0) ***
Oct 6 23:15:09 ntop00 sfacctd[1075592]: INFO ( m1/mysql ): *** Purging cache - END (PID: 4406, QN: 4632/4632, ET: 8) ***
Oct 6 23:18:01 ntop00 sfacctd[1075592]: INFO ( p1/print ): *** Purging cache - START (PID: 4407) ***
Oct 6 23:18:01 ntop00 sfacctd[1075592]: INFO ( p1/print ): *** Purging cache - END (PID: 4407, QN: 4387/4387, ET: 0) ***
Oct 6 23:18:01 ntop00 nfacctd[1075699]: INFO ( p1/print ): *** Purging cache - START (PID: 4407) ***
Oct 6 23:18:01 ntop00 nfacctd[1075699]: INFO ( p1/print ): *** Purging cache - END (PID: 4407, QN: 59/59, ET: 0) ***
Oct 6 23:20:01 ntop00 sfacctd[1075592]: INFO ( m1/mysql ): *** Purging cache - START (PID: 4408) ***
Oct 6 23:20:01 ntop00 nfacctd[1075699]: INFO ( m1/mysql ): *** Purging cache - START (PID: 4408) ***
Oct 6 23:20:01 ntop00 nfacctd[1075699]: INFO ( m1/mysql ): *** Purging cache - END (PID: 4408, QN: 48/48, ET: 0) ***
Oct 6 23:20:08 ntop00 sfacctd[1075592]: INFO ( m1/mysql ): *** Purging cache - END (PID: 4408, QN: 4385/4385, ET: 7) ***
Oct 6 23:23:01 ntop00 nfacctd[1075699]: INFO ( p1/print ): *** Purging cache - START (PID: 4409) ***
Oct 6 23:23:01 ntop00 nfacctd[1075699]: INFO ( p1/print ): *** Purging cache - END (PID: 4409, QN: 49/49, ET: 0) ***
Oct 6 23:23:01 ntop00 sfacctd[1075592]: INFO ( p1/print ): *** Purging cache - START (PID: 4409) ***
... 66 more distinct messages not shown
== openvox08-cmp2 (3 distinct, 713 total) ==
Oct 6 23:05:03 openvox08-cmp2 rsyslogd[983]: imjournal: open() failed for path: '/var/lib/rsyslog/imjournal.state.tmp': Input/output error [v8.2510.0-5.el10 try https://www.rsyslog.com/e/2433 ] [x711]
Oct 7 00:02:27 openvox08-cmp2 systemd[1]: forgejo-runner-restart.service: Failed to spawn executor: Input/output error
Oct 7 00:02:27 openvox08-cmp2 systemd[1]: forgejo-runner-restart.service: Failed to spawn 'start' task: Input/output error
== outbound00.cs.umd.edu (1 distinct, 6 total) ==
Oct 6 23:09:09 outbound00.cs.umd.edu python3[94829]: ldapdb [x6]
== outbound01.cs.umd.edu (1 distinct, 6 total) ==
Oct 6 23:13:06 outbound01.cs.umd.edu python3[1554914]: ldapdb [x6]
== portal (1 distinct, 76 total) ==
Oct 6 23:05:03 portal setroubleshoot[1623391]: SELinux is preventing /usr/local/bin/traefik from connectto access on the unix_stream_socket /run/podman/podman.sock. For complete SELinux messages run: sealert -l e0a307a3-2c22-4320-8f9d-6a166c45222d [x76]
== soul (1 distinct, 1 total) ==
Oct 6 23:56:44 soul krb5_child[3373616]: Client 'admin(a)UMD.EDU' not found in Kerberos database
== strawberry (7 distinct, 38 total) ==
Oct 6 23:07:04 strawberry kernel: I/O error, dev sda, sector 206848 op 0x0:(READ) flags 0x80700 phys_seg 1 prio class 2 [x6]
Oct 6 23:07:04 strawberry kernel: I/O error, dev sda, sector 206848 op 0x0:(READ) flags 0x0 phys_seg 1 prio class 2 [x6]
Oct 6 23:07:04 strawberry kernel: Buffer I/O error on dev sda2, logical block 0, async page read [x6]
Oct 6 23:07:04 strawberry kernel: I/O error, dev sda, sector 2048 op 0x0:(READ) flags 0x80700 phys_seg 1 prio class 2 [x6]
Oct 6 23:07:04 strawberry kernel: I/O error, dev sda, sector 2048 op 0x0:(READ) flags 0x0 phys_seg 1 prio class 2 [x6]
Oct 6 23:07:04 strawberry kernel: Buffer I/O error on dev sda1, logical block 0, async page read [x6]
Oct 6 23:34:42 strawberry smartd[5314]: Device: /dev/sda [SAT], failed to read SMART Attribute Data [x2]
== submit10-cln25 (6 distinct, 1540 total) ==
Oct 6 23:05:22 submit10-cln25 rsyslogd: file '/var/log/messages': open error: Input/output error [v8.24.0-57.el7_9.3 try http://www.rsyslog.com/e/2433 ] [x1200]
Oct 6 23:05:22 submit10-cln25 rsyslogd: imjournal: fopen() failed for path: '/var/lib/rsyslog/imjournal.state.tmp': Input/output error [v8.24.0-57.el7_9.3 try http://www.rsyslog.com/e/2013 ] [x334]
Oct 6 23:25:00 submit10-cln25 systemd: Failed at step USER spawning /usr/libexec/pcp/bin/pmlogger_check: Input/output error [x2]
Oct 6 23:28:00 submit10-cln25 systemd: Failed at step USER spawning /usr/libexec/pcp/bin/pmie_check: Input/output error [x2]
Oct 6 23:30:00 submit10-cln25 systemd: Failed at step USER spawning /usr/libexec/pcp/bin/pmlogger_daily: Input/output error
Oct 7 00:00:00 submit10-cln25 systemd: Failed at step USER spawning /usr/sbin/unbound-anchor: Input/output error
== submit26-b9-f1 (1 distinct, 1 total) ==
Oct 6 23:23:38 submit26-b9-f1 systemd[1]: user(a)1001.service: Main process exited, code=killed, status=9/KILL
== submit26-b9-f2 (1 distinct, 6 total) ==
Oct 6 23:17:40 submit26-b9-f2 systemd[1]: user(a)1001.service: Main process exited, code=killed, status=9/KILL [x6]
== submit26-b9-f3 (1 distinct, 6 total) ==
Oct 6 23:13:21 submit26-b9-f3 systemd[1]: user(a)1001.service: Main process exited, code=killed, status=9/KILL [x6]
== submit26-b9-f4 (1 distinct, 3 total) ==
Oct 6 23:33:48 submit26-b9-f4 systemd[1]: user(a)1001.service: Main process exited, code=killed, status=9/KILL [x3]
== wraith (2 distinct, 2 total) ==
Oct 7 00:00:11 wraith kernel: kauditd_printk_skb: 2 callbacks suppressed
Oct 7 00:00:11 wraith (nin-node)[82701]: munin-node.service: Referenced but unset environment variable evaluates to an empty string: DAEMON_ARGS
1
0
Command: /usr/local/sbin/syslog-digest.py
Time : 0.2136s
Status : exited 0
Output :
Syslog digest — 2026-10-06 23:05 EDT
Processed 8,904 lines, filtered 5,890 (66%). 3,014 unknown (259 distinct) from 56 host(s).
== abadi-computer (2 distinct, 2 total) ==
Oct 6 22:20:47 abadi-computer falcon-sensor[553]: CrowdStrike(4): Could not retrieve DisableProxy value: c0000225
Oct 6 22:20:47 abadi-computer falcon-sensor[553]: CrowdStrike(4): ConnectWithProxy: Unable to get application proxy host from CsConfig: c0000225
== abuse (1 distinct, 347 total) ==
Oct 6 22:05:25 abuse rsyslogd[1033]: imjournal: open() failed for path: '/var/lib/rsyslog/imjournal.state.tmp': Input/output error [v8.2404.0 try https://www.rsyslog.com/e/2433 ] [x347]
== ai-course (2 distinct, 2 total) ==
Oct 6 22:19:02 ai-course falcon-sensor-bpf[2244606]: CrowdStrike(4): Could not retrieve DisableProxy value: c0000225
Oct 6 22:19:02 ai-course falcon-sensor-bpf[2244606]: CrowdStrike(4): ConnectWithProxy: Unable to get application proxy host from CsConfig: c0000225
== b0b02.cs.umd.edu (1 distinct, 1 total) ==
Oct 6 22:16:46 b0b02.cs.umd.edu rustdesk[1016654]: cannot open display:
== bachata (10 distinct, 10 total) ==
Oct 6 22:32:00 bachata smbd[5586]: [2026/10/06 22:32:00.199620, 0] ../../source3/smbd/smb2_service.c:117(chdir_current_service)
Oct 6 22:32:00 bachata smbd[5586]: chdir_current_service: vfs_ChDir(/fs/junkfood/mount) failed: Permission denied. Current token: uid=11255, gid=11255, 12 groups: 11255 319000009 25038 15294 15229 755 25030 25025 30880 25029 770 15026
Oct 6 22:32:00 bachata smbd[5586]: [2026/10/06 22:32:00.201317, 0] ../../source3/smbd/smbXsrv_tcon.c:914(smbXsrv_tcon_disconnect)
Oct 6 22:32:00 bachata smbd[5586]: smbXsrv_tcon_disconnect: disconnect(0xd42df9ac, 'mount'): chdir_current_service() failed: NT_STATUS_INTERNAL_ERROR
Oct 6 22:32:00 bachata smbd[5586]: [2026/10/06 22:32:00.202338, 0] ../../source3/smbd/smbXsrv_tcon.c:1028(smbXsrv_tcon_disconnect_all)
Oct 6 22:32:00 bachata smbd[5586]: smbXsrv_tcon_disconnect_all: count[2] errors[1] first[NT_STATUS_INTERNAL_ERROR]
Oct 6 22:32:00 bachata smbd[5586]: [2026/10/06 22:32:00.202429, 0] ../../source3/smbd/smbXsrv_session.c:1901(smbXsrv_session_logoff)
Oct 6 22:32:00 bachata smbd[5586]: smbXsrv_session_logoff: smbXsrv_session_logoff(0xf0af07b9): smb2srv_tcon_disconnect_all() failed: NT_STATUS_INTERNAL_ERROR
Oct 6 22:32:00 bachata smbd[5586]: [2026/10/06 22:32:00.202556, 0] ../../source3/smbd/smbXsrv_session.c:1729(smbXsrv_session_remove_channel_done)
Oct 6 22:32:00 bachata smbd[5586]: smbXsrv_session_remove_channel_done: smbXsrv_session_logoff(4038002617) failed: NT_STATUS_INTERNAL_ERROR
== biggulp.cs.umd.edu (2 distinct, 2 total) ==
Oct 6 22:06:17 biggulp.cs.umd.edu falcon-sensor-bpf[830]: CrowdStrike(4): Could not retrieve DisableProxy value: c0000225
Oct 6 22:06:17 biggulp.cs.umd.edu falcon-sensor-bpf[830]: CrowdStrike(4): ConnectWithProxy: Unable to get application proxy host from CsConfig: c0000225
== bigtuna (2 distinct, 2 total) ==
Oct 6 22:19:33 bigtuna falcon-sensor-bpf[876]: CrowdStrike(4): Could not retrieve DisableProxy value: c0000225
Oct 6 22:19:33 bigtuna falcon-sensor-bpf[876]: CrowdStrike(4): ConnectWithProxy: Unable to get application proxy host from CsConfig: c0000225
== borealis (2 distinct, 2 total) ==
Oct 6 22:11:18 borealis falcon-sensor-bpf[921]: CrowdStrike(4): Could not retrieve DisableProxy value: c0000225
Oct 6 22:11:18 borealis falcon-sensor-bpf[921]: CrowdStrike(4): ConnectWithProxy: Unable to get application proxy host from CsConfig: c0000225
== cheezit.cs.umd.edu (2 distinct, 2 total) ==
Oct 6 22:07:45 cheezit.cs.umd.edu falcon-sensor-bpf[1351]: CrowdStrike(4): Could not retrieve DisableProxy value: c0000225
Oct 6 22:07:45 cheezit.cs.umd.edu falcon-sensor-bpf[1351]: CrowdStrike(4): ConnectWithProxy: Unable to get application proxy host from CsConfig: c0000225
== cskayako (2 distinct, 2 total) ==
Oct 6 22:11:18 cskayako falcon-sensor-bpf[746]: CrowdStrike(4): Could not retrieve DisableProxy value: c0000225
Oct 6 22:11:18 cskayako falcon-sensor-bpf[746]: CrowdStrike(4): ConnectWithProxy: Unable to get application proxy host from CsConfig: c0000225
== defer (2 distinct, 2 total) ==
Oct 6 22:27:21 defer falcon-sensor-bpf[811]: CrowdStrike(4): Could not retrieve DisableProxy value: c0000225
Oct 6 22:27:21 defer falcon-sensor-bpf[811]: CrowdStrike(4): ConnectWithProxy: Unable to get application proxy host from CsConfig: c0000225
== emaar (2 distinct, 2 total) ==
Oct 6 22:24:36 emaar falcon-sensor-bpf[971]: CrowdStrike(4): Could not retrieve DisableProxy value: c0000225
Oct 6 22:24:36 emaar falcon-sensor-bpf[971]: CrowdStrike(4): ConnectWithProxy: Unable to get application proxy host from CsConfig: c0000225
== frozone (2 distinct, 2 total) ==
Oct 6 22:10:08 frozone falcon-sensor-bpf[1051]: CrowdStrike(4): Could not retrieve DisableProxy value: c0000225
Oct 6 22:10:08 frozone falcon-sensor-bpf[1051]: CrowdStrike(4): ConnectWithProxy: Unable to get application proxy host from CsConfig: c0000225
== galax (2 distinct, 2 total) ==
Oct 6 22:27:32 galax falcon-sensor[1499]: CrowdStrike(4): Could not retrieve DisableProxy value: c0000225
Oct 6 22:27:32 galax falcon-sensor[1499]: CrowdStrike(4): ConnectWithProxy: Unable to get application proxy host from CsConfig: c0000225
== gle-dind02.cs.umd.edu (18 distinct, 18 total) ==
Oct 6 23:02:44 gle-dind02.cs.umd.edu systemd-udevd[1550798]: Could not generate persistent MAC address for veth7339cfb: No such file or directory
Oct 6 23:02:44 gle-dind02.cs.umd.edu systemd-udevd[1550797]: Could not generate persistent MAC address for veth420f24a: No such file or directory
Oct 6 23:02:45 gle-dind02.cs.umd.edu systemd-udevd[1550896]: Could not generate persistent MAC address for veth4100023: No such file or directory
Oct 6 23:02:45 gle-dind02.cs.umd.edu systemd-udevd[1550897]: Could not generate persistent MAC address for vethf4aef23: No such file or directory
Oct 6 23:02:46 gle-dind02.cs.umd.edu systemd-udevd[1550995]: Could not generate persistent MAC address for veth943316a: No such file or directory
Oct 6 23:02:46 gle-dind02.cs.umd.edu systemd-udevd[1550996]: Could not generate persistent MAC address for veth8a567fd: No such file or directory
Oct 6 23:02:47 gle-dind02.cs.umd.edu systemd-udevd[1551092]: Could not generate persistent MAC address for veth1f1104a: No such file or directory
Oct 6 23:02:47 gle-dind02.cs.umd.edu systemd-udevd[1551093]: Could not generate persistent MAC address for veth0e691dd: No such file or directory
Oct 6 23:02:48 gle-dind02.cs.umd.edu systemd-udevd[1551181]: Could not generate persistent MAC address for vethbf65e41: No such file or directory
Oct 6 23:02:48 gle-dind02.cs.umd.edu systemd-udevd[1551182]: Could not generate persistent MAC address for veth92291c8: No such file or directory
Oct 6 23:03:06 gle-dind02.cs.umd.edu systemd-udevd[1551487]: Could not generate persistent MAC address for veth2774ef6: No such file or directory
Oct 6 23:03:06 gle-dind02.cs.umd.edu systemd-udevd[1551488]: Could not generate persistent MAC address for veth87f5176: No such file or directory
Oct 6 23:03:07 gle-dind02.cs.umd.edu systemd-udevd[1551619]: Could not generate persistent MAC address for veth1e269c4: No such file or directory
Oct 6 23:03:07 gle-dind02.cs.umd.edu systemd-udevd[1551620]: Could not generate persistent MAC address for vethc66d257: No such file or directory
Oct 6 23:03:08 gle-dind02.cs.umd.edu systemd-udevd[1551796]: Could not generate persistent MAC address for veth8385c02: No such file or directory
Oct 6 23:03:08 gle-dind02.cs.umd.edu systemd-udevd[1551797]: Could not generate persistent MAC address for veth770436b: No such file or directory
Oct 6 23:03:09 gle-dind02.cs.umd.edu systemd-udevd[1551908]: Could not generate persistent MAC address for veth1af08bd: No such file or directory
Oct 6 23:03:09 gle-dind02.cs.umd.edu systemd-udevd[1551907]: Could not generate persistent MAC address for vethbf6e506: No such file or directory
== gle-dind04 (4 distinct, 4 total) ==
Oct 6 22:09:16 gle-dind04 lldpd[1171]: unable to send packet on real device for vethab7d71f: No such device or address
Oct 6 22:09:29 gle-dind04 lldpd[1171]: unable to send packet on real device for vetha86ee05: No such device or address
Oct 6 22:12:32 gle-dind04 falcon-sensor-bpf[1017]: CrowdStrike(4): Could not retrieve DisableProxy value: c0000225
Oct 6 22:12:32 gle-dind04 falcon-sensor-bpf[1017]: CrowdStrike(4): ConnectWithProxy: Unable to get application proxy host from CsConfig: c0000225
== gle-omnibus00.cs.umd.edu (2 distinct, 2 total) ==
Oct 6 22:15:59 gle-omnibus00.cs.umd.edu falcon-sensor-bpf[935]: CrowdStrike(4): Could not retrieve DisableProxy value: c0000225
Oct 6 22:15:59 gle-omnibus00.cs.umd.edu falcon-sensor-bpf[935]: CrowdStrike(4): ConnectWithProxy: Unable to get application proxy host from CsConfig: c0000225
== grosh (2 distinct, 2 total) ==
Oct 6 22:05:40 grosh falcon-sensor-bpf[3220]: CrowdStrike(4): Could not retrieve DisableProxy value: c0000225
Oct 6 22:05:40 grosh falcon-sensor-bpf[3220]: CrowdStrike(4): ConnectWithProxy: Unable to get application proxy host from CsConfig: c0000225
== hackerman (2 distinct, 2 total) ==
Oct 6 22:25:43 hackerman falcon-sensor-bpf[896]: CrowdStrike(4): Could not retrieve DisableProxy value: c0000225
Oct 6 22:25:43 hackerman falcon-sensor-bpf[896]: CrowdStrike(4): ConnectWithProxy: Unable to get application proxy host from CsConfig: c0000225
== haproxy02.cs.umd.edu (2 distinct, 2 total) ==
Oct 6 22:09:09 haproxy02.cs.umd.edu falcon-sensor-bpf[990]: CrowdStrike(4): Could not retrieve DisableProxy value: c0000225
Oct 6 22:09:09 haproxy02.cs.umd.edu falcon-sensor-bpf[990]: CrowdStrike(4): ConnectWithProxy: Unable to get application proxy host from CsConfig: c0000225
== hasaraumd (2 distinct, 2 total) ==
Oct 6 22:20:20 hasaraumd falcon-sensor-bpf[730]: CrowdStrike(4): Could not retrieve DisableProxy value: c0000225
Oct 6 22:20:20 hasaraumd falcon-sensor-bpf[730]: CrowdStrike(4): ConnectWithProxy: Unable to get application proxy host from CsConfig: c0000225
== hspc (2 distinct, 2 total) ==
Oct 6 22:13:44 hspc falcon-sensor-bpf[1008]: CrowdStrike(4): Could not retrieve DisableProxy value: c0000225
Oct 6 22:13:44 hspc falcon-sensor-bpf[1008]: CrowdStrike(4): ConnectWithProxy: Unable to get application proxy host from CsConfig: c0000225
== idm00 (1 distinct, 1 total) ==
Oct 6 22:54:40 idm00 named[4166701]: client @0x7f11980696f8 10.73.240.42#58155: update '73.10.in-addr.arpa/IN' denied
== idmp0 (1 distinct, 1 total) ==
Oct 6 22:39:23 idmp0 named[1598691]: client @0x7f2d200241d8 10.73.240.43#63640: update '73.10.in-addr.arpa/IN' denied
== inbound00.cs.umd.edu (1 distinct, 1 total) ==
Oct 6 22:33:53 inbound00.cs.umd.edu krb5_child[3655909]: Client 'admin(a)UMD.EDU' not found in Kerberos database
== itmon02 (1 distinct, 3 total) ==
Oct 6 22:43:50 itmon02 sshd[805675]: error: beginning MaxStartups throttling [x3]
== jaws.cs.umd.edu (2 distinct, 2 total) ==
Oct 6 22:15:05 jaws.cs.umd.edu falcon-sensor-bpf[1192]: CrowdStrike(4): Could not retrieve DisableProxy value: c0000225
Oct 6 22:15:05 jaws.cs.umd.edu falcon-sensor-bpf[1192]: CrowdStrike(4): ConnectWithProxy: Unable to get application proxy host from CsConfig: c0000225
== kadath.cs.umd.edu (2 distinct, 2 total) ==
Oct 6 22:09:12 kadath.cs.umd.edu falcon-sensor-bpf[950]: CrowdStrike(4): Could not retrieve DisableProxy value: c0000225
Oct 6 22:09:12 kadath.cs.umd.edu falcon-sensor-bpf[950]: CrowdStrike(4): ConnectWithProxy: Unable to get application proxy host from CsConfig: c0000225
== krispykreme.cs.umd.edu (10 distinct, 14 total) ==
Oct 6 22:17:07 krispykreme.cs.umd.edu sshd-session[2839342]: pam_access(sshd:auth): access denied for user `admin' from `34.156.51.134'
Oct 6 22:17:08 krispykreme.cs.umd.edu krb5_child[2839344]: Client 'admin(a)UMD.EDU' not found in Kerberos database [x3]
Oct 6 22:17:08 krispykreme.cs.umd.edu sshd-session[2839324]: error: PAM: System error for admin from 34.156.51.134
Oct 6 22:17:44 krispykreme.cs.umd.edu sshd-session[2839429]: error: Protocol major versions differ: 2 vs. 1 [x3]
Oct 6 22:18:36 krispykreme.cs.umd.edu sshd-session[2839493]: pam_access(sshd:auth): access denied for user `admin' from `35.233.108.161'
Oct 6 22:18:37 krispykreme.cs.umd.edu sshd-session[2839462]: error: PAM: System error for admin from 35.233.108.161
Oct 6 22:22:44 krispykreme.cs.umd.edu sshd-session[2840842]: pam_access(sshd:auth): access denied for user `admin' from `34.79.36.93'
Oct 6 22:22:45 krispykreme.cs.umd.edu sshd-session[2840836]: error: PAM: System error for admin from 34.79.36.93
Oct 6 22:28:22 krispykreme.cs.umd.edu falcon-sensor-bpf[1298]: CrowdStrike(4): Could not retrieve DisableProxy value: c0000225
Oct 6 22:28:22 krispykreme.cs.umd.edu falcon-sensor-bpf[1298]: CrowdStrike(4): ConnectWithProxy: Unable to get application proxy host from CsConfig: c0000225
== lifepix (2 distinct, 2 total) ==
Oct 6 22:10:27 lifepix falcon-sensor-bpf[875]: CrowdStrike(4): Could not retrieve DisableProxy value: c0000225
Oct 6 22:10:27 lifepix falcon-sensor-bpf[875]: CrowdStrike(4): ConnectWithProxy: Unable to get application proxy host from CsConfig: c0000225
== mashie (2 distinct, 2 total) ==
Oct 6 22:17:43 mashie falcon-sensor-bpf[786]: CrowdStrike(4): Could not retrieve DisableProxy value: c0000225
Oct 6 22:17:43 mashie falcon-sensor-bpf[786]: CrowdStrike(4): ConnectWithProxy: Unable to get application proxy host from CsConfig: c0000225
== matrix (3 distinct, 4 total) ==
Oct 6 22:23:53 matrix krb5_child[50230]: Client 'admin(a)UMD.EDU' not found in Kerberos database [x2]
Oct 6 22:23:56 matrix sshd[50204]: error: PAM: Authentication failure for admin from 35.205.187.128
Oct 6 22:28:49 matrix sshd[52765]: error: Protocol major versions differ: 2 vs. 1
== munin (2 distinct, 12 total) ==
Oct 6 22:08:05 munin sudo[973577]: pam_systemd(sudo:session): Failed to stat() runtime directory '/run/user/0': No such file or directory [x6]
Oct 6 22:08:05 munin sudo[973577]: pam_systemd(sudo:session): Not setting $XDG_RUNTIME_DIR, as the directory is not in order. [x6]
== neodontcare.cs.umd.edu (2 distinct, 2 total) ==
Oct 6 22:09:24 neodontcare.cs.umd.edu falcon-sensor-bpf[951]: CrowdStrike(4): Could not retrieve DisableProxy value: c0000225
Oct 6 22:09:24 neodontcare.cs.umd.edu falcon-sensor-bpf[951]: CrowdStrike(4): ConnectWithProxy: Unable to get application proxy host from CsConfig: c0000225
== neograd (2 distinct, 2 total) ==
Oct 6 22:25:47 neograd falcon-sensor-bpf[697]: CrowdStrike(4): Could not retrieve DisableProxy value: c0000225
Oct 6 22:25:47 neograd falcon-sensor-bpf[697]: CrowdStrike(4): ConnectWithProxy: Unable to get application proxy host from CsConfig: c0000225
== netman.cs.umd.edu (2 distinct, 2 total) ==
Oct 6 22:19:20 netman.cs.umd.edu falcon-sensor-bpf[1126]: CrowdStrike(4): Could not retrieve DisableProxy value: c0000225
Oct 6 22:19:20 netman.cs.umd.edu falcon-sensor-bpf[1126]: CrowdStrike(4): ConnectWithProxy: Unable to get application proxy host from CsConfig: c0000225
== newhonors2 (1 distinct, 24 total) ==
Oct 6 22:13:02 newhonors2 dhcpcd[3658314]: dhcpcd is not running [x24]
== nightingale (2 distinct, 2 total) ==
Oct 6 22:18:21 nightingale falcon-sensor-bpf[870]: CrowdStrike(4): Could not retrieve DisableProxy value: c0000225
Oct 6 22:18:21 nightingale falcon-sensor-bpf[870]: CrowdStrike(4): ConnectWithProxy: Unable to get application proxy host from CsConfig: c0000225
== ntop00 (94 distinct, 94 total) ==
Oct 6 22:05:09 ntop00 sfacctd[1075592]: INFO ( m1/mysql ): *** Purging cache - END (PID: 4378, QN: 3869/3869, ET: 8) ***
Oct 6 22:08:01 ntop00 sfacctd[1075592]: INFO ( p1/print ): *** Purging cache - START (PID: 4379) ***
Oct 6 22:08:01 ntop00 sfacctd[1075592]: INFO ( p1/print ): *** Purging cache - END (PID: 4379, QN: 4505/4505, ET: 0) ***
Oct 6 22:08:01 ntop00 nfacctd[1075699]: INFO ( p1/print ): *** Purging cache - START (PID: 4379) ***
Oct 6 22:08:01 ntop00 nfacctd[1075699]: INFO ( p1/print ): *** Purging cache - END (PID: 4379, QN: 90/90, ET: 0) ***
Oct 6 22:10:01 ntop00 sfacctd[1075592]: INFO ( m1/mysql ): *** Purging cache - START (PID: 4380) ***
Oct 6 22:10:01 ntop00 nfacctd[1075699]: INFO ( m1/mysql ): *** Purging cache - START (PID: 4380) ***
Oct 6 22:10:01 ntop00 nfacctd[1075699]: INFO ( m1/mysql ): *** Purging cache - END (PID: 4380, QN: 71/71, ET: 0) ***
Oct 6 22:10:07 ntop00 sfacctd[1075592]: INFO ( m1/mysql ): *** Purging cache - END (PID: 4380, QN: 4233/4233, ET: 6) ***
Oct 6 22:13:01 ntop00 sfacctd[1075592]: INFO ( p1/print ): *** Purging cache - START (PID: 4381) ***
Oct 6 22:13:01 ntop00 sfacctd[1075592]: INFO ( p1/print ): *** Purging cache - END (PID: 4381, QN: 4569/4569, ET: 0) ***
Oct 6 22:13:02 ntop00 nfacctd[1075699]: INFO ( p1/print ): *** Purging cache - START (PID: 4381) ***
Oct 6 22:13:02 ntop00 nfacctd[1075699]: INFO ( p1/print ): *** Purging cache - END (PID: 4381, QN: 90/90, ET: 0) ***
Oct 6 22:15:01 ntop00 sfacctd[1075592]: INFO ( m1/mysql ): *** Purging cache - START (PID: 4382) ***
Oct 6 22:15:01 ntop00 nfacctd[1075699]: INFO ( m1/mysql ): *** Purging cache - START (PID: 4382) ***
Oct 6 22:15:01 ntop00 nfacctd[1075699]: INFO ( m1/mysql ): *** Purging cache - END (PID: 4382, QN: 81/81, ET: 0) ***
Oct 6 22:15:08 ntop00 sfacctd[1075592]: INFO ( m1/mysql ): *** Purging cache - END (PID: 4382, QN: 4544/4544, ET: 7) ***
Oct 6 22:18:01 ntop00 nfacctd[1075699]: INFO ( p1/print ): *** Purging cache - START (PID: 4383) ***
Oct 6 22:18:01 ntop00 nfacctd[1075699]: INFO ( p1/print ): *** Purging cache - END (PID: 4383, QN: 54/54, ET: 0) ***
Oct 6 22:18:01 ntop00 sfacctd[1075592]: INFO ( p1/print ): *** Purging cache - START (PID: 4383) ***
Oct 6 22:18:01 ntop00 sfacctd[1075592]: INFO ( p1/print ): *** Purging cache - END (PID: 4383, QN: 4235/4235, ET: 0) ***
Oct 6 22:20:01 ntop00 nfacctd[1075699]: INFO ( m1/mysql ): *** Purging cache - START (PID: 4384) ***
Oct 6 22:20:01 ntop00 sfacctd[1075592]: INFO ( m1/mysql ): *** Purging cache - START (PID: 4384) ***
Oct 6 22:20:01 ntop00 nfacctd[1075699]: INFO ( m1/mysql ): *** Purging cache - END (PID: 4384, QN: 62/62, ET: 0) ***
Oct 6 22:20:08 ntop00 sfacctd[1075592]: INFO ( m1/mysql ): *** Purging cache - END (PID: 4384, QN: 4151/4151, ET: 7) ***
Oct 6 22:23:01 ntop00 sfacctd[1075592]: INFO ( p1/print ): *** Purging cache - START (PID: 4385) ***
Oct 6 22:23:01 ntop00 sfacctd[1075592]: INFO ( p1/print ): *** Purging cache - END (PID: 4385, QN: 3722/3722, ET: 0) ***
Oct 6 22:23:01 ntop00 nfacctd[1075699]: INFO ( p1/print ): *** Purging cache - START (PID: 4385) ***
Oct 6 22:23:01 ntop00 nfacctd[1075699]: INFO ( p1/print ): *** Purging cache - END (PID: 4385, QN: 71/71, ET: 0) ***
Oct 6 22:25:01 ntop00 nfacctd[1075699]: INFO ( m1/mysql ): *** Purging cache - START (PID: 4386) ***
... 64 more distinct messages not shown
== openvox08-cmp2 (1 distinct, 711 total) ==
Oct 6 22:05:05 openvox08-cmp2 rsyslogd[983]: imjournal: open() failed for path: '/var/lib/rsyslog/imjournal.state.tmp': Input/output error [v8.2510.0-5.el10 try https://www.rsyslog.com/e/2433 ] [x711]
== orchids (2 distinct, 2 total) ==
Oct 6 22:29:06 orchids falcon-sensor-bpf[1099]: CrowdStrike(4): Could not retrieve DisableProxy value: c0000225
Oct 6 22:29:06 orchids falcon-sensor-bpf[1099]: CrowdStrike(4): ConnectWithProxy: Unable to get application proxy host from CsConfig: c0000225
== outbound00.cs.umd.edu (3 distinct, 8 total) ==
Oct 6 22:09:09 outbound00.cs.umd.edu python3[80431]: ldapdb [x6]
Oct 6 23:04:16 outbound00.cs.umd.edu krb5_child[93891]: Client 'admin(a)UMD.EDU' not found in Kerberos database
Oct 6 23:04:54 outbound00.cs.umd.edu sshd-session[93908]: error: Protocol major versions differ: 2 vs. 1
== outbound01.cs.umd.edu (2 distinct, 7 total) ==
Oct 6 22:13:06 outbound01.cs.umd.edu python3[1540378]: ldapdb [x6]
Oct 6 22:21:43 outbound01.cs.umd.edu krb5_child[1542068]: Client 'admin(a)UMD.EDU' not found in Kerberos database
== portal (3 distinct, 76 total) ==
Oct 6 22:05:59 portal setroubleshoot[1610953]: SELinux is preventing /usr/local/bin/traefik from connectto access on the unix_stream_socket /run/podman/podman.sock. For complete SELinux messages run: sealert -l e0a307a3-2c22-4320-8f9d-6a166c45222d [x74]
Oct 6 22:06:53 portal falcon-sensor-bpf[7590]: CrowdStrike(4): Could not retrieve DisableProxy value: c0000225
Oct 6 22:06:53 portal falcon-sensor-bpf[7590]: CrowdStrike(4): ConnectWithProxy: Unable to get application proxy host from CsConfig: c0000225
== strawberry (9 distinct, 40 total) ==
Oct 6 22:07:03 strawberry kernel: I/O error, dev sda, sector 206848 op 0x0:(READ) flags 0x80700 phys_seg 1 prio class 2 [x6]
Oct 6 22:07:03 strawberry kernel: I/O error, dev sda, sector 206848 op 0x0:(READ) flags 0x0 phys_seg 1 prio class 2 [x6]
Oct 6 22:07:03 strawberry kernel: Buffer I/O error on dev sda2, logical block 0, async page read [x6]
Oct 6 22:07:03 strawberry kernel: I/O error, dev sda, sector 2048 op 0x0:(READ) flags 0x80700 phys_seg 1 prio class 2 [x6]
Oct 6 22:07:03 strawberry kernel: I/O error, dev sda, sector 2048 op 0x0:(READ) flags 0x0 phys_seg 1 prio class 2 [x6]
Oct 6 22:07:03 strawberry kernel: Buffer I/O error on dev sda1, logical block 0, async page read [x6]
Oct 6 22:20:02 strawberry falcon-sensor-bpf[808]: CrowdStrike(4): Could not retrieve DisableProxy value: c0000225
Oct 6 22:20:02 strawberry falcon-sensor-bpf[808]: CrowdStrike(4): ConnectWithProxy: Unable to get application proxy host from CsConfig: c0000225
Oct 6 22:34:42 strawberry smartd[5314]: Device: /dev/sda [SAT], failed to read SMART Attribute Data [x2]
== stuckeys (2 distinct, 2 total) ==
Oct 6 22:13:59 stuckeys falcon-sensor-bpf[1493]: CrowdStrike(4): Could not retrieve DisableProxy value: c0000225
Oct 6 22:13:59 stuckeys falcon-sensor-bpf[1493]: CrowdStrike(4): ConnectWithProxy: Unable to get application proxy host from CsConfig: c0000225
== submit10-cln25 (5 distinct, 1539 total) ==
Oct 6 22:05:22 submit10-cln25 rsyslogd: file '/var/log/messages': open error: Input/output error [v8.24.0-57.el7_9.3 try http://www.rsyslog.com/e/2433 ] [x1200]
Oct 6 22:05:22 submit10-cln25 rsyslogd: imjournal: fopen() failed for path: '/var/lib/rsyslog/imjournal.state.tmp': Input/output error [v8.24.0-57.el7_9.3 try http://www.rsyslog.com/e/2013 ] [x334]
Oct 6 22:25:00 submit10-cln25 systemd: Failed at step USER spawning /usr/libexec/pcp/bin/pmlogger_check: Input/output error [x2]
Oct 6 22:28:00 submit10-cln25 systemd: Failed at step USER spawning /usr/libexec/pcp/bin/pmie_check: Input/output error [x2]
Oct 6 22:30:00 submit10-cln25 systemd: Failed at step USER spawning /usr/libexec/pcp/bin/pmlogger_daily: Input/output error
== submit26-b9-f1 (10 distinct, 12 total) ==
Oct 6 22:26:01 submit26-b9-f1 setroubleshoot[1574774]: SELinux is preventing /usr/bin/python3.9 from create access on the directory /(null). For complete SELinux messages run: sealert -l 3ef7d677-731f-46bf-9c34-c2c55fea665c
Oct 6 22:26:01 submit26-b9-f1 setroubleshoot[1574774]: SELinux is preventing /usr/bin/python3.9 from add_name access on the directory /(null). For complete SELinux messages run: sealert -l aa60e26f-72e1-45f1-bc12-aa8b3b669e36
Oct 6 22:26:01 submit26-b9-f1 setroubleshoot[1574774]: SELinux is preventing /usr/bin/python3.9 from create access on the file /(null). For complete SELinux messages run: sealert -l d088fb43-23ee-4ae8-ae6a-5d1c041ee2d6
Oct 6 22:26:01 submit26-b9-f1 setroubleshoot[1574774]: SELinux is preventing /usr/bin/python3.9 from open access on the file /tmp/libdnf.3arUOQ/repodata/repomd.xml. For complete SELinux messages run: sealert -l 3b0d8c9a-6637-4d6e-a864-f1dd7c00377d
Oct 6 22:26:01 submit26-b9-f1 setroubleshoot[1574774]: SELinux is preventing /usr/bin/python3.9 from setattr access on the file repomd.xml. For complete SELinux messages run: sealert -l 0fd3339f-3ef2-45f3-9e58-65a58b42f3ee
Oct 6 22:26:01 submit26-b9-f1 setroubleshoot[1574774]: SELinux is preventing /usr/bin/python3.9 from read access on the directory libdnf.3arUOQ. For complete SELinux messages run: sealert -l 0d661d88-dc9e-469d-986b-52e29b353aa8
Oct 6 22:26:01 submit26-b9-f1 setroubleshoot[1574774]: SELinux is preventing /usr/bin/python3.9 from remove_name access on the directory repomd.xml. For complete SELinux messages run: sealert -l 405a8556-cf9f-4ef4-8525-0dca18d4259d
Oct 6 22:26:01 submit26-b9-f1 setroubleshoot[1574774]: SELinux is preventing /usr/bin/python3.9 from unlink access on the file repomd.xml. For complete SELinux messages run: sealert -l 3c38e23e-3631-4cb5-81c7-992675c836d9
Oct 6 22:26:01 submit26-b9-f1 setroubleshoot[1574774]: SELinux is preventing /usr/bin/python3.9 from rmdir access on the directory repodata. For complete SELinux messages run: sealert -l a070e9b5-2867-47d6-b2e3-3b7d99725848
Oct 6 22:33:08 submit26-b9-f1 systemd[1]: user(a)1001.service: Main process exited, code=killed, status=9/KILL [x3]
== submit26-b9-f2 (10 distinct, 12 total) ==
Oct 6 22:06:55 submit26-b9-f2 setroubleshoot[667500]: SELinux is preventing /usr/bin/python3.9 from create access on the directory /(null). For complete SELinux messages run: sealert -l 0659d546-3107-4f75-b00f-008c85f41dc6
Oct 6 22:06:55 submit26-b9-f2 setroubleshoot[667500]: SELinux is preventing /usr/bin/python3.9 from add_name access on the directory /(null). For complete SELinux messages run: sealert -l 156d9270-3466-4356-b86f-1a128825961a
Oct 6 22:06:55 submit26-b9-f2 setroubleshoot[667500]: SELinux is preventing /usr/bin/python3.9 from create access on the file /(null). For complete SELinux messages run: sealert -l c8a40bf5-2fc4-46b3-b813-8592b3523339
Oct 6 22:06:55 submit26-b9-f2 setroubleshoot[667500]: SELinux is preventing /usr/bin/python3.9 from open access on the file /tmp/libdnf.oeXDnO/repodata/repomd.xml. For complete SELinux messages run: sealert -l 7f4c3a8e-0f99-47c4-9baf-e1336fe24876
Oct 6 22:06:55 submit26-b9-f2 setroubleshoot[667500]: SELinux is preventing /usr/bin/python3.9 from setattr access on the file repomd.xml. For complete SELinux messages run: sealert -l 988123da-b724-4e6a-900c-33a2723fdaf1
Oct 6 22:06:55 submit26-b9-f2 setroubleshoot[667500]: SELinux is preventing /usr/bin/python3.9 from read access on the directory libdnf.oeXDnO. For complete SELinux messages run: sealert -l ca585e2b-d50f-4264-8127-6b3fa04070c8
Oct 6 22:06:55 submit26-b9-f2 setroubleshoot[667500]: SELinux is preventing /usr/bin/python3.9 from remove_name access on the directory repomd.xml. For complete SELinux messages run: sealert -l 3a749560-1cec-40ca-a4dc-596841be3885
Oct 6 22:06:55 submit26-b9-f2 setroubleshoot[667500]: SELinux is preventing /usr/bin/python3.9 from unlink access on the file repomd.xml. For complete SELinux messages run: sealert -l 0aa52f08-94f8-474e-96d8-e818846941af
Oct 6 22:06:55 submit26-b9-f2 setroubleshoot[667500]: SELinux is preventing /usr/bin/python3.9 from rmdir access on the directory repodata. For complete SELinux messages run: sealert -l de019dc4-408f-439c-902a-676d18dfe8e7
Oct 6 22:09:36 submit26-b9-f2 systemd[1]: user(a)1001.service: Main process exited, code=killed, status=9/KILL [x3]
== submit26-b9-f3 (1 distinct, 4 total) ==
Oct 6 22:08:10 submit26-b9-f3 systemd[1]: user(a)1001.service: Main process exited, code=killed, status=9/KILL [x4]
== submit26-b9-f4 (1 distinct, 5 total) ==
Oct 6 22:11:47 submit26-b9-f4 systemd[1]: user(a)1001.service: Main process exited, code=killed, status=9/KILL [x5]
== talkhosts9 (2 distinct, 2 total) ==
Oct 6 22:15:44 talkhosts9 falcon-sensor-bpf[714]: CrowdStrike(4): Could not retrieve DisableProxy value: c0000225
Oct 6 22:15:44 talkhosts9 falcon-sensor-bpf[714]: CrowdStrike(4): ConnectWithProxy: Unable to get application proxy host from CsConfig: c0000225
== tumtum.cs.umd.edu (2 distinct, 2 total) ==
Oct 6 22:21:50 tumtum.cs.umd.edu falcon-sensor-bpf[1360]: CrowdStrike(4): Could not retrieve DisableProxy value: c0000225
Oct 6 22:21:50 tumtum.cs.umd.edu falcon-sensor-bpf[1360]: CrowdStrike(4): ConnectWithProxy: Unable to get application proxy host from CsConfig: c0000225
== vacuum.cs.umd.edu (4 distinct, 4 total) ==
Oct 6 22:09:53 vacuum.cs.umd.edu abrt-hook-ccpp[21115]: Process 17640 (driver) of user 33 killed by SIGABRT - dumping core
Oct 6 22:09:53 vacuum.cs.umd.edu abrt-server[21117]: Package 'amanda-backup_server' isn't signed with proper key
Oct 6 22:09:53 vacuum.cs.umd.edu abrt-server[21117]: 'post-create' on '/var/spool/abrt/ccpp-2026-10-06-22:09:53-17640' exited with 1
Oct 6 22:09:53 vacuum.cs.umd.edu abrt-server[21117]: Deleting problem directory '/var/spool/abrt/ccpp-2026-10-06-22:09:53-17640'
== yogurt (2 distinct, 2 total) ==
Oct 6 22:05:10 yogurt falcon-sensor-bpf[947]: CrowdStrike(4): Could not retrieve DisableProxy value: c0000225
Oct 6 22:05:10 yogurt falcon-sensor-bpf[947]: CrowdStrike(4): ConnectWithProxy: Unable to get application proxy host from CsConfig: c0000225
== zwicker-computer (2 distinct, 2 total) ==
Oct 6 22:06:55 zwicker-computer falcon-sensor-bpf[718]: CrowdStrike(4): Could not retrieve DisableProxy value: c0000225
Oct 6 22:06:55 zwicker-computer falcon-sensor-bpf[718]: CrowdStrike(4): ConnectWithProxy: Unable to get application proxy host from CsConfig: c0000225
1
0
Command: /usr/local/sbin/syslog-digest.py
Time : 0.2136s
Status : exited 0
Output :
Syslog digest — 2026-10-06 22:05 EDT
Processed 8,388 lines, filtered 5,348 (63%). 3,040 unknown (271 distinct) from 29 host(s).
== abuse (1 distinct, 347 total) ==
Oct 6 21:05:14 abuse rsyslogd[1033]: imjournal: open() failed for path: '/var/lib/rsyslog/imjournal.state.tmp': Input/output error [v8.2404.0 try https://www.rsyslog.com/e/2433 ] [x347]
== b0b02.cs.umd.edu (1 distinct, 1 total) ==
Oct 6 21:16:42 b0b02.cs.umd.edu rustdesk[1001495]: cannot open display:
== borogove.cs.umd.edu (2 distinct, 2 total) ==
Oct 6 22:03:55 borogove.cs.umd.edu falcon-sensor-bpf[1404]: CrowdStrike(4): Could not retrieve DisableProxy value: c0000225
Oct 6 22:03:55 borogove.cs.umd.edu falcon-sensor-bpf[1404]: CrowdStrike(4): ConnectWithProxy: Unable to get application proxy host from CsConfig: c0000225
== gle-dind00.cs.umd.edu (23 distinct, 23 total) ==
Oct 6 21:23:47 gle-dind00.cs.umd.edu systemd-udevd[2644873]: Could not generate persistent MAC address for vethc9cc118: No such file or directory
Oct 6 21:23:47 gle-dind00.cs.umd.edu systemd-udevd[2644872]: Could not generate persistent MAC address for vethb0e2a75: No such file or directory
Oct 6 21:23:48 gle-dind00.cs.umd.edu systemd-udevd[2644972]: Could not generate persistent MAC address for vethb857372: No such file or directory
Oct 6 21:23:48 gle-dind00.cs.umd.edu systemd-udevd[2644973]: Could not generate persistent MAC address for veth9a801be: No such file or directory
Oct 6 21:23:49 gle-dind00.cs.umd.edu systemd-udevd[2645073]: Could not generate persistent MAC address for vethd0a4177: No such file or directory
Oct 6 21:23:49 gle-dind00.cs.umd.edu systemd-udevd[2645074]: Could not generate persistent MAC address for veth6abd97d: No such file or directory
Oct 6 21:23:50 gle-dind00.cs.umd.edu systemd-udevd[2645174]: Could not generate persistent MAC address for vethfe0c26d: No such file or directory
Oct 6 21:23:50 gle-dind00.cs.umd.edu systemd-udevd[2645173]: Could not generate persistent MAC address for veth5d5de40: No such file or directory
Oct 6 21:23:51 gle-dind00.cs.umd.edu systemd-udevd[2645265]: Could not generate persistent MAC address for veth23da139: No such file or directory
Oct 6 21:23:51 gle-dind00.cs.umd.edu systemd-udevd[2645266]: Could not generate persistent MAC address for veth43a89c0: No such file or directory
Oct 6 21:24:09 gle-dind00.cs.umd.edu systemd-udevd[2645557]: Could not generate persistent MAC address for vetheabf6ed: No such file or directory
Oct 6 21:24:09 gle-dind00.cs.umd.edu systemd-udevd[2645558]: Could not generate persistent MAC address for vethfdb9ead: No such file or directory
Oct 6 21:24:10 gle-dind00.cs.umd.edu systemd-udevd[2645652]: Could not generate persistent MAC address for veth1d90bb8: No such file or directory
Oct 6 21:24:10 gle-dind00.cs.umd.edu systemd-udevd[2645653]: Could not generate persistent MAC address for veth20bf148: No such file or directory
Oct 6 21:24:11 gle-dind00.cs.umd.edu systemd-udevd[2645825]: Could not generate persistent MAC address for veth6110bcb: No such file or directory
Oct 6 21:24:11 gle-dind00.cs.umd.edu systemd-udevd[2645826]: Could not generate persistent MAC address for veth17f475f: No such file or directory
Oct 6 21:24:13 gle-dind00.cs.umd.edu systemd-udevd[2645937]: Could not generate persistent MAC address for veth58feda9: No such file or directory
Oct 6 21:24:13 gle-dind00.cs.umd.edu systemd-udevd[2645938]: Could not generate persistent MAC address for vetha59f710: No such file or directory
Oct 6 21:34:33 gle-dind00.cs.umd.edu systemd-udevd[2649078]: Could not generate persistent MAC address for veth861e51f: No such file or directory
Oct 6 21:34:33 gle-dind00.cs.umd.edu systemd-udevd[2649079]: Could not generate persistent MAC address for veth5978490: No such file or directory
Oct 6 21:34:52 gle-dind00.cs.umd.edu systemd-udevd[2649223]: Could not generate persistent MAC address for veth1f484c8: No such file or directory
Oct 6 21:34:52 gle-dind00.cs.umd.edu systemd-udevd[2649224]: Could not generate persistent MAC address for veth36e879d: No such file or directory
Oct 6 21:34:53 gle-dind00.cs.umd.edu lldpd[1000]: unable to send packet on real device for vethfe0c26d: No such device or address
== gle-dind02.cs.umd.edu (71 distinct, 71 total) ==
Oct 6 21:08:24 gle-dind02.cs.umd.edu systemd-udevd[1526019]: Could not generate persistent MAC address for veth7b2277a: No such file or directory
Oct 6 21:08:24 gle-dind02.cs.umd.edu systemd-udevd[1526018]: Could not generate persistent MAC address for vethf62abab: No such file or directory
Oct 6 21:08:36 gle-dind02.cs.umd.edu systemd-udevd[1526138]: Could not generate persistent MAC address for vethfde9cd6: No such file or directory
Oct 6 21:08:36 gle-dind02.cs.umd.edu systemd-udevd[1526139]: Could not generate persistent MAC address for veth2db3fac: No such file or directory
Oct 6 21:21:20 gle-dind02.cs.umd.edu systemd-udevd[1528442]: Could not generate persistent MAC address for veth3e42f48: No such file or directory
Oct 6 21:21:20 gle-dind02.cs.umd.edu systemd-udevd[1528443]: Could not generate persistent MAC address for veth81ac5e0: No such file or directory
Oct 6 21:21:21 gle-dind02.cs.umd.edu systemd-udevd[1528540]: Could not generate persistent MAC address for vethde26eb0: No such file or directory
Oct 6 21:21:21 gle-dind02.cs.umd.edu systemd-udevd[1528541]: Could not generate persistent MAC address for veth2182c3c: No such file or directory
Oct 6 21:21:22 gle-dind02.cs.umd.edu systemd-udevd[1528639]: Could not generate persistent MAC address for vethc8a0eb1: No such file or directory
Oct 6 21:21:22 gle-dind02.cs.umd.edu systemd-udevd[1528640]: Could not generate persistent MAC address for vethdf07d88: No such file or directory
Oct 6 21:21:23 gle-dind02.cs.umd.edu systemd-udevd[1528738]: Could not generate persistent MAC address for vethde017e5: No such file or directory
Oct 6 21:21:23 gle-dind02.cs.umd.edu systemd-udevd[1528737]: Could not generate persistent MAC address for vethd449e48: No such file or directory
Oct 6 21:21:24 gle-dind02.cs.umd.edu systemd-udevd[1528828]: Could not generate persistent MAC address for vethd0bb226: No such file or directory
Oct 6 21:21:24 gle-dind02.cs.umd.edu systemd-udevd[1528829]: Could not generate persistent MAC address for vethb71a71d: No such file or directory
Oct 6 21:21:42 gle-dind02.cs.umd.edu systemd-udevd[1529115]: Could not generate persistent MAC address for vethd29e94a: No such file or directory
Oct 6 21:21:42 gle-dind02.cs.umd.edu systemd-udevd[1529116]: Could not generate persistent MAC address for veth75ca0ec: No such file or directory
Oct 6 21:21:42 gle-dind02.cs.umd.edu systemd-udevd[1529212]: Could not generate persistent MAC address for veth32caec4: No such file or directory
Oct 6 21:21:42 gle-dind02.cs.umd.edu systemd-udevd[1529211]: Could not generate persistent MAC address for veth960d62c: No such file or directory
Oct 6 21:21:44 gle-dind02.cs.umd.edu systemd-udevd[1529385]: Could not generate persistent MAC address for veth797153c: No such file or directory
Oct 6 21:21:44 gle-dind02.cs.umd.edu systemd-udevd[1529386]: Could not generate persistent MAC address for vethd2a8af2: No such file or directory
Oct 6 21:21:45 gle-dind02.cs.umd.edu systemd-udevd[1529498]: Could not generate persistent MAC address for vethe580e94: No such file or directory
Oct 6 21:21:45 gle-dind02.cs.umd.edu systemd-udevd[1529499]: Could not generate persistent MAC address for veth0fed57d: No such file or directory
Oct 6 21:28:16 gle-dind02.cs.umd.edu systemd-udevd[1531199]: Could not generate persistent MAC address for veth609b3d0: No such file or directory
Oct 6 21:28:16 gle-dind02.cs.umd.edu systemd-udevd[1531198]: Could not generate persistent MAC address for veth15e4f1c: No such file or directory
Oct 6 21:28:17 gle-dind02.cs.umd.edu lldpd[973]: unable to send packet on real device for veth0fed57d: No such device or address
Oct 6 21:28:30 gle-dind02.cs.umd.edu systemd-udevd[1531316]: Could not generate persistent MAC address for veth363aba8: No such file or directory
Oct 6 21:28:30 gle-dind02.cs.umd.edu systemd-udevd[1531315]: Could not generate persistent MAC address for veth4e2fcab: No such file or directory
Oct 6 21:30:37 gle-dind02.cs.umd.edu systemd-udevd[1531930]: Could not generate persistent MAC address for veth2c07917: No such file or directory
Oct 6 21:30:37 gle-dind02.cs.umd.edu systemd-udevd[1531931]: Could not generate persistent MAC address for vethbdfec56: No such file or directory
Oct 6 21:30:38 gle-dind02.cs.umd.edu systemd-udevd[1532028]: Could not generate persistent MAC address for veth369b2d7: No such file or directory
... 41 more distinct messages not shown
== gle-dind04 (7 distinct, 9 total) ==
Oct 6 21:22:09 gle-dind04 lldpd[1171]: unable to send packet on real device for veth3f5931d: No such device or address
Oct 6 21:22:09 gle-dind04 lldpd[1171]: unable to send packet on real device for vetha956748: No such device or address
Oct 6 21:28:55 gle-dind04 lldpd[1171]: unable to send packet on real device for veth61c38ad: No such device or address
Oct 6 21:28:55 gle-dind04 lldpd[1171]: unable to send packet on real device for veth5dc3c18: No such device or address
Oct 6 21:29:56 gle-dind04 kernel: overlayfs: upperdir is in-use as upperdir/workdir of another mount, accessing files from both mounts will result in undefined behavior. [x2]
Oct 6 21:29:56 gle-dind04 kernel: overlayfs: workdir is in-use as upperdir/workdir of another mount, accessing files from both mounts will result in undefined behavior. [x2]
Oct 6 21:37:04 gle-dind04 lldpd[1171]: unable to send packet on real device for veth89fb2f2: No such device or address
== gle-omnibus00.cs.umd.edu (12 distinct, 12 total) ==
Oct 6 21:07:12 gle-omnibus00.cs.umd.edu microcode_ctl[1227436]: <4>After installation of a new version of microcode_ctl package,
Oct 6 21:07:12 gle-omnibus00.cs.umd.edu microcode_ctl[1227436]: initramfs hasn't been re-generated for all the installed kernel packages.
Oct 6 21:07:12 gle-omnibus00.cs.umd.edu microcode_ctl[1227436]: The following kernel packages have been skipped: kernel-core-5.14.0-687.41.1.el9_8.x86_64.
Oct 6 21:07:12 gle-omnibus00.cs.umd.edu microcode_ctl[1227436]: Please re-generate initramfs manually for these kernel packages with the
Oct 6 21:07:12 gle-omnibus00.cs.umd.edu microcode_ctl[1227436]: "dracut -f --kver KERNEL_VERSION" command in order to get the latest
Oct 6 21:07:12 gle-omnibus00.cs.umd.edu microcode_ctl[1227436]: Intel CPU microcode included into early initramfs image for it, if needed.
Oct 6 21:07:12 gle-omnibus00.cs.umd.edu journal: After installation of a new version of microcode_ctl package,
Oct 6 21:07:12 gle-omnibus00.cs.umd.edu journal: initramfs hasn't been re-generated for all the installed kernel packages.
Oct 6 21:07:12 gle-omnibus00.cs.umd.edu journal: The following kernel packages have been skipped: kernel-core-5.14.0-687.41.1.el9_8.x86_64.
Oct 6 21:07:12 gle-omnibus00.cs.umd.edu journal: Please re-generate initramfs manually for these kernel packages with the
Oct 6 21:07:12 gle-omnibus00.cs.umd.edu journal: "dracut -f --kver KERNEL_VERSION" command in order to get the latest
Oct 6 21:07:12 gle-omnibus00.cs.umd.edu journal: Intel CPU microcode included into early initramfs image for it, if needed.
== haproxy03.cs.umd.edu (2 distinct, 2 total) ==
Oct 6 22:04:07 haproxy03.cs.umd.edu falcon-sensor-bpf[1401]: CrowdStrike(4): Could not retrieve DisableProxy value: c0000225
Oct 6 22:04:07 haproxy03.cs.umd.edu falcon-sensor-bpf[1401]: CrowdStrike(4): ConnectWithProxy: Unable to get application proxy host from CsConfig: c0000225
== idm00 (1 distinct, 1 total) ==
Oct 6 21:54:40 idm00 named[4166701]: client @0x7f11980762a8 10.73.240.42#59060: update '73.10.in-addr.arpa/IN' denied
== idmp0 (1 distinct, 1 total) ==
Oct 6 21:39:23 idmp0 named[1598691]: client @0x7f2d48013d38 10.73.240.43#65187: update '73.10.in-addr.arpa/IN' denied
== irb2156 (2 distinct, 2 total) ==
Oct 6 21:57:04 irb2156 falcon-sensor-bpf[3902]: CrowdStrike(4): Could not retrieve DisableProxy value: c0000225
Oct 6 21:57:04 irb2156 falcon-sensor-bpf[3902]: CrowdStrike(4): ConnectWithProxy: Unable to get application proxy host from CsConfig: c0000225
== itmon02 (1 distinct, 7 total) ==
Oct 6 21:08:00 itmon02 sshd[805675]: error: beginning MaxStartups throttling [x7]
== munin (2 distinct, 22 total) ==
Oct 6 21:07:57 munin sudo[950965]: pam_systemd(sudo:session): Failed to stat() runtime directory '/run/user/0': No such file or directory [x11]
Oct 6 21:07:57 munin sudo[950965]: pam_systemd(sudo:session): Not setting $XDG_RUNTIME_DIR, as the directory is not in order. [x11]
== newhonors2 (1 distinct, 24 total) ==
Oct 6 21:13:03 newhonors2 dhcpcd[3656471]: dhcpcd is not running [x24]
== ntop00 (98 distinct, 98 total) ==
Oct 6 21:05:01 ntop00 nfacctd[1075699]: INFO ( m1/mysql ): *** Purging cache - START (PID: 4354) ***
Oct 6 21:05:01 ntop00 nfacctd[1075699]: INFO ( m1/mysql ): *** Purging cache - END (PID: 4354, QN: 65/65, ET: 0) ***
Oct 6 21:05:08 ntop00 sfacctd[1075592]: INFO ( m1/mysql ): *** Purging cache - END (PID: 4354, QN: 4707/4707, ET: 7) ***
Oct 6 21:08:01 ntop00 sfacctd[1075592]: INFO ( p1/print ): *** Purging cache - START (PID: 4355) ***
Oct 6 21:08:01 ntop00 sfacctd[1075592]: INFO ( p1/print ): *** Purging cache - END (PID: 4355, QN: 6082/6082, ET: 0) ***
Oct 6 21:08:02 ntop00 nfacctd[1075699]: INFO ( p1/print ): *** Purging cache - START (PID: 4355) ***
Oct 6 21:08:02 ntop00 nfacctd[1075699]: INFO ( p1/print ): *** Purging cache - END (PID: 4355, QN: 67/67, ET: 0) ***
Oct 6 21:10:01 ntop00 sfacctd[1075592]: INFO ( m1/mysql ): *** Purging cache - START (PID: 4356) ***
Oct 6 21:10:01 ntop00 nfacctd[1075699]: INFO ( m1/mysql ): *** Purging cache - START (PID: 4356) ***
Oct 6 21:10:01 ntop00 nfacctd[1075699]: INFO ( m1/mysql ): *** Purging cache - END (PID: 4356, QN: 65/65, ET: 0) ***
Oct 6 21:10:09 ntop00 sfacctd[1075592]: INFO ( m1/mysql ): *** Purging cache - END (PID: 4356, QN: 5353/5353, ET: 8) ***
Oct 6 21:13:01 ntop00 sfacctd[1075592]: INFO ( p1/print ): *** Purging cache - START (PID: 4357) ***
Oct 6 21:13:01 ntop00 sfacctd[1075592]: INFO ( p1/print ): *** Purging cache - END (PID: 4357, QN: 4495/4495, ET: 0) ***
Oct 6 21:13:01 ntop00 nfacctd[1075699]: INFO ( p1/print ): *** Purging cache - START (PID: 4357) ***
Oct 6 21:13:01 ntop00 nfacctd[1075699]: INFO ( p1/print ): *** Purging cache - END (PID: 4357, QN: 68/68, ET: 0) ***
Oct 6 21:15:01 ntop00 sfacctd[1075592]: INFO ( m1/mysql ): *** Purging cache - START (PID: 4358) ***
Oct 6 21:15:01 ntop00 nfacctd[1075699]: INFO ( m1/mysql ): *** Purging cache - START (PID: 4358) ***
Oct 6 21:15:01 ntop00 nfacctd[1075699]: INFO ( m1/mysql ): *** Purging cache - END (PID: 4358, QN: 60/60, ET: 0) ***
Oct 6 21:15:08 ntop00 sfacctd[1075592]: INFO ( m1/mysql ): *** Purging cache - END (PID: 4358, QN: 4858/4858, ET: 7) ***
Oct 6 21:18:01 ntop00 nfacctd[1075699]: INFO ( p1/print ): *** Purging cache - START (PID: 4359) ***
Oct 6 21:18:01 ntop00 nfacctd[1075699]: INFO ( p1/print ): *** Purging cache - END (PID: 4359, QN: 64/64, ET: 0) ***
Oct 6 21:18:01 ntop00 sfacctd[1075592]: INFO ( p1/print ): *** Purging cache - START (PID: 4359) ***
Oct 6 21:18:01 ntop00 sfacctd[1075592]: INFO ( p1/print ): *** Purging cache - END (PID: 4359, QN: 5043/5043, ET: 0) ***
Oct 6 21:20:01 ntop00 sfacctd[1075592]: INFO ( m1/mysql ): *** Purging cache - START (PID: 4360) ***
Oct 6 21:20:01 ntop00 nfacctd[1075699]: INFO ( m1/mysql ): *** Purging cache - START (PID: 4360) ***
Oct 6 21:20:01 ntop00 nfacctd[1075699]: INFO ( m1/mysql ): *** Purging cache - END (PID: 4360, QN: 87/87, ET: 0) ***
Oct 6 21:20:08 ntop00 sfacctd[1075592]: INFO ( m1/mysql ): *** Purging cache - END (PID: 4360, QN: 4346/4346, ET: 7) ***
Oct 6 21:23:01 ntop00 sfacctd[1075592]: INFO ( p1/print ): *** Purging cache - START (PID: 4361) ***
Oct 6 21:23:01 ntop00 sfacctd[1075592]: INFO ( p1/print ): *** Purging cache - END (PID: 4361, QN: 4868/4868, ET: 0) ***
Oct 6 21:23:01 ntop00 nfacctd[1075699]: INFO ( p1/print ): *** Purging cache - START (PID: 4361) ***
... 68 more distinct messages not shown
== openvox08-cmp2 (1 distinct, 711 total) ==
Oct 6 21:05:09 openvox08-cmp2 rsyslogd[983]: imjournal: open() failed for path: '/var/lib/rsyslog/imjournal.state.tmp': Input/output error [v8.2510.0-5.el10 try https://www.rsyslog.com/e/2433 ] [x711]
== outbound00.cs.umd.edu (1 distinct, 6 total) ==
Oct 6 21:09:09 outbound00.cs.umd.edu python3[66609]: ldapdb [x6]
== outbound01.cs.umd.edu (1 distinct, 6 total) ==
Oct 6 21:13:06 outbound01.cs.umd.edu python3[1526213]: ldapdb [x6]
== portal (1 distinct, 73 total) ==
Oct 6 21:05:14 portal setroubleshoot[1598646]: SELinux is preventing /usr/local/bin/traefik from connectto access on the unix_stream_socket /run/podman/podman.sock. For complete SELinux messages run: sealert -l e0a307a3-2c22-4320-8f9d-6a166c45222d [x73]
== quiss (2 distinct, 2 total) ==
Oct 6 22:00:08 quiss falcon-sensor-bpf[1301]: CrowdStrike(4): Could not retrieve DisableProxy value: c0000225
Oct 6 22:00:08 quiss falcon-sensor-bpf[1301]: CrowdStrike(4): ConnectWithProxy: Unable to get application proxy host from CsConfig: c0000225
== strawberry (7 distinct, 38 total) ==
Oct 6 21:07:03 strawberry kernel: I/O error, dev sda, sector 206848 op 0x0:(READ) flags 0x80700 phys_seg 1 prio class 2 [x6]
Oct 6 21:07:03 strawberry kernel: I/O error, dev sda, sector 206848 op 0x0:(READ) flags 0x0 phys_seg 1 prio class 2 [x6]
Oct 6 21:07:03 strawberry kernel: Buffer I/O error on dev sda2, logical block 0, async page read [x6]
Oct 6 21:07:03 strawberry kernel: I/O error, dev sda, sector 2048 op 0x0:(READ) flags 0x80700 phys_seg 1 prio class 2 [x6]
Oct 6 21:07:03 strawberry kernel: I/O error, dev sda, sector 2048 op 0x0:(READ) flags 0x0 phys_seg 1 prio class 2 [x6]
Oct 6 21:07:03 strawberry kernel: Buffer I/O error on dev sda1, logical block 0, async page read [x6]
Oct 6 21:34:42 strawberry smartd[5314]: Device: /dev/sda [SAT], failed to read SMART Attribute Data [x2]
== submit10-cln25 (5 distinct, 1539 total) ==
Oct 6 21:05:22 submit10-cln25 rsyslogd: file '/var/log/messages': open error: Input/output error [v8.24.0-57.el7_9.3 try http://www.rsyslog.com/e/2433 ] [x1200]
Oct 6 21:05:22 submit10-cln25 rsyslogd: imjournal: fopen() failed for path: '/var/lib/rsyslog/imjournal.state.tmp': Input/output error [v8.24.0-57.el7_9.3 try http://www.rsyslog.com/e/2013 ] [x334]
Oct 6 21:25:01 submit10-cln25 systemd: Failed at step USER spawning /usr/libexec/pcp/bin/pmlogger_check: Input/output error [x2]
Oct 6 21:28:01 submit10-cln25 systemd: Failed at step USER spawning /usr/libexec/pcp/bin/pmie_check: Input/output error [x2]
Oct 6 21:30:01 submit10-cln25 systemd: Failed at step USER spawning /usr/libexec/pcp/bin/pmlogger_daily: Input/output error
== submit26-b9-f1 (1 distinct, 3 total) ==
Oct 6 21:18:07 submit26-b9-f1 systemd[1]: user(a)1001.service: Main process exited, code=killed, status=9/KILL [x3]
== submit26-b9-f2 (1 distinct, 4 total) ==
Oct 6 21:08:14 submit26-b9-f2 systemd[1]: user(a)1001.service: Main process exited, code=killed, status=9/KILL [x4]
== submit26-b9-f3 (10 distinct, 16 total) ==
Oct 6 21:06:48 submit26-b9-f3 setroubleshoot[1842786]: SELinux is preventing /usr/bin/python3.9 from create access on the directory /(null). For complete SELinux messages run: sealert -l a653b772-cbcd-438b-bae5-23c3dc69b31b
Oct 6 21:06:48 submit26-b9-f3 setroubleshoot[1842786]: SELinux is preventing /usr/bin/python3.9 from add_name access on the directory /(null). For complete SELinux messages run: sealert -l 3e904634-6caa-4202-8c92-f139db798859
Oct 6 21:06:48 submit26-b9-f3 setroubleshoot[1842786]: SELinux is preventing /usr/bin/python3.9 from create access on the file /(null). For complete SELinux messages run: sealert -l 580b20e4-ec2c-433d-905c-5bd417fba033
Oct 6 21:06:48 submit26-b9-f3 setroubleshoot[1842786]: SELinux is preventing /usr/bin/python3.9 from open access on the file /tmp/libdnf.X9zLeq/repodata/repomd.xml. For complete SELinux messages run: sealert -l 27f29d48-5e7c-4db7-b051-8ac055737d6f
Oct 6 21:06:49 submit26-b9-f3 setroubleshoot[1842786]: SELinux is preventing /usr/bin/python3.9 from setattr access on the file repomd.xml. For complete SELinux messages run: sealert -l bff72452-d40a-430b-9060-dd0a48f5b6ba
Oct 6 21:06:49 submit26-b9-f3 setroubleshoot[1842786]: SELinux is preventing /usr/bin/python3.9 from read access on the directory libdnf.X9zLeq. For complete SELinux messages run: sealert -l 9638d396-8ce5-4e6a-ae47-45cd3985e1cd
Oct 6 21:06:49 submit26-b9-f3 setroubleshoot[1842786]: SELinux is preventing /usr/bin/python3.9 from remove_name access on the directory repomd.xml. For complete SELinux messages run: sealert -l 6da64b94-7024-45a9-b8c2-3b9812517407
Oct 6 21:06:49 submit26-b9-f3 setroubleshoot[1842786]: SELinux is preventing /usr/bin/python3.9 from unlink access on the file repomd.xml. For complete SELinux messages run: sealert -l 64cbe179-abf1-4d5a-bade-bb164897ee65
Oct 6 21:06:49 submit26-b9-f3 setroubleshoot[1842786]: SELinux is preventing /usr/bin/python3.9 from rmdir access on the directory repodata. For complete SELinux messages run: sealert -l d2e35b1a-e27c-4f91-9217-2bb1204e1e68
Oct 6 21:10:06 submit26-b9-f3 systemd[1]: user(a)1001.service: Main process exited, code=killed, status=9/KILL [x7]
== submit26-b9-f4 (10 distinct, 14 total) ==
Oct 6 21:22:09 submit26-b9-f4 systemd[1]: user(a)1001.service: Main process exited, code=killed, status=9/KILL [x5]
Oct 6 21:24:54 submit26-b9-f4 setroubleshoot[151498]: SELinux is preventing /usr/bin/python3.9 from create access on the directory /(null). For complete SELinux messages run: sealert -l ee160f23-b161-4f4a-9985-c4edfd3a5beb
Oct 6 21:24:54 submit26-b9-f4 setroubleshoot[151498]: SELinux is preventing /usr/bin/python3.9 from add_name access on the directory /(null). For complete SELinux messages run: sealert -l 89a83821-4b24-4081-9973-0a79ca6ed5b4
Oct 6 21:24:54 submit26-b9-f4 setroubleshoot[151498]: SELinux is preventing /usr/bin/python3.9 from create access on the file /(null). For complete SELinux messages run: sealert -l f73955d6-1416-45f9-bab6-ff1f3ea07e9d
Oct 6 21:24:54 submit26-b9-f4 setroubleshoot[151498]: SELinux is preventing /usr/bin/python3.9 from open access on the file /tmp/libdnf.8PTGef/repodata/repomd.xml. For complete SELinux messages run: sealert -l 9f8f24a0-8fb6-454d-a103-31a8f7a6efa0
Oct 6 21:24:54 submit26-b9-f4 setroubleshoot[151498]: SELinux is preventing /usr/bin/python3.9 from setattr access on the file repomd.xml. For complete SELinux messages run: sealert -l 20293136-86a3-40ba-a651-cff48d36059e
Oct 6 21:24:54 submit26-b9-f4 setroubleshoot[151498]: SELinux is preventing /usr/bin/python3.9 from read access on the directory libdnf.8PTGef. For complete SELinux messages run: sealert -l 25f86b49-4ee7-4f60-ad1c-73a70032560c
Oct 6 21:24:54 submit26-b9-f4 setroubleshoot[151498]: SELinux is preventing /usr/bin/python3.9 from remove_name access on the directory repomd.xml. For complete SELinux messages run: sealert -l eec250fb-073f-456d-93bc-f98776fd476d
Oct 6 21:24:54 submit26-b9-f4 setroubleshoot[151498]: SELinux is preventing /usr/bin/python3.9 from unlink access on the file repomd.xml. For complete SELinux messages run: sealert -l c9209e04-a349-43d5-8cb2-3e303e48df74
Oct 6 21:24:54 submit26-b9-f4 setroubleshoot[151498]: SELinux is preventing /usr/bin/python3.9 from rmdir access on the directory repodata. For complete SELinux messages run: sealert -l 3178d5f5-80e9-404b-92b7-9bef397a8915
== teaching-awards (2 distinct, 2 total) ==
Oct 6 22:02:57 teaching-awards falcon-sensor-bpf[782]: CrowdStrike(4): Could not retrieve DisableProxy value: c0000225
Oct 6 22:02:57 teaching-awards falcon-sensor-bpf[782]: CrowdStrike(4): ConnectWithProxy: Unable to get application proxy host from CsConfig: c0000225
== tulgey.cs.umd.edu (2 distinct, 2 total) ==
Oct 6 22:04:56 tulgey.cs.umd.edu falcon-sensor-bpf[1534]: CrowdStrike(4): Could not retrieve DisableProxy value: c0000225
Oct 6 22:04:56 tulgey.cs.umd.edu falcon-sensor-bpf[1534]: CrowdStrike(4): ConnectWithProxy: Unable to get application proxy host from CsConfig: c0000225
== wraith (2 distinct, 2 total) ==
Oct 6 21:59:53 wraith falcon-sensor[917]: CrowdStrike(4): Could not retrieve DisableProxy value: c0000225
Oct 6 21:59:53 wraith falcon-sensor[917]: CrowdStrike(4): ConnectWithProxy: Unable to get application proxy host from CsConfig: c0000225
1
0
Command: /usr/local/sbin/syslog-digest.py
Time : 0.2150s
Status : exited 0
Output :
Syslog digest — 2026-10-06 21:05 EDT
Processed 8,850 lines, filtered 5,843 (66%). 3,007 unknown (209 distinct) from 24 host(s).
== abuse (1 distinct, 346 total) ==
Oct 6 20:05:25 abuse rsyslogd[1033]: imjournal: open() failed for path: '/var/lib/rsyslog/imjournal.state.tmp': Input/output error [v8.2404.0 try https://www.rsyslog.com/e/2433 ] [x346]
== b0b02.cs.umd.edu (1 distinct, 1 total) ==
Oct 6 20:16:41 b0b02.cs.umd.edu rustdesk[986398]: cannot open display:
== gle-dind00.cs.umd.edu (44 distinct, 44 total) ==
Oct 6 20:30:45 gle-dind00.cs.umd.edu systemd-udevd[2630863]: Could not generate persistent MAC address for vetha601ed4: No such file or directory
Oct 6 20:30:45 gle-dind00.cs.umd.edu systemd-udevd[2630864]: Could not generate persistent MAC address for veth45bcec6: No such file or directory
Oct 6 20:30:46 gle-dind00.cs.umd.edu systemd-udevd[2630995]: Could not generate persistent MAC address for veth75c88b6: No such file or directory
Oct 6 20:30:46 gle-dind00.cs.umd.edu systemd-udevd[2630996]: Could not generate persistent MAC address for veth11cd58a: No such file or directory
Oct 6 20:30:47 gle-dind00.cs.umd.edu systemd-udevd[2631204]: Could not generate persistent MAC address for veth8ad9e81: No such file or directory
Oct 6 20:30:47 gle-dind00.cs.umd.edu systemd-udevd[2631205]: Could not generate persistent MAC address for veth902fa00: No such file or directory
Oct 6 20:30:48 gle-dind00.cs.umd.edu systemd-udevd[2631302]: Could not generate persistent MAC address for veth6e920fb: No such file or directory
Oct 6 20:30:48 gle-dind00.cs.umd.edu systemd-udevd[2631303]: Could not generate persistent MAC address for veth86da192: No such file or directory
Oct 6 20:30:49 gle-dind00.cs.umd.edu systemd-udevd[2631391]: Could not generate persistent MAC address for vethab8e08f: No such file or directory
Oct 6 20:30:49 gle-dind00.cs.umd.edu systemd-udevd[2631390]: Could not generate persistent MAC address for veth224b40a: No such file or directory
Oct 6 20:31:06 gle-dind00.cs.umd.edu systemd-udevd[2631677]: Could not generate persistent MAC address for vethfeb9f31: No such file or directory
Oct 6 20:31:06 gle-dind00.cs.umd.edu systemd-udevd[2631678]: Could not generate persistent MAC address for veth30689d8: No such file or directory
Oct 6 20:31:07 gle-dind00.cs.umd.edu systemd-udevd[2631774]: Could not generate persistent MAC address for veth7da5849: No such file or directory
Oct 6 20:31:07 gle-dind00.cs.umd.edu systemd-udevd[2631775]: Could not generate persistent MAC address for veth071c819: No such file or directory
Oct 6 20:31:09 gle-dind00.cs.umd.edu systemd-udevd[2631955]: Could not generate persistent MAC address for veth9fe7d79: No such file or directory
Oct 6 20:31:09 gle-dind00.cs.umd.edu systemd-udevd[2631956]: Could not generate persistent MAC address for veth8fed114: No such file or directory
Oct 6 20:31:10 gle-dind00.cs.umd.edu systemd-udevd[2632069]: Could not generate persistent MAC address for veth4ac98ed: No such file or directory
Oct 6 20:31:10 gle-dind00.cs.umd.edu systemd-udevd[2632070]: Could not generate persistent MAC address for veth20b1704: No such file or directory
Oct 6 20:36:18 gle-dind00.cs.umd.edu systemd-udevd[2633316]: Could not generate persistent MAC address for vethb0c40f9: No such file or directory
Oct 6 20:36:18 gle-dind00.cs.umd.edu systemd-udevd[2633317]: Could not generate persistent MAC address for vethff9e9fc: No such file or directory
Oct 6 20:36:37 gle-dind00.cs.umd.edu systemd-udevd[2633436]: Could not generate persistent MAC address for veth8e39e64: No such file or directory
Oct 6 20:36:37 gle-dind00.cs.umd.edu systemd-udevd[2633437]: Could not generate persistent MAC address for vethf3f7514: No such file or directory
Oct 6 20:50:24 gle-dind00.cs.umd.edu systemd-udevd[2636093]: Could not generate persistent MAC address for veth10980b9: No such file or directory
Oct 6 20:50:24 gle-dind00.cs.umd.edu systemd-udevd[2636094]: Could not generate persistent MAC address for vethacac48f: No such file or directory
Oct 6 20:50:25 gle-dind00.cs.umd.edu systemd-udevd[2636192]: Could not generate persistent MAC address for vethee0436a: No such file or directory
Oct 6 20:50:25 gle-dind00.cs.umd.edu systemd-udevd[2636193]: Could not generate persistent MAC address for vethb1f3645: No such file or directory
Oct 6 20:50:26 gle-dind00.cs.umd.edu systemd-udevd[2636383]: Could not generate persistent MAC address for veth7563fc3: No such file or directory
Oct 6 20:50:26 gle-dind00.cs.umd.edu systemd-udevd[2636384]: Could not generate persistent MAC address for vethed428cd: No such file or directory
Oct 6 20:50:27 gle-dind00.cs.umd.edu systemd-udevd[2636515]: Could not generate persistent MAC address for veth7576681: No such file or directory
Oct 6 20:50:27 gle-dind00.cs.umd.edu systemd-udevd[2636516]: Could not generate persistent MAC address for vethf47887d: No such file or directory
... 14 more distinct messages not shown
== gle-dind02.cs.umd.edu (18 distinct, 18 total) ==
Oct 6 20:56:52 gle-dind02.cs.umd.edu systemd-udevd[1522072]: Could not generate persistent MAC address for vethf21192c: No such file or directory
Oct 6 20:56:52 gle-dind02.cs.umd.edu systemd-udevd[1522071]: Could not generate persistent MAC address for veth2d01f78: No such file or directory
Oct 6 20:56:53 gle-dind02.cs.umd.edu systemd-udevd[1522176]: Could not generate persistent MAC address for veth03fea76: No such file or directory
Oct 6 20:56:53 gle-dind02.cs.umd.edu systemd-udevd[1522177]: Could not generate persistent MAC address for veth34dd15b: No such file or directory
Oct 6 20:56:54 gle-dind02.cs.umd.edu systemd-udevd[1522273]: Could not generate persistent MAC address for veth15c40c2: No such file or directory
Oct 6 20:56:54 gle-dind02.cs.umd.edu systemd-udevd[1522274]: Could not generate persistent MAC address for veth349e5b8: No such file or directory
Oct 6 20:56:55 gle-dind02.cs.umd.edu systemd-udevd[1522373]: Could not generate persistent MAC address for vethb2bfd26: No such file or directory
Oct 6 20:56:55 gle-dind02.cs.umd.edu systemd-udevd[1522372]: Could not generate persistent MAC address for veth8a90a8c: No such file or directory
Oct 6 20:56:56 gle-dind02.cs.umd.edu systemd-udevd[1522462]: Could not generate persistent MAC address for veth2d4d11a: No such file or directory
Oct 6 20:56:56 gle-dind02.cs.umd.edu systemd-udevd[1522463]: Could not generate persistent MAC address for vethb597375: No such file or directory
Oct 6 20:57:14 gle-dind02.cs.umd.edu systemd-udevd[1523191]: Could not generate persistent MAC address for veth3161a5c: No such file or directory
Oct 6 20:57:14 gle-dind02.cs.umd.edu systemd-udevd[1523192]: Could not generate persistent MAC address for veth8f7dffc: No such file or directory
Oct 6 20:57:14 gle-dind02.cs.umd.edu systemd-udevd[1523291]: Could not generate persistent MAC address for vethb954887: No such file or directory
Oct 6 20:57:14 gle-dind02.cs.umd.edu systemd-udevd[1523293]: Could not generate persistent MAC address for vethb29fcee: No such file or directory
Oct 6 20:57:16 gle-dind02.cs.umd.edu systemd-udevd[1523465]: Could not generate persistent MAC address for veth6d820a0: No such file or directory
Oct 6 20:57:16 gle-dind02.cs.umd.edu systemd-udevd[1523466]: Could not generate persistent MAC address for vethaa52280: No such file or directory
Oct 6 20:57:17 gle-dind02.cs.umd.edu systemd-udevd[1523581]: Could not generate persistent MAC address for veth4b2ed59: No such file or directory
Oct 6 20:57:17 gle-dind02.cs.umd.edu systemd-udevd[1523582]: Could not generate persistent MAC address for vethdc79c4c: No such file or directory
== gle-dind04 (4 distinct, 4 total) ==
Oct 6 20:07:54 gle-dind04 lldpd[1171]: unable to send packet on real device for veth8e9cc82: No such device or address
Oct 6 20:09:57 gle-dind04 lldpd[1171]: unable to send packet on real device for veth48f0da9: No such device or address
Oct 6 20:29:14 gle-dind04 lldpd[1171]: unable to send packet on real device for veth51dc117: No such device or address
Oct 6 20:29:14 gle-dind04 lldpd[1171]: unable to send packet on real device for veth3f484e3: No such device or address
== idm00 (1 distinct, 1 total) ==
Oct 6 20:54:40 idm00 named[4166701]: client @0x7f11a402f3b8 10.73.240.42#61192: update '73.10.in-addr.arpa/IN' denied
== idmp0 (1 distinct, 1 total) ==
Oct 6 20:39:23 idmp0 named[1598691]: client @0x7f2d34017478 10.73.240.43#57374: update '73.10.in-addr.arpa/IN' denied
== inbound00.cs.umd.edu (1 distinct, 1 total) ==
Oct 6 20:41:01 inbound00.cs.umd.edu sshd-session[3628360]: fatal: userauth_pubkey: parse publickey packet: incomplete message [preauth]
== itmon02 (1 distinct, 2 total) ==
Oct 6 20:18:00 itmon02 sshd[805675]: error: beginning MaxStartups throttling [x2]
== munin (2 distinct, 38 total) ==
Oct 6 20:23:35 munin sudo[935041]: pam_systemd(sudo:session): Failed to stat() runtime directory '/run/user/0': No such file or directory [x19]
Oct 6 20:23:35 munin sudo[935041]: pam_systemd(sudo:session): Not setting $XDG_RUNTIME_DIR, as the directory is not in order. [x19]
== newhonors2 (1 distinct, 24 total) ==
Oct 6 20:13:03 newhonors2 dhcpcd[3654630]: dhcpcd is not running [x24]
== ntop00 (97 distinct, 97 total) ==
Oct 6 20:05:01 ntop00 nfacctd[1075699]: INFO ( m1/mysql ): *** Purging cache - START (PID: 4330) ***
Oct 6 20:05:01 ntop00 sfacctd[1075592]: INFO ( m1/mysql ): *** Purging cache - START (PID: 4330) ***
Oct 6 20:05:01 ntop00 nfacctd[1075699]: INFO ( m1/mysql ): *** Purging cache - END (PID: 4330, QN: 70/70, ET: 0) ***
Oct 6 20:05:14 ntop00 sfacctd[1075592]: INFO ( m1/mysql ): *** Purging cache - END (PID: 4330, QN: 8308/8308, ET: 13) ***
Oct 6 20:08:01 ntop00 sfacctd[1075592]: INFO ( p1/print ): *** Purging cache - START (PID: 4331) ***
Oct 6 20:08:01 ntop00 sfacctd[1075592]: INFO ( p1/print ): *** Purging cache - END (PID: 4331, QN: 6513/6513, ET: 0) ***
Oct 6 20:08:01 ntop00 nfacctd[1075699]: INFO ( p1/print ): *** Purging cache - START (PID: 4331) ***
Oct 6 20:08:01 ntop00 nfacctd[1075699]: INFO ( p1/print ): *** Purging cache - END (PID: 4331, QN: 61/61, ET: 0) ***
Oct 6 20:10:01 ntop00 sfacctd[1075592]: INFO ( m1/mysql ): *** Purging cache - START (PID: 4332) ***
Oct 6 20:10:01 ntop00 nfacctd[1075699]: INFO ( m1/mysql ): *** Purging cache - START (PID: 4332) ***
Oct 6 20:10:01 ntop00 nfacctd[1075699]: INFO ( m1/mysql ): *** Purging cache - END (PID: 4332, QN: 61/61, ET: 0) ***
Oct 6 20:10:11 ntop00 sfacctd[1075592]: INFO ( m1/mysql ): *** Purging cache - END (PID: 4332, QN: 6077/6077, ET: 10) ***
Oct 6 20:13:01 ntop00 sfacctd[1075592]: INFO ( p1/print ): *** Purging cache - START (PID: 4333) ***
Oct 6 20:13:01 ntop00 sfacctd[1075592]: INFO ( p1/print ): *** Purging cache - END (PID: 4333, QN: 4546/4546, ET: 0) ***
Oct 6 20:13:01 ntop00 nfacctd[1075699]: INFO ( p1/print ): *** Purging cache - START (PID: 4333) ***
Oct 6 20:13:01 ntop00 nfacctd[1075699]: INFO ( p1/print ): *** Purging cache - END (PID: 4333, QN: 58/58, ET: 0) ***
Oct 6 20:15:01 ntop00 sfacctd[1075592]: INFO ( m1/mysql ): *** Purging cache - START (PID: 4334) ***
Oct 6 20:15:01 ntop00 nfacctd[1075699]: INFO ( m1/mysql ): *** Purging cache - START (PID: 4334) ***
Oct 6 20:15:01 ntop00 nfacctd[1075699]: INFO ( m1/mysql ): *** Purging cache - END (PID: 4334, QN: 53/53, ET: 0) ***
Oct 6 20:15:10 ntop00 sfacctd[1075592]: INFO ( m1/mysql ): *** Purging cache - END (PID: 4334, QN: 5368/5368, ET: 9) ***
Oct 6 20:18:01 ntop00 sfacctd[1075592]: INFO ( p1/print ): *** Purging cache - START (PID: 4335) ***
Oct 6 20:18:01 ntop00 sfacctd[1075592]: INFO ( p1/print ): *** Purging cache - END (PID: 4335, QN: 6000/6000, ET: 0) ***
Oct 6 20:18:01 ntop00 nfacctd[1075699]: INFO ( p1/print ): *** Purging cache - START (PID: 4335) ***
Oct 6 20:18:01 ntop00 nfacctd[1075699]: INFO ( p1/print ): *** Purging cache - END (PID: 4335, QN: 60/60, ET: 0) ***
Oct 6 20:20:01 ntop00 sfacctd[1075592]: INFO ( m1/mysql ): *** Purging cache - START (PID: 4336) ***
Oct 6 20:20:01 ntop00 nfacctd[1075699]: INFO ( m1/mysql ): *** Purging cache - START (PID: 4336) ***
Oct 6 20:20:01 ntop00 nfacctd[1075699]: INFO ( m1/mysql ): *** Purging cache - END (PID: 4336, QN: 55/55, ET: 0) ***
Oct 6 20:20:09 ntop00 sfacctd[1075592]: INFO ( m1/mysql ): *** Purging cache - END (PID: 4336, QN: 4704/4704, ET: 8) ***
Oct 6 20:23:01 ntop00 sfacctd[1075592]: INFO ( p1/print ): *** Purging cache - START (PID: 4337) ***
Oct 6 20:23:01 ntop00 sfacctd[1075592]: INFO ( p1/print ): *** Purging cache - END (PID: 4337, QN: 4663/4663, ET: 0) ***
... 67 more distinct messages not shown
== openvox08-cmp2 (2 distinct, 713 total) ==
Oct 6 20:05:13 openvox08-cmp2 rsyslogd[983]: imjournal: open() failed for path: '/var/lib/rsyslog/imjournal.state.tmp': Input/output error [v8.2510.0-5.el10 try https://www.rsyslog.com/e/2433 ] [x712]
Oct 6 21:04:34 openvox08-cmp2 kernel: coredump: 2375(sssd_be): |/usr/lib/systemd/systemd-coredump pipe failed
== outbound00.cs.umd.edu (1 distinct, 6 total) ==
Oct 6 20:09:09 outbound00.cs.umd.edu python3[52902]: ldapdb [x6]
== outbound01.cs.umd.edu (1 distinct, 6 total) ==
Oct 6 20:13:06 outbound01.cs.umd.edu python3[1512335]: ldapdb [x6]
== portal (1 distinct, 81 total) ==
Oct 6 20:05:59 portal setroubleshoot[1586075]: SELinux is preventing /usr/local/bin/traefik from connectto access on the unix_stream_socket /run/podman/podman.sock. For complete SELinux messages run: sealert -l e0a307a3-2c22-4320-8f9d-6a166c45222d [x81]
== strawberry (7 distinct, 38 total) ==
Oct 6 20:07:03 strawberry kernel: I/O error, dev sda, sector 206848 op 0x0:(READ) flags 0x80700 phys_seg 1 prio class 2 [x6]
Oct 6 20:07:03 strawberry kernel: I/O error, dev sda, sector 206848 op 0x0:(READ) flags 0x0 phys_seg 1 prio class 2 [x6]
Oct 6 20:07:03 strawberry kernel: Buffer I/O error on dev sda2, logical block 0, async page read [x6]
Oct 6 20:07:03 strawberry kernel: I/O error, dev sda, sector 2048 op 0x0:(READ) flags 0x80700 phys_seg 1 prio class 2 [x6]
Oct 6 20:07:03 strawberry kernel: I/O error, dev sda, sector 2048 op 0x0:(READ) flags 0x0 phys_seg 1 prio class 2 [x6]
Oct 6 20:07:03 strawberry kernel: Buffer I/O error on dev sda1, logical block 0, async page read [x6]
Oct 6 20:34:42 strawberry smartd[5314]: Device: /dev/sda [SAT], failed to read SMART Attribute Data [x2]
== submit10-cln25 (5 distinct, 1539 total) ==
Oct 6 20:05:22 submit10-cln25 rsyslogd: file '/var/log/messages': open error: Input/output error [v8.24.0-57.el7_9.3 try http://www.rsyslog.com/e/2433 ] [x1200]
Oct 6 20:05:22 submit10-cln25 rsyslogd: imjournal: fopen() failed for path: '/var/lib/rsyslog/imjournal.state.tmp': Input/output error [v8.24.0-57.el7_9.3 try http://www.rsyslog.com/e/2013 ] [x334]
Oct 6 20:25:01 submit10-cln25 systemd: Failed at step USER spawning /usr/libexec/pcp/bin/pmlogger_check: Input/output error [x2]
Oct 6 20:28:00 submit10-cln25 systemd: Failed at step USER spawning /usr/libexec/pcp/bin/pmie_check: Input/output error [x2]
Oct 6 20:30:00 submit10-cln25 systemd: Failed at step USER spawning /usr/libexec/pcp/bin/pmlogger_daily: Input/output error
== submit26-b9-f1 (1 distinct, 3 total) ==
Oct 6 20:06:43 submit26-b9-f1 systemd[1]: user(a)1001.service: Main process exited, code=killed, status=9/KILL [x3]
== submit26-b9-f2 (1 distinct, 2 total) ==
Oct 6 20:35:46 submit26-b9-f2 systemd[1]: user(a)1001.service: Main process exited, code=killed, status=9/KILL [x2]
== submit26-b9-f3 (6 distinct, 10 total) ==
Oct 6 20:11:35 submit26-b9-f3 systemd[1]: user(a)1001.service: Main process exited, code=killed, status=9/KILL [x5]
Oct 6 20:11:38 submit26-b9-f3 systemd-coredump[1821128]: Process 1821125 (public06) of user 1001 dumped core.#012#012Stack trace of thread 1821125:#012#0 0x00007f8073d665c0 __strcpy_avx2_rtm (libc.so.6 + 0x1665c0)#012#1 0x0000000000401c7c append_line (public06 + 0x1c7c)#012#2 0x0000000000401dbb load_document (public06 + 0x1dbb)#012#3 0x0000000000401560 main (public06 + 0x1560)#012#4 0x00007f8073c2a610 __libc_start_call_main (libc.so.6 + 0x2a610)#012#5 0x00007f8073c2a6c0 __libc_start_main@@GLIBC_2.34 (libc.so.6 + 0x2a6c0)#012#6 0x00000000004010b5 _start (public06 + 0x10b5)#012ELF object binary architecture: AMD x86-64
Oct 6 20:11:38 submit26-b9-f3 systemd-coredump[1821136]: Process 1821133 (release01) of user 1001 dumped core.#012#012Stack trace of thread 1821133:#012#0 0x00007fcdc716674a __strcpy_avx2_rtm (libc.so.6 + 0x16674a)#012#1 0x0000000000401ca4 append_line (release01 + 0x1ca4)#012#2 0x0000000000401de3 load_document (release01 + 0x1de3)#012#3 0x0000000000401560 main (release01 + 0x1560)#012#4 0x00007fcdc702a610 __libc_start_call_main (libc.so.6 + 0x2a610)#012#5 0x00007fcdc702a6c0 __libc_start_main@@GLIBC_2.34 (libc.so.6 + 0x2a6c0)#012#6 0x00000000004010b5 _start (release01 + 0x10b5)#012ELF object binary architecture: AMD x86-64
Oct 6 20:11:38 submit26-b9-f3 systemd-coredump[1821144]: Process 1821141 (release02) of user 1001 dumped core.#012#012Stack trace of thread 1821141:#012#0 0x00007f1a271665c0 __strcpy_avx2_rtm (libc.so.6 + 0x1665c0)#012#1 0x0000000000401c9f append_line (release02 + 0x1c9f)#012#2 0x0000000000401dde load_document (release02 + 0x1dde)#012#3 0x0000000000401560 main (release02 + 0x1560)#012#4 0x00007f1a2702a610 __libc_start_call_main (libc.so.6 + 0x2a610)#012#5 0x00007f1a2702a6c0 __libc_start_main@@GLIBC_2.34 (libc.so.6 + 0x2a6c0)#012#6 0x00000000004010b5 _start (release02 + 0x10b5)#012ELF object binary architecture: AMD x86-64
Oct 6 20:11:38 submit26-b9-f3 systemd-coredump[1821154]: Process 1821151 (release03) of user 1001 dumped core.#012#012Stack trace of thread 1821151:#012#0 0x00007ff0a43665c0 __strcpy_avx2_rtm (libc.so.6 + 0x1665c0)#012#1 0x0000000000401c9f append_line (release03 + 0x1c9f)#012#2 0x0000000000401dde load_document (release03 + 0x1dde)#012#3 0x0000000000401560 main (release03 + 0x1560)#012#4 0x00007ff0a422a610 __libc_start_call_main (libc.so.6 + 0x2a610)#012#5 0x00007ff0a422a6c0 __libc_start_main@@GLIBC_2.34 (libc.so.6 + 0x2a6c0)#012#6 0x00000000004010b5 _start (release03 + 0x10b5)#012ELF object binary architecture: AMD x86-64
Oct 6 20:11:38 submit26-b9-f3 systemd-coredump[1821165]: Process 1821162 (release05) of user 1001 dumped core.#012#012Stack trace of thread 1821162:#012#0 0x00007fd58bb6672a __strcpy_avx2_rtm (libc.so.6 + 0x16672a)#012#1 0x0000000000401c57 append_line (release05 + 0x1c57)#012#2 0x0000000000401d96 load_document (release05 + 0x1d96)#012#3 0x0000000000401518 main (release05 + 0x1518)#012#4 0x00007fd58ba2a610 __libc_start_call_main (libc.so.6 + 0x2a610)#012#5 0x00007fd58ba2a6c0 __libc_start_main@@GLIBC_2.34 (libc.so.6 + 0x2a6c0)#012#6 0x00000000004010b5 _start (release05 + 0x10b5)#012ELF object binary architecture: AMD x86-64
== submit26-b9-f4 (1 distinct, 4 total) ==
Oct 6 20:22:08 submit26-b9-f4 systemd[1]: user(a)1001.service: Main process exited, code=killed, status=9/KILL [x4]
== submit26-b9-fclone (9 distinct, 12 total) ==
Oct 6 20:22:04 submit26-b9-fclone setroubleshoot[1132445]: SELinux is preventing /usr/bin/python3.9 from create access on the directory /(null). For complete SELinux messages run: sealert -l 9355d9d9-a311-48d2-bd37-6c0f6947dfff
Oct 6 20:22:04 submit26-b9-fclone setroubleshoot[1132445]: SELinux is preventing /usr/bin/python3.9 from add_name access on the directory /(null). For complete SELinux messages run: sealert -l cc4658d7-9db1-405d-9eee-de0ccee5857f
Oct 6 20:22:04 submit26-b9-fclone setroubleshoot[1132445]: SELinux is preventing /usr/bin/python3.9 from create access on the file /(null). For complete SELinux messages run: sealert -l 568a2429-0b1b-49df-af41-49b5cd298ae8 [x2]
Oct 6 20:22:04 submit26-b9-fclone setroubleshoot[1132445]: SELinux is preventing /usr/bin/python3.9 from open access on the file /tmp/libdnf.4keK5n/repodata/repomd.xml. For complete SELinux messages run: sealert -l 03e2f521-0e7c-481f-8e92-0602c6adeedc [x2]
Oct 6 20:22:04 submit26-b9-fclone setroubleshoot[1132445]: SELinux is preventing /usr/bin/python3.9 from setattr access on the file repomd.xml. For complete SELinux messages run: sealert -l 0d6b7b1f-ebe3-4beb-915a-b06b63bf2566 [x2]
Oct 6 20:22:04 submit26-b9-fclone setroubleshoot[1132445]: SELinux is preventing /usr/bin/python3.9 from read access on the directory libdnf.4keK5n. For complete SELinux messages run: sealert -l 887adbf9-2bb9-4009-b800-36ddf9ba0db5
Oct 6 20:22:04 submit26-b9-fclone setroubleshoot[1132445]: SELinux is preventing /usr/bin/python3.9 from remove_name access on the directory repomd.xml. For complete SELinux messages run: sealert -l 092e0644-8373-4017-b77f-1afa6c6da4ac
Oct 6 20:22:04 submit26-b9-fclone setroubleshoot[1132445]: SELinux is preventing /usr/bin/python3.9 from unlink access on the file repomd.xml. For complete SELinux messages run: sealert -l ce429a92-56de-4de1-b859-cbfb69ae123c
Oct 6 20:22:04 submit26-b9-fclone setroubleshoot[1132445]: SELinux is preventing /usr/bin/python3.9 from rmdir access on the directory repodata. For complete SELinux messages run: sealert -l 99b886eb-497b-406d-8206-afe76a1086b4
== yogurt (2 distinct, 16 total) ==
Oct 6 20:14:21 yogurt kernel: [drm:radeon_gem_va_update_vm [radeon]] *ERROR* Couldn't update BO_VA (-4) [x15]
Oct 6 20:59:28 yogurt xdg-desktop-por[1084445]: Backend call failed: Cannot invoke method; proxy is for the well-known name org.freedesktop.ScreenSaver without an owner, and proxy was constructed with the G_DBUS_PROXY_FLAGS_DO_NOT_AUTO_START flag
1
0
Command: /usr/local/sbin/syslog-digest.py
Time : 0.2080s
Status : exited 0
Output :
Syslog digest — 2026-10-06 20:05 EDT
Processed 8,262 lines, filtered 5,346 (64%). 2,916 unknown (288 distinct) from 23 host(s).
== abuse (1 distinct, 349 total) ==
Oct 6 19:05:23 abuse rsyslogd[1033]: imjournal: open() failed for path: '/var/lib/rsyslog/imjournal.state.tmp': Input/output error [v8.2404.0 try https://www.rsyslog.com/e/2433 ] [x349]
== b0b02.cs.umd.edu (1 distinct, 1 total) ==
Oct 6 19:16:36 b0b02.cs.umd.edu rustdesk[971129]: cannot open display:
== gle-dind00.cs.umd.edu (44 distinct, 44 total) ==
Oct 6 19:05:20 gle-dind00.cs.umd.edu systemd-udevd[2609605]: Could not generate persistent MAC address for veth61e4c59: No such file or directory
Oct 6 19:05:20 gle-dind00.cs.umd.edu systemd-udevd[2609606]: Could not generate persistent MAC address for veth3d95043: No such file or directory
Oct 6 19:05:20 gle-dind00.cs.umd.edu systemd-udevd[2609705]: Could not generate persistent MAC address for vethb26ccf2: No such file or directory
Oct 6 19:05:20 gle-dind00.cs.umd.edu systemd-udevd[2609706]: Could not generate persistent MAC address for vethabe7a2d: No such file or directory
Oct 6 19:05:21 gle-dind00.cs.umd.edu systemd-udevd[2609804]: Could not generate persistent MAC address for vetha2e37b1: No such file or directory
Oct 6 19:05:21 gle-dind00.cs.umd.edu systemd-udevd[2609805]: Could not generate persistent MAC address for vethe74c2b6: No such file or directory
Oct 6 19:05:22 gle-dind00.cs.umd.edu systemd-udevd[2609905]: Could not generate persistent MAC address for veth32b372b: No such file or directory
Oct 6 19:05:22 gle-dind00.cs.umd.edu systemd-udevd[2609906]: Could not generate persistent MAC address for veth9c7915e: No such file or directory
Oct 6 19:05:23 gle-dind00.cs.umd.edu systemd-udevd[2609995]: Could not generate persistent MAC address for veth36da1c1: No such file or directory
Oct 6 19:05:23 gle-dind00.cs.umd.edu systemd-udevd[2609996]: Could not generate persistent MAC address for veth67f04f4: No such file or directory
Oct 6 19:05:41 gle-dind00.cs.umd.edu systemd-udevd[2610281]: Could not generate persistent MAC address for vethb386e7c: No such file or directory
Oct 6 19:05:41 gle-dind00.cs.umd.edu systemd-udevd[2610282]: Could not generate persistent MAC address for veth90cfe1f: No such file or directory
Oct 6 19:05:41 gle-dind00.cs.umd.edu systemd-udevd[2610378]: Could not generate persistent MAC address for veth6c1d08e: No such file or directory
Oct 6 19:05:41 gle-dind00.cs.umd.edu systemd-udevd[2610379]: Could not generate persistent MAC address for veth9618b6e: No such file or directory
Oct 6 19:05:43 gle-dind00.cs.umd.edu systemd-udevd[2610553]: Could not generate persistent MAC address for veth0a1ca8d: No such file or directory
Oct 6 19:05:43 gle-dind00.cs.umd.edu systemd-udevd[2610554]: Could not generate persistent MAC address for vethabe4672: No such file or directory
Oct 6 19:05:44 gle-dind00.cs.umd.edu systemd-udevd[2610687]: Could not generate persistent MAC address for veth1ba61aa: No such file or directory
Oct 6 19:05:44 gle-dind00.cs.umd.edu systemd-udevd[2610688]: Could not generate persistent MAC address for veth6a3afee: No such file or directory
Oct 6 19:13:55 gle-dind00.cs.umd.edu systemd-udevd[2612681]: Could not generate persistent MAC address for vethf043fa1: No such file or directory
Oct 6 19:13:55 gle-dind00.cs.umd.edu systemd-udevd[2612683]: Could not generate persistent MAC address for veth44cefb6: No such file or directory
Oct 6 19:14:15 gle-dind00.cs.umd.edu systemd-udevd[2612805]: Could not generate persistent MAC address for veth395f7fc: No such file or directory
Oct 6 19:14:15 gle-dind00.cs.umd.edu systemd-udevd[2612806]: Could not generate persistent MAC address for vethce97f31: No such file or directory
Oct 6 19:52:27 gle-dind00.cs.umd.edu systemd-udevd[2620658]: Could not generate persistent MAC address for veth00fe89b: No such file or directory
Oct 6 19:52:27 gle-dind00.cs.umd.edu systemd-udevd[2620659]: Could not generate persistent MAC address for veth57fed62: No such file or directory
Oct 6 19:52:28 gle-dind00.cs.umd.edu systemd-udevd[2620759]: Could not generate persistent MAC address for veth532d39a: No such file or directory
Oct 6 19:52:28 gle-dind00.cs.umd.edu systemd-udevd[2620760]: Could not generate persistent MAC address for vethec5a293: No such file or directory
Oct 6 19:52:29 gle-dind00.cs.umd.edu systemd-udevd[2620858]: Could not generate persistent MAC address for vethdf14237: No such file or directory
Oct 6 19:52:29 gle-dind00.cs.umd.edu systemd-udevd[2620859]: Could not generate persistent MAC address for vethb397229: No such file or directory
Oct 6 19:52:30 gle-dind00.cs.umd.edu systemd-udevd[2620955]: Could not generate persistent MAC address for veth67850b2: No such file or directory
Oct 6 19:52:30 gle-dind00.cs.umd.edu systemd-udevd[2620954]: Could not generate persistent MAC address for vethac8b97f: No such file or directory
... 14 more distinct messages not shown
== gle-dind02.cs.umd.edu (22 distinct, 22 total) ==
Oct 6 19:38:43 gle-dind02.cs.umd.edu systemd-udevd[1507373]: Could not generate persistent MAC address for veth4154a70: No such file or directory
Oct 6 19:38:43 gle-dind02.cs.umd.edu systemd-udevd[1507374]: Could not generate persistent MAC address for veth0b1896a: No such file or directory
Oct 6 19:38:44 gle-dind02.cs.umd.edu systemd-udevd[1507477]: Could not generate persistent MAC address for vethc70c095: No such file or directory
Oct 6 19:38:44 gle-dind02.cs.umd.edu systemd-udevd[1507478]: Could not generate persistent MAC address for veth5fda858: No such file or directory
Oct 6 19:38:44 gle-dind02.cs.umd.edu systemd-udevd[1507578]: Could not generate persistent MAC address for veth3cae4e3: No such file or directory
Oct 6 19:38:44 gle-dind02.cs.umd.edu systemd-udevd[1507579]: Could not generate persistent MAC address for veth4b0a031: No such file or directory
Oct 6 19:38:45 gle-dind02.cs.umd.edu systemd-udevd[1507679]: Could not generate persistent MAC address for veth2ac95ee: No such file or directory
Oct 6 19:38:45 gle-dind02.cs.umd.edu systemd-udevd[1507680]: Could not generate persistent MAC address for veth4b4f3a8: No such file or directory
Oct 6 19:38:46 gle-dind02.cs.umd.edu systemd-udevd[1507767]: Could not generate persistent MAC address for vethd40d315: No such file or directory
Oct 6 19:38:46 gle-dind02.cs.umd.edu systemd-udevd[1507768]: Could not generate persistent MAC address for veth58967c2: No such file or directory
Oct 6 19:39:03 gle-dind02.cs.umd.edu systemd-udevd[1507901]: Could not generate persistent MAC address for vetha1581a6: No such file or directory
Oct 6 19:39:03 gle-dind02.cs.umd.edu systemd-udevd[1507900]: Could not generate persistent MAC address for veth9a88727: No such file or directory
Oct 6 19:39:03 gle-dind02.cs.umd.edu systemd-udevd[1508168]: Could not generate persistent MAC address for veth149053a: No such file or directory
Oct 6 19:39:03 gle-dind02.cs.umd.edu systemd-udevd[1508169]: Could not generate persistent MAC address for veth3d0e041: No such file or directory
Oct 6 19:39:05 gle-dind02.cs.umd.edu systemd-udevd[1508350]: Could not generate persistent MAC address for veth31bdb57: No such file or directory
Oct 6 19:39:05 gle-dind02.cs.umd.edu systemd-udevd[1508351]: Could not generate persistent MAC address for veth788e519: No such file or directory
Oct 6 19:39:06 gle-dind02.cs.umd.edu systemd-udevd[1508498]: Could not generate persistent MAC address for veth5191584: No such file or directory
Oct 6 19:39:06 gle-dind02.cs.umd.edu systemd-udevd[1508497]: Could not generate persistent MAC address for vethe8549be: No such file or directory
Oct 6 19:48:54 gle-dind02.cs.umd.edu systemd-udevd[1510762]: Could not generate persistent MAC address for veth44232e6: No such file or directory
Oct 6 19:48:54 gle-dind02.cs.umd.edu systemd-udevd[1510761]: Could not generate persistent MAC address for veth9ada79d: No such file or directory
Oct 6 19:49:06 gle-dind02.cs.umd.edu systemd-udevd[1510915]: Could not generate persistent MAC address for vethcb39b21: No such file or directory
Oct 6 19:49:06 gle-dind02.cs.umd.edu systemd-udevd[1510916]: Could not generate persistent MAC address for veth57bc06e: No such file or directory
== gle-dind04 (5 distinct, 5 total) ==
Oct 6 19:37:02 gle-dind04 lldpd[1171]: unable to send packet on real device for veth553c2dd: No such device or address
Oct 6 19:48:11 gle-dind04 lldpd[1171]: unable to send packet on real device for veth3638efb: No such device or address
Oct 6 19:48:20 gle-dind04 lldpd[1171]: unable to send packet on real device for veth8dc932c: No such device or address
Oct 6 19:49:06 gle-dind04 lldpd[1171]: unable to send packet on real device for vetheb6a858: No such device or address
Oct 6 19:49:10 gle-dind04 lldpd[1171]: unable to send packet on real device for veth5e9f4a8: No such device or address
== hazfs.cs.umd.edu (11 distinct, 66 total) ==
Oct 6 19:19:57 hazfs.cs.umd.edu snmpd[1431]: send response: Failure in sendto [x6]
Oct 6 19:19:57 hazfs.cs.umd.edu snmpd[1431]: -- NET-SNMP-EXTEND-MIB::nsExtendStatus."userweb" [x6]
Oct 6 19:19:57 hazfs.cs.umd.edu snmpd[1431]: -- NET-SNMP-EXTEND-MIB::nsExtendStatus."zfslist" [x6]
Oct 6 19:19:57 hazfs.cs.umd.edu snmpd[1431]: -- NET-SNMP-EXTEND-MIB::nsExtendStatus."userhome" [x6]
Oct 6 19:19:57 hazfs.cs.umd.edu snmpd[1431]: -- NET-SNMP-EXTEND-MIB::nsExtendOutput1Line."userweb" [x6]
Oct 6 19:19:57 hazfs.cs.umd.edu snmpd[1431]: -- NET-SNMP-EXTEND-MIB::nsExtendOutput1Line."zfslist" [x6]
Oct 6 19:19:57 hazfs.cs.umd.edu snmpd[1431]: -- NET-SNMP-EXTEND-MIB::nsExtendOutput1Line."userhome" [x6]
Oct 6 19:19:57 hazfs.cs.umd.edu snmpd[1431]: -- NET-SNMP-EXTEND-MIB::nsExtendOutputFull."userweb" [x6]
Oct 6 19:19:57 hazfs.cs.umd.edu snmpd[1431]: -- NET-SNMP-EXTEND-MIB::nsExtendOutputFull."zfslist" [x6]
Oct 6 19:19:57 hazfs.cs.umd.edu snmpd[1431]: -- NET-SNMP-EXTEND-MIB::nsExtendOutputFull."userhome" [x6]
Oct 6 19:19:57 hazfs.cs.umd.edu snmpd[1431]: -- NET-SNMP-EXTEND-MIB::nsExtendOutNumLines."userweb" [x6]
== idm00 (1 distinct, 1 total) ==
Oct 6 19:54:40 idm00 named[4166701]: client @0x7f11a00732a8 10.73.240.42#63129: update '73.10.in-addr.arpa/IN' denied
== idmp0 (1 distinct, 1 total) ==
Oct 6 19:39:23 idmp0 named[1598691]: client @0x7f2d08c219f8 10.73.240.43#52876: update '73.10.in-addr.arpa/IN' denied
== itmon02 (1 distinct, 2 total) ==
Oct 6 19:28:41 itmon02 sshd[805675]: error: beginning MaxStartups throttling [x2]
== munin (2 distinct, 6 total) ==
Oct 6 19:09:01 munin sudo[908325]: pam_systemd(sudo:session): Failed to stat() runtime directory '/run/user/0': No such file or directory [x3]
Oct 6 19:09:01 munin sudo[908325]: pam_systemd(sudo:session): Not setting $XDG_RUNTIME_DIR, as the directory is not in order. [x3]
== newhonors2 (1 distinct, 24 total) ==
Oct 6 19:13:03 newhonors2 dhcpcd[3652787]: dhcpcd is not running [x24]
== ntop00 (95 distinct, 95 total) ==
Oct 6 19:05:01 ntop00 nfacctd[1075699]: INFO ( m1/mysql ): *** Purging cache - START (PID: 4306) ***
Oct 6 19:05:01 ntop00 nfacctd[1075699]: INFO ( m1/mysql ): *** Purging cache - END (PID: 4306, QN: 80/80, ET: 0) ***
Oct 6 19:05:13 ntop00 sfacctd[1075592]: INFO ( m1/mysql ): *** Purging cache - END (PID: 4306, QN: 7583/7583, ET: 12) ***
Oct 6 19:08:01 ntop00 sfacctd[1075592]: INFO ( p1/print ): *** Purging cache - START (PID: 4307) ***
Oct 6 19:08:01 ntop00 sfacctd[1075592]: INFO ( p1/print ): *** Purging cache - END (PID: 4307, QN: 7018/7018, ET: 0) ***
Oct 6 19:08:02 ntop00 nfacctd[1075699]: INFO ( p1/print ): *** Purging cache - START (PID: 4307) ***
Oct 6 19:08:02 ntop00 nfacctd[1075699]: INFO ( p1/print ): *** Purging cache - END (PID: 4307, QN: 68/68, ET: 0) ***
Oct 6 19:10:01 ntop00 sfacctd[1075592]: INFO ( m1/mysql ): *** Purging cache - START (PID: 4308) ***
Oct 6 19:10:01 ntop00 nfacctd[1075699]: INFO ( m1/mysql ): *** Purging cache - START (PID: 4308) ***
Oct 6 19:10:01 ntop00 nfacctd[1075699]: INFO ( m1/mysql ): *** Purging cache - END (PID: 4308, QN: 48/48, ET: 0) ***
Oct 6 19:10:11 ntop00 sfacctd[1075592]: INFO ( m1/mysql ): *** Purging cache - END (PID: 4308, QN: 6318/6318, ET: 10) ***
Oct 6 19:13:01 ntop00 sfacctd[1075592]: INFO ( p1/print ): *** Purging cache - START (PID: 4309) ***
Oct 6 19:13:01 ntop00 sfacctd[1075592]: INFO ( p1/print ): *** Purging cache - END (PID: 4309, QN: 8343/8343, ET: 0) ***
Oct 6 19:13:01 ntop00 nfacctd[1075699]: INFO ( p1/print ): *** Purging cache - START (PID: 4309) ***
Oct 6 19:13:01 ntop00 nfacctd[1075699]: INFO ( p1/print ): *** Purging cache - END (PID: 4309, QN: 54/54, ET: 0) ***
Oct 6 19:15:01 ntop00 sfacctd[1075592]: INFO ( m1/mysql ): *** Purging cache - START (PID: 4310) ***
Oct 6 19:15:01 ntop00 nfacctd[1075699]: INFO ( m1/mysql ): *** Purging cache - START (PID: 4310) ***
Oct 6 19:15:01 ntop00 nfacctd[1075699]: INFO ( m1/mysql ): *** Purging cache - END (PID: 4310, QN: 52/52, ET: 0) ***
Oct 6 19:15:15 ntop00 sfacctd[1075592]: INFO ( m1/mysql ): *** Purging cache - END (PID: 4310, QN: 9090/9090, ET: 14) ***
Oct 6 19:18:01 ntop00 sfacctd[1075592]: INFO ( p1/print ): *** Purging cache - START (PID: 4311) ***
Oct 6 19:18:01 ntop00 sfacctd[1075592]: INFO ( p1/print ): *** Purging cache - END (PID: 4311, QN: 8276/8276, ET: 0) ***
Oct 6 19:18:01 ntop00 nfacctd[1075699]: INFO ( p1/print ): *** Purging cache - START (PID: 4311) ***
Oct 6 19:18:01 ntop00 nfacctd[1075699]: INFO ( p1/print ): *** Purging cache - END (PID: 4311, QN: 53/53, ET: 0) ***
Oct 6 19:20:01 ntop00 sfacctd[1075592]: INFO ( m1/mysql ): *** Purging cache - START (PID: 4312) ***
Oct 6 19:20:01 ntop00 nfacctd[1075699]: INFO ( m1/mysql ): *** Purging cache - START (PID: 4312) ***
Oct 6 19:20:01 ntop00 nfacctd[1075699]: INFO ( m1/mysql ): *** Purging cache - END (PID: 4312, QN: 66/66, ET: 0) ***
Oct 6 19:20:15 ntop00 sfacctd[1075592]: INFO ( m1/mysql ): *** Purging cache - END (PID: 4312, QN: 8619/8619, ET: 14) ***
Oct 6 19:23:01 ntop00 sfacctd[1075592]: INFO ( p1/print ): *** Purging cache - START (PID: 4313) ***
Oct 6 19:23:01 ntop00 sfacctd[1075592]: INFO ( p1/print ): *** Purging cache - END (PID: 4313, QN: 8264/8264, ET: 0) ***
Oct 6 19:23:01 ntop00 nfacctd[1075699]: INFO ( p1/print ): *** Purging cache - START (PID: 4313) ***
... 65 more distinct messages not shown
== openvox08-cmp2 (1 distinct, 712 total) ==
Oct 6 19:05:12 openvox08-cmp2 rsyslogd[983]: imjournal: open() failed for path: '/var/lib/rsyslog/imjournal.state.tmp': Input/output error [v8.2510.0-5.el10 try https://www.rsyslog.com/e/2433 ] [x712]
== outbound00.cs.umd.edu (1 distinct, 6 total) ==
Oct 6 19:09:09 outbound00.cs.umd.edu python3[39212]: ldapdb [x6]
== outbound01.cs.umd.edu (1 distinct, 6 total) ==
Oct 6 19:13:06 outbound01.cs.umd.edu python3[1498391]: ldapdb [x6]
== portal (1 distinct, 74 total) ==
Oct 6 19:05:15 portal setroubleshoot[1573837]: SELinux is preventing /usr/local/bin/traefik from connectto access on the unix_stream_socket /run/podman/podman.sock. For complete SELinux messages run: sealert -l e0a307a3-2c22-4320-8f9d-6a166c45222d [x74]
== soul (1 distinct, 1 total) ==
Oct 6 19:41:00 soul krb5_child[3332893]: Preauthentication failed
== strawberry (7 distinct, 38 total) ==
Oct 6 19:07:04 strawberry kernel: I/O error, dev sda, sector 206848 op 0x0:(READ) flags 0x80700 phys_seg 1 prio class 2 [x6]
Oct 6 19:07:04 strawberry kernel: I/O error, dev sda, sector 206848 op 0x0:(READ) flags 0x0 phys_seg 1 prio class 2 [x6]
Oct 6 19:07:04 strawberry kernel: Buffer I/O error on dev sda2, logical block 0, async page read [x6]
Oct 6 19:07:04 strawberry kernel: I/O error, dev sda, sector 2048 op 0x0:(READ) flags 0x80700 phys_seg 1 prio class 2 [x6]
Oct 6 19:07:04 strawberry kernel: I/O error, dev sda, sector 2048 op 0x0:(READ) flags 0x0 phys_seg 1 prio class 2 [x6]
Oct 6 19:07:04 strawberry kernel: Buffer I/O error on dev sda1, logical block 0, async page read [x6]
Oct 6 19:34:42 strawberry smartd[5314]: Device: /dev/sda [SAT], failed to read SMART Attribute Data [x2]
== submit10-cln25 (77 distinct, 1446 total) ==
Oct 6 19:05:10 submit10-cln25 rsyslogd: imjournal: fopen() failed for path: '/var/lib/rsyslog/imjournal.state.tmp': Input/output error [v8.24.0-57.el7_9.3 try http://www.rsyslog.com/e/2013 ] [x291]
Oct 6 19:05:22 submit10-cln25 rsyslogd: file '/var/log/messages': open error: Input/output error [v8.24.0-57.el7_9.3 try http://www.rsyslog.com/e/2433 ] [x1046]
Jul 20 15:23:18 submit10-cln25 kernel: ACPI: RSDP 00000000000f5290 00014 (v00 BOCHS )
Jul 20 15:23:18 submit10-cln25 kernel: ACPI: RSDT 00000000bffe3bb0 00034 (v01 BOCHS BXPC 00000001 BXPC 00000001)
Jul 20 15:23:18 submit10-cln25 kernel: ACPI: FACP 00000000bffe39c2 00074 (v01 BOCHS BXPC 00000001 BXPC 00000001)
Jul 20 15:23:18 submit10-cln25 kernel: ACPI: DSDT 00000000bffdf040 04982 (v01 BOCHS BXPC 00000001 BXPC 00000001)
Jul 20 15:23:18 submit10-cln25 kernel: ACPI: FACS 00000000bffdf000 00040
Jul 20 15:23:18 submit10-cln25 kernel: ACPI: APIC 00000000bffe3a36 00088 (v03 BOCHS BXPC 00000001 BXPC 00000001)
Jul 20 15:23:18 submit10-cln25 kernel: ACPI: SSDT 00000000bffe3abe 000CA (v01 BOCHS VMGENID 00000001 BXPC 00000001)
Jul 20 15:23:18 submit10-cln25 kernel: ACPI: WAET 00000000bffe3b88 00028 (v01 BOCHS BXPC 00000001 BXPC 00000001)
Jul 20 15:23:18 submit10-cln25 kernel: Zone ranges:
Jul 20 15:23:18 submit10-cln25 kernel: DMA [mem 0x00001000-0x00ffffff]
Jul 20 15:23:18 submit10-cln25 kernel: DMA32 [mem 0x01000000-0xffffffff]
Jul 20 15:23:18 submit10-cln25 kernel: Normal [mem 0x100000000-0x23fffffff]
Jul 20 15:23:18 submit10-cln25 kernel: Movable zone start for each node
Jul 20 15:23:18 submit10-cln25 kernel: Early memory node ranges
Jul 20 15:23:18 submit10-cln25 kernel: node 0: [mem 0x00001000-0x0009efff]
Jul 20 15:23:18 submit10-cln25 kernel: node 0: [mem 0x00100000-0xbffd9fff]
Jul 20 15:23:18 submit10-cln25 kernel: node 0: [mem 0x100000000-0x23fffffff]
Jul 20 15:23:18 submit10-cln25 kernel: Detected CPU family 6 model 143 stepping 8
Jul 20 15:23:18 submit10-cln25 kernel: Warning: Intel Processor - this hardware has not undergone testing by Red Hat and might not be certified. Please consult https://hardware.redhat.com for certified hardware.
Jul 20 15:23:18 submit10-cln25 kernel: Built 1 zonelists in Zone order, mobility grouping on. Total pages: 2064227
Jul 20 15:23:18 submit10-cln25 kernel: Policy zone: Normal
Jul 20 15:23:18 submit10-cln25 kernel: ACPI: All ACPI Tables successfully acquired
Jul 20 15:23:18 submit10-cln25 kernel: ACPI: Enabled 3 GPEs in block 00 to 0F
Jul 20 15:23:18 submit10-cln25 kernel: acpi PNP0A03:00: fail to add MMCONFIG information, can't access extended PCI configuration space under this bridge.
Jul 20 15:23:18 submit10-cln25 kernel: ACPI: PCI Interrupt Link [LNKD] enabled at IRQ 11
Jul 20 15:23:18 submit10-cln25 kernel: Dquot-cache hash table entries: 512 (order 0, 4096 bytes)
Jul 20 15:23:18 submit10-cln25 kernel: ACPI: PCI Interrupt Link [LNKC] enabled at IRQ 10
Jul 20 15:23:18 submit10-cln25 kernel: ACPI: PCI Interrupt Link [LNKB] enabled at IRQ 10
... 47 more distinct messages not shown
== submit26-b9-f1 (1 distinct, 1 total) ==
Oct 6 19:14:05 submit26-b9-f1 systemd[1]: user(a)1001.service: Main process exited, code=killed, status=9/KILL
== submit26-b9-f2 (11 distinct, 13 total) ==
Oct 6 19:20:11 submit26-b9-f2 systemd[1]: user(a)1001.service: Main process exited, code=killed, status=9/KILL [x3]
Oct 6 19:20:13 submit26-b9-f2 systemd-coredump[580793]: Process 580790 (public06) of user 1001 dumped core.#012#012Stack trace of thread 580790:#012#0 0x00007fbebdd6f1b1 __strcpy_evex (libc.so.6 + 0x16f1b1)#012#1 0x0000000000401c7c append_line (public06 + 0x1c7c)#012#2 0x0000000000401dbb load_document (public06 + 0x1dbb)#012#3 0x0000000000401560 main (public06 + 0x1560)#012#4 0x00007fbebdc2a610 __libc_start_call_main (libc.so.6 + 0x2a610)#012#5 0x00007fbebdc2a6c0 __libc_start_main@@GLIBC_2.34 (libc.so.6 + 0x2a6c0)#012#6 0x00000000004010b5 _start (public06 + 0x10b5)#012ELF object binary architecture: AMD x86-64
Oct 6 19:20:13 submit26-b9-f2 systemd-coredump[580821]: Process 580818 (release01) of user 1001 dumped core.#012#012Stack trace of thread 580818:#012#0 0x00007f0dcc16f1b1 __strcpy_evex (libc.so.6 + 0x16f1b1)#012#1 0x0000000000401ca4 append_line (release01 + 0x1ca4)#012#2 0x0000000000401de3 load_document (release01 + 0x1de3)#012#3 0x0000000000401560 main (release01 + 0x1560)#012#4 0x00007f0dcc02a610 __libc_start_call_main (libc.so.6 + 0x2a610)#012#5 0x00007f0dcc02a6c0 __libc_start_main@@GLIBC_2.34 (libc.so.6 + 0x2a6c0)#012#6 0x00000000004010b5 _start (release01 + 0x10b5)#012ELF object binary architecture: AMD x86-64
Oct 6 19:20:13 submit26-b9-f2 systemd-coredump[580831]: Process 580828 (release02) of user 1001 dumped core.#012#012Stack trace of thread 580828:#012#0 0x00007f73f256f1b1 __strcpy_evex (libc.so.6 + 0x16f1b1)#012#1 0x0000000000401c9f append_line (release02 + 0x1c9f)#012#2 0x0000000000401dde load_document (release02 + 0x1dde)#012#3 0x0000000000401560 main (release02 + 0x1560)#012#4 0x00007f73f242a610 __libc_start_call_main (libc.so.6 + 0x2a610)#012#5 0x00007f73f242a6c0 __libc_start_main@@GLIBC_2.34 (libc.so.6 + 0x2a6c0)#012#6 0x00000000004010b5 _start (release02 + 0x10b5)#012ELF object binary architecture: AMD x86-64
Oct 6 19:20:13 submit26-b9-f2 systemd-coredump[580840]: Process 580836 (release03) of user 1001 dumped core.#012#012Stack trace of thread 580836:#012#0 0x00007f177896f341 __strcpy_evex (libc.so.6 + 0x16f341)#012#1 0x0000000000401c9f append_line (release03 + 0x1c9f)#012#2 0x0000000000401dde load_document (release03 + 0x1dde)#012#3 0x0000000000401560 main (release03 + 0x1560)#012#4 0x00007f177882a610 __libc_start_call_main (libc.so.6 + 0x2a610)#012#5 0x00007f177882a6c0 __libc_start_main@@GLIBC_2.34 (libc.so.6 + 0x2a6c0)#012#6 0x00000000004010b5 _start (release03 + 0x10b5)#012ELF object binary architecture: AMD x86-64
Oct 6 19:20:13 submit26-b9-f2 systemd-coredump[580851]: Process 580849 (release05) of user 1001 dumped core.#012#012Stack trace of thread 580849:#012#0 0x00007f71aa16f311 __strcpy_evex (libc.so.6 + 0x16f311)#012#1 0x0000000000401c57 append_line (release05 + 0x1c57)#012#2 0x0000000000401d96 load_document (release05 + 0x1d96)#012#3 0x0000000000401518 main (release05 + 0x1518)#012#4 0x00007f71aa02a610 __libc_start_call_main (libc.so.6 + 0x2a610)#012#5 0x00007f71aa02a6c0 __libc_start_main@@GLIBC_2.34 (libc.so.6 + 0x2a6c0)#012#6 0x00000000004010b5 _start (release05 + 0x10b5)#012ELF object binary architecture: AMD x86-64
Oct 6 19:51:21 submit26-b9-f2 systemd-coredump[622689]: Process 622686 (public06) of user 1001 dumped core.#012#012Stack trace of thread 622686:#012#0 0x00007f2d5296f341 __strcpy_evex (libc.so.6 + 0x16f341)#012#1 0x0000000000401c7c append_line (public06 + 0x1c7c)#012#2 0x0000000000401dbb load_document (public06 + 0x1dbb)#012#3 0x0000000000401560 main (public06 + 0x1560)#012#4 0x00007f2d5282a610 __libc_start_call_main (libc.so.6 + 0x2a610)#012#5 0x00007f2d5282a6c0 __libc_start_main@@GLIBC_2.34 (libc.so.6 + 0x2a6c0)#012#6 0x00000000004010b5 _start (public06 + 0x10b5)#012ELF object binary architecture: AMD x86-64
Oct 6 19:51:22 submit26-b9-f2 systemd-coredump[622697]: Process 622694 (release01) of user 1001 dumped core.#012#012Stack trace of thread 622694:#012#0 0x00007f129796f1b1 __strcpy_evex (libc.so.6 + 0x16f1b1)#012#1 0x0000000000401ca4 append_line (release01 + 0x1ca4)#012#2 0x0000000000401de3 load_document (release01 + 0x1de3)#012#3 0x0000000000401560 main (release01 + 0x1560)#012#4 0x00007f129782a610 __libc_start_call_main (libc.so.6 + 0x2a610)#012#5 0x00007f129782a6c0 __libc_start_main@@GLIBC_2.34 (libc.so.6 + 0x2a6c0)#012#6 0x00000000004010b5 _start (release01 + 0x10b5)#012ELF object binary architecture: AMD x86-64
Oct 6 19:51:22 submit26-b9-f2 systemd-coredump[622705]: Process 622702 (release02) of user 1001 dumped core.#012#012Stack trace of thread 622702:#012#0 0x00007ffadf76f1b1 __strcpy_evex (libc.so.6 + 0x16f1b1)#012#1 0x0000000000401c9f append_line (release02 + 0x1c9f)#012#2 0x0000000000401dde load_document (release02 + 0x1dde)#012#3 0x0000000000401560 main (release02 + 0x1560)#012#4 0x00007ffadf62a610 __libc_start_call_main (libc.so.6 + 0x2a610)#012#5 0x00007ffadf62a6c0 __libc_start_main@@GLIBC_2.34 (libc.so.6 + 0x2a6c0)#012#6 0x00000000004010b5 _start (release02 + 0x10b5)#012ELF object binary architecture: AMD x86-64
Oct 6 19:51:22 submit26-b9-f2 systemd-coredump[622715]: Process 622711 (release03) of user 1001 dumped core.#012#012Stack trace of thread 622711:#012#0 0x00007f9b7bd6f1b1 __strcpy_evex (libc.so.6 + 0x16f1b1)#012#1 0x0000000000401c9f append_line (release03 + 0x1c9f)#012#2 0x0000000000401dde load_document (release03 + 0x1dde)#012#3 0x0000000000401560 main (release03 + 0x1560)#012#4 0x00007f9b7bc2a610 __libc_start_call_main (libc.so.6 + 0x2a610)#012#5 0x00007f9b7bc2a6c0 __libc_start_main@@GLIBC_2.34 (libc.so.6 + 0x2a6c0)#012#6 0x00000000004010b5 _start (release03 + 0x10b5)#012ELF object binary architecture: AMD x86-64
Oct 6 19:51:22 submit26-b9-f2 systemd-coredump[622725]: Process 622722 (release05) of user 1001 dumped core.#012#012Stack trace of thread 622722:#012#0 0x00007f116b76f311 __strcpy_evex (libc.so.6 + 0x16f311)#012#1 0x0000000000401c57 append_line (release05 + 0x1c57)#012#2 0x0000000000401d96 load_document (release05 + 0x1d96)#012#3 0x0000000000401518 main (release05 + 0x1518)#012#4 0x00007f116b62a610 __libc_start_call_main (libc.so.6 + 0x2a610)#012#5 0x00007f116b62a6c0 __libc_start_main@@GLIBC_2.34 (libc.so.6 + 0x2a6c0)#012#6 0x00000000004010b5 _start (release05 + 0x10b5)#012ELF object binary architecture: AMD x86-64
== submit26-b9-f3 (1 distinct, 2 total) ==
Oct 6 19:24:28 submit26-b9-f3 systemd[1]: user(a)1001.service: Main process exited, code=killed, status=9/KILL [x2]
== submit26-b9-f4 (1 distinct, 1 total) ==
Oct 6 19:16:51 submit26-b9-f4 systemd[1]: user(a)1001.service: Main process exited, code=killed, status=9/KILL
1
0