Command: /usr/local/sbin/syslog-digest.py
Time : 1.1295s
Status : exited 0
Output :
Syslog digest — 2026-08-06 11:05 EDT
Processed 8,437 lines, filtered 5,498 (65%). 2,939 unknown (221 distinct) from 26 host(s).
== abuse (3 distinct, 2256 total) ==
Aug 6 10:05:02 abuse systemd[1]: Failed to load environment files: Input/output error [x688]
Aug 6 10:05:02 abuse systemd[1]: choria-server.service failed to run 'start' task: Input/output error [x688]
Aug 6 10:05:08 abuse rsyslogd[21745]: imjournal: open() failed for path: '/var/lib/rsyslog/imjournal.state.tmp': Input/output error [v8.2404.0 try https://www.rsyslog.com/e/2433 ] [x880]
== b0b02.cs.umd.edu (1 distinct, 1 total) ==
Aug 6 10:47:45 b0b02.cs.umd.edu rustdesk[3554001]: cannot open display:
== contest (1 distinct, 33 total) ==
Aug 6 10:06:38 contest goferd[1007]: [ERROR][worker-0] gofer.messaging.adapter.connect:33 - connect: proton+amqps://satellite8.cs.umd.edu:5647, failed: Connection amqps://satellite8.cs.umd.edu:5647 disconnected: Condition('proton.pythonio', 'Connection refused to all addresses') [x33]
== csfw00a (1 distinct, 300 total) ==
Aug 6 10:05:41 csfw00a kernel: bnxt_en 0000:09:00.0 eth3: NIC Link is Down [x300]
== cskayako (2 distinct, 4 total) ==
Aug 6 10:53:06 cskayako setroubleshoot[2392704]: failed to retrieve rpm info for path '/var/www/html/__swift/logs/log.cache_06_Aug_2026_f2ef3746cf.txt': [x2]
Aug 6 10:53:07 cskayako setroubleshoot[2392704]: SELinux is preventing /usr/sbin/sendmail.postfix from append access on the file /var/www/html/__swift/logs/log.cache_06_Aug_2026_f2ef3746cf.txt. For complete SELinux messages run: sealert -l c566b62c-2773-4bf0-808b-10f832f1eafb [x2]
== frabjous (5 distinct, 12 total) ==
Aug 6 10:21:17 frabjous krb5_child[3379589]: Client 'admin(a)UMD.EDU' not found in Kerberos database [x5]
Aug 6 10:21:20 frabjous sshd-session[3379582]: error: PAM: Authentication failure for admin from 171.231.194.150 [x4]
Aug 6 10:23:32 frabjous sshd-session[3379772]: error: PAM: Authentication failure for root from 171.231.194.150
Aug 6 10:36:50 frabjous sshd-session[3381605]: error: PAM: Authentication failure for root from 116.110.212.151
Aug 6 10:55:20 frabjous sshd-session[3383630]: error: PAM: Authentication failure for admin from 116.110.212.151
== hackerman (6 distinct, 11 total) ==
Aug 6 10:20:04 hackerman gnome-software[2060381]: can't reliably fixup error code 4 in domain g-io-error-quark: Not a directory [x4]
Aug 6 10:20:12 hackerman gnome-software[2060381]: Only 0 apps for recent list, hiding
Aug 6 10:20:28 hackerman gnome-software[2060381]: failed to commit changes to dconf: GDBus.Error:org.gtk.GDBus.UnmappedGError.Quark._g_2dfile_2derror_2dquark.Code2: Failed to create file “/adminhomes/sajith/.config/dconf/user.UCPJT3”: Permission denied
Aug 6 10:20:29 hackerman packagekitd[225566]: Failed to get cache filename for libreoffice [x2]
Aug 6 10:20:29 hackerman packagekitd[225566]: Failed to get cache filename for kernel [x2]
Aug 6 10:20:38 hackerman packagekitd[225566]: failed to parse public key for /etc/pki/rpm-gpg/RPM-GPG-KEY-PQC-redhat-release
== idm00 (1 distinct, 1 total) ==
Aug 6 10:51:19 idm00 named[1455]: client @0x7f33102ce0c8 10.73.240.42#64899: update '73.10.in-addr.arpa/IN' denied
== idmp0 (2 distinct, 3 total) ==
Aug 6 10:36:00 idmp0 named[5198]: client @0x7f99180928f8 10.73.240.43#62813: update '73.10.in-addr.arpa/IN' denied
Aug 6 10:38:27 idmp0 named[5198]: client @0x7f9910009828 10.73.245.14#58463: update '73.10.in-addr.arpa/IN' denied [x2]
== inbound00.cs.umd.edu (1 distinct, 7 total) ==
Aug 6 10:22:41 inbound00.cs.umd.edu krb5_child[3514547]: Client 'admin(a)UMD.EDU' not found in Kerberos database [x7]
== irb2156 (1 distinct, 1 total) ==
Aug 6 11:00:00 irb2156 (da-udp.*)[997028]: amanda-udp-restart.service: Failed at step EXEC spawning /usr/bin/systemctl restart amanda-udp.*: No such file or directory
== itmon02 (1 distinct, 34 total) ==
Aug 6 10:07:58 itmon02 sshd[1750555]: error: beginning MaxStartups throttling [x34]
== jaws.cs.umd.edu (88 distinct, 95 total) ==
Aug 6 10:57:27 jaws.cs.umd.edu kernel: ACPI: SPCR: [Firmware Bug]: Unexpected SPCR Access Width. Defaulting to byte size
Aug 6 10:57:27 jaws.cs.umd.edu kernel: Warning: Deprecated Hardware is detected: x86_64-v2:GenuineIntel:Intel(R) Xeon(R) CPU E5-2650 v2 @ 2.60GHz will not be maintained in a future major release and may be disabled
Aug 6 10:57:27 jaws.cs.umd.edu kernel: MDS CPU bug present and SMT on, data leak possible. See https://www.kernel.org/doc/html/latest/admin-guide/hw-vuln/mds.html for more details.
Aug 6 10:57:27 jaws.cs.umd.edu kernel: VMSCAPE: SMT on, STIBP is required for full protection. See https://www.kernel.org/doc/html/latest/admin-guide/hw-vuln/vmscape.html for more details.
Aug 6 10:57:27 jaws.cs.umd.edu kernel: pci 0000:02:00.0: [Firmware Bug]: disabling VPD access (can't determine size of non-standard VPD format)
Aug 6 10:57:27 jaws.cs.umd.edu kernel: ERST: NVRAM ERST Log Address Range not implemented yet.
Aug 6 10:57:27 jaws.cs.umd.edu kernel: device-mapper: core: CONFIG_IMA_DISABLE_HTABLE is disabled. Duplicate IMA measurements will not be recorded in the IMA log.
Aug 6 10:57:28 jaws.cs.umd.edu systemd[1]: sys-module-fuse.device: Failed to enqueue SYSTEMD_WANTS= job, ignoring: Unit sys-fs-fuse-connections.mount not found.
Aug 6 10:57:28 jaws.cs.umd.edu kernel: Warning: Unmaintained Hardware is detected: megaraid_sas:1000:005B @ 0000:02:00.0
Aug 6 10:57:35 jaws.cs.umd.edu kernel: ipmi_si dmi-ipmi-si.0: The BMC does not support setting the recv irq bit, compensating, but the BMC needs to be fixed.
Aug 6 10:57:35 jaws.cs.umd.edu lvm[1085]: PV /dev/sda2 online, VG rhel_jaws is complete.
Aug 6 10:57:37 jaws.cs.umd.edu kernel: power_meter ACPI000D:00: Waiting for ACPI IPMI timeout
Aug 6 10:57:37 jaws.cs.umd.edu kernel: ACPI Error: AE_NOT_EXIST, Returned by Handler for [IPMI] (20230331/evregion-301)
Aug 6 10:57:37 jaws.cs.umd.edu kernel: ACPI Error: Region IPMI (ID=7) has no handler (20230331/exfldio-261)
Aug 6 10:57:37 jaws.cs.umd.edu kernel: ACPI Error: Aborting method \_SB.PMI0._GHL due to previous error (AE_NOT_EXIST) (20230331/psparse-529)
Aug 6 10:57:37 jaws.cs.umd.edu kernel: ACPI Error: Aborting method \_SB.PMI0._PMC due to previous error (AE_NOT_EXIST) (20230331/psparse-529)
Aug 6 10:57:37 jaws.cs.umd.edu kernel: ACPI: \_SB_.PMI0: _PMC evaluation failed: AE_NOT_EXIST
Aug 6 10:57:49 jaws.cs.umd.edu irqbalance[1284]: Cannot change IRQ 45 affinity: Operation not permitted
Aug 6 10:57:49 jaws.cs.umd.edu irqbalance[1284]: IRQ 45 affinity is now unmanaged
Aug 6 10:57:49 jaws.cs.umd.edu irqbalance[1284]: Cannot change IRQ 53 affinity: Operation not permitted
Aug 6 10:57:49 jaws.cs.umd.edu irqbalance[1284]: IRQ 53 affinity is now unmanaged
Aug 6 10:57:49 jaws.cs.umd.edu irqbalance[1284]: Cannot change IRQ 43 affinity: Operation not permitted
Aug 6 10:57:49 jaws.cs.umd.edu irqbalance[1284]: IRQ 43 affinity is now unmanaged
Aug 6 10:57:49 jaws.cs.umd.edu irqbalance[1284]: Cannot change IRQ 51 affinity: Operation not permitted
Aug 6 10:57:49 jaws.cs.umd.edu irqbalance[1284]: IRQ 51 affinity is now unmanaged
Aug 6 10:57:49 jaws.cs.umd.edu irqbalance[1284]: Cannot change IRQ 41 affinity: Operation not permitted
Aug 6 10:57:49 jaws.cs.umd.edu irqbalance[1284]: IRQ 41 affinity is now unmanaged
Aug 6 10:57:49 jaws.cs.umd.edu irqbalance[1284]: Cannot change IRQ 48 affinity: Operation not permitted
Aug 6 10:57:49 jaws.cs.umd.edu irqbalance[1284]: IRQ 48 affinity is now unmanaged
Aug 6 10:57:49 jaws.cs.umd.edu irqbalance[1284]: Cannot change IRQ 46 affinity: Operation not permitted
... 58 more distinct messages not shown
== krispykreme.cs.umd.edu (13 distinct, 29 total) ==
Aug 6 10:20:56 krispykreme.cs.umd.edu sshd-session[3966294]: pam_access(sshd:auth): access denied for user `admin' from `27.79.2.42'
Aug 6 10:20:56 krispykreme.cs.umd.edu krb5_child[3966296]: Client 'admin(a)UMD.EDU' not found in Kerberos database [x7]
Aug 6 10:20:56 krispykreme.cs.umd.edu sshd-session[3966292]: error: PAM: System error for admin from 27.79.2.42
Aug 6 10:23:08 krispykreme.cs.umd.edu sshd-session[3966493]: pam_access(sshd:auth): access denied for user `root' from `27.79.2.42'
Aug 6 10:23:10 krispykreme.cs.umd.edu sshd-session[3966490]: error: PAM: Authentication failure for root from 27.79.2.42
Aug 6 10:39:34 krispykreme.cs.umd.edu sshd-session[3971308]: pam_access(sshd:auth): access denied for user `root' from `116.110.212.151' [x2]
Aug 6 10:39:36 krispykreme.cs.umd.edu sshd-session[3971306]: error: PAM: Authentication failure for root from 116.110.212.151 [x2]
Aug 6 10:43:22 krispykreme.cs.umd.edu sshd-session[3972195]: pam_access(sshd:auth): access denied for user `admin' from `116.110.212.151' [x5]
Aug 6 10:43:22 krispykreme.cs.umd.edu sshd-session[3972158]: error: PAM: System error for admin from 116.110.212.151 [x5]
Aug 6 10:44:53 krispykreme.cs.umd.edu sshd-session[3972332]: pam_access(sshd:auth): access denied for user `root' from `171.231.194.150'
Aug 6 10:44:56 krispykreme.cs.umd.edu sshd-session[3972325]: error: PAM: Authentication failure for root from 171.231.194.150
Aug 6 10:56:49 krispykreme.cs.umd.edu sshd-session[3976160]: pam_access(sshd:auth): access denied for user `admin' from `171.231.194.150'
Aug 6 10:56:49 krispykreme.cs.umd.edu sshd-session[3976154]: error: PAM: System error for admin from 171.231.194.150
== netbox (5 distinct, 5 total) ==
Aug 6 10:22:44 netbox kernel: clocksource: timekeeping watchdog on CPU0: Marking clocksource 'tsc' as unstable because the skew is too large:
Aug 6 10:22:44 netbox kernel: clocksource: 'kvm-clock' wd_nsec: 495975037 wd_now: e1bf211cadd94 wd_last: e1bf1f43ae317 mask: ffffffffffffffff
Aug 6 10:22:44 netbox kernel: clocksource: 'tsc' cs_nsec: 496546776 cs_now: a2873213ec924 cs_last: a2872da36baa8 mask: ffffffffffffffff
Aug 6 10:22:44 netbox kernel: clocksource: Clocksource 'tsc' skewed 571739 ns (0 ms) over watchdog 'kvm-clock' interval of 495975037 ns (495 ms)
Aug 6 10:22:44 netbox kernel: clocksource: 'kvm-clock' (not 'tsc') is current clocksource.
== newhonors2 (1 distinct, 24 total) ==
Aug 6 10:13:03 newhonors2 dhcpcd[819128]: dhcpcd is not running [x24]
== nightingale (12 distinct, 12 total) ==
Aug 6 10:05:04 nightingale gnome-software[2519548]: failed to install runtime/org.freedesktop.Platform.GL.default/x86_64/22.08-extra (non fatal): Flatpak system operation Deploy not allowed for user
Aug 6 10:05:19 nightingale gnome-software[2519548]: failed to install runtime/org.freedesktop.Platform.GL.default/x86_64/25.08 (non fatal): Flatpak system operation Deploy not allowed for user
Aug 6 10:05:30 nightingale gnome-software[2519548]: failed to install runtime/org.freedesktop.Platform.GL.default/x86_64/25.08-extra (non fatal): Flatpak system operation Deploy not allowed for user
Aug 6 10:05:31 nightingale gnome-software[2519548]: failed to install runtime/org.freedesktop.Platform.Locale/x86_64/22.08 (non fatal): Flatpak system operation Deploy not allowed for user
Aug 6 10:05:33 nightingale gnome-software[2519548]: failed to install runtime/org.freedesktop.Platform.Locale/x86_64/25.08 (non fatal): Flatpak system operation Deploy not allowed for user
Aug 6 10:05:35 nightingale gnome-software[2519548]: failed to install runtime/org.freedesktop.Platform.VAAPI.Intel/x86_64/22.08 (non fatal): Flatpak system operation Deploy not allowed for user
Aug 6 10:05:46 nightingale gnome-software[2519548]: failed to install runtime/org.freedesktop.Platform.VAAPI.Intel/x86_64/25.08 (non fatal): Flatpak system operation Deploy not allowed for user
Aug 6 10:05:48 nightingale gnome-software[2519548]: failed to install runtime/org.freedesktop.Platform.codecs-extra/x86_64/25.08-extra (non fatal): Flatpak system operation Deploy not allowed for user
Aug 6 10:06:08 nightingale gnome-software[2519548]: failed to install runtime/org.freedesktop.Platform.openh264/x86_64/2.2.0 (non fatal): Flatpak system operation Deploy not allowed for user
Aug 6 10:06:08 nightingale gnome-software[2519548]: State change on system/flatpak/flathub/org.freedesktop.Platform/22.08 (Freedesktop Platform) from installing to removing is not OK
Aug 6 10:06:09 nightingale gnome-software[2519548]: State change on system/flatpak/flathub/im.riot.Riot/stable (Element) from updatable-live to installed is not OK
Aug 6 10:06:09 nightingale gnome-software[2519548]: State change on system/flatpak/flathub/org.freedesktop.Platform/22.08 (Freedesktop Platform) from updatable-live to installed is not OK
== outbound00.cs.umd.edu (2 distinct, 14 total) ==
Aug 6 10:09:09 outbound00.cs.umd.edu python3[3461581]: ldapdb [x6]
Aug 6 10:15:05 outbound00.cs.umd.edu krb5_child[3462679]: Client 'admin(a)UMD.EDU' not found in Kerberos database [x8]
== outbound01.cs.umd.edu (1 distinct, 6 total) ==
Aug 6 10:13:06 outbound01.cs.umd.edu python3[1496660]: ldapdb [x6]
== peach.cs.umd.edu (2 distinct, 2 total) ==
Aug 6 10:42:10 peach.cs.umd.edu setroubleshoot[925271]: SELinux is preventing /usr/bin/qemu-ga from search access on the directory /var/lib/containers/storage/overlay. For complete SELinux messages run: sealert -l 007f2494-1b82-4ff6-bd59-5f449ab9de99
Aug 6 10:42:10 peach.cs.umd.edu setroubleshoot[925271]: SELinux is preventing /usr/bin/qemu-ga from search access on the directory /var/lib/containers/storage/overlay. For complete SELinux messages run: sealert -l a801d9aa-5cee-4f5c-b9a9-bd22e572596b
== quiss (3 distinct, 5 total) ==
Aug 6 10:55:17 quiss kernel: sd 5:0:0:0: [sdc] No Caching mode page found [x2]
Aug 6 10:55:17 quiss kernel: sd 5:0:0:0: [sdc] Assuming drive cache: write through [x2]
Aug 6 11:00:18 quiss (da-udp.*)[588931]: amanda-udp-restart.service: Failed at step EXEC spawning /usr/bin/systemctl restart amanda-udp.*: No such file or directory
== sentry-docker00.cs.umd.edu (34 distinct, 34 total) ==
Aug 6 10:09:33 sentry-docker00.cs.umd.edu systemd-udevd[3035116]: Could not generate persistent MAC address for veth216ef24: No such file or directory
Aug 6 10:09:33 sentry-docker00.cs.umd.edu systemd-udevd[3035117]: Could not generate persistent MAC address for vethe24ef66: No such file or directory
Aug 6 10:09:33 sentry-docker00.cs.umd.edu systemd-udevd[3035120]: Could not generate persistent MAC address for veth76c2d36: No such file or directory
Aug 6 10:09:33 sentry-docker00.cs.umd.edu systemd-udevd[3035121]: Could not generate persistent MAC address for veth64a5eb4: No such file or directory
Aug 6 10:09:33 sentry-docker00.cs.umd.edu systemd-udevd[3035134]: Could not generate persistent MAC address for vethce6cc88: No such file or directory
Aug 6 10:09:33 sentry-docker00.cs.umd.edu systemd-udevd[3035129]: Could not generate persistent MAC address for veth44ba569: No such file or directory
Aug 6 10:09:33 sentry-docker00.cs.umd.edu systemd-udevd[3035141]: Could not generate persistent MAC address for veth1ab4496: No such file or directory
Aug 6 10:09:33 sentry-docker00.cs.umd.edu systemd-udevd[3035126]: Could not generate persistent MAC address for veth0bd7e16: No such file or directory
Aug 6 10:09:33 sentry-docker00.cs.umd.edu systemd-udevd[3035129]: Could not generate persistent MAC address for vethb1843c3: No such file or directory
Aug 6 10:09:33 sentry-docker00.cs.umd.edu systemd-udevd[3035135]: Could not generate persistent MAC address for veth9dfa408: No such file or directory
Aug 6 10:29:41 sentry-docker00.cs.umd.edu systemd-udevd[3044464]: link_config: could not set ethtool features for veth9dfa408
Aug 6 10:29:41 sentry-docker00.cs.umd.edu systemd-udevd[3044464]: Could not set offload features of veth9dfa408: Operation not permitted
Aug 6 10:29:41 sentry-docker00.cs.umd.edu systemd-udevd[3044494]: Could not generate persistent MAC address for vethcf49dab: No such file or directory
Aug 6 10:29:41 sentry-docker00.cs.umd.edu systemd-udevd[3044495]: Could not generate persistent MAC address for vethc9932bf: No such file or directory
Aug 6 10:29:41 sentry-docker00.cs.umd.edu systemd-udevd[3044498]: Could not generate persistent MAC address for veth10b3ee6: No such file or directory
Aug 6 10:29:41 sentry-docker00.cs.umd.edu systemd-udevd[3044505]: Could not generate persistent MAC address for veth66b83c0: No such file or directory
Aug 6 10:29:41 sentry-docker00.cs.umd.edu systemd-udevd[3044518]: Could not generate persistent MAC address for veth5fe80a2: No such file or directory
Aug 6 10:29:41 sentry-docker00.cs.umd.edu systemd-udevd[3044504]: Could not generate persistent MAC address for veth02cd593: No such file or directory
Aug 6 10:29:41 sentry-docker00.cs.umd.edu systemd-udevd[3044516]: Could not generate persistent MAC address for veth1696e9f: No such file or directory
Aug 6 10:29:41 sentry-docker00.cs.umd.edu systemd-udevd[3044502]: Could not generate persistent MAC address for veth8e9ddc1: No such file or directory
Aug 6 10:29:41 sentry-docker00.cs.umd.edu systemd-udevd[3044595]: Could not generate persistent MAC address for vethae33632: No such file or directory
Aug 6 10:29:41 sentry-docker00.cs.umd.edu systemd-udevd[3044596]: Could not generate persistent MAC address for veth5eeb069: No such file or directory
Aug 6 10:49:49 sentry-docker00.cs.umd.edu systemd-udevd[3053871]: link_config: could not get ethtool features for vethcf49dab
Aug 6 10:49:49 sentry-docker00.cs.umd.edu systemd-udevd[3053871]: Could not set offload features of vethcf49dab: No such device
Aug 6 10:49:49 sentry-docker00.cs.umd.edu systemd-udevd[3053901]: Could not generate persistent MAC address for vethd19ff57: No such file or directory
Aug 6 10:49:49 sentry-docker00.cs.umd.edu systemd-udevd[3053900]: Could not generate persistent MAC address for veth2c227b1: No such file or directory
Aug 6 10:49:49 sentry-docker00.cs.umd.edu systemd-udevd[3053904]: Could not generate persistent MAC address for vethcae6812: No such file or directory
Aug 6 10:49:49 sentry-docker00.cs.umd.edu systemd-udevd[3053911]: Could not generate persistent MAC address for vethfa8ae8b: No such file or directory
Aug 6 10:49:49 sentry-docker00.cs.umd.edu systemd-udevd[3053915]: Could not generate persistent MAC address for veth4fd9209: No such file or directory
Aug 6 10:49:49 sentry-docker00.cs.umd.edu systemd-udevd[3053918]: Could not generate persistent MAC address for veth55d0f38: No such file or directory
... 4 more distinct messages not shown
== soul (1 distinct, 6 total) ==
Aug 6 10:22:14 soul krb5_child[3904275]: Client 'admin(a)UMD.EDU' not found in Kerberos database [x6]
== strawberry (2 distinct, 8 total) ==
Aug 6 10:09:44 strawberry udisksd[1067]: Error performing housekeeping for drive /org/freedesktop/UDisks2/drives/ST2000DM001_1CH164_W1E8J5KJ: Error updating SMART data: Error sending ATA command CHECK POWER MODE: Unexpected sense data returned:#0120000: 00 00 00 00 00 00 00 00 00 00 00 00 00 00 00 00 ................#0120010: 00 00 00 00 00 00 00 00 00 00 00 00 00 00 00 00 ................#012 (g-io-error-quark, 0) [x6]
Aug 6 10:34:42 strawberry smartd[5314]: Device: /dev/sda [SAT], failed to read SMART Attribute Data [x2]
== uffish.cs.umd.edu (1 distinct, 2 total) ==
Aug 6 11:00:36 uffish.cs.umd.edu sshd[1740035]: error: key_cert_check_authority: invalid certificate [x2]
== wraith (31 distinct, 34 total) ==
Aug 6 10:07:36 wraith tracker-miner-f[1293618]: tracker_indexing_tree_remove: assertion 'TRACKER_IS_INDEXING_TREE (tree)' failed
Aug 6 10:15:04 wraith falcon-sensor[959]: CrowdStrike(4): Could not retrieve DisableProxy value: c0000225
Aug 6 10:15:04 wraith falcon-sensor[959]: CrowdStrike(4): ConnectWithProxy: Unable to get application proxy host from CsConfig: c0000225
Aug 6 10:20:30 wraith pipewire[3718]: mod.jackdbus-detect: Failed to receive jackdbus reply: org.freedesktop.DBus.Error.ServiceUnknown: The name org.jackaudio.service was not provided by any .service files [x2]
Aug 6 10:20:31 wraith gdm3[2940]: Gdm: on_display_added: assertion 'GDM_IS_REMOTE_DISPLAY (display)' failed [x2]
Aug 6 10:20:32 wraith at-spi2-registr[4125]: Failed to register client: GDBus.Error:org.gnome.SessionManager.AlreadyRegistered: Unable to register client
Aug 6 10:20:32 wraith at-spi2-registr[4125]: Unable to register client with session manager
Aug 6 10:20:32 wraith goa-identity-se[4426]: GoaKerberosIdentityManager: Using polling for change notification for credential cache type 'KEYRING'
Aug 6 10:20:33 wraith gdm3[2940]: Gdm: on_display_removed: assertion 'GDM_IS_REMOTE_DISPLAY (display)' failed [x2]
Aug 6 10:20:56 wraith io.snapcraft.Settings[5307]: userd.go:93: Starting snap userd
Aug 6 10:33:25 wraith tracker-miner-f[4561]: Owner of volume monitor org.gtk.vfs.AfcVolumeMonitor disconnected from the bus; removing drives/volumes/mounts
Aug 6 10:33:25 wraith tracker-miner-f[4561]: Owner of volume monitor org.gtk.vfs.GoaVolumeMonitor disconnected from the bus; removing drives/volumes/mounts
Aug 6 10:33:25 wraith tracker-miner-f[4561]: Owner of volume monitor org.gtk.vfs.GPhoto2VolumeMonitor disconnected from the bus; removing drives/volumes/mounts
Aug 6 10:33:25 wraith tracker-miner-f[4561]: Owner of volume monitor org.gtk.vfs.MTPVolumeMonitor disconnected from the bus; removing drives/volumes/mounts
Aug 6 10:33:25 wraith tracker-miner-f[4561]: Owner of volume monitor org.gtk.vfs.UDisks2VolumeMonitor disconnected from the bus; removing drives/volumes/mounts
Aug 6 10:33:26 wraith evolution-calen[4434]: Error setting property 'ConnectionStatus' on interface org.gnome.evolution.dataserver.Source: The connection is closed (g-io-error-quark, 18)
Aug 6 10:33:26 wraith evolution-addre[4465]: Error setting property 'ConnectionStatus' on interface org.gnome.evolution.dataserver.Source: The connection is closed (g-io-error-quark, 18)
Aug 6 10:39:00 wraith kernel: workqueue: i915_hpd_poll_init_work [i915] hogged CPU for >10000us 4 times, consider switching to WQ_UNBOUND
Aug 6 10:39:25 wraith kernel: workqueue: i915_hpd_poll_init_work [i915] hogged CPU for >10000us 5 times, consider switching to WQ_UNBOUND
Aug 6 10:39:47 wraith kernel: workqueue: output_poll_execute hogged CPU for >10000us 4 times, consider switching to WQ_UNBOUND
Aug 6 10:40:23 wraith kernel: workqueue: output_poll_execute hogged CPU for >10000us 5 times, consider switching to WQ_UNBOUND
Aug 6 10:40:24 wraith kernel: workqueue: i915_hpd_poll_init_work [i915] hogged CPU for >10000us 7 times, consider switching to WQ_UNBOUND
Aug 6 10:41:24 wraith kernel: workqueue: output_poll_execute hogged CPU for >10000us 7 times, consider switching to WQ_UNBOUND
Aug 6 10:41:49 wraith kernel: workqueue: i915_hpd_poll_init_work [i915] hogged CPU for >10000us 11 times, consider switching to WQ_UNBOUND
Aug 6 10:43:23 wraith kernel: workqueue: output_poll_execute hogged CPU for >10000us 11 times, consider switching to WQ_UNBOUND
Aug 6 10:45:24 wraith kernel: workqueue: i915_hpd_poll_init_work [i915] hogged CPU for >10000us 19 times, consider switching to WQ_UNBOUND
Aug 6 10:47:23 wraith kernel: workqueue: output_poll_execute hogged CPU for >10000us 19 times, consider switching to WQ_UNBOUND
Aug 6 10:51:48 wraith kernel: workqueue: i915_hpd_poll_init_work [i915] hogged CPU for >10000us 35 times, consider switching to WQ_UNBOUND
Aug 6 10:53:27 wraith gsd-power[7377]: Error calling suspend action: GDBus.Error:org.freedesktop.DBus.Error.AccessDenied: Permission denied
Aug 6 10:55:24 wraith kernel: workqueue: output_poll_execute hogged CPU for >10000us 35 times, consider switching to WQ_UNBOUND
... 1 more distinct messages not shown
1
0
Command: /usr/local/sbin/syslog-digest.py
Time : 1.0078s
Status : exited 0
Output :
Syslog digest — 2026-08-06 10:05 EDT
Processed 7,975 lines, filtered 5,105 (64%). 2,870 unknown (205 distinct) from 26 host(s).
== abuse (3 distinct, 2248 total) ==
Aug 6 09:05:06 abuse systemd[1]: Failed to load environment files: Input/output error [x687]
Aug 6 09:05:06 abuse systemd[1]: choria-server.service failed to run 'start' task: Input/output error [x687]
Aug 6 09:05:11 abuse rsyslogd[21745]: imjournal: open() failed for path: '/var/lib/rsyslog/imjournal.state.tmp': Input/output error [v8.2404.0 try https://www.rsyslog.com/e/2433 ] [x874]
== b0b02.cs.umd.edu (2 distinct, 2 total) ==
Aug 6 09:42:07 b0b02.cs.umd.edu systemd[1]: insights-client.service: Start request repeated too quickly.
Aug 6 09:47:42 b0b02.cs.umd.edu rustdesk[3538951]: cannot open display:
== bachata (10 distinct, 10 total) ==
Aug 6 09:44:32 bachata smbd[2527068]: [2026/08/06 09:44:32.687086, 0] ../../source3/smbd/smb2_service.c:117(chdir_current_service)
Aug 6 09:44:32 bachata smbd[2527068]: chdir_current_service: vfs_ChDir(/fs/junkfood/mount) failed: Permission denied. Current token: uid=11255, gid=11255, 12 groups: 11255 319000009 25038 15294 15229 755 25030 25025 30880 25029 770 15026
Aug 6 09:44:32 bachata smbd[2527068]: [2026/08/06 09:44:32.687812, 0] ../../source3/smbd/smbXsrv_tcon.c:914(smbXsrv_tcon_disconnect)
Aug 6 09:44:32 bachata smbd[2527068]: smbXsrv_tcon_disconnect: disconnect(0x8940d4f8, 'mount'): chdir_current_service() failed: NT_STATUS_INTERNAL_ERROR
Aug 6 09:44:32 bachata smbd[2527068]: [2026/08/06 09:44:32.744551, 0] ../../source3/smbd/smbXsrv_tcon.c:1028(smbXsrv_tcon_disconnect_all)
Aug 6 09:44:32 bachata smbd[2527068]: smbXsrv_tcon_disconnect_all: count[2] errors[1] first[NT_STATUS_INTERNAL_ERROR]
Aug 6 09:44:32 bachata smbd[2527068]: [2026/08/06 09:44:32.744685, 0] ../../source3/smbd/smbXsrv_session.c:1900(smbXsrv_session_logoff)
Aug 6 09:44:32 bachata smbd[2527068]: smbXsrv_session_logoff: smbXsrv_session_logoff(0xa27780b6): smb2srv_tcon_disconnect_all() failed: NT_STATUS_INTERNAL_ERROR
Aug 6 09:44:32 bachata smbd[2527068]: [2026/08/06 09:44:32.744764, 0] ../../source3/smbd/smbXsrv_session.c:1728(smbXsrv_session_remove_channel_done)
Aug 6 09:44:32 bachata smbd[2527068]: smbXsrv_session_remove_channel_done: smbXsrv_session_logoff(2725740726) failed: NT_STATUS_INTERNAL_ERROR
== borealis (17 distinct, 26 total) ==
Aug 6 10:02:27 borealis gnome-software[2228034]: Only 0 apps for recent list, hiding
Aug 6 10:02:32 borealis gsd-color[2227912]: failed to connect to device: Failed to connect to missing device /org/freedesktop/ColorManager/devices/xrandr_Dell_Inc__DELL_U2412M_7WFG152E149L_gdm_42
Aug 6 10:02:32 borealis gsd-color[2227912]: failed to connect to device: Failed to connect to missing device /org/freedesktop/ColorManager/devices/xrandr_Dell_Inc__DELL_U2412M_4V35D7133HNU_gdm_42
Aug 6 10:02:45 borealis packagekitd[2514162]: Failed to get cache filename for libreoffice-calc
Aug 6 10:02:45 borealis packagekitd[2514162]: Failed to get cache filename for libreoffice-draw
Aug 6 10:02:45 borealis packagekitd[2514162]: Failed to get cache filename for gstreamer1-plugins-bad-free
Aug 6 10:02:45 borealis packagekitd[2514162]: Failed to get cache filename for gstreamer1-plugins-good
Aug 6 10:02:45 borealis packagekitd[2514162]: Failed to get cache filename for libreoffice-base
Aug 6 10:02:45 borealis packagekitd[2514162]: Failed to get cache filename for libreoffice-writer
Aug 6 10:02:45 borealis packagekitd[2514162]: Failed to get cache filename for libreoffice-impress
Aug 6 10:02:45 borealis packagekitd[2514162]: Failed to get cache filename for gstreamer1-plugins-ugly-free
Aug 6 10:02:47 borealis packagekitd[2514162]: Failed to get cache filename for chromium
Aug 6 10:02:47 borealis packagekitd[2514162]: Failed to get cache filename for chromium-common
Aug 6 10:02:47 borealis packagekitd[2514162]: Failed to get cache filename for kernel-devel-matched [x6]
Aug 6 10:02:47 borealis packagekitd[2514162]: Failed to get cache filename for libreoffice [x3]
Aug 6 10:02:47 borealis packagekitd[2514162]: Failed to get cache filename for kernel [x3]
Aug 6 10:02:55 borealis packagekitd[2514162]: failed to parse public key for /etc/pki/rpm-gpg/RPM-GPG-KEY-PQC-redhat-release
== cheezit.cs.umd.edu (1 distinct, 1 total) ==
Aug 6 09:35:47 cheezit.cs.umd.edu sshd-session[1650923]: pam_access(sshd:auth): access denied for user `psadeghi' from `173.69.166.58'
== contest (10 distinct, 44 total) ==
Aug 6 09:05:56 contest goferd[1007]: [ERROR][worker-0] gofer.messaging.adapter.connect:33 - connect: proton+amqps://satellite8.cs.umd.edu:5647, failed: Connection amqps://satellite8.cs.umd.edu:5647 disconnected: Condition('proton.pythonio', 'Connection refused to all addresses') [x34]
Aug 6 09:48:18 contest setroubleshoot[720712]: SELinux is preventing /usr/libexec/platform-python3.6 from create access on the directory libdnf.hkRjVr. For complete SELinux messages run: sealert -l cb6b25c6-4765-4cf2-88a0-9b3b508e94e9
Aug 6 09:48:18 contest setroubleshoot[720712]: SELinux is preventing /usr/bin/gpgconf from add_name access on the directory repodata. For complete SELinux messages run: sealert -l 41cf7b1b-0f34-4609-98f2-b66e7825fef7
Aug 6 09:48:18 contest setroubleshoot[720712]: SELinux is preventing /usr/libexec/platform-python3.6 from create access on the file mirrorlist. For complete SELinux messages run: sealert -l fc20ff92-ea83-4f38-a24b-ddfd737a3141
Aug 6 09:48:19 contest setroubleshoot[720712]: SELinux is preventing /usr/libexec/platform-python3.6 from setattr access on the file repomd.xml. For complete SELinux messages run: sealert -l ac675631-fa35-4e93-adc9-b692b18e53e5
Aug 6 09:48:19 contest setroubleshoot[720712]: SELinux is preventing /usr/bin/gpgconf from add_name access on the directory repomd.xml.asc. For complete SELinux messages run: sealert -l 41cf7b1b-0f34-4609-98f2-b66e7825fef7
Aug 6 09:48:19 contest setroubleshoot[720712]: SELinux is preventing /usr/libexec/platform-python3.6 from read access on the directory libdnf.hkRjVr. For complete SELinux messages run: sealert -l 45d103b6-0810-4890-a705-990118577ce8
Aug 6 09:48:19 contest setroubleshoot[720712]: SELinux is preventing /usr/libexec/platform-python3.6 from remove_name access on the directory repomd.xml. For complete SELinux messages run: sealert -l 7e499113-2fd7-4f67-bec6-3521efbe3637 [x2]
Aug 6 09:48:19 contest setroubleshoot[720712]: SELinux is preventing /usr/libexec/platform-python3.6 from rmdir access on the directory repodata. For complete SELinux messages run: sealert -l 3928930b-a1ed-448d-950b-0665ac2adef8
Aug 6 09:48:21 contest setroubleshoot[720712]: SELinux is preventing /usr/libexec/platform-python3.6 from create access on the directory libdnf.2yuujf. For complete SELinux messages run: sealert -l cb6b25c6-4765-4cf2-88a0-9b3b508e94e9
== csfw00a (2 distinct, 264 total) ==
Aug 6 09:05:37 csfw00a kernel: bnxt_en 0000:09:00.0 eth3: NIC Link is Down [x260]
Aug 6 09:30:14 csfw00a ospf6d[1477]: [EC 100663307] Could not send entire message [x4]
== cskayako (4 distinct, 4 total) ==
Aug 6 09:24:36 cskayako setroubleshoot[2383013]: failed to retrieve rpm info for path '/var/www/html/__swift/logs/log.cache_06_Aug_2026_f2ef3746cf.txt':
Aug 6 09:24:37 cskayako setroubleshoot[2383013]: SELinux is preventing /usr/sbin/sendmail.postfix from append access on the file /var/www/html/__swift/logs/log.cache_06_Aug_2026_f2ef3746cf.txt. For complete SELinux messages run: sealert -l c566b62c-2773-4bf0-808b-10f832f1eafb
Aug 6 09:53:50 cskayako setroubleshoot[2386352]: SELinux is preventing /usr/bin/php from add_name access on the directory /var/www/html/(null). For complete SELinux messages run: sealert -l 5239c113-abc1-4953-a9c0-21d695a0d1bb
Aug 6 09:53:50 cskayako setroubleshoot[2386352]: SELinux is preventing /usr/bin/php from create access on the file /var/www/html/(null). For complete SELinux messages run: sealert -l cacf8f36-45b0-4374-9a33-d15de767aae7
== hackerman (7 distinct, 12 total) ==
Aug 6 09:19:01 hackerman gnome-software[2060381]: failed to commit changes to dconf: GDBus.Error:org.gtk.GDBus.UnmappedGError.Quark._g_2dfile_2derror_2dquark.Code2: Failed to create file “/adminhomes/sajith/.config/dconf/user.LWLVT3”: Permission denied
Aug 6 09:20:04 hackerman gnome-software[2060381]: can't reliably fixup error code 4 in domain g-io-error-quark: Not a directory [x4]
Aug 6 09:20:12 hackerman gnome-software[2060381]: Only 0 apps for recent list, hiding
Aug 6 09:20:28 hackerman gnome-software[2060381]: failed to commit changes to dconf: GDBus.Error:org.gtk.GDBus.UnmappedGError.Quark._g_2dfile_2derror_2dquark.Code2: Failed to create file “/adminhomes/sajith/.config/dconf/user.L35LT3”: Permission denied
Aug 6 09:20:28 hackerman packagekitd[211746]: Failed to get cache filename for libreoffice [x2]
Aug 6 09:20:28 hackerman packagekitd[211746]: Failed to get cache filename for kernel [x2]
Aug 6 09:20:39 hackerman packagekitd[211746]: failed to parse public key for /etc/pki/rpm-gpg/RPM-GPG-KEY-PQC-redhat-release
== idm00 (1 distinct, 1 total) ==
Aug 6 09:51:19 idm00 named[1455]: client @0x7f330c464c88 10.73.240.42#56288: update '73.10.in-addr.arpa/IN' denied
== idmp0 (1 distinct, 1 total) ==
Aug 6 09:36:07 idmp0 named[5198]: client @0x7f9928021e58 10.73.240.43#49751: update '73.10.in-addr.arpa/IN' denied
== irb2156 (4 distinct, 10 total) ==
Aug 6 09:54:14 irb2156 gcr-prompter[988026]: cannot open display: [x4]
Aug 6 09:54:14 irb2156 gnome-keyring-d[16342]: couldn't create system prompt: GDBus.Error:org.freedesktop.DBus.Error.NameHasNoOwner: Could not activate remote peer 'org.gnome.keyring.SystemPrompter': unit failed [x4]
Aug 6 09:54:14 irb2156 falcon-sensor-bpf[3727]: CrowdStrike(4): Could not retrieve DisableProxy value: c0000225
Aug 6 09:54:14 irb2156 falcon-sensor-bpf[3727]: CrowdStrike(4): ConnectWithProxy: Unable to get application proxy host from CsConfig: c0000225
== itmon02 (1 distinct, 40 total) ==
Aug 6 09:08:02 itmon02 sshd[1750555]: error: beginning MaxStartups throttling [x40]
== mcstic (1 distinct, 2 total) ==
Aug 6 09:10:37 mcstic krb5_child[2194710]: Client 'admin(a)UMD.EDU' not found in Kerberos database [x2]
== newhonors2 (1 distinct, 24 total) ==
Aug 6 09:13:02 newhonors2 dhcpcd[817253]: dhcpcd is not running [x24]
== nightingale (60 distinct, 79 total) ==
Aug 6 10:03:01 nightingale goa-identity-se[2519484]: GoaKerberosIdentityManager: Using polling for change notification for credential cache type 'KCM'
Aug 6 10:03:01 nightingale vmware-user.desktop[2519650]: vmware-user: could not open /proc/fs/vmblock/dev
Aug 6 10:03:01 nightingale gsd-usb-protect[2519583]: Failed to fetch USBGuard parameters: GDBus.Error:org.freedesktop.DBus.Error.ServiceUnknown: The name is not activatable
Aug 6 10:03:03 nightingale gsd-color[2519518]: failed to connect to device: Failed to connect to missing device /org/freedesktop/ColorManager/devices/xrandr_Acer_Technologies_B246WL_T1ZAA0012420_gdm_42
Aug 6 10:03:10 nightingale PanGPUI[2519555]: QObject::connect: No such slot PanGPUIWebDialog::onReload()
Aug 6 10:03:10 nightingale PanGPUI[2519555]: Setting a QCompleter on non-editable QComboBox is not allowed.
Aug 6 10:03:10 nightingale PanGPUI[2519555]: QLayout: Attempting to add QLayout "" to ConnectionsTab "", which already has a layout [x5]
Aug 6 10:03:10 nightingale PanGPUI[2519555]: QLayout: Attempting to add QLayout "" to TroubleShootingTab "", which already has a layout
Aug 6 10:03:10 nightingale PanGPUI[2519555]: QLayout: Attempting to add QLayout "" to PanGPUIFedMandateDialog "", which already has a layout
Aug 6 10:03:10 nightingale PanGPUI[2519555]: QLayout: Attempting to add QLayout "" to PanGPUIPreferredGwDialog "", which already has a layout
Aug 6 10:03:10 nightingale PanGPUI[2519555]: QLayout: Attempting to add QLayout "" to PanGPUICertSelectDialog "", which already has a layout
Aug 6 10:03:18 nightingale gnome-software[2519548]: Kind change on net.launchpad.Gnuclad from console-application to desktop-application is not OK
Aug 6 10:03:21 nightingale gnome-software[2519548]: Kind change on io.github.sil_car.SqueezeVid from console-application to desktop-application is not OK
Aug 6 10:03:23 nightingale gnome-software[2519548]: Kind change on net.mkiol.SpeechNote.Addon.amd from addon to runtime is not OK
Aug 6 10:03:23 nightingale gnome-software[2519548]: Kind change on net.mkiol.SpeechNote.Addon.nvidia from addon to runtime is not OK
Aug 6 10:03:23 nightingale gnome-software[2519548]: Kind change on org.videolan.VLC.Plugin.pause_click from addon to runtime is not OK
Aug 6 10:03:25 nightingale gnome-software[2519548]: Kind change on org.nuspell.Nuspell from console-application to desktop-application is not OK
Aug 6 10:03:25 nightingale gnome-software[2519548]: Kind change on com.github.ilai_deutel.kibi from console-application to desktop-application is not OK
Aug 6 10:03:26 nightingale gnome-software[2519548]: Kind change on dev.paullee.scraterpreter.Scrape from console-application to desktop-application is not OK
Aug 6 10:03:26 nightingale gnome-software[2519548]: Kind change on dev.paullee.scraterpreter.Scrapec from console-application to desktop-application is not OK
Aug 6 10:03:26 nightingale gnome-software[2519548]: Kind change on fr.inria.corese.CoreseCommand from console-application to desktop-application is not OK
Aug 6 10:03:27 nightingale gnome-software[2519548]: Kind change on io.github.coccinelle.coccinelle from console-application to desktop-application is not OK
Aug 6 10:03:27 nightingale gnome-software[2519548]: Kind change on io.github.erkin.ponysay from console-application to desktop-application is not OK
Aug 6 10:03:29 nightingale gnome-software[2519548]: Kind change on net.imaginaryinfinity.Squiid from console-application to desktop-application is not OK
Aug 6 10:03:29 nightingale gnome-software[2519548]: Kind change on org.eu.wabarc.wayback from console-application to desktop-application is not OK
Aug 6 10:03:31 nightingale gnome-software[2519548]: Kind change on com.jeffser.Alpaca.Plugins.AMD from addon to runtime is not OK
Aug 6 10:03:31 nightingale gnome-software[2519548]: Kind change on com.jeffser.Alpaca.Plugins.Ollama from addon to runtime is not OK
Aug 6 10:03:31 nightingale gnome-software[2519548]: Kind change on com.sublimetext.three.DevUtils from addon to runtime is not OK [x4]
Aug 6 10:03:31 nightingale gnome-software[2519548]: Kind change on com.valvesoftware.Steam.Utility.slonfig from addon to runtime is not OK
Aug 6 10:03:37 nightingale gnome-software[2519548]: Kind change on com.valvesoftware.Steam.Utility.InhibitScreensaver from addon to runtime is not OK
... 30 more distinct messages not shown
== outbound00.cs.umd.edu (1 distinct, 6 total) ==
Aug 6 09:09:09 outbound00.cs.umd.edu python3[3447772]: ldapdb [x6]
== outbound01.cs.umd.edu (1 distinct, 6 total) ==
Aug 6 09:13:06 outbound01.cs.umd.edu python3[1482654]: ldapdb [x6]
== sebatinsky.cs.umd.edu (4 distinct, 4 total) ==
Aug 6 09:41:16 sebatinsky.cs.umd.edu setroubleshoot[1902717]: SELinux is preventing pdns/comm-main from name_bind access on the udp_socket port 11211. For complete SELinux messages run: sealert -l 119d68a4-b6b5-4da3-94a0-ee86b02b1c83
Aug 6 09:50:32 sebatinsky.cs.umd.edu setroubleshoot[1904420]: SELinux is preventing /usr/libexec/platform-python3.6 from add_name access on the directory .dbenv.lock. For complete SELinux messages run: sealert -l 26d5bc02-bfff-4827-a9f2-b991fef962b5
Aug 6 09:50:32 sebatinsky.cs.umd.edu setroubleshoot[1904420]: failed to retrieve rpm info for /var/lib/rpm/.dbenv.lock
Aug 6 09:50:35 sebatinsky.cs.umd.edu setroubleshoot[1904420]: SELinux is preventing rhsmcertd-worke from create access on the file /var/lib/rpm/.dbenv.lock. For complete SELinux messages run: sealert -l c2202c24-dc18-413b-8198-09e05919353b
== sentry-docker00.cs.umd.edu (38 distinct, 38 total) ==
Aug 6 09:09:07 sentry-docker00.cs.umd.edu systemd-udevd[3006515]: link_config: could not get ethtool features for vetha8f6516
Aug 6 09:09:07 sentry-docker00.cs.umd.edu systemd-udevd[3006515]: Could not set offload features of vetha8f6516: No such device
Aug 6 09:09:08 sentry-docker00.cs.umd.edu systemd-udevd[3006614]: link_config: could not get ethtool features for veth9c59d53
Aug 6 09:09:08 sentry-docker00.cs.umd.edu systemd-udevd[3006614]: Could not set offload features of veth9c59d53: No such device
Aug 6 09:09:08 sentry-docker00.cs.umd.edu systemd-udevd[3006629]: Could not generate persistent MAC address for veth4c61518: No such file or directory
Aug 6 09:09:08 sentry-docker00.cs.umd.edu systemd-udevd[3006630]: Could not generate persistent MAC address for veth4edd01e: No such file or directory
Aug 6 09:09:08 sentry-docker00.cs.umd.edu systemd-udevd[3006648]: Could not generate persistent MAC address for vethbe66c1a: No such file or directory
Aug 6 09:09:08 sentry-docker00.cs.umd.edu systemd-udevd[3006637]: Could not generate persistent MAC address for vethc65edc3: No such file or directory
Aug 6 09:09:08 sentry-docker00.cs.umd.edu systemd-udevd[3006657]: Could not generate persistent MAC address for veth29db23c: No such file or directory
Aug 6 09:09:08 sentry-docker00.cs.umd.edu systemd-udevd[3006658]: Could not generate persistent MAC address for veth2b29332: No such file or directory
Aug 6 09:09:08 sentry-docker00.cs.umd.edu systemd-udevd[3006676]: Could not generate persistent MAC address for veth1e56e9e: No such file or directory
Aug 6 09:09:08 sentry-docker00.cs.umd.edu systemd-udevd[3006675]: Could not generate persistent MAC address for vethdf501ce: No such file or directory
Aug 6 09:09:08 sentry-docker00.cs.umd.edu systemd-udevd[3006685]: Could not generate persistent MAC address for vethe202ddb: No such file or directory
Aug 6 09:09:08 sentry-docker00.cs.umd.edu systemd-udevd[3006686]: Could not generate persistent MAC address for veth24bfdc7: No such file or directory
Aug 6 09:29:16 sentry-docker00.cs.umd.edu systemd-udevd[3016291]: Could not generate persistent MAC address for vethdcc4c07: No such file or directory
Aug 6 09:29:16 sentry-docker00.cs.umd.edu systemd-udevd[3016292]: Could not generate persistent MAC address for veth363c7aa: No such file or directory
Aug 6 09:29:16 sentry-docker00.cs.umd.edu systemd-udevd[3016295]: Could not generate persistent MAC address for veth78de329: No such file or directory
Aug 6 09:29:16 sentry-docker00.cs.umd.edu systemd-udevd[3016296]: Could not generate persistent MAC address for vethb44d48f: No such file or directory
Aug 6 09:29:16 sentry-docker00.cs.umd.edu systemd-udevd[3016313]: Could not generate persistent MAC address for vethe369685: No such file or directory
Aug 6 09:29:16 sentry-docker00.cs.umd.edu systemd-udevd[3016295]: Could not generate persistent MAC address for vethac082a4: No such file or directory
Aug 6 09:29:16 sentry-docker00.cs.umd.edu systemd-udevd[3016311]: Could not generate persistent MAC address for veth2db749a: No such file or directory
Aug 6 09:29:16 sentry-docker00.cs.umd.edu systemd-udevd[3016318]: Could not generate persistent MAC address for vethb65000e: No such file or directory
Aug 6 09:29:16 sentry-docker00.cs.umd.edu systemd-udevd[3016315]: Could not generate persistent MAC address for veth5676ac2: No such file or directory
Aug 6 09:29:16 sentry-docker00.cs.umd.edu systemd-udevd[3016313]: Could not generate persistent MAC address for vethc41f67e: No such file or directory
Aug 6 09:49:24 sentry-docker00.cs.umd.edu systemd-udevd[3025647]: link_config: could not get ethtool features for veth5676ac2
Aug 6 09:49:24 sentry-docker00.cs.umd.edu systemd-udevd[3025647]: Could not set offload features of veth5676ac2: No such device
Aug 6 09:49:24 sentry-docker00.cs.umd.edu systemd-udevd[3025648]: link_config: could not get ethtool features for veth78de329
Aug 6 09:49:24 sentry-docker00.cs.umd.edu systemd-udevd[3025648]: Could not set offload features of veth78de329: No such device
Aug 6 09:49:24 sentry-docker00.cs.umd.edu systemd-udevd[3025686]: Could not generate persistent MAC address for vethaaedfa0: No such file or directory
Aug 6 09:49:24 sentry-docker00.cs.umd.edu systemd-udevd[3025687]: Could not generate persistent MAC address for vethfed04e2: No such file or directory
... 8 more distinct messages not shown
== strawberry (2 distinct, 8 total) ==
Aug 6 09:09:44 strawberry udisksd[1067]: Error performing housekeeping for drive /org/freedesktop/UDisks2/drives/ST2000DM001_1CH164_W1E8J5KJ: Error updating SMART data: Error sending ATA command CHECK POWER MODE: Unexpected sense data returned:#0120000: 00 00 00 00 00 00 00 00 00 00 00 00 00 00 00 00 ................#0120010: 00 00 00 00 00 00 00 00 00 00 00 00 00 00 00 00 ................#012 (g-io-error-quark, 0) [x6]
Aug 6 09:34:42 strawberry smartd[5314]: Device: /dev/sda [SAT], failed to read SMART Attribute Data [x2]
== submit26-b9-2 (9 distinct, 9 total) ==
Aug 6 09:12:53 submit26-b9-2 setroubleshoot[1149429]: SELinux is preventing /usr/bin/python3.9 from create access on the directory /(null). For complete SELinux messages run: sealert -l d506243c-d61e-48f3-b42a-4592c913deb0
Aug 6 09:12:53 submit26-b9-2 setroubleshoot[1149429]: SELinux is preventing /usr/bin/python3.9 from add_name access on the directory /(null). For complete SELinux messages run: sealert -l 3b4752ac-1b9a-4af9-a05b-32e4c2eb13ab
Aug 6 09:12:53 submit26-b9-2 setroubleshoot[1149429]: SELinux is preventing /usr/bin/python3.9 from create access on the file /(null). For complete SELinux messages run: sealert -l 29e5adbd-4381-4467-b40d-a2219101e096
Aug 6 09:12:53 submit26-b9-2 setroubleshoot[1149429]: SELinux is preventing /usr/bin/python3.9 from open access on the file /tmp/libdnf.fYQQxq/repodata/repomd.xml. For complete SELinux messages run: sealert -l 1b38f2ec-01ce-4343-8059-ba7494ecc5c4
Aug 6 09:12:53 submit26-b9-2 setroubleshoot[1149429]: SELinux is preventing /usr/bin/python3.9 from setattr access on the file repomd.xml. For complete SELinux messages run: sealert -l e5f9af40-1f63-4924-b012-27ab2a7b2266
Aug 6 09:12:53 submit26-b9-2 setroubleshoot[1149429]: SELinux is preventing /usr/bin/python3.9 from read access on the directory libdnf.fYQQxq. For complete SELinux messages run: sealert -l 5c54db87-54a3-4a7c-97b4-b5c48d6c3543
Aug 6 09:12:53 submit26-b9-2 setroubleshoot[1149429]: SELinux is preventing /usr/bin/python3.9 from remove_name access on the directory repomd.xml. For complete SELinux messages run: sealert -l 63cd60e1-1e61-4276-afea-dd8526ffe8b2
Aug 6 09:12:53 submit26-b9-2 setroubleshoot[1149429]: SELinux is preventing /usr/bin/python3.9 from unlink access on the file repomd.xml. For complete SELinux messages run: sealert -l 81c7e9ec-e023-4c6d-b1ad-c02a242e655e
Aug 6 09:12:53 submit26-b9-2 setroubleshoot[1149429]: SELinux is preventing /usr/bin/python3.9 from rmdir access on the directory repodata. For complete SELinux messages run: sealert -l 6ae9a597-e123-4d74-8eec-a8ebe0f5e4d0
== submit26-b9-3 (10 distinct, 13 total) ==
Aug 6 09:20:39 submit26-b9-3 setroubleshoot[875852]: SELinux is preventing /usr/bin/python3.9 from create access on the directory /(null). For complete SELinux messages run: sealert -l 5b912a44-22fd-4560-b201-2a4e289b73f5
Aug 6 09:20:39 submit26-b9-3 setroubleshoot[875852]: SELinux is preventing /usr/bin/python3.9 from add_name access on the directory /(null). For complete SELinux messages run: sealert -l 7f1df1e4-725e-4953-98eb-1079f908f543
Aug 6 09:20:39 submit26-b9-3 setroubleshoot[875852]: SELinux is preventing /usr/bin/python3.9 from create access on the file /(null). For complete SELinux messages run: sealert -l 40b8852a-f77b-44b4-affe-5f11fa33de43 [x2]
Aug 6 09:20:39 submit26-b9-3 setroubleshoot[875852]: SELinux is preventing /usr/bin/python3.9 from open access on the file /tmp/libdnf.GO6pu5/repodata/repomd.xml. For complete SELinux messages run: sealert -l 45a8019e-f6b5-4baa-92c1-862594b40d46
Aug 6 09:20:39 submit26-b9-3 setroubleshoot[875852]: SELinux is preventing /usr/bin/python3.9 from setattr access on the file repomd.xml. For complete SELinux messages run: sealert -l e9f0bfff-7784-4126-baa4-2bb06da56591 [x2]
Aug 6 09:20:39 submit26-b9-3 setroubleshoot[875852]: SELinux is preventing /usr/bin/python3.9 from read access on the directory libdnf.GO6pu5. For complete SELinux messages run: sealert -l 0b17cc3d-cdc6-4fe2-a11f-3892e7c41dc7
Aug 6 09:20:39 submit26-b9-3 setroubleshoot[875852]: SELinux is preventing /usr/bin/python3.9 from remove_name access on the directory repomd.xml. For complete SELinux messages run: sealert -l 10e38c64-b65f-4cdd-901e-4375652d9a42
Aug 6 09:20:39 submit26-b9-3 setroubleshoot[875852]: SELinux is preventing /usr/bin/python3.9 from unlink access on the file repomd.xml. For complete SELinux messages run: sealert -l 7fd9cf72-ef38-48e1-b6aa-b571b26a7b22 [x2]
Aug 6 09:20:39 submit26-b9-3 setroubleshoot[875852]: SELinux is preventing /usr/bin/python3.9 from rmdir access on the directory repodata. For complete SELinux messages run: sealert -l b9b11116-89bd-4a3c-980c-1d422c5dcee4
Aug 6 09:20:40 submit26-b9-3 setroubleshoot[875852]: SELinux is preventing /usr/bin/python3.9 from open access on the file /tmp/libdnf.c69qse/repodata/repomd.xml. For complete SELinux messages run: sealert -l 45a8019e-f6b5-4baa-92c1-862594b40d46
== submit26-clnb9 (9 distinct, 11 total) ==
Aug 6 09:31:58 submit26-clnb9 setroubleshoot[1875885]: SELinux is preventing /usr/bin/python3.9 from create access on the directory /(null). For complete SELinux messages run: sealert -l 6783ed2b-5ae4-42b5-975a-4bf50eec4658 [x2]
Aug 6 09:31:58 submit26-clnb9 setroubleshoot[1875885]: SELinux is preventing /usr/bin/python3.9 from add_name access on the directory /(null). For complete SELinux messages run: sealert -l 9e7fa955-cc30-4804-ac8c-e1779e85946c [x2]
Aug 6 09:31:58 submit26-clnb9 setroubleshoot[1875885]: SELinux is preventing /usr/bin/python3.9 from create access on the file /(null). For complete SELinux messages run: sealert -l 69bfa6e3-089c-40ff-9563-fd30787d0774
Aug 6 09:31:58 submit26-clnb9 setroubleshoot[1875885]: SELinux is preventing /usr/bin/python3.9 from open access on the file /tmp/libdnf.kvuLPb/repodata/repomd.xml. For complete SELinux messages run: sealert -l 001acdb5-31ef-4e52-b10b-90f467a89ddc
Aug 6 09:31:58 submit26-clnb9 setroubleshoot[1875885]: SELinux is preventing /usr/bin/python3.9 from setattr access on the file repomd.xml. For complete SELinux messages run: sealert -l edacddcf-16ed-4dc3-8d82-7c597d5dee23
Aug 6 09:31:58 submit26-clnb9 setroubleshoot[1875885]: SELinux is preventing /usr/bin/python3.9 from read access on the directory libdnf.kvuLPb. For complete SELinux messages run: sealert -l 62b3782e-4730-4488-8178-94dafe9b552c
Aug 6 09:31:58 submit26-clnb9 setroubleshoot[1875885]: SELinux is preventing /usr/bin/python3.9 from remove_name access on the directory repomd.xml. For complete SELinux messages run: sealert -l 81cb3698-78f8-440a-8e3c-e5d1041e6b78
Aug 6 09:31:58 submit26-clnb9 setroubleshoot[1875885]: SELinux is preventing /usr/bin/python3.9 from unlink access on the file repomd.xml. For complete SELinux messages run: sealert -l 792b472a-115c-4799-9805-fc7436f916b9
Aug 6 09:31:58 submit26-clnb9 setroubleshoot[1875885]: SELinux is preventing /usr/bin/python3.9 from rmdir access on the directory repodata. For complete SELinux messages run: sealert -l 15c83a86-837b-41e2-b662-b39cd4e361cb
== teaching-awards (1 distinct, 2 total) ==
Aug 6 09:18:30 teaching-awards krb5_child[1971390]: Preauthentication failed [x2]
== wraith (5 distinct, 5 total) ==
Aug 6 09:50:55 wraith tracker-miner-f[1293618]: tracker_indexing_tree_remove: assertion 'TRACKER_IS_INDEXING_TREE (tree)' failed
Aug 6 09:54:13 wraith kernel: ......ready
Aug 6 09:54:13 wraith kernel: sd 9:0:0:0: [sde] No Caching mode page found
Aug 6 09:54:13 wraith kernel: sd 9:0:0:0: [sde] Assuming drive cache: write through
Aug 6 09:54:13 wraith udisksd[1615]: Error probing device: Error sending ATA command IDENTIFY DEVICE to '/dev/sde': Unexpected sense data returned:#0120000: 00 00 00 00 00 00 00 00 00 00 00 00 00 00 00 00 ................#0120010: 00 00 00 00 00 00 00 00 00 00 00 00 00 00 00 00 ................#012 (g-io-error-quark, 0)
1
0
Command: /usr/local/sbin/syslog-digest.py
Time : 0.9585s
Status : exited 0
Output :
Syslog digest — 2026-08-06 09:05 EDT
Processed 7,538 lines, filtered 4,818 (63%). 2,720 unknown (85 distinct) from 18 host(s).
== abuse (3 distinct, 2249 total) ==
Aug 6 08:05:02 abuse systemd[1]: Failed to load environment files: Input/output error [x688]
Aug 6 08:05:02 abuse systemd[1]: choria-server.service failed to run 'start' task: Input/output error [x688]
Aug 6 08:05:02 abuse rsyslogd[21745]: imjournal: open() failed for path: '/var/lib/rsyslog/imjournal.state.tmp': Input/output error [v8.2404.0 try https://www.rsyslog.com/e/2433 ] [x873]
== b0b02.cs.umd.edu (4 distinct, 4 total) ==
Aug 6 08:42:08 b0b02.cs.umd.edu setroubleshoot[3522950]: SELinux is preventing /usr/bin/python3.9 from getattr access on the file /etc/authselect/nsswitch.conf. For complete SELinux messages run: sealert -l 9a1e2952-3fde-4937-a8ab-f7f59791a458
Aug 6 08:42:11 b0b02.cs.umd.edu setroubleshoot[3522950]: SELinux is preventing /usr/bin/python3.9 from read access on the file /etc/authselect/nsswitch.conf. For complete SELinux messages run: sealert -l 97d74423-e027-4cd6-8810-ad80944900b5
Aug 6 08:42:13 b0b02.cs.umd.edu setroubleshoot[3522950]: SELinux is preventing /usr/bin/python3.9 from open access on the file /etc/authselect/nsswitch.conf. For complete SELinux messages run: sealert -l 4f253f6a-62d6-46dd-8eaf-0b4d29df41c6
Aug 6 08:47:38 b0b02.cs.umd.edu rustdesk[3523891]: cannot open display:
== contest (1 distinct, 34 total) ==
Aug 6 08:05:14 contest goferd[1007]: [ERROR][worker-0] gofer.messaging.adapter.connect:33 - connect: proton+amqps://satellite8.cs.umd.edu:5647, failed: Connection amqps://satellite8.cs.umd.edu:5647 disconnected: Condition('proton.pythonio', 'Connection refused to all addresses') [x34]
== csfw00a (1 distinct, 266 total) ==
Aug 6 08:05:06 csfw00a kernel: bnxt_en 0000:09:00.0 eth3: NIC Link is Down [x266]
== emaar (2 distinct, 2 total) ==
Aug 6 08:11:37 emaar systemd[1]: insights-client.service: Start request repeated too quickly.
Aug 6 08:43:21 emaar puppet-agent[550464]: (Facter) invalid or malformed lldp data: MalformedDataError: no lldp interface data found
== hackerman (7 distinct, 12 total) ==
Aug 6 08:20:04 hackerman gnome-software[2060381]: can't reliably fixup error code 4 in domain g-io-error-quark: Not a directory [x4]
Aug 6 08:20:13 hackerman gnome-software[2060381]: Only 0 apps for recent list, hiding
Aug 6 08:20:29 hackerman gnome-software[2060381]: failed to commit changes to dconf: GDBus.Error:org.gtk.GDBus.UnmappedGError.Quark._g_2dfile_2derror_2dquark.Code2: Failed to create file “/adminhomes/sajith/.config/dconf/user.E221T3”: Permission denied
Aug 6 08:20:30 hackerman packagekitd[198114]: Failed to get cache filename for libreoffice [x2]
Aug 6 08:20:30 hackerman packagekitd[198114]: Failed to get cache filename for kernel [x2]
Aug 6 08:20:39 hackerman packagekitd[198114]: failed to parse public key for /etc/pki/rpm-gpg/RPM-GPG-KEY-PQC-redhat-release
Aug 6 08:53:52 hackerman systemd[1]: insights-client.service: Start request repeated too quickly.
== idm00 (1 distinct, 1 total) ==
Aug 6 08:51:19 idm00 named[1455]: client @0x7f33155207f8 10.73.240.42#56549: update '73.10.in-addr.arpa/IN' denied
== idmp0 (1 distinct, 1 total) ==
Aug 6 08:36:07 idmp0 named[5198]: client @0x7f992c05cb58 10.73.240.43#56177: update '73.10.in-addr.arpa/IN' denied
== itmon02 (1 distinct, 40 total) ==
Aug 6 08:08:15 itmon02 sshd[1750555]: error: beginning MaxStartups throttling [x40]
== netman.cs.umd.edu (3 distinct, 3 total) ==
Aug 6 08:30:01 netman.cs.umd.edu setroubleshoot[1442618]: SELinux is preventing /usr/bin/gpg from read access on the file gpg.conf. For complete SELinux messages run: sealert -l 019ad1da-a874-4814-8037-3b3e5f413ad2
Aug 6 08:30:02 netman.cs.umd.edu setroubleshoot[1442618]: SELinux is preventing /usr/bin/gpg from open access on the file /root/.gnupg/gpg.conf. For complete SELinux messages run: sealert -l cb54177e-d44c-46a1-b246-5c0bbb8343be
Aug 6 08:30:02 netman.cs.umd.edu setroubleshoot[1442618]: SELinux is preventing /usr/bin/gpg from getattr access on the file /root/.gnupg/gpg.conf. For complete SELinux messages run: sealert -l fbba2e30-b7ab-491c-9ec6-f553e9ef72af
== newhonors2 (1 distinct, 24 total) ==
Aug 6 08:13:03 newhonors2 dhcpcd[815426]: dhcpcd is not running [x24]
== outbound00.cs.umd.edu (1 distinct, 6 total) ==
Aug 6 08:09:09 outbound00.cs.umd.edu python3[3433971]: ldapdb [x6]
== outbound01.cs.umd.edu (2 distinct, 7 total) ==
Aug 6 08:08:12 outbound01.cs.umd.edu sshd-session[1467769]: fatal: userauth_pubkey: parse publickey packet: incomplete message [preauth]
Aug 6 08:13:06 outbound01.cs.umd.edu python3[1468826]: ldapdb [x6]
== sentry-docker00.cs.umd.edu (36 distinct, 36 total) ==
Aug 6 08:08:43 sentry-docker00.cs.umd.edu systemd-udevd[2976735]: link_config: could not get ethtool features for veth0925614
Aug 6 08:08:43 sentry-docker00.cs.umd.edu systemd-udevd[2976735]: Could not set offload features of veth0925614: No such device
Aug 6 08:08:43 sentry-docker00.cs.umd.edu systemd-udevd[2976825]: Could not generate persistent MAC address for vethc99d3de: No such file or directory
Aug 6 08:08:43 sentry-docker00.cs.umd.edu systemd-udevd[2976826]: Could not generate persistent MAC address for veth0f45f30: No such file or directory
Aug 6 08:08:43 sentry-docker00.cs.umd.edu systemd-udevd[2976829]: Could not generate persistent MAC address for vethd365f68: No such file or directory
Aug 6 08:08:43 sentry-docker00.cs.umd.edu systemd-udevd[2976837]: Could not generate persistent MAC address for veth996ef66: No such file or directory
Aug 6 08:08:43 sentry-docker00.cs.umd.edu systemd-udevd[2976839]: Could not generate persistent MAC address for veth478290d: No such file or directory
Aug 6 08:08:43 sentry-docker00.cs.umd.edu systemd-udevd[2976838]: Could not generate persistent MAC address for veth0b91301: No such file or directory
Aug 6 08:08:43 sentry-docker00.cs.umd.edu systemd-udevd[2976829]: Could not generate persistent MAC address for vethc58768c: No such file or directory
Aug 6 08:08:43 sentry-docker00.cs.umd.edu systemd-udevd[2976839]: Could not generate persistent MAC address for vethbb30b31: No such file or directory
Aug 6 08:08:43 sentry-docker00.cs.umd.edu systemd-udevd[2976840]: Could not generate persistent MAC address for vethd6518f0: No such file or directory
Aug 6 08:08:43 sentry-docker00.cs.umd.edu systemd-udevd[2976838]: Could not generate persistent MAC address for vethb6dec0e: No such file or directory
Aug 6 08:28:51 sentry-docker00.cs.umd.edu systemd-udevd[2986265]: link_config: could not get ethtool features for vethb6dec0e
Aug 6 08:28:51 sentry-docker00.cs.umd.edu systemd-udevd[2986265]: Could not set offload features of vethb6dec0e: No such device
Aug 6 08:28:51 sentry-docker00.cs.umd.edu systemd-udevd[2986295]: Could not generate persistent MAC address for vethf9a0e41: No such file or directory
Aug 6 08:28:51 sentry-docker00.cs.umd.edu systemd-udevd[2986296]: Could not generate persistent MAC address for vethaa45d7d: No such file or directory
Aug 6 08:28:51 sentry-docker00.cs.umd.edu systemd-udevd[2986321]: Could not generate persistent MAC address for vethfc5a0b4: No such file or directory
Aug 6 08:28:51 sentry-docker00.cs.umd.edu systemd-udevd[2986322]: Could not generate persistent MAC address for vethb712bdd: No such file or directory
Aug 6 08:28:51 sentry-docker00.cs.umd.edu systemd-udevd[2986340]: Could not generate persistent MAC address for vethdee256c: No such file or directory
Aug 6 08:28:51 sentry-docker00.cs.umd.edu systemd-udevd[2986325]: Could not generate persistent MAC address for veth03cd492: No such file or directory
Aug 6 08:28:51 sentry-docker00.cs.umd.edu systemd-udevd[2986361]: Could not generate persistent MAC address for veth477e4eb: No such file or directory
Aug 6 08:28:51 sentry-docker00.cs.umd.edu systemd-udevd[2986357]: Could not generate persistent MAC address for veth04a6ddc: No such file or directory
Aug 6 08:28:51 sentry-docker00.cs.umd.edu systemd-udevd[2986425]: Could not generate persistent MAC address for veth9fe4704: No such file or directory
Aug 6 08:28:51 sentry-docker00.cs.umd.edu systemd-udevd[2986406]: Could not generate persistent MAC address for veth1752cf3: No such file or directory
Aug 6 08:48:59 sentry-docker00.cs.umd.edu systemd-udevd[2995673]: link_config: could not get ethtool features for veth1752cf3
Aug 6 08:48:59 sentry-docker00.cs.umd.edu systemd-udevd[2995673]: Could not set offload features of veth1752cf3: No such device
Aug 6 08:49:00 sentry-docker00.cs.umd.edu systemd-udevd[2995706]: Could not generate persistent MAC address for veth9c59d53: No such file or directory
Aug 6 08:49:00 sentry-docker00.cs.umd.edu systemd-udevd[2995707]: Could not generate persistent MAC address for veth90eb80e: No such file or directory
Aug 6 08:49:00 sentry-docker00.cs.umd.edu systemd-udevd[2995710]: Could not generate persistent MAC address for vetha8f6516: No such file or directory
Aug 6 08:49:00 sentry-docker00.cs.umd.edu systemd-udevd[2995711]: Could not generate persistent MAC address for veth4f61472: No such file or directory
... 6 more distinct messages not shown
== smokeping-slave (1 distinct, 1 total) ==
Aug 6 08:58:11 smokeping-slave nologin[995837]: Attempted login by UNKNOWN (UID: 65534) on UNKNOWN
== strawberry (2 distinct, 8 total) ==
Aug 6 08:09:44 strawberry udisksd[1067]: Error performing housekeeping for drive /org/freedesktop/UDisks2/drives/ST2000DM001_1CH164_W1E8J5KJ: Error updating SMART data: Error sending ATA command CHECK POWER MODE: Unexpected sense data returned:#0120000: 00 00 00 00 00 00 00 00 00 00 00 00 00 00 00 00 ................#0120010: 00 00 00 00 00 00 00 00 00 00 00 00 00 00 00 00 ................#012 (g-io-error-quark, 0) [x6]
Aug 6 08:34:42 strawberry smartd[5314]: Device: /dev/sda [SAT], failed to read SMART Attribute Data [x2]
== submit26-b9-4 (9 distinct, 9 total) ==
Aug 6 08:15:30 submit26-b9-4 setroubleshoot[1173231]: SELinux is preventing /usr/bin/python3.9 from create access on the directory /(null). For complete SELinux messages run: sealert -l a4e66030-8621-4da9-bd27-5988bb1bf8ad
Aug 6 08:15:30 submit26-b9-4 setroubleshoot[1173231]: SELinux is preventing /usr/bin/python3.9 from add_name access on the directory /(null). For complete SELinux messages run: sealert -l c055e37d-bbf5-4800-9083-d606f792c8c1
Aug 6 08:15:30 submit26-b9-4 setroubleshoot[1173231]: SELinux is preventing /usr/bin/python3.9 from create access on the file /(null). For complete SELinux messages run: sealert -l e5bc3a56-6d6f-4776-954f-ddde1579648f
Aug 6 08:15:30 submit26-b9-4 setroubleshoot[1173231]: SELinux is preventing /usr/bin/python3.9 from open access on the file /tmp/libdnf.tG4raV/repodata/repomd.xml. For complete SELinux messages run: sealert -l a8ec5e1b-49f9-4fbc-a8ae-22e800f7abf2
Aug 6 08:15:30 submit26-b9-4 setroubleshoot[1173231]: SELinux is preventing /usr/bin/python3.9 from setattr access on the file repomd.xml. For complete SELinux messages run: sealert -l 945db714-d0c0-4402-911e-932978b8b036
Aug 6 08:15:30 submit26-b9-4 setroubleshoot[1173231]: SELinux is preventing /usr/bin/python3.9 from read access on the directory libdnf.tG4raV. For complete SELinux messages run: sealert -l 463998a0-fb0d-463c-82b1-471135710a14
Aug 6 08:15:30 submit26-b9-4 setroubleshoot[1173231]: SELinux is preventing /usr/bin/python3.9 from remove_name access on the directory repomd.xml. For complete SELinux messages run: sealert -l 473d2e21-15d8-407a-a9ee-2b842607fa00
Aug 6 08:15:30 submit26-b9-4 setroubleshoot[1173231]: SELinux is preventing /usr/bin/python3.9 from unlink access on the file repomd.xml. For complete SELinux messages run: sealert -l 80c54d4f-bf4b-4501-addb-1627383587d0
Aug 6 08:15:30 submit26-b9-4 setroubleshoot[1173231]: SELinux is preventing /usr/bin/python3.9 from rmdir access on the directory repodata. For complete SELinux messages run: sealert -l c63d3890-151e-49a0-83f0-3dfb69d051e5
== wraith (9 distinct, 17 total) ==
Aug 6 08:30:24 wraith tracker-miner-f[1293618]: tracker_indexing_tree_remove: assertion 'TRACKER_IS_INDEXING_TREE (tree)' failed [x3]
Aug 6 08:31:46 wraith kernel: ......ready
Aug 6 08:31:46 wraith kernel: sd 9:0:0:0: [sde] No Caching mode page found [x3]
Aug 6 08:31:46 wraith kernel: sd 9:0:0:0: [sde] Assuming drive cache: write through [x3]
Aug 6 08:31:46 wraith udisksd[1615]: Error probing device: Error sending ATA command IDENTIFY DEVICE to '/dev/sde': Unexpected sense data returned:#0120000: f0 00 01 00 50 00 00 0a 80 00 00 00 00 1d 00 00 ....P...........#0120010: 00 00 00 00 00 00 00 00 00 00 00 00 00 00 00 00 ................#012 (g-io-error-quark, 0) [x3]
Aug 6 08:33:10 wraith kernel: .....ready
Aug 6 08:34:09 wraith kernel: ....ready
Aug 6 08:54:39 wraith gsd-power[1293244]: Error calling suspend action: GDBus.Error:org.freedesktop.DBus.Error.AccessDenied: Permission denied
Aug 6 09:00:49 wraith kernel: kauditd_printk_skb: 4 callbacks suppressed
1
0
Command: /usr/local/sbin/syslog-digest.py
Time : 0.9159s
Status : exited 0
Output :
Syslog digest — 2026-08-06 08:05 EDT
Processed 7,384 lines, filtered 4,818 (65%). 2,566 unknown (94 distinct) from 18 host(s).
== abuse (3 distinct, 2057 total) ==
Aug 6 07:05:06 abuse rsyslogd[21745]: imjournal: open() failed for path: '/var/lib/rsyslog/imjournal.state.tmp': Input/output error [v8.2404.0 try https://www.rsyslog.com/e/2433 ] [x823]
Aug 6 07:11:11 abuse systemd[1]: Failed to load environment files: Input/output error [x617]
Aug 6 07:11:11 abuse systemd[1]: choria-server.service failed to run 'start' task: Input/output error [x617]
== b0b02.cs.umd.edu (4 distinct, 4 total) ==
Aug 6 07:42:04 b0b02.cs.umd.edu setroubleshoot[3507706]: SELinux is preventing /usr/bin/python3.9 from getattr access on the file /etc/authselect/nsswitch.conf. For complete SELinux messages run: sealert -l 9a1e2952-3fde-4937-a8ab-f7f59791a458
Aug 6 07:42:06 b0b02.cs.umd.edu setroubleshoot[3507706]: SELinux is preventing /usr/bin/python3.9 from read access on the file /etc/authselect/nsswitch.conf. For complete SELinux messages run: sealert -l 97d74423-e027-4cd6-8810-ad80944900b5
Aug 6 07:42:09 b0b02.cs.umd.edu setroubleshoot[3507706]: SELinux is preventing /usr/bin/python3.9 from open access on the file /etc/authselect/nsswitch.conf. For complete SELinux messages run: sealert -l 4f253f6a-62d6-46dd-8eaf-0b4d29df41c6
Aug 6 07:47:35 b0b02.cs.umd.edu rustdesk[3508650]: cannot open display:
== contest (1 distinct, 33 total) ==
Aug 6 07:06:19 contest goferd[1007]: [ERROR][worker-0] gofer.messaging.adapter.connect:33 - connect: proton+amqps://satellite8.cs.umd.edu:5647, failed: Connection amqps://satellite8.cs.umd.edu:5647 disconnected: Condition('proton.pythonio', 'Connection refused to all addresses') [x33]
== csfw00a (2 distinct, 258 total) ==
Aug 6 07:04:45 csfw00a kernel: bnxt_en 0000:09:00.0 eth3: NIC Link is Down [x254]
Aug 6 07:29:07 csfw00a ospf6d[1477]: [EC 100663307] Could not send entire message [x4]
== dojo (2 distinct, 2 total) ==
Aug 6 07:38:24 dojo nologin[1248685]: Attempted login by UNKNOWN (UID: 65534) on UNKNOWN
Aug 6 07:38:35 dojo puppet-agent[1248686]: The current total number of fact values: 17067 exceeds the fact values limit: 10240
== hackerman (7 distinct, 12 total) ==
Aug 6 07:19:01 hackerman gnome-software[2060381]: failed to commit changes to dconf: GDBus.Error:org.gtk.GDBus.UnmappedGError.Quark._g_2dfile_2derror_2dquark.Code2: Failed to create file “/adminhomes/sajith/.config/dconf/user.DAURT3”: Permission denied
Aug 6 07:20:04 hackerman gnome-software[2060381]: can't reliably fixup error code 4 in domain g-io-error-quark: Not a directory [x4]
Aug 6 07:20:13 hackerman gnome-software[2060381]: Only 0 apps for recent list, hiding
Aug 6 07:20:28 hackerman gnome-software[2060381]: failed to commit changes to dconf: GDBus.Error:org.gtk.GDBus.UnmappedGError.Quark._g_2dfile_2derror_2dquark.Code2: Failed to create file “/adminhomes/sajith/.config/dconf/user.DGA0T3”: Permission denied
Aug 6 07:20:29 hackerman packagekitd[184550]: Failed to get cache filename for libreoffice [x2]
Aug 6 07:20:29 hackerman packagekitd[184550]: Failed to get cache filename for kernel [x2]
Aug 6 07:20:39 hackerman packagekitd[184550]: failed to parse public key for /etc/pki/rpm-gpg/RPM-GPG-KEY-PQC-redhat-release
== hazfs.cs.umd.edu (11 distinct, 66 total) ==
Aug 6 07:54:53 hazfs.cs.umd.edu snmpd[1431]: send response: Failure in sendto [x6]
Aug 6 07:54:53 hazfs.cs.umd.edu snmpd[1431]: -- NET-SNMP-EXTEND-MIB::nsExtendStatus."userweb" [x6]
Aug 6 07:54:53 hazfs.cs.umd.edu snmpd[1431]: -- NET-SNMP-EXTEND-MIB::nsExtendStatus."zfslist" [x6]
Aug 6 07:54:53 hazfs.cs.umd.edu snmpd[1431]: -- NET-SNMP-EXTEND-MIB::nsExtendStatus."userhome" [x6]
Aug 6 07:54:53 hazfs.cs.umd.edu snmpd[1431]: -- NET-SNMP-EXTEND-MIB::nsExtendOutput1Line."userweb" [x6]
Aug 6 07:54:53 hazfs.cs.umd.edu snmpd[1431]: -- NET-SNMP-EXTEND-MIB::nsExtendOutput1Line."zfslist" [x6]
Aug 6 07:54:53 hazfs.cs.umd.edu snmpd[1431]: -- NET-SNMP-EXTEND-MIB::nsExtendOutput1Line."userhome" [x6]
Aug 6 07:54:53 hazfs.cs.umd.edu snmpd[1431]: -- NET-SNMP-EXTEND-MIB::nsExtendOutputFull."userweb" [x6]
Aug 6 07:54:53 hazfs.cs.umd.edu snmpd[1431]: -- NET-SNMP-EXTEND-MIB::nsExtendOutputFull."zfslist" [x6]
Aug 6 07:54:53 hazfs.cs.umd.edu snmpd[1431]: -- NET-SNMP-EXTEND-MIB::nsExtendOutputFull."userhome" [x6]
Aug 6 07:54:53 hazfs.cs.umd.edu snmpd[1431]: -- NET-SNMP-EXTEND-MIB::nsExtendOutNumLines."userweb" [x6]
== idm00 (1 distinct, 1 total) ==
Aug 6 07:51:19 idm00 named[1455]: client @0x7f331037fbd8 10.73.240.42#50530: update '73.10.in-addr.arpa/IN' denied
== idmp0 (1 distinct, 1 total) ==
Aug 6 07:36:07 idmp0 named[5198]: client @0x7f993005c168 10.73.240.43#59418: update '73.10.in-addr.arpa/IN' denied
== irb2156 (1 distinct, 1 total) ==
Aug 6 07:29:07 irb2156 systemd-resolved[3398]: Using degraded feature set TCP instead of UDP for DNS server 128.8.76.3.
== itmon02 (1 distinct, 32 total) ==
Aug 6 07:08:04 itmon02 sshd[1750555]: error: beginning MaxStartups throttling [x32]
== newhonors2 (1 distinct, 24 total) ==
Aug 6 07:13:03 newhonors2 dhcpcd[813566]: dhcpcd is not running [x24]
== outbound00.cs.umd.edu (1 distinct, 6 total) ==
Aug 6 07:09:09 outbound00.cs.umd.edu python3[3420171]: ldapdb [x6]
== outbound01.cs.umd.edu (1 distinct, 6 total) ==
Aug 6 07:13:06 outbound01.cs.umd.edu python3[1454988]: ldapdb [x6]
== sentry-docker00.cs.umd.edu (36 distinct, 36 total) ==
Aug 6 07:08:18 sentry-docker00.cs.umd.edu systemd-udevd[2948484]: link_config: could not get ethtool features for veth2e912cf
Aug 6 07:08:18 sentry-docker00.cs.umd.edu systemd-udevd[2948484]: Could not set offload features of veth2e912cf: No such device
Aug 6 07:08:18 sentry-docker00.cs.umd.edu systemd-udevd[2948569]: Could not generate persistent MAC address for veth2c0e3a5: No such file or directory
Aug 6 07:08:18 sentry-docker00.cs.umd.edu systemd-udevd[2948568]: Could not generate persistent MAC address for vethab48ef6: No such file or directory
Aug 6 07:08:18 sentry-docker00.cs.umd.edu systemd-udevd[2948587]: Could not generate persistent MAC address for veth69f86cb: No such file or directory
Aug 6 07:08:18 sentry-docker00.cs.umd.edu systemd-udevd[2948586]: Could not generate persistent MAC address for vetha5bc4f4: No such file or directory
Aug 6 07:08:18 sentry-docker00.cs.umd.edu systemd-udevd[2948584]: Could not generate persistent MAC address for veth7ab4c21: No such file or directory
Aug 6 07:08:18 sentry-docker00.cs.umd.edu systemd-udevd[2948577]: Could not generate persistent MAC address for veth46d3b99: No such file or directory
Aug 6 07:08:18 sentry-docker00.cs.umd.edu systemd-udevd[2948602]: Could not generate persistent MAC address for veth7d41a5a: No such file or directory
Aug 6 07:08:18 sentry-docker00.cs.umd.edu systemd-udevd[2948603]: Could not generate persistent MAC address for veth29db27b: No such file or directory
Aug 6 07:08:18 sentry-docker00.cs.umd.edu systemd-udevd[2948643]: Could not generate persistent MAC address for veth61c0f41: No such file or directory
Aug 6 07:08:18 sentry-docker00.cs.umd.edu systemd-udevd[2948644]: Could not generate persistent MAC address for veth27dac38: No such file or directory
Aug 6 07:28:26 sentry-docker00.cs.umd.edu systemd-udevd[2957936]: link_config: could not get ethtool features for veth7d41a5a
Aug 6 07:28:26 sentry-docker00.cs.umd.edu systemd-udevd[2957936]: Could not set offload features of veth7d41a5a: No such device
Aug 6 07:28:26 sentry-docker00.cs.umd.edu systemd-udevd[2958029]: Could not generate persistent MAC address for veth14a4d78: No such file or directory
Aug 6 07:28:26 sentry-docker00.cs.umd.edu systemd-udevd[2958028]: Could not generate persistent MAC address for veth8a5ae23: No such file or directory
Aug 6 07:28:26 sentry-docker00.cs.umd.edu systemd-udevd[2958032]: Could not generate persistent MAC address for vethc2fb595: No such file or directory
Aug 6 07:28:26 sentry-docker00.cs.umd.edu systemd-udevd[2958033]: Could not generate persistent MAC address for veth5fd9157: No such file or directory
Aug 6 07:28:26 sentry-docker00.cs.umd.edu systemd-udevd[2958056]: Could not generate persistent MAC address for vethdeb7f63: No such file or directory
Aug 6 07:28:26 sentry-docker00.cs.umd.edu systemd-udevd[2958057]: Could not generate persistent MAC address for veth1abd1ea: No such file or directory
Aug 6 07:28:26 sentry-docker00.cs.umd.edu systemd-udevd[2958075]: Could not generate persistent MAC address for veth9ae9b64: No such file or directory
Aug 6 07:28:26 sentry-docker00.cs.umd.edu systemd-udevd[2958060]: Could not generate persistent MAC address for vethabbc2d3: No such file or directory
Aug 6 07:28:26 sentry-docker00.cs.umd.edu systemd-udevd[2958091]: Could not generate persistent MAC address for vethc31b6b6: No such file or directory
Aug 6 07:28:26 sentry-docker00.cs.umd.edu systemd-udevd[2958097]: Could not generate persistent MAC address for veth45376f5: No such file or directory
Aug 6 07:48:34 sentry-docker00.cs.umd.edu systemd-udevd[2967425]: link_config: could not get ethtool features for vethc31b6b6
Aug 6 07:48:34 sentry-docker00.cs.umd.edu systemd-udevd[2967425]: Could not set offload features of vethc31b6b6: No such device
Aug 6 07:48:35 sentry-docker00.cs.umd.edu systemd-udevd[2967456]: Could not generate persistent MAC address for veth928672f: No such file or directory
Aug 6 07:48:35 sentry-docker00.cs.umd.edu systemd-udevd[2967457]: Could not generate persistent MAC address for veth69d8109: No such file or directory
Aug 6 07:48:35 sentry-docker00.cs.umd.edu systemd-udevd[2967460]: Could not generate persistent MAC address for veth8033519: No such file or directory
Aug 6 07:48:35 sentry-docker00.cs.umd.edu systemd-udevd[2967461]: Could not generate persistent MAC address for veth8882260: No such file or directory
... 6 more distinct messages not shown
== strawberry (2 distinct, 8 total) ==
Aug 6 07:09:44 strawberry udisksd[1067]: Error performing housekeeping for drive /org/freedesktop/UDisks2/drives/ST2000DM001_1CH164_W1E8J5KJ: Error updating SMART data: Error sending ATA command CHECK POWER MODE: Unexpected sense data returned:#0120000: 00 00 00 00 00 00 00 00 00 00 00 00 00 00 00 00 ................#0120010: 00 00 00 00 00 00 00 00 00 00 00 00 00 00 00 00 ................#012 (g-io-error-quark, 0) [x6]
Aug 6 07:34:42 strawberry smartd[5314]: Device: /dev/sda [SAT], failed to read SMART Attribute Data [x2]
== submit10-cln25 (1 distinct, 1 total) ==
Aug 6 07:37:00 submit10-cln25 systemd: Failed at step EXEC spawning /usr/local/bin/cronjob: No such file or directory
== wraith (18 distinct, 18 total) ==
Aug 6 07:53:05 wraith pipewire[1292758]: mod.jackdbus-detect: Failed to receive jackdbus reply: org.freedesktop.DBus.Error.ServiceUnknown: The name org.jackaudio.service was not provided by any .service files
Aug 6 07:53:05 wraith gdm3[3035]: Gdm: on_display_added: assertion 'GDM_IS_REMOTE_DISPLAY (display)' failed
Aug 6 07:53:07 wraith at-spi2-registr[1293182]: Failed to register client: GDBus.Error:org.gnome.SessionManager.AlreadyRegistered: Unable to register client
Aug 6 07:53:07 wraith at-spi2-registr[1293182]: Unable to register client with session manager
Aug 6 07:53:07 wraith goa-identity-se[1293486]: GoaKerberosIdentityManager: Using polling for change notification for credential cache type 'KEYRING'
Aug 6 07:53:07 wraith gsd-rfkill[3301]: Error releasing name org.gnome.SettingsDaemon.Rfkill: The connection is closed
Aug 6 07:53:07 wraith gsd-a11y-settin[3334]: Error releasing name org.gnome.SettingsDaemon.A11ySettings: The connection is closed
Aug 6 07:53:07 wraith gsd-datetime[3314]: Error releasing name org.gnome.SettingsDaemon.Datetime: The connection is closed
Aug 6 07:53:07 wraith gsd-housekeepin[3349]: Error releasing name org.gnome.SettingsDaemon.Housekeeping: The connection is closed
Aug 6 07:53:07 wraith gsd-sound[3331]: Error releasing name org.gnome.SettingsDaemon.Sound: The connection is closed
Aug 6 07:53:08 wraith gdm3[3035]: Gdm: on_display_removed: assertion 'GDM_IS_REMOTE_DISPLAY (display)' failed
Aug 6 07:53:49 wraith kernel: ......ready
Aug 6 07:53:50 wraith kernel: sd 9:0:0:0: [sde] No Caching mode page found
Aug 6 07:53:50 wraith kernel: sd 9:0:0:0: [sde] Assuming drive cache: write through
Aug 6 07:53:50 wraith kernel: scsi 9:0:0:1: Wrong diagnostic page; asked for 1 got 8
Aug 6 07:53:50 wraith kernel: scsi 9:0:0:1: Failed to get diagnostic page 0x1
Aug 6 07:53:50 wraith kernel: scsi 9:0:0:1: Failed to bind enclosure -19
Aug 6 07:53:50 wraith udisksd[1615]: Error probing device: Error sending ATA command IDENTIFY DEVICE to '/dev/sde': Unexpected sense data returned:#0120000: f0 00 01 00 50 00 01 0a 80 00 00 00 00 1d 00 00 ....P...........#0120010: 00 00 00 00 00 00 00 00 00 00 00 00 00 00 00 00 ................#012 (g-io-error-quark, 0)
1
0
Command: /usr/local/sbin/syslog-digest.py
Time : 0.5335s
Status : exited 0
Output :
Syslog digest — 2026-08-06 07:05 EDT
Processed 5,121 lines, filtered 4,213 (82%). 908 unknown (140 distinct) from 22 host(s).
== abadi-computer (2 distinct, 2 total) ==
Aug 6 06:15:00 abadi-computer nologin[1809759]: Attempted login by UNKNOWN (UID: 65534) on UNKNOWN
Aug 6 06:15:00 abadi-computer pipewire[1809758]: mod.jackdbus-detect: Failed to receive jackdbus reply: org.freedesktop.DBus.Error.ServiceUnknown: The name org.jackaudio.service was not provided by any .service files
== abuse (1 distinct, 346 total) ==
Aug 6 06:05:06 abuse rsyslogd[21745]: imjournal: open() failed for path: '/var/lib/rsyslog/imjournal.state.tmp': Input/output error [v8.2404.0 try https://www.rsyslog.com/e/2433 ] [x346]
== atif01.cs.umd.edu (20 distinct, 33 total) ==
Aug 6 06:12:49 atif01.cs.umd.edu kernel: net_ratelimit: 10 callbacks suppressed
Aug 6 06:31:25 atif01.cs.umd.edu sshd[22289]: error: maximum authentication attempts exceeded for root from 41.63.0.139 port 62407 ssh2 [preauth]
Aug 6 06:31:25 atif01.cs.umd.edu sshd[22289]: PAM service(sshd) ignoring max retries; 6 > 3 [x14]
Aug 6 06:31:43 atif01.cs.umd.edu sshd[22299]: error: maximum authentication attempts exceeded for root from 41.63.0.139 port 65500 ssh2 [preauth]
Aug 6 06:31:59 atif01.cs.umd.edu sshd[22309]: error: maximum authentication attempts exceeded for root from 41.63.0.139 port 52028 ssh2 [preauth]
Aug 6 06:32:16 atif01.cs.umd.edu sshd[22325]: error: maximum authentication attempts exceeded for root from 41.63.0.139 port 54697 ssh2 [preauth]
Aug 6 06:32:33 atif01.cs.umd.edu sshd[22335]: error: maximum authentication attempts exceeded for root from 41.63.0.139 port 57649 ssh2 [preauth]
Aug 6 06:32:49 atif01.cs.umd.edu sshd[22345]: error: maximum authentication attempts exceeded for root from 41.63.0.139 port 60398 ssh2 [preauth]
Aug 6 06:33:05 atif01.cs.umd.edu sshd[22362]: error: maximum authentication attempts exceeded for root from 41.63.0.139 port 63111 ssh2 [preauth]
Aug 6 06:33:21 atif01.cs.umd.edu sshd[22379]: error: maximum authentication attempts exceeded for root from 41.63.0.139 port 49478 ssh2 [preauth]
Aug 6 06:33:45 atif01.cs.umd.edu sshd[22390]: error: maximum authentication attempts exceeded for root from 41.63.0.139 port 52243 ssh2 [preauth]
Aug 6 06:34:00 atif01.cs.umd.edu sshd[22415]: error: maximum authentication attempts exceeded for root from 41.63.0.139 port 56409 ssh2 [preauth]
Aug 6 06:34:15 atif01.cs.umd.edu sshd[22425]: error: maximum authentication attempts exceeded for root from 41.63.0.139 port 59008 ssh2 [preauth]
Aug 6 06:34:31 atif01.cs.umd.edu sshd[22436]: error: maximum authentication attempts exceeded for root from 41.63.0.139 port 61763 ssh2 [preauth]
Aug 6 06:34:46 atif01.cs.umd.edu sshd[22444]: error: maximum authentication attempts exceeded for root from 41.63.0.139 port 64529 ssh2 [preauth]
Aug 6 06:35:05 atif01.cs.umd.edu sshd[22462]: error: maximum authentication attempts exceeded for root from 41.63.0.139 port 50835 ssh2 [preauth]
Aug 6 06:43:01 atif01.cs.umd.edu xinetd[22606]: warning: can't get client address: Connection reset by peer
Aug 6 06:43:02 atif01.cs.umd.edu kernel: net_ratelimit: 9 callbacks suppressed
Aug 6 06:43:03 atif01.cs.umd.edu kernel: nfsd: peername failed (err 107)!
Aug 6 06:54:15 atif01.cs.umd.edu sshd[22878]: fatal: ssh_packet_get_string: incomplete message [preauth]
== b0b02.cs.umd.edu (4 distinct, 4 total) ==
Aug 6 06:42:00 b0b02.cs.umd.edu setroubleshoot[3491589]: SELinux is preventing /usr/bin/python3.9 from getattr access on the file /etc/authselect/nsswitch.conf. For complete SELinux messages run: sealert -l 9a1e2952-3fde-4937-a8ab-f7f59791a458
Aug 6 06:42:02 b0b02.cs.umd.edu setroubleshoot[3491589]: SELinux is preventing /usr/bin/python3.9 from read access on the file /etc/authselect/nsswitch.conf. For complete SELinux messages run: sealert -l 97d74423-e027-4cd6-8810-ad80944900b5
Aug 6 06:42:05 b0b02.cs.umd.edu setroubleshoot[3491589]: SELinux is preventing /usr/bin/python3.9 from open access on the file /etc/authselect/nsswitch.conf. For complete SELinux messages run: sealert -l 4f253f6a-62d6-46dd-8eaf-0b4d29df41c6
Aug 6 06:47:31 b0b02.cs.umd.edu rustdesk[3492562]: cannot open display:
== contest (1 distinct, 34 total) ==
Aug 6 06:05:37 contest goferd[1007]: [ERROR][worker-0] gofer.messaging.adapter.connect:33 - connect: proton+amqps://satellite8.cs.umd.edu:5647, failed: Connection amqps://satellite8.cs.umd.edu:5647 disconnected: Condition('proton.pythonio', 'Connection refused to all addresses') [x34]
== csfw00a (2 distinct, 292 total) ==
Aug 6 06:05:13 csfw00a kernel: bnxt_en 0000:09:00.0 eth3: NIC Link is Down [x288]
Aug 6 06:22:01 csfw00a ospf6d[1477]: [EC 100663307] Could not send entire message [x4]
== hackerman (9 distinct, 14 total) ==
Aug 6 06:20:04 hackerman gnome-software[2060381]: can't reliably fixup error code 4 in domain g-io-error-quark: Not a directory [x4]
Aug 6 06:20:13 hackerman gnome-software[2060381]: Only 0 apps for recent list, hiding
Aug 6 06:20:33 hackerman packagekitd[170752]: Failed to get cache filename for chromium
Aug 6 06:20:33 hackerman packagekitd[170752]: Failed to get cache filename for chromium-common
Aug 6 06:20:33 hackerman packagekitd[170752]: Failed to get cache filename for libreoffice [x2]
Aug 6 06:20:33 hackerman packagekitd[170752]: Failed to get cache filename for kernel [x2]
Aug 6 06:20:37 hackerman gnome-software[2060381]: failed to commit changes to dconf: GDBus.Error:org.gtk.GDBus.UnmappedGError.Quark._g_2dfile_2derror_2dquark.Code2: Failed to create file “/adminhomes/sajith/.config/dconf/user.KULST3”: Permission denied
Aug 6 06:20:39 hackerman gnome-software[2060381]: failed to commit changes to dconf: GDBus.Error:org.gtk.GDBus.UnmappedGError.Quark._g_2dfile_2derror_2dquark.Code2: Failed to create file “/adminhomes/sajith/.config/dconf/user.7NZPT3”: Permission denied
Aug 6 06:20:45 hackerman packagekitd[170752]: failed to parse public key for /etc/pki/rpm-gpg/RPM-GPG-KEY-PQC-redhat-release
== idm00 (1 distinct, 1 total) ==
Aug 6 06:51:19 idm00 named[1455]: client @0x7f331037de68 10.73.240.42#60634: update '73.10.in-addr.arpa/IN' denied
== idmp0 (1 distinct, 1 total) ==
Aug 6 06:36:07 idmp0 named[5198]: client @0x7f98fc007ab8 10.73.240.43#55330: update '73.10.in-addr.arpa/IN' denied
== inbound00.cs.umd.edu (1 distinct, 1 total) ==
Aug 6 06:06:57 inbound00.cs.umd.edu systemd[1]: Configuration file /usr/lib/systemd/system/authentication_milter.service is marked executable. Please remove executable permission bits. Proceeding anyway.
== inbound01.cs.umd.edu (1 distinct, 1 total) ==
Aug 6 06:17:59 inbound01.cs.umd.edu systemd[1]: Configuration file /usr/lib/systemd/system/authentication_milter.service is marked executable. Please remove executable permission bits. Proceeding anyway.
== itmon02 (1 distinct, 38 total) ==
Aug 6 06:08:13 itmon02 sshd[1750555]: error: beginning MaxStartups throttling [x38]
== krispykreme.cs.umd.edu (3 distinct, 3 total) ==
Aug 6 06:38:51 krispykreme.cs.umd.edu sshd-session[3905735]: pam_access(sshd:auth): access denied for user `admin' from `94.183.187.22'
Aug 6 06:38:51 krispykreme.cs.umd.edu krb5_child[3905737]: Client 'admin(a)UMD.EDU' not found in Kerberos database
Aug 6 06:38:51 krispykreme.cs.umd.edu sshd-session[3905733]: error: PAM: System error for admin from 94.183.187.22
== matrix (2 distinct, 3 total) ==
Aug 6 06:25:00 matrix krb5_child[3330090]: Client 'admin(a)UMD.EDU' not found in Kerberos database [x2]
Aug 6 06:25:02 matrix sshd[3330083]: error: PAM: Authentication failure for admin from 94.183.187.22
== neodontcare.cs.umd.edu (5 distinct, 6 total) ==
Aug 6 06:13:30 neodontcare.cs.umd.edu gnome-software[7556]: Only 0 apps for recent list, hiding
Aug 6 06:13:34 neodontcare.cs.umd.edu packagekitd[2868022]: Failed to get cache filename for gnu-free-mono-fonts
Aug 6 06:13:34 neodontcare.cs.umd.edu packagekitd[2868022]: Failed to get cache filename for gnu-free-serif-fonts
Aug 6 06:13:34 neodontcare.cs.umd.edu packagekitd[2868022]: Failed to get cache filename for libreoffice [x2]
Aug 6 06:13:38 neodontcare.cs.umd.edu packagekitd[2868022]: failed to parse public key for /etc/pki/rpm-gpg/RPM-GPG-KEY-PQC-redhat-release
== newhonors2 (38 distinct, 65 total) ==
Aug 6 06:13:03 newhonors2 dhcpcd[805031]: dhcpcd is not running [x28]
Aug 6 06:48:19 newhonors2 puppet-agent[806192]: Could not update: Execution of '/usr/bin/apt-get -q -y -o DPkg::Options::=--force-confold --force-yes install openvox-agent=8.27.0-1+ubuntu24.04' returned 100: Reading package lists...
Aug 6 06:48:19 newhonors2 puppet-agent[806192]: Building dependency tree...
Aug 6 06:48:19 newhonors2 puppet-agent[806192]: Reading state information...
Aug 6 06:48:19 newhonors2 puppet-agent[806192]: Package openvox-agent is not available, but is referred to by another package.
Aug 6 06:48:19 newhonors2 puppet-agent[806192]: This may mean that the package is missing, has been obsoleted, or
Aug 6 06:48:19 newhonors2 puppet-agent[806192]: is only available from another source
Aug 6 06:48:19 newhonors2 puppet-agent[806192]:
Aug 6 06:48:19 newhonors2 puppet-agent[806192]: W: --force-yes is deprecated, use one of the options starting with --allow instead.
Aug 6 06:48:19 newhonors2 puppet-agent[806192]: E: Version '8.27.0-1+ubuntu24.04' for 'openvox-agent' was not found
Aug 6 06:48:19 newhonors2 puppet-agent[806192]: (/Stage[main]/Puppet::Agent::Install/Package[openvox-agent]/ensure) change from '7.37.2-1+ubuntu24.04' to '8.27.0-1+ubuntu24.04' failed: Could not update: Execution of '/usr/bin/apt-get -q -y -o DPkg::Options::=--force-confold --force-yes install openvox-agent=8.27.0-1+ubuntu24.04' returned 100: Reading package lists...
Aug 6 06:48:19 newhonors2 puppet-agent[806192]: (/Stage[main]/Puppet::Agent::Install/Package[openvox-agent]/ensure) Building dependency tree...
Aug 6 06:48:19 newhonors2 puppet-agent[806192]: (/Stage[main]/Puppet::Agent::Install/Package[openvox-agent]/ensure) Reading state information...
Aug 6 06:48:19 newhonors2 puppet-agent[806192]: (/Stage[main]/Puppet::Agent::Install/Package[openvox-agent]/ensure) Package openvox-agent is not available, but is referred to by another package.
Aug 6 06:48:19 newhonors2 puppet-agent[806192]: (/Stage[main]/Puppet::Agent::Install/Package[openvox-agent]/ensure) This may mean that the package is missing, has been obsoleted, or
Aug 6 06:48:19 newhonors2 puppet-agent[806192]: (/Stage[main]/Puppet::Agent::Install/Package[openvox-agent]/ensure) is only available from another source
Aug 6 06:48:19 newhonors2 puppet-agent[806192]: (/Stage[main]/Puppet::Agent::Install/Package[openvox-agent]/ensure)
Aug 6 06:48:19 newhonors2 puppet-agent[806192]: (/Stage[main]/Puppet::Agent::Install/Package[openvox-agent]/ensure) W: --force-yes is deprecated, use one of the options starting with --allow instead.
Aug 6 06:48:19 newhonors2 puppet-agent[806192]: (/Stage[main]/Puppet::Agent::Install/Package[openvox-agent]/ensure) E: Version '8.27.0-1+ubuntu24.04' for 'openvox-agent' was not found
Aug 6 06:48:43 newhonors2 puppet-agent[806192]: (/Stage[main]/Puppet::Agent::Config/Puppet::Config::Agent[classfile]/Puppet::Config::Entry[agent_classfile]/Concat::Fragment[puppet.conf_agent]/Concat_fragment[puppet.conf_agent]) Skipping because of failed dependencies
Aug 6 06:48:43 newhonors2 puppet-agent[806192]: (/Stage[main]/Puppet::Agent::Config/Puppet::Config::Agent[classfile]/Puppet::Config::Entry[agent_classfile]/Concat::Fragment[puppet.conf_agent_end]/Concat_fragment[puppet.conf_agent_end]) Skipping because of failed dependencies
Aug 6 06:48:43 newhonors2 puppet-agent[806192]: (/Stage[main]/Puppet::Agent::Config/Puppet::Config::Agent[classfile]/Puppet::Config::Entry[agent_classfile]/Concat::Fragment[puppet.conf_agent_classfile]/Concat_fragment[puppet.conf_agent_classfile]) Skipping because of failed dependencies
Aug 6 06:48:43 newhonors2 puppet-agent[806192]: (/Stage[main]/Puppet::Agent::Config/Puppet::Config::Agent[default_schedules]/Puppet::Config::Entry[agent_default_schedules]/Concat::Fragment[puppet.conf_agent_default_schedules]/Concat_fragment[puppet.conf_agent_default_schedules]) Skipping because of failed dependencies
Aug 6 06:48:43 newhonors2 puppet-agent[806192]: (/Stage[main]/Puppet::Agent::Config/Puppet::Config::Agent[report]/Puppet::Config::Entry[agent_report]/Concat::Fragment[puppet.conf_agent_report]/Concat_fragment[puppet.conf_agent_report]) Skipping because of failed dependencies
Aug 6 06:48:43 newhonors2 puppet-agent[806192]: (/Stage[main]/Puppet::Agent::Config/Puppet::Config::Agent[masterport]/Puppet::Config::Entry[agent_masterport]/Concat::Fragment[puppet.conf_agent_masterport]/Concat_fragment[puppet.conf_agent_masterport]) Skipping because of failed dependencies
Aug 6 06:48:43 newhonors2 puppet-agent[806192]: (/Stage[main]/Puppet::Agent::Config/Puppet::Config::Agent[splay]/Puppet::Config::Entry[agent_splay]/Concat::Fragment[puppet.conf_agent_splay]/Concat_fragment[puppet.conf_agent_splay]) Skipping because of failed dependencies
Aug 6 06:48:43 newhonors2 puppet-agent[806192]: (/Stage[main]/Puppet::Agent::Config/Puppet::Config::Agent[splaylimit]/Puppet::Config::Entry[agent_splaylimit]/Concat::Fragment[puppet.conf_agent_splaylimit]/Concat_fragment[puppet.conf_agent_splaylimit]) Skipping because of failed dependencies
Aug 6 06:48:43 newhonors2 puppet-agent[806192]: (/Stage[main]/Puppet::Agent::Config/Puppet::Config::Agent[runinterval]/Puppet::Config::Entry[agent_runinterval]/Concat::Fragment[puppet.conf_agent_runinterval]/Concat_fragment[puppet.conf_agent_runinterval]) Skipping because of failed dependencies
Aug 6 06:48:43 newhonors2 puppet-agent[806192]: (/Stage[main]/Puppet::Agent::Config/Puppet::Config::Agent[noop]/Puppet::Config::Entry[agent_noop]/Concat::Fragment[puppet.conf_agent_noop]/Concat_fragment[puppet.conf_agent_noop]) Skipping because of failed dependencies
Aug 6 06:48:43 newhonors2 puppet-agent[806192]: (/Stage[main]/Puppet::Agent::Config/Puppet::Config::Agent[usecacheonfailure]/Puppet::Config::Entry[agent_usecacheonfailure]/Concat::Fragment[puppet.conf_agent_usecacheonfailure]/Concat_fragment[puppet.conf_agent_usecacheonfailure]) Skipping because of failed dependencies
... 8 more distinct messages not shown
== orchids (5 distinct, 5 total) ==
Aug 6 06:11:31 orchids gnome-software[1516991]: Only 0 apps for recent list, hiding
Aug 6 06:11:39 orchids packagekitd[4088063]: Failed to get cache filename for libreoffice
Aug 6 06:11:39 orchids packagekitd[4088063]: Failed to get cache filename for chromium
Aug 6 06:11:39 orchids packagekitd[4088063]: Failed to get cache filename for chromium-common
Aug 6 06:11:44 orchids packagekitd[4088063]: failed to parse public key for /etc/pki/rpm-gpg/RPM-GPG-KEY-PQC-redhat-release
== outbound00.cs.umd.edu (1 distinct, 6 total) ==
Aug 6 06:09:09 outbound00.cs.umd.edu python3[3405720]: ldapdb [x6]
== outbound01.cs.umd.edu (1 distinct, 6 total) ==
Aug 6 06:13:06 outbound01.cs.umd.edu python3[1440587]: ldapdb [x6]
== sentry-docker00.cs.umd.edu (36 distinct, 36 total) ==
Aug 6 06:07:53 sentry-docker00.cs.umd.edu systemd-udevd[2919288]: link_config: could not get ethtool features for vethb274a78
Aug 6 06:07:53 sentry-docker00.cs.umd.edu systemd-udevd[2919288]: Could not set offload features of vethb274a78: No such device
Aug 6 06:07:53 sentry-docker00.cs.umd.edu systemd-udevd[2919356]: Could not generate persistent MAC address for vethd45739f: No such file or directory
Aug 6 06:07:53 sentry-docker00.cs.umd.edu systemd-udevd[2919357]: Could not generate persistent MAC address for vethbf444f3: No such file or directory
Aug 6 06:07:53 sentry-docker00.cs.umd.edu systemd-udevd[2919360]: Could not generate persistent MAC address for veth18e3b69: No such file or directory
Aug 6 06:07:53 sentry-docker00.cs.umd.edu systemd-udevd[2919361]: Could not generate persistent MAC address for veth69a4b93: No such file or directory
Aug 6 06:07:53 sentry-docker00.cs.umd.edu systemd-udevd[2919371]: Could not generate persistent MAC address for vethfb7e39a: No such file or directory
Aug 6 06:07:53 sentry-docker00.cs.umd.edu systemd-udevd[2919360]: Could not generate persistent MAC address for vethc2f5e58: No such file or directory
Aug 6 06:07:53 sentry-docker00.cs.umd.edu systemd-udevd[2919356]: Could not generate persistent MAC address for veth19b6822: No such file or directory
Aug 6 06:07:53 sentry-docker00.cs.umd.edu systemd-udevd[2919371]: Could not generate persistent MAC address for veth1798971: No such file or directory
Aug 6 06:07:53 sentry-docker00.cs.umd.edu systemd-udevd[2919371]: Could not generate persistent MAC address for veth4a7f40d: No such file or directory
Aug 6 06:07:53 sentry-docker00.cs.umd.edu systemd-udevd[2919360]: Could not generate persistent MAC address for veth7276e50: No such file or directory
Aug 6 06:28:01 sentry-docker00.cs.umd.edu systemd-udevd[2928750]: Could not generate persistent MAC address for veth9db16f9: No such file or directory
Aug 6 06:28:01 sentry-docker00.cs.umd.edu systemd-udevd[2928751]: Could not generate persistent MAC address for veth6141092: No such file or directory
Aug 6 06:28:01 sentry-docker00.cs.umd.edu systemd-udevd[2928776]: Could not generate persistent MAC address for vethbc465ad: No such file or directory
Aug 6 06:28:01 sentry-docker00.cs.umd.edu systemd-udevd[2928778]: Could not generate persistent MAC address for veth423ba82: No such file or directory
Aug 6 06:28:01 sentry-docker00.cs.umd.edu systemd-udevd[2928780]: Could not generate persistent MAC address for veth28462f6: No such file or directory
Aug 6 06:28:01 sentry-docker00.cs.umd.edu systemd-udevd[2928795]: Could not generate persistent MAC address for vethceff6f8: No such file or directory
Aug 6 06:28:01 sentry-docker00.cs.umd.edu systemd-udevd[2928801]: Could not generate persistent MAC address for vethae1c280: No such file or directory
Aug 6 06:28:01 sentry-docker00.cs.umd.edu systemd-udevd[2928785]: Could not generate persistent MAC address for vethed6ac77: No such file or directory
Aug 6 06:28:01 sentry-docker00.cs.umd.edu systemd-udevd[2928885]: Could not generate persistent MAC address for vethd390251: No such file or directory
Aug 6 06:28:01 sentry-docker00.cs.umd.edu systemd-udevd[2928886]: Could not generate persistent MAC address for veth377e581: No such file or directory
Aug 6 06:48:09 sentry-docker00.cs.umd.edu systemd-udevd[2939135]: link_config: could not get ethtool features for veth9db16f9
Aug 6 06:48:09 sentry-docker00.cs.umd.edu systemd-udevd[2939135]: Could not set offload features of veth9db16f9: No such device
Aug 6 06:48:09 sentry-docker00.cs.umd.edu systemd-udevd[2939140]: link_config: could not get ethtool features for vethae1c280
Aug 6 06:48:09 sentry-docker00.cs.umd.edu systemd-udevd[2939140]: Could not set offload features of vethae1c280: No such device
Aug 6 06:48:10 sentry-docker00.cs.umd.edu systemd-udevd[2939173]: Could not generate persistent MAC address for veth0606977: No such file or directory
Aug 6 06:48:10 sentry-docker00.cs.umd.edu systemd-udevd[2939174]: Could not generate persistent MAC address for vethaf43f0f: No such file or directory
Aug 6 06:48:10 sentry-docker00.cs.umd.edu systemd-udevd[2939177]: Could not generate persistent MAC address for veth9cfcdd1: No such file or directory
Aug 6 06:48:10 sentry-docker00.cs.umd.edu systemd-udevd[2939178]: Could not generate persistent MAC address for veth5ccb5b2: No such file or directory
... 6 more distinct messages not shown
== strawberry (4 distinct, 10 total) ==
Aug 6 06:09:44 strawberry udisksd[1067]: Error performing housekeeping for drive /org/freedesktop/UDisks2/drives/ST2000DM001_1CH164_W1E8J5KJ: Error updating SMART data: Error sending ATA command CHECK POWER MODE: Unexpected sense data returned:#0120000: 00 00 00 00 00 00 00 00 00 00 00 00 00 00 00 00 ................#0120010: 00 00 00 00 00 00 00 00 00 00 00 00 00 00 00 00 ................#012 (g-io-error-quark, 0) [x6]
Aug 6 06:31:00 strawberry nologin[3669118]: Attempted login by UNKNOWN (UID: 65534) on UNKNOWN
Aug 6 06:31:01 strawberry pipewire[3669117]: mod.jackdbus-detect: Failed to receive jackdbus reply: org.freedesktop.DBus.Error.ServiceUnknown: The name org.jackaudio.service was not provided by any .service files
Aug 6 06:34:42 strawberry smartd[5314]: Device: /dev/sda [SAT], failed to read SMART Attribute Data [x2]
== tlsrpt (1 distinct, 1 total) ==
Aug 6 06:38:03 tlsrpt (httpd)[751010]: httpd.service: Referenced but unset environment variable evaluates to an empty string: OPTIONS
1
0
Command: /usr/local/sbin/syslog-digest.py
Time : 0.4984s
Status : exited 0
Output :
Syslog digest — 2026-08-06 06:05 EDT
Processed 4,343 lines, filtered 3,574 (82%). 769 unknown (100 distinct) from 23 host(s).
== abuse (1 distinct, 346 total) ==
Aug 6 05:05:06 abuse rsyslogd[21745]: imjournal: open() failed for path: '/var/lib/rsyslog/imjournal.state.tmp': Input/output error [v8.2404.0 try https://www.rsyslog.com/e/2433 ] [x346]
== b0b02.cs.umd.edu (4 distinct, 4 total) ==
Aug 6 05:41:55 b0b02.cs.umd.edu setroubleshoot[3476492]: SELinux is preventing /usr/bin/python3.9 from getattr access on the file /etc/authselect/nsswitch.conf. For complete SELinux messages run: sealert -l 9a1e2952-3fde-4937-a8ab-f7f59791a458
Aug 6 05:41:58 b0b02.cs.umd.edu setroubleshoot[3476492]: SELinux is preventing /usr/bin/python3.9 from read access on the file /etc/authselect/nsswitch.conf. For complete SELinux messages run: sealert -l 97d74423-e027-4cd6-8810-ad80944900b5
Aug 6 05:42:01 b0b02.cs.umd.edu setroubleshoot[3476492]: SELinux is preventing /usr/bin/python3.9 from open access on the file /etc/authselect/nsswitch.conf. For complete SELinux messages run: sealert -l 4f253f6a-62d6-46dd-8eaf-0b4d29df41c6
Aug 6 05:47:28 b0b02.cs.umd.edu rustdesk[3477467]: cannot open display:
== bachata (1 distinct, 2 total) ==
Aug 6 05:48:06 bachata setroubleshoot[2547425]: SELinux is preventing /usr/sbin/smbd from name_bind access on the udp_socket port 628. For complete SELinux messages run: sealert -l 8f7247f1-69a5-4a62-a4f0-88a324bfd75c [x2]
== contest (10 distinct, 43 total) ==
Aug 6 05:06:42 contest goferd[1007]: [ERROR][worker-0] gofer.messaging.adapter.connect:33 - connect: proton+amqps://satellite8.cs.umd.edu:5647, failed: Connection amqps://satellite8.cs.umd.edu:5647 disconnected: Condition('proton.pythonio', 'Connection refused to all addresses') [x33]
Aug 6 05:48:18 contest setroubleshoot[711480]: SELinux is preventing /usr/libexec/platform-python3.6 from create access on the directory libdnf.TS2JdO. For complete SELinux messages run: sealert -l cb6b25c6-4765-4cf2-88a0-9b3b508e94e9
Aug 6 05:48:18 contest setroubleshoot[711480]: SELinux is preventing /usr/bin/gpgconf from add_name access on the directory repodata. For complete SELinux messages run: sealert -l 41cf7b1b-0f34-4609-98f2-b66e7825fef7
Aug 6 05:48:19 contest setroubleshoot[711480]: SELinux is preventing /usr/libexec/platform-python3.6 from create access on the file mirrorlist. For complete SELinux messages run: sealert -l fc20ff92-ea83-4f38-a24b-ddfd737a3141
Aug 6 05:48:19 contest setroubleshoot[711480]: SELinux is preventing /usr/libexec/platform-python3.6 from setattr access on the file repomd.xml. For complete SELinux messages run: sealert -l ac675631-fa35-4e93-adc9-b692b18e53e5
Aug 6 05:48:19 contest setroubleshoot[711480]: SELinux is preventing /usr/bin/gpgconf from add_name access on the directory repomd.xml.asc. For complete SELinux messages run: sealert -l 41cf7b1b-0f34-4609-98f2-b66e7825fef7
Aug 6 05:48:19 contest setroubleshoot[711480]: SELinux is preventing /usr/libexec/platform-python3.6 from read access on the directory libdnf.TS2JdO. For complete SELinux messages run: sealert -l 45d103b6-0810-4890-a705-990118577ce8
Aug 6 05:48:19 contest setroubleshoot[711480]: SELinux is preventing /usr/libexec/platform-python3.6 from remove_name access on the directory repomd.xml. For complete SELinux messages run: sealert -l 7e499113-2fd7-4f67-bec6-3521efbe3637 [x2]
Aug 6 05:48:19 contest setroubleshoot[711480]: SELinux is preventing /usr/libexec/platform-python3.6 from rmdir access on the directory repodata. For complete SELinux messages run: sealert -l 3928930b-a1ed-448d-950b-0665ac2adef8
Aug 6 05:48:21 contest setroubleshoot[711480]: SELinux is preventing /usr/libexec/platform-python3.6 from create access on the directory libdnf.dugtFo. For complete SELinux messages run: sealert -l cb6b25c6-4765-4cf2-88a0-9b3b508e94e9
== csfw00a (1 distinct, 224 total) ==
Aug 6 05:04:24 csfw00a kernel: bnxt_en 0000:09:00.0 eth3: NIC Link is Down [x224]
== frabjous (2 distinct, 2 total) ==
Aug 6 05:46:00 frabjous krb5_child[3344643]: Client 'admin(a)UMD.EDU' not found in Kerberos database
Aug 6 05:46:02 frabjous sshd-session[3344639]: error: PAM: Authentication failure for admin from 94.183.187.22
== grades01.cs.umd.edu (1 distinct, 1 total) ==
Aug 6 05:48:40 grades01.cs.umd.edu puppet-agent[32273]: The directory '/srv/grades' contains 2471 entries, which exceeds the default soft limit 1000 and may cause excessive resource consumption and degraded performance. To remove this warning set a value for `max_files` parameter or consider using an alternate method to manage large directory trees
== hackerman (1 distinct, 1 total) ==
Aug 6 05:19:01 hackerman gnome-software[2060381]: failed to commit changes to dconf: GDBus.Error:org.gtk.GDBus.UnmappedGError.Quark._g_2dfile_2derror_2dquark.Code2: Failed to create file “/adminhomes/sajith/.config/dconf/user.5JPST3”: Permission denied
== idm00 (1 distinct, 1 total) ==
Aug 6 05:51:19 idm00 named[1455]: client @0x7f330c467a48 10.73.240.42#54528: update '73.10.in-addr.arpa/IN' denied
== idmp0 (1 distinct, 1 total) ==
Aug 6 05:36:07 idmp0 named[5198]: client @0x7f99000dfeb8 10.73.240.43#55356: update '73.10.in-addr.arpa/IN' denied
== inbound00.cs.umd.edu (1 distinct, 1 total) ==
Aug 6 05:32:32 inbound00.cs.umd.edu cockpit-ws[3445756]: /usr/share/cockpit/static/login.js/favicon.ico: Failed to open file “/usr/share/cockpit/static/login.js/favicon.ico”: open() failed: Not a directory
== inbound01.cs.umd.edu (2 distinct, 4 total) ==
Aug 6 05:32:33 inbound01.cs.umd.edu cockpit-ws[1460148]: /usr/share/cockpit/static/login.js/favicon.ico: Failed to open file “/usr/share/cockpit/static/login.js/favicon.ico”: open() failed: Not a directory [x3]
Aug 6 05:41:51 inbound01.cs.umd.edu krb5_child[1462132]: Client 'admin(a)UMD.EDU' not found in Kerberos database
== itmon02 (1 distinct, 22 total) ==
Aug 6 05:13:06 itmon02 sshd[1750555]: error: beginning MaxStartups throttling [x22]
== newhonors2 (1 distinct, 24 total) ==
Aug 6 05:13:02 newhonors2 dhcpcd[803189]: dhcpcd is not running [x24]
== outbound00.cs.umd.edu (2 distinct, 8 total) ==
Aug 6 05:09:09 outbound00.cs.umd.edu python3[3391602]: ldapdb [x6]
Aug 6 05:30:31 outbound00.cs.umd.edu cockpit-ws[3397005]: /usr/share/cockpit/static/login.js/favicon.ico: Failed to open file “/usr/share/cockpit/static/login.js/favicon.ico”: open() failed: Not a directory [x2]
== outbound01.cs.umd.edu (3 distinct, 11 total) ==
Aug 6 05:08:24 outbound01.cs.umd.edu python3[1424683]: ldapdb [x7]
Aug 6 05:09:31 outbound01.cs.umd.edu systemd[1]: Configuration file /usr/lib/systemd/system/authentication_milter.service is marked executable. Please remove executable permission bits. Proceeding anyway.
Aug 6 06:03:35 outbound01.cs.umd.edu cockpit-ws[1438441]: /usr/share/cockpit/static/login.js/favicon.ico: Failed to open file “/usr/share/cockpit/static/login.js/favicon.ico”: open() failed: Not a directory [x3]
== sentry-docker00.cs.umd.edu (34 distinct, 34 total) ==
Aug 6 05:07:28 sentry-docker00.cs.umd.edu systemd-udevd[2890797]: link_config: could not get ethtool features for veth14f3274
Aug 6 05:07:28 sentry-docker00.cs.umd.edu systemd-udevd[2890797]: Could not set offload features of veth14f3274: No such device
Aug 6 05:07:28 sentry-docker00.cs.umd.edu systemd-udevd[2890826]: Could not generate persistent MAC address for vethefb9944: No such file or directory
Aug 6 05:07:28 sentry-docker00.cs.umd.edu systemd-udevd[2890827]: Could not generate persistent MAC address for veth0dfbfeb: No such file or directory
Aug 6 05:07:28 sentry-docker00.cs.umd.edu systemd-udevd[2890834]: Could not generate persistent MAC address for vethd630ad5: No such file or directory
Aug 6 05:07:28 sentry-docker00.cs.umd.edu systemd-udevd[2890832]: Could not generate persistent MAC address for vethafd54d5: No such file or directory
Aug 6 05:07:28 sentry-docker00.cs.umd.edu systemd-udevd[2890832]: Could not generate persistent MAC address for veth0461a8a: No such file or directory
Aug 6 05:07:28 sentry-docker00.cs.umd.edu systemd-udevd[2890826]: Could not generate persistent MAC address for veth7342480: No such file or directory
Aug 6 05:07:28 sentry-docker00.cs.umd.edu systemd-udevd[2890858]: Could not generate persistent MAC address for veth724fc30: No such file or directory
Aug 6 05:07:28 sentry-docker00.cs.umd.edu systemd-udevd[2890859]: Could not generate persistent MAC address for vethbea723a: No such file or directory
Aug 6 05:07:28 sentry-docker00.cs.umd.edu systemd-udevd[2890889]: Could not generate persistent MAC address for veth735f062: No such file or directory
Aug 6 05:07:28 sentry-docker00.cs.umd.edu systemd-udevd[2890891]: Could not generate persistent MAC address for veth68fa6e5: No such file or directory
Aug 6 05:27:36 sentry-docker00.cs.umd.edu systemd-udevd[2900439]: Could not generate persistent MAC address for vethaa8b90d: No such file or directory
Aug 6 05:27:36 sentry-docker00.cs.umd.edu systemd-udevd[2900440]: Could not generate persistent MAC address for veth00bb72a: No such file or directory
Aug 6 05:27:36 sentry-docker00.cs.umd.edu systemd-udevd[2900464]: Could not generate persistent MAC address for veth9329151: No such file or directory
Aug 6 05:27:36 sentry-docker00.cs.umd.edu systemd-udevd[2900465]: Could not generate persistent MAC address for veth12e6897: No such file or directory
Aug 6 05:27:36 sentry-docker00.cs.umd.edu systemd-udevd[2900483]: Could not generate persistent MAC address for veth2f1736d: No such file or directory
Aug 6 05:27:36 sentry-docker00.cs.umd.edu systemd-udevd[2900478]: Could not generate persistent MAC address for veth2578c4b: No such file or directory
Aug 6 05:27:36 sentry-docker00.cs.umd.edu systemd-udevd[2900492]: Could not generate persistent MAC address for veth2a01fcd: No such file or directory
Aug 6 05:27:36 sentry-docker00.cs.umd.edu systemd-udevd[2900493]: Could not generate persistent MAC address for vethd70ac0b: No such file or directory
Aug 6 05:27:36 sentry-docker00.cs.umd.edu systemd-udevd[2900533]: Could not generate persistent MAC address for veth1dd58af: No such file or directory
Aug 6 05:27:36 sentry-docker00.cs.umd.edu systemd-udevd[2900536]: Could not generate persistent MAC address for vethc9bff15: No such file or directory
Aug 6 05:47:44 sentry-docker00.cs.umd.edu systemd-udevd[2909887]: link_config: could not set ethtool features for veth2f1736d
Aug 6 05:47:44 sentry-docker00.cs.umd.edu systemd-udevd[2909887]: Could not set offload features of veth2f1736d: Operation not permitted
Aug 6 05:47:45 sentry-docker00.cs.umd.edu systemd-udevd[2909917]: Could not generate persistent MAC address for veth339529c: No such file or directory
Aug 6 05:47:45 sentry-docker00.cs.umd.edu systemd-udevd[2909918]: Could not generate persistent MAC address for veth33c4554: No such file or directory
Aug 6 05:47:45 sentry-docker00.cs.umd.edu systemd-udevd[2909929]: Could not generate persistent MAC address for vethb274a78: No such file or directory
Aug 6 05:47:45 sentry-docker00.cs.umd.edu systemd-udevd[2909942]: Could not generate persistent MAC address for veth8522892: No such file or directory
Aug 6 05:47:45 sentry-docker00.cs.umd.edu systemd-udevd[2909938]: Could not generate persistent MAC address for veth2087767: No such file or directory
Aug 6 05:47:45 sentry-docker00.cs.umd.edu systemd-udevd[2909929]: Could not generate persistent MAC address for veth23c93ce: No such file or directory
... 4 more distinct messages not shown
== strawberry (2 distinct, 8 total) ==
Aug 6 05:09:44 strawberry udisksd[1067]: Error performing housekeeping for drive /org/freedesktop/UDisks2/drives/ST2000DM001_1CH164_W1E8J5KJ: Error updating SMART data: Error sending ATA command CHECK POWER MODE: Unexpected sense data returned:#0120000: 00 00 00 00 00 00 00 00 00 00 00 00 00 00 00 00 ................#0120010: 00 00 00 00 00 00 00 00 00 00 00 00 00 00 00 00 ................#012 (g-io-error-quark, 0) [x6]
Aug 6 05:34:42 strawberry smartd[5314]: Device: /dev/sda [SAT], failed to read SMART Attribute Data [x2]
== submit26-b9-2 (9 distinct, 9 total) ==
Aug 6 05:12:53 submit26-b9-2 setroubleshoot[1139706]: SELinux is preventing /usr/bin/python3.9 from create access on the directory /(null). For complete SELinux messages run: sealert -l d506243c-d61e-48f3-b42a-4592c913deb0
Aug 6 05:12:53 submit26-b9-2 setroubleshoot[1139706]: SELinux is preventing /usr/bin/python3.9 from add_name access on the directory /(null). For complete SELinux messages run: sealert -l 3b4752ac-1b9a-4af9-a05b-32e4c2eb13ab
Aug 6 05:12:53 submit26-b9-2 setroubleshoot[1139706]: SELinux is preventing /usr/bin/python3.9 from create access on the file /(null). For complete SELinux messages run: sealert -l 29e5adbd-4381-4467-b40d-a2219101e096
Aug 6 05:12:53 submit26-b9-2 setroubleshoot[1139706]: SELinux is preventing /usr/bin/python3.9 from open access on the file /tmp/libdnf.n3dp7N/repodata/repomd.xml. For complete SELinux messages run: sealert -l 1b38f2ec-01ce-4343-8059-ba7494ecc5c4
Aug 6 05:12:53 submit26-b9-2 setroubleshoot[1139706]: SELinux is preventing /usr/bin/python3.9 from setattr access on the file repomd.xml. For complete SELinux messages run: sealert -l e5f9af40-1f63-4924-b012-27ab2a7b2266
Aug 6 05:12:53 submit26-b9-2 setroubleshoot[1139706]: SELinux is preventing /usr/bin/python3.9 from read access on the directory libdnf.n3dp7N. For complete SELinux messages run: sealert -l 5c54db87-54a3-4a7c-97b4-b5c48d6c3543
Aug 6 05:12:53 submit26-b9-2 setroubleshoot[1139706]: SELinux is preventing /usr/bin/python3.9 from remove_name access on the directory repomd.xml. For complete SELinux messages run: sealert -l 63cd60e1-1e61-4276-afea-dd8526ffe8b2
Aug 6 05:12:53 submit26-b9-2 setroubleshoot[1139706]: SELinux is preventing /usr/bin/python3.9 from unlink access on the file repomd.xml. For complete SELinux messages run: sealert -l 81c7e9ec-e023-4c6d-b1ad-c02a242e655e
Aug 6 05:12:53 submit26-b9-2 setroubleshoot[1139706]: SELinux is preventing /usr/bin/python3.9 from rmdir access on the directory repodata. For complete SELinux messages run: sealert -l 6ae9a597-e123-4d74-8eec-a8ebe0f5e4d0
== submit26-b9-3 (9 distinct, 9 total) ==
Aug 6 05:20:39 submit26-b9-3 setroubleshoot[871781]: SELinux is preventing /usr/bin/python3.9 from create access on the directory /(null). For complete SELinux messages run: sealert -l 5b912a44-22fd-4560-b201-2a4e289b73f5
Aug 6 05:20:39 submit26-b9-3 setroubleshoot[871781]: SELinux is preventing /usr/bin/python3.9 from add_name access on the directory /(null). For complete SELinux messages run: sealert -l 7f1df1e4-725e-4953-98eb-1079f908f543
Aug 6 05:20:39 submit26-b9-3 setroubleshoot[871781]: SELinux is preventing /usr/bin/python3.9 from create access on the file /(null). For complete SELinux messages run: sealert -l 40b8852a-f77b-44b4-affe-5f11fa33de43
Aug 6 05:20:39 submit26-b9-3 setroubleshoot[871781]: SELinux is preventing /usr/bin/python3.9 from open access on the file /tmp/libdnf.aWCusx/repodata/repomd.xml. For complete SELinux messages run: sealert -l 45a8019e-f6b5-4baa-92c1-862594b40d46
Aug 6 05:20:39 submit26-b9-3 setroubleshoot[871781]: SELinux is preventing /usr/bin/python3.9 from setattr access on the file repomd.xml. For complete SELinux messages run: sealert -l e9f0bfff-7784-4126-baa4-2bb06da56591
Aug 6 05:20:39 submit26-b9-3 setroubleshoot[871781]: SELinux is preventing /usr/bin/python3.9 from read access on the directory libdnf.aWCusx. For complete SELinux messages run: sealert -l 0b17cc3d-cdc6-4fe2-a11f-3892e7c41dc7
Aug 6 05:20:39 submit26-b9-3 setroubleshoot[871781]: SELinux is preventing /usr/bin/python3.9 from remove_name access on the directory repomd.xml. For complete SELinux messages run: sealert -l 10e38c64-b65f-4cdd-901e-4375652d9a42
Aug 6 05:20:39 submit26-b9-3 setroubleshoot[871781]: SELinux is preventing /usr/bin/python3.9 from unlink access on the file repomd.xml. For complete SELinux messages run: sealert -l 7fd9cf72-ef38-48e1-b6aa-b571b26a7b22
Aug 6 05:20:39 submit26-b9-3 setroubleshoot[871781]: SELinux is preventing /usr/bin/python3.9 from rmdir access on the directory repodata. For complete SELinux messages run: sealert -l b9b11116-89bd-4a3c-980c-1d422c5dcee4
== submit26-clnb9 (9 distinct, 9 total) ==
Aug 6 05:31:58 submit26-clnb9 setroubleshoot[1867748]: SELinux is preventing /usr/bin/python3.9 from create access on the directory /(null). For complete SELinux messages run: sealert -l 6783ed2b-5ae4-42b5-975a-4bf50eec4658
Aug 6 05:31:58 submit26-clnb9 setroubleshoot[1867748]: SELinux is preventing /usr/bin/python3.9 from add_name access on the directory /(null). For complete SELinux messages run: sealert -l 9e7fa955-cc30-4804-ac8c-e1779e85946c
Aug 6 05:31:58 submit26-clnb9 setroubleshoot[1867748]: SELinux is preventing /usr/bin/python3.9 from create access on the file /(null). For complete SELinux messages run: sealert -l 69bfa6e3-089c-40ff-9563-fd30787d0774
Aug 6 05:31:58 submit26-clnb9 setroubleshoot[1867748]: SELinux is preventing /usr/bin/python3.9 from open access on the file /tmp/libdnf.VW6DvJ/repodata/repomd.xml. For complete SELinux messages run: sealert -l 001acdb5-31ef-4e52-b10b-90f467a89ddc
Aug 6 05:31:58 submit26-clnb9 setroubleshoot[1867748]: SELinux is preventing /usr/bin/python3.9 from setattr access on the file repomd.xml. For complete SELinux messages run: sealert -l edacddcf-16ed-4dc3-8d82-7c597d5dee23
Aug 6 05:31:58 submit26-clnb9 setroubleshoot[1867748]: SELinux is preventing /usr/bin/python3.9 from read access on the directory libdnf.VW6DvJ. For complete SELinux messages run: sealert -l 62b3782e-4730-4488-8178-94dafe9b552c
Aug 6 05:31:58 submit26-clnb9 setroubleshoot[1867748]: SELinux is preventing /usr/bin/python3.9 from remove_name access on the directory repomd.xml. For complete SELinux messages run: sealert -l 81cb3698-78f8-440a-8e3c-e5d1041e6b78
Aug 6 05:31:58 submit26-clnb9 setroubleshoot[1867748]: SELinux is preventing /usr/bin/python3.9 from unlink access on the file repomd.xml. For complete SELinux messages run: sealert -l 792b472a-115c-4799-9805-fc7436f916b9
Aug 6 05:31:58 submit26-clnb9 setroubleshoot[1867748]: SELinux is preventing /usr/bin/python3.9 from rmdir access on the directory repodata. For complete SELinux messages run: sealert -l 15c83a86-837b-41e2-b662-b39cd4e361cb
== talkhosts9 (1 distinct, 2 total) ==
Aug 6 05:09:32 talkhosts9 setroubleshoot[1598656]: SELinux is preventing /usr/bin/lsof from getattr access on the unix_stream_socket unix_stream_socket. For complete SELinux messages run: sealert -l a6df89b3-c497-469c-8232-c4fde0508abf [x2]
== updates00.cs.umd.edu (3 distinct, 3 total) ==
Aug 6 05:18:31 updates00.cs.umd.edu puppet-agent[17062]: Could not retrieve catalog from remote server: Error 500 on SERVER: Server Error: Function lookup() did not find a value for the name 'vault::kerberos' on node updates00.cs.umd.edu
Aug 6 05:18:31 updates00.cs.umd.edu puppet-agent[17062]: Not using cache on failed catalog
Aug 6 05:18:31 updates00.cs.umd.edu puppet-agent[17062]: Could not retrieve catalog; skipping run
1
0
Command: /usr/local/sbin/syslog-digest.py
Time : 0.4990s
Status : exited 0
Output :
Syslog digest — 2026-08-06 05:05 EDT
Processed 4,562 lines, filtered 3,799 (83%). 763 unknown (89 distinct) from 22 host(s).
== abadi-computer (2 distinct, 2 total) ==
Aug 6 04:15:01 abadi-computer nologin[1794714]: Attempted login by UNKNOWN (UID: 65534) on UNKNOWN
Aug 6 04:15:01 abadi-computer pipewire[1794711]: mod.jackdbus-detect: Failed to receive jackdbus reply: org.freedesktop.DBus.Error.ServiceUnknown: The name org.jackaudio.service was not provided by any .service files
== abuse (1 distinct, 346 total) ==
Aug 6 04:05:06 abuse rsyslogd[21745]: imjournal: open() failed for path: '/var/lib/rsyslog/imjournal.state.tmp': Input/output error [v8.2404.0 try https://www.rsyslog.com/e/2433 ] [x346]
== atif01.cs.umd.edu (1 distinct, 1 total) ==
Aug 6 05:04:04 atif01.cs.umd.edu kernel: net_ratelimit: 12 callbacks suppressed
== b0b02.cs.umd.edu (4 distinct, 4 total) ==
Aug 6 04:41:51 b0b02.cs.umd.edu setroubleshoot[3461408]: SELinux is preventing /usr/bin/python3.9 from getattr access on the file /etc/authselect/nsswitch.conf. For complete SELinux messages run: sealert -l 9a1e2952-3fde-4937-a8ab-f7f59791a458
Aug 6 04:41:54 b0b02.cs.umd.edu setroubleshoot[3461408]: SELinux is preventing /usr/bin/python3.9 from read access on the file /etc/authselect/nsswitch.conf. For complete SELinux messages run: sealert -l 97d74423-e027-4cd6-8810-ad80944900b5
Aug 6 04:41:57 b0b02.cs.umd.edu setroubleshoot[3461408]: SELinux is preventing /usr/bin/python3.9 from open access on the file /etc/authselect/nsswitch.conf. For complete SELinux messages run: sealert -l 4f253f6a-62d6-46dd-8eaf-0b4d29df41c6
Aug 6 04:47:25 b0b02.cs.umd.edu rustdesk[3462385]: cannot open display:
== biggulp.cs.umd.edu (3 distinct, 3 total) ==
Aug 6 04:23:28 biggulp.cs.umd.edu sshd-session[3307866]: pam_access(sshd:auth): access denied for user `admin' from `94.183.187.22'
Aug 6 04:23:28 biggulp.cs.umd.edu krb5_child[3307868]: Client 'admin(a)UMD.EDU' not found in Kerberos database
Aug 6 04:23:28 biggulp.cs.umd.edu sshd-session[3307864]: error: PAM: System error for admin from 94.183.187.22
== contest (1 distinct, 34 total) ==
Aug 6 04:06:00 contest goferd[1007]: [ERROR][worker-0] gofer.messaging.adapter.connect:33 - connect: proton+amqps://satellite8.cs.umd.edu:5647, failed: Connection amqps://satellite8.cs.umd.edu:5647 disconnected: Condition('proton.pythonio', 'Connection refused to all addresses') [x34]
== csfw00a (1 distinct, 226 total) ==
Aug 6 04:04:38 csfw00a kernel: bnxt_en 0000:09:00.0 eth3: NIC Link is Down [x226]
== dojo (1 distinct, 1 total) ==
Aug 6 04:15:24 dojo nologin[1228254]: Attempted login by UNKNOWN (UID: 65534) on UNKNOWN
== forge00 (1 distinct, 1 total) ==
Aug 6 04:09:02 forge00 (httpd)[2027577]: httpd.service: Referenced but unset environment variable evaluates to an empty string: OPTIONS
== idm00 (1 distinct, 1 total) ==
Aug 6 04:51:18 idm00 named[1455]: client @0x7f33103836b8 10.73.240.42#55385: update '73.10.in-addr.arpa/IN' denied
== idmp0 (1 distinct, 1 total) ==
Aug 6 04:36:07 idmp0 named[5198]: client @0x7f9908000cc8 10.73.240.43#57630: update '73.10.in-addr.arpa/IN' denied
== inbound00.cs.umd.edu (1 distinct, 1 total) ==
Aug 6 04:09:21 inbound00.cs.umd.edu krb5_child[3425801]: Client 'admin(a)UMD.EDU' not found in Kerberos database
== itmon02 (1 distinct, 32 total) ==
Aug 6 04:08:05 itmon02 sshd[1750555]: error: beginning MaxStartups throttling [x32]
== matrix (11 distinct, 12 total) ==
Aug 6 04:23:59 matrix systemd[1]: networkd-dispatcher.service: Got notification message from PID 3260559, but reception only permitted for main PID 720
Aug 6 04:23:59 matrix systemd[1]: networkd-dispatcher.service: Got notification message from PID 3260572, but reception only permitted for main PID 720
Aug 6 04:24:07 matrix systemd[1]: networkd-dispatcher.service: Got notification message from PID 3260704, but reception only permitted for main PID 720
Aug 6 04:24:07 matrix systemd[1]: networkd-dispatcher.service: Got notification message from PID 3260710, but reception only permitted for main PID 720
Aug 6 04:24:07 matrix networkctl[3260723]: Interface "vethbb30bf9" not found.
Aug 6 04:24:08 matrix systemd[1]: networkd-dispatcher.service: Got notification message from PID 3260779, but reception only permitted for main PID 720
Aug 6 04:24:08 matrix systemd[1]: networkd-dispatcher.service: Got notification message from PID 3260792, but reception only permitted for main PID 720
Aug 6 04:24:17 matrix systemd[1]: networkd-dispatcher.service: Got notification message from PID 3260895, but reception only permitted for main PID 720
Aug 6 04:24:17 matrix systemd[1]: networkd-dispatcher.service: Got notification message from PID 3260901, but reception only permitted for main PID 720
Aug 6 04:24:17 matrix networkctl[3260913]: Interface "vethe5f6624" not found.
Aug 6 04:24:17 matrix systemd[1]: networkd-dispatcher.service: Got notification message from PID 3260913, but reception only permitted for main PID 720 [x2]
== netman.cs.umd.edu (4 distinct, 4 total) ==
Aug 6 04:30:01 netman.cs.umd.edu setroubleshoot[1376608]: SELinux is preventing /usr/bin/gpg from read access on the file gpg.conf. For complete SELinux messages run: sealert -l 019ad1da-a874-4814-8037-3b3e5f413ad2
Aug 6 04:30:02 netman.cs.umd.edu setroubleshoot[1376608]: SELinux is preventing /usr/bin/gpg from open access on the file /root/.gnupg/gpg.conf. For complete SELinux messages run: sealert -l cb54177e-d44c-46a1-b246-5c0bbb8343be
Aug 6 04:30:02 netman.cs.umd.edu setroubleshoot[1376608]: SELinux is preventing /usr/bin/gpg from getattr access on the file /root/.gnupg/gpg.conf. For complete SELinux messages run: sealert -l fbba2e30-b7ab-491c-9ec6-f553e9ef72af
Aug 6 04:41:30 netman.cs.umd.edu sshd[1379868]: error: PAM: Authentication failure for sshd from 122.187.227.152
== newhonors2 (1 distinct, 24 total) ==
Aug 6 04:13:03 newhonors2 dhcpcd[801319]: dhcpcd is not running [x24]
== outbound00.cs.umd.edu (1 distinct, 6 total) ==
Aug 6 04:09:09 outbound00.cs.umd.edu python3[3377652]: ldapdb [x6]
== outbound01.cs.umd.edu (1 distinct, 6 total) ==
Aug 6 04:13:06 outbound01.cs.umd.edu python3[1411519]: ldapdb [x6]
== sentry-docker00.cs.umd.edu (38 distinct, 38 total) ==
Aug 6 04:07:03 sentry-docker00.cs.umd.edu systemd-udevd[2862407]: link_config: could not get ethtool features for veth15d9cbf
Aug 6 04:07:03 sentry-docker00.cs.umd.edu systemd-udevd[2862407]: Could not set offload features of veth15d9cbf: No such device
Aug 6 04:07:03 sentry-docker00.cs.umd.edu systemd-udevd[2862435]: Could not generate persistent MAC address for veth087a328: No such file or directory
Aug 6 04:07:03 sentry-docker00.cs.umd.edu systemd-udevd[2862436]: Could not generate persistent MAC address for vetha028ad4: No such file or directory
Aug 6 04:07:03 sentry-docker00.cs.umd.edu systemd-udevd[2862461]: Could not generate persistent MAC address for veth117a660: No such file or directory
Aug 6 04:07:03 sentry-docker00.cs.umd.edu systemd-udevd[2862462]: Could not generate persistent MAC address for veth7902f0e: No such file or directory
Aug 6 04:07:03 sentry-docker00.cs.umd.edu systemd-udevd[2862487]: Could not generate persistent MAC address for veth741a7dc: No such file or directory
Aug 6 04:07:03 sentry-docker00.cs.umd.edu systemd-udevd[2862488]: Could not generate persistent MAC address for vethf2bb0e2: No such file or directory
Aug 6 04:07:03 sentry-docker00.cs.umd.edu systemd-udevd[2862487]: Could not generate persistent MAC address for vetha1af088: No such file or directory
Aug 6 04:07:03 sentry-docker00.cs.umd.edu systemd-udevd[2862510]: Could not generate persistent MAC address for veth48d952c: No such file or directory
Aug 6 04:07:03 sentry-docker00.cs.umd.edu systemd-udevd[2862499]: Could not generate persistent MAC address for veth15fe071: No such file or directory
Aug 6 04:07:03 sentry-docker00.cs.umd.edu systemd-udevd[2862510]: Could not generate persistent MAC address for vethff07072: No such file or directory
Aug 6 04:27:11 sentry-docker00.cs.umd.edu systemd-udevd[2871910]: link_config: could not get ethtool features for veth087a328
Aug 6 04:27:11 sentry-docker00.cs.umd.edu systemd-udevd[2871910]: Could not set offload features of veth087a328: No such device
Aug 6 04:27:11 sentry-docker00.cs.umd.edu systemd-udevd[2871945]: Could not generate persistent MAC address for veth288d6a8: No such file or directory
Aug 6 04:27:11 sentry-docker00.cs.umd.edu systemd-udevd[2871946]: Could not generate persistent MAC address for veth71d4f47: No such file or directory
Aug 6 04:27:11 sentry-docker00.cs.umd.edu systemd-udevd[2871949]: Could not generate persistent MAC address for veth34bb73b: No such file or directory
Aug 6 04:27:11 sentry-docker00.cs.umd.edu systemd-udevd[2871950]: Could not generate persistent MAC address for vetha107dae: No such file or directory
Aug 6 04:27:11 sentry-docker00.cs.umd.edu systemd-udevd[2871967]: Could not generate persistent MAC address for veth868dec5: No such file or directory
Aug 6 04:27:11 sentry-docker00.cs.umd.edu systemd-udevd[2871945]: Could not generate persistent MAC address for vethaba402b: No such file or directory
Aug 6 04:27:11 sentry-docker00.cs.umd.edu systemd-udevd[2871967]: Could not generate persistent MAC address for vetha367946: No such file or directory
Aug 6 04:27:11 sentry-docker00.cs.umd.edu systemd-udevd[2871950]: Could not generate persistent MAC address for vethfd39c39: No such file or directory
Aug 6 04:27:11 sentry-docker00.cs.umd.edu systemd-udevd[2871984]: Could not generate persistent MAC address for vethc74d234: No such file or directory
Aug 6 04:27:11 sentry-docker00.cs.umd.edu systemd-udevd[2871988]: Could not generate persistent MAC address for veth3d4311e: No such file or directory
Aug 6 04:47:19 sentry-docker00.cs.umd.edu systemd-udevd[2881232]: link_config: could not get ethtool features for vethfd39c39
Aug 6 04:47:19 sentry-docker00.cs.umd.edu systemd-udevd[2881232]: Could not set offload features of vethfd39c39: No such device
Aug 6 04:47:19 sentry-docker00.cs.umd.edu systemd-udevd[2881282]: link_config: could not get ethtool features for vethc74d234
Aug 6 04:47:19 sentry-docker00.cs.umd.edu systemd-udevd[2881282]: Could not set offload features of vethc74d234: No such device
Aug 6 04:47:20 sentry-docker00.cs.umd.edu systemd-udevd[2881341]: Could not generate persistent MAC address for vethe25195e: No such file or directory
Aug 6 04:47:20 sentry-docker00.cs.umd.edu systemd-udevd[2881339]: Could not generate persistent MAC address for veth5984efe: No such file or directory
... 8 more distinct messages not shown
== smokeping-slave (1 distinct, 1 total) ==
Aug 6 04:15:01 smokeping-slave nologin[973036]: Attempted login by UNKNOWN (UID: 65534) on UNKNOWN
== strawberry (4 distinct, 10 total) ==
Aug 6 04:09:44 strawberry udisksd[1067]: Error performing housekeeping for drive /org/freedesktop/UDisks2/drives/ST2000DM001_1CH164_W1E8J5KJ: Error updating SMART data: Error sending ATA command CHECK POWER MODE: Unexpected sense data returned:#0120000: 00 00 00 00 00 00 00 00 00 00 00 00 00 00 00 00 ................#0120010: 00 00 00 00 00 00 00 00 00 00 00 00 00 00 00 00 ................#012 (g-io-error-quark, 0) [x6]
Aug 6 04:15:00 strawberry nologin[3663192]: Attempted login by UNKNOWN (UID: 65534) on UNKNOWN
Aug 6 04:15:00 strawberry pipewire[3663191]: mod.jackdbus-detect: Failed to receive jackdbus reply: org.freedesktop.DBus.Error.ServiceUnknown: The name org.jackaudio.service was not provided by any .service files
Aug 6 04:34:42 strawberry smartd[5314]: Device: /dev/sda [SAT], failed to read SMART Attribute Data [x2]
== submit26-b9-4 (9 distinct, 9 total) ==
Aug 6 04:16:25 submit26-b9-4 setroubleshoot[1163498]: SELinux is preventing /usr/bin/python3.9 from create access on the directory /(null). For complete SELinux messages run: sealert -l a4e66030-8621-4da9-bd27-5988bb1bf8ad
Aug 6 04:16:25 submit26-b9-4 setroubleshoot[1163498]: SELinux is preventing /usr/bin/python3.9 from add_name access on the directory /(null). For complete SELinux messages run: sealert -l c055e37d-bbf5-4800-9083-d606f792c8c1
Aug 6 04:16:25 submit26-b9-4 setroubleshoot[1163498]: SELinux is preventing /usr/bin/python3.9 from create access on the file /(null). For complete SELinux messages run: sealert -l e5bc3a56-6d6f-4776-954f-ddde1579648f
Aug 6 04:16:25 submit26-b9-4 setroubleshoot[1163498]: SELinux is preventing /usr/bin/python3.9 from open access on the file /tmp/libdnf.g8nveZ/repodata/repomd.xml. For complete SELinux messages run: sealert -l a8ec5e1b-49f9-4fbc-a8ae-22e800f7abf2
Aug 6 04:16:25 submit26-b9-4 setroubleshoot[1163498]: SELinux is preventing /usr/bin/python3.9 from setattr access on the file repomd.xml. For complete SELinux messages run: sealert -l 945db714-d0c0-4402-911e-932978b8b036
Aug 6 04:16:25 submit26-b9-4 setroubleshoot[1163498]: SELinux is preventing /usr/bin/python3.9 from read access on the directory libdnf.g8nveZ. For complete SELinux messages run: sealert -l 463998a0-fb0d-463c-82b1-471135710a14
Aug 6 04:16:25 submit26-b9-4 setroubleshoot[1163498]: SELinux is preventing /usr/bin/python3.9 from remove_name access on the directory repomd.xml. For complete SELinux messages run: sealert -l 473d2e21-15d8-407a-a9ee-2b842607fa00
Aug 6 04:16:25 submit26-b9-4 setroubleshoot[1163498]: SELinux is preventing /usr/bin/python3.9 from unlink access on the file repomd.xml. For complete SELinux messages run: sealert -l 80c54d4f-bf4b-4501-addb-1627383587d0
Aug 6 04:16:25 submit26-b9-4 setroubleshoot[1163498]: SELinux is preventing /usr/bin/python3.9 from rmdir access on the directory repodata. For complete SELinux messages run: sealert -l c63d3890-151e-49a0-83f0-3dfb69d051e5
1
0
Command: /usr/local/sbin/syslog-digest.py
Time : 0.4710s
Status : exited 0
Output :
Syslog digest — 2026-08-06 04:05 EDT
Processed 3,958 lines, filtered 3,236 (81%). 722 unknown (61 distinct) from 19 host(s).
== abuse (1 distinct, 347 total) ==
Aug 6 03:05:06 abuse rsyslogd[21745]: imjournal: open() failed for path: '/var/lib/rsyslog/imjournal.state.tmp': Input/output error [v8.2404.0 try https://www.rsyslog.com/e/2433 ] [x347]
== b0b02.cs.umd.edu (4 distinct, 4 total) ==
Aug 6 03:41:47 b0b02.cs.umd.edu setroubleshoot[3446014]: SELinux is preventing /usr/bin/python3.9 from getattr access on the file /etc/authselect/nsswitch.conf. For complete SELinux messages run: sealert -l 9a1e2952-3fde-4937-a8ab-f7f59791a458
Aug 6 03:41:49 b0b02.cs.umd.edu setroubleshoot[3446014]: SELinux is preventing /usr/bin/python3.9 from read access on the file /etc/authselect/nsswitch.conf. For complete SELinux messages run: sealert -l 97d74423-e027-4cd6-8810-ad80944900b5
Aug 6 03:41:52 b0b02.cs.umd.edu setroubleshoot[3446014]: SELinux is preventing /usr/bin/python3.9 from open access on the file /etc/authselect/nsswitch.conf. For complete SELinux messages run: sealert -l 4f253f6a-62d6-46dd-8eaf-0b4d29df41c6
Aug 6 03:47:21 b0b02.cs.umd.edu rustdesk[3446985]: cannot open display:
== bachata (1 distinct, 1 total) ==
Aug 6 03:47:34 bachata setroubleshoot[2542191]: SELinux is preventing /usr/sbin/smbd from name_bind access on the udp_socket port 628. For complete SELinux messages run: sealert -l 8f7247f1-69a5-4a62-a4f0-88a324bfd75c
== contest (1 distinct, 34 total) ==
Aug 6 03:05:18 contest goferd[1007]: [ERROR][worker-0] gofer.messaging.adapter.connect:33 - connect: proton+amqps://satellite8.cs.umd.edu:5647, failed: Connection amqps://satellite8.cs.umd.edu:5647 disconnected: Condition('proton.pythonio', 'Connection refused to all addresses') [x34]
== csfw00a (2 distinct, 206 total) ==
Aug 6 03:04:27 csfw00a kernel: bnxt_en 0000:09:00.0 eth3: NIC Link is Down [x202]
Aug 6 03:17:34 csfw00a ospf6d[1477]: [EC 100663307] Could not send entire message [x4]
== frabjous (3 distinct, 3 total) ==
Aug 6 03:08:17 frabjous krb5_child[3325214]: Client 'admin(a)UMD.EDU' not found in Kerberos database
Aug 6 03:08:19 frabjous sshd-session[3325210]: error: PAM: Authentication failure for admin from 35.241.231.49
Aug 6 03:08:39 frabjous sshd-session[3325231]: error: Protocol major versions differ: 2 vs. 1
== hackerman (1 distinct, 1 total) ==
Aug 6 03:19:01 hackerman gnome-software[2060381]: failed to commit changes to dconf: GDBus.Error:org.gtk.GDBus.UnmappedGError.Quark._g_2dfile_2derror_2dquark.Code2: Failed to create file “/adminhomes/sajith/.config/dconf/user.ERFVT3”: Permission denied
== idm00 (1 distinct, 1 total) ==
Aug 6 03:51:18 idm00 named[1455]: client @0x7f3310201ff8 10.73.240.42#60595: update '73.10.in-addr.arpa/IN' denied
== idmp0 (1 distinct, 1 total) ==
Aug 6 03:36:07 idmp0 named[5198]: client @0x7f99000dfeb8 10.73.240.43#55677: update '73.10.in-addr.arpa/IN' denied
== inbound01.cs.umd.edu (2 distinct, 2 total) ==
Aug 6 03:16:50 inbound01.cs.umd.edu krb5_child[1427849]: Client 'admin(a)UMD.EDU' not found in Kerberos database
Aug 6 03:17:10 inbound01.cs.umd.edu sshd-session[1427856]: error: Protocol major versions differ: 2 vs. 1
== itmon02 (2 distinct, 38 total) ==
Aug 6 03:08:12 itmon02 sshd[1750555]: error: beginning MaxStartups throttling [x37]
Aug 6 03:15:03 itmon02 (httpd)[1382051]: httpd.service: Referenced but unset environment variable evaluates to an empty string: OPTIONS
== kadath.cs.umd.edu (1 distinct, 1 total) ==
Aug 6 03:47:08 kadath.cs.umd.edu puppet-agent[2329808]: (Facter) invalid or malformed lldp data: MalformedDataError: no lldp interface data found
== munin (2 distinct, 4 total) ==
Aug 6 03:48:10 munin sudo[2476545]: pam_systemd(sudo:session): Failed to stat() runtime directory '/run/user/0': No such file or directory [x2]
Aug 6 03:48:10 munin sudo[2476545]: pam_systemd(sudo:session): Not setting $XDG_RUNTIME_DIR, as the directory is not in order. [x2]
== netbox (1 distinct, 1 total) ==
Aug 6 03:08:02 netbox (httpd)[1884893]: httpd.service: Referenced but unset environment variable evaluates to an empty string: OPTIONS
== newhonors2 (1 distinct, 24 total) ==
Aug 6 03:13:03 newhonors2 dhcpcd[799475]: dhcpcd is not running [x24]
== outbound00.cs.umd.edu (2 distinct, 8 total) ==
Aug 6 03:09:09 outbound00.cs.umd.edu python3[3363093]: ldapdb [x7]
Aug 6 03:24:23 outbound00.cs.umd.edu systemd[1]: Configuration file /usr/lib/systemd/system/authentication_milter.service is marked executable. Please remove executable permission bits. Proceeding anyway.
== outbound01.cs.umd.edu (1 distinct, 6 total) ==
Aug 6 03:13:06 outbound01.cs.umd.edu python3[1397666]: ldapdb [x6]
== sentry-docker00.cs.umd.edu (32 distinct, 32 total) ==
Aug 6 03:06:38 sentry-docker00.cs.umd.edu systemd-udevd[2834009]: link_config: could not get ethtool features for veth23db48f
Aug 6 03:06:38 sentry-docker00.cs.umd.edu systemd-udevd[2834009]: Could not set offload features of veth23db48f: No such device
Aug 6 03:06:38 sentry-docker00.cs.umd.edu systemd-udevd[2834096]: Could not generate persistent MAC address for vethbb6c558: No such file or directory
Aug 6 03:06:38 sentry-docker00.cs.umd.edu systemd-udevd[2834097]: Could not generate persistent MAC address for veth7e33555: No such file or directory
Aug 6 03:06:38 sentry-docker00.cs.umd.edu systemd-udevd[2834100]: Could not generate persistent MAC address for veth8b0df90: No such file or directory
Aug 6 03:06:38 sentry-docker00.cs.umd.edu systemd-udevd[2834101]: Could not generate persistent MAC address for veth0fc8970: No such file or directory
Aug 6 03:06:38 sentry-docker00.cs.umd.edu systemd-udevd[2834122]: Could not generate persistent MAC address for vethedc198b: No such file or directory
Aug 6 03:06:38 sentry-docker00.cs.umd.edu systemd-udevd[2834111]: Could not generate persistent MAC address for veth96fff2e: No such file or directory
Aug 6 03:06:38 sentry-docker00.cs.umd.edu systemd-udevd[2834126]: Could not generate persistent MAC address for veth056341e: No such file or directory
Aug 6 03:06:38 sentry-docker00.cs.umd.edu systemd-udevd[2834127]: Could not generate persistent MAC address for veth0cac80b: No such file or directory
Aug 6 03:06:38 sentry-docker00.cs.umd.edu systemd-udevd[2834163]: Could not generate persistent MAC address for veth9777e7c: No such file or directory
Aug 6 03:06:38 sentry-docker00.cs.umd.edu systemd-udevd[2834170]: Could not generate persistent MAC address for vethd3b84a9: No such file or directory
Aug 6 03:26:46 sentry-docker00.cs.umd.edu systemd-udevd[2843537]: Could not generate persistent MAC address for veth5c6b4a6: No such file or directory
Aug 6 03:26:46 sentry-docker00.cs.umd.edu systemd-udevd[2843538]: Could not generate persistent MAC address for veth6239420: No such file or directory
Aug 6 03:26:46 sentry-docker00.cs.umd.edu systemd-udevd[2843563]: Could not generate persistent MAC address for veth81e7756: No such file or directory
Aug 6 03:26:46 sentry-docker00.cs.umd.edu systemd-udevd[2843564]: Could not generate persistent MAC address for vethd7a2cb7: No such file or directory
Aug 6 03:26:46 sentry-docker00.cs.umd.edu systemd-udevd[2843577]: Could not generate persistent MAC address for veth7befd2a: No such file or directory
Aug 6 03:26:46 sentry-docker00.cs.umd.edu systemd-udevd[2843576]: Could not generate persistent MAC address for veth6d9810b: No such file or directory
Aug 6 03:26:46 sentry-docker00.cs.umd.edu systemd-udevd[2843591]: Could not generate persistent MAC address for vethb2778e1: No such file or directory
Aug 6 03:26:46 sentry-docker00.cs.umd.edu systemd-udevd[2843592]: Could not generate persistent MAC address for vetha012845: No such file or directory
Aug 6 03:26:46 sentry-docker00.cs.umd.edu systemd-udevd[2843667]: Could not generate persistent MAC address for vethbffdd51: No such file or directory
Aug 6 03:26:46 sentry-docker00.cs.umd.edu systemd-udevd[2843672]: Could not generate persistent MAC address for veth98ccb6d: No such file or directory
Aug 6 03:46:55 sentry-docker00.cs.umd.edu systemd-udevd[2852989]: Could not generate persistent MAC address for veth52dfa3d: No such file or directory
Aug 6 03:46:55 sentry-docker00.cs.umd.edu systemd-udevd[2852990]: Could not generate persistent MAC address for veth272d8d1: No such file or directory
Aug 6 03:46:55 sentry-docker00.cs.umd.edu systemd-udevd[2852993]: Could not generate persistent MAC address for veth397e006: No such file or directory
Aug 6 03:46:55 sentry-docker00.cs.umd.edu systemd-udevd[2852993]: Could not generate persistent MAC address for veth2bc88bd: No such file or directory
Aug 6 03:46:55 sentry-docker00.cs.umd.edu systemd-udevd[2852998]: Could not generate persistent MAC address for veth35ab358: No such file or directory
Aug 6 03:46:55 sentry-docker00.cs.umd.edu systemd-udevd[2853004]: Could not generate persistent MAC address for vethb8743f8: No such file or directory
Aug 6 03:46:55 sentry-docker00.cs.umd.edu systemd-udevd[2853019]: Could not generate persistent MAC address for veth15d9cbf: No such file or directory
Aug 6 03:46:55 sentry-docker00.cs.umd.edu systemd-udevd[2853020]: Could not generate persistent MAC address for vethaa3124e: No such file or directory
... 2 more distinct messages not shown
== strawberry (2 distinct, 8 total) ==
Aug 6 03:09:44 strawberry udisksd[1067]: Error performing housekeeping for drive /org/freedesktop/UDisks2/drives/ST2000DM001_1CH164_W1E8J5KJ: Error updating SMART data: Error sending ATA command CHECK POWER MODE: Unexpected sense data returned:#0120000: 00 00 00 00 00 00 00 00 00 00 00 00 00 00 00 00 ................#0120010: 00 00 00 00 00 00 00 00 00 00 00 00 00 00 00 00 ................#012 (g-io-error-quark, 0) [x6]
Aug 6 03:34:42 strawberry smartd[5314]: Device: /dev/sda [SAT], failed to read SMART Attribute Data [x2]
1
0
Command: /usr/local/sbin/syslog-digest.py
Time : 0.4790s
Status : exited 0
Output :
Syslog digest — 2026-08-06 03:05 EDT
Processed 3,996 lines, filtered 3,207 (80%). 789 unknown (53 distinct) from 13 host(s).
== abuse (1 distinct, 347 total) ==
Aug 6 02:05:06 abuse rsyslogd[21745]: imjournal: open() failed for path: '/var/lib/rsyslog/imjournal.state.tmp': Input/output error [v8.2404.0 try https://www.rsyslog.com/e/2433 ] [x347]
== b0b02.cs.umd.edu (1 distinct, 1 total) ==
Aug 6 02:47:16 b0b02.cs.umd.edu rustdesk[3431910]: cannot open display:
== contest (1 distinct, 33 total) ==
Aug 6 02:06:24 contest goferd[1007]: [ERROR][worker-0] gofer.messaging.adapter.connect:33 - connect: proton+amqps://satellite8.cs.umd.edu:5647, failed: Connection amqps://satellite8.cs.umd.edu:5647 disconnected: Condition('proton.pythonio', 'Connection refused to all addresses') [x33]
== csfw00a (1 distinct, 270 total) ==
Aug 6 02:04:31 csfw00a kernel: bnxt_en 0000:09:00.0 eth3: NIC Link is Down [x270]
== idm00 (1 distinct, 1 total) ==
Aug 6 02:51:18 idm00 named[1455]: client @0x7f3310a9be68 10.73.240.42#51484: update '73.10.in-addr.arpa/IN' denied
== idmp0 (1 distinct, 1 total) ==
Aug 6 02:36:07 idmp0 named[5198]: client @0x7f99000c2598 10.73.240.43#59081: update '73.10.in-addr.arpa/IN' denied
== itmon02 (1 distinct, 48 total) ==
Aug 6 02:08:02 itmon02 sshd[1750555]: error: beginning MaxStartups throttling [x48]
== netman.cs.umd.edu (3 distinct, 6 total) ==
Aug 6 02:52:28 netman.cs.umd.edu krb5_child[1346759]: Client 'admin(a)UMD.EDU' not found in Kerberos database [x4]
Aug 6 02:52:33 netman.cs.umd.edu sshd[1346756]: error: PAM: Authentication failure for admin from 34.62.27.196
Aug 6 02:52:57 netman.cs.umd.edu sshd[1346805]: error: Protocol major versions differ: 2 vs. 1
== newhonors2 (1 distinct, 24 total) ==
Aug 6 02:13:03 newhonors2 dhcpcd[797648]: dhcpcd is not running [x24]
== outbound00.cs.umd.edu (1 distinct, 6 total) ==
Aug 6 02:09:09 outbound00.cs.umd.edu python3[3349051]: ldapdb [x6]
== outbound01.cs.umd.edu (1 distinct, 6 total) ==
Aug 6 02:13:06 outbound01.cs.umd.edu python3[1383804]: ldapdb [x6]
== sentry-docker00.cs.umd.edu (38 distinct, 38 total) ==
Aug 6 02:06:13 sentry-docker00.cs.umd.edu systemd-udevd[2805183]: link_config: could not get ethtool features for vethc76607b
Aug 6 02:06:13 sentry-docker00.cs.umd.edu systemd-udevd[2805183]: Could not set offload features of vethc76607b: No such device
Aug 6 02:06:13 sentry-docker00.cs.umd.edu systemd-udevd[2805231]: link_config: could not get ethtool features for veth499fb04
Aug 6 02:06:13 sentry-docker00.cs.umd.edu systemd-udevd[2805231]: Could not set offload features of veth499fb04: No such device
Aug 6 02:06:13 sentry-docker00.cs.umd.edu systemd-udevd[2805296]: Could not generate persistent MAC address for veth0e3cd5a: No such file or directory
Aug 6 02:06:13 sentry-docker00.cs.umd.edu systemd-udevd[2805297]: Could not generate persistent MAC address for vethfe6df52: No such file or directory
Aug 6 02:06:13 sentry-docker00.cs.umd.edu systemd-udevd[2805322]: Could not generate persistent MAC address for veth7f142ca: No such file or directory
Aug 6 02:06:13 sentry-docker00.cs.umd.edu systemd-udevd[2805323]: Could not generate persistent MAC address for veth7094041: No such file or directory
Aug 6 02:06:13 sentry-docker00.cs.umd.edu systemd-udevd[2805348]: Could not generate persistent MAC address for veth21dfd86: No such file or directory
Aug 6 02:06:13 sentry-docker00.cs.umd.edu systemd-udevd[2805349]: Could not generate persistent MAC address for veth89adfe6: No such file or directory
Aug 6 02:06:13 sentry-docker00.cs.umd.edu systemd-udevd[2805367]: Could not generate persistent MAC address for veth970f374: No such file or directory
Aug 6 02:06:13 sentry-docker00.cs.umd.edu systemd-udevd[2805348]: Could not generate persistent MAC address for vethdf7b864: No such file or directory
Aug 6 02:06:13 sentry-docker00.cs.umd.edu systemd-udevd[2805396]: Could not generate persistent MAC address for vethded5990: No such file or directory
Aug 6 02:06:13 sentry-docker00.cs.umd.edu systemd-udevd[2805398]: Could not generate persistent MAC address for veth786f21e: No such file or directory
Aug 6 02:26:21 sentry-docker00.cs.umd.edu systemd-udevd[2814784]: link_config: could not get ethtool features for veth970f374
Aug 6 02:26:21 sentry-docker00.cs.umd.edu systemd-udevd[2814784]: Could not set offload features of veth970f374: No such device
Aug 6 02:26:21 sentry-docker00.cs.umd.edu systemd-udevd[2814854]: Could not generate persistent MAC address for veth7c575da: No such file or directory
Aug 6 02:26:21 sentry-docker00.cs.umd.edu systemd-udevd[2814853]: Could not generate persistent MAC address for veth211c3c1: No such file or directory
Aug 6 02:26:21 sentry-docker00.cs.umd.edu systemd-udevd[2814872]: Could not generate persistent MAC address for vethf688f72: No such file or directory
Aug 6 02:26:21 sentry-docker00.cs.umd.edu systemd-udevd[2814878]: Could not generate persistent MAC address for veth60aa96b: No such file or directory
Aug 6 02:26:21 sentry-docker00.cs.umd.edu systemd-udevd[2814854]: Could not generate persistent MAC address for vethd9a53e1: No such file or directory
Aug 6 02:26:21 sentry-docker00.cs.umd.edu systemd-udevd[2814868]: Could not generate persistent MAC address for vethcf171f8: No such file or directory
Aug 6 02:26:21 sentry-docker00.cs.umd.edu systemd-udevd[2814868]: Could not generate persistent MAC address for veth5c79d0d: No such file or directory
Aug 6 02:26:21 sentry-docker00.cs.umd.edu systemd-udevd[2814854]: Could not generate persistent MAC address for veth16e6632: No such file or directory
Aug 6 02:26:21 sentry-docker00.cs.umd.edu systemd-udevd[2814854]: Could not generate persistent MAC address for veth219df63: No such file or directory
Aug 6 02:26:21 sentry-docker00.cs.umd.edu systemd-udevd[2814873]: Could not generate persistent MAC address for veth7494834: No such file or directory
Aug 6 02:46:29 sentry-docker00.cs.umd.edu systemd-udevd[2824431]: link_config: could not get ethtool features for vethf688f72
Aug 6 02:46:29 sentry-docker00.cs.umd.edu systemd-udevd[2824431]: Could not set offload features of vethf688f72: No such device
Aug 6 02:46:30 sentry-docker00.cs.umd.edu systemd-udevd[2824461]: Could not generate persistent MAC address for vethfe0874f: No such file or directory
Aug 6 02:46:30 sentry-docker00.cs.umd.edu systemd-udevd[2824462]: Could not generate persistent MAC address for veth8cfdac3: No such file or directory
... 8 more distinct messages not shown
== strawberry (2 distinct, 8 total) ==
Aug 6 02:09:44 strawberry udisksd[1067]: Error performing housekeeping for drive /org/freedesktop/UDisks2/drives/ST2000DM001_1CH164_W1E8J5KJ: Error updating SMART data: Error sending ATA command CHECK POWER MODE: Unexpected sense data returned:#0120000: 00 00 00 00 00 00 00 00 00 00 00 00 00 00 00 00 ................#0120010: 00 00 00 00 00 00 00 00 00 00 00 00 00 00 00 00 ................#012 (g-io-error-quark, 0) [x6]
Aug 6 02:34:42 strawberry smartd[5314]: Device: /dev/sda [SAT], failed to read SMART Attribute Data [x2]
1
0
Command: /usr/local/sbin/syslog-digest.py
Time : 0.5179s
Status : exited 0
Output :
Syslog digest — 2026-08-06 02:05 EDT
Processed 4,271 lines, filtered 3,361 (78%). 910 unknown (120 distinct) from 24 host(s).
== abuse (1 distinct, 347 total) ==
Aug 6 01:05:06 abuse rsyslogd[21745]: imjournal: open() failed for path: '/var/lib/rsyslog/imjournal.state.tmp': Input/output error [v8.2404.0 try https://www.rsyslog.com/e/2433 ] [x347]
== b0b02.cs.umd.edu (1 distinct, 1 total) ==
Aug 6 01:47:12 b0b02.cs.umd.edu rustdesk[3416828]: cannot open display:
== bachata (1 distinct, 1 total) ==
Aug 6 01:47:02 bachata setroubleshoot[2537582]: SELinux is preventing /usr/sbin/smbd from name_bind access on the udp_socket port 628. For complete SELinux messages run: sealert -l 8f7247f1-69a5-4a62-a4f0-88a324bfd75c
== cheezit.cs.umd.edu (4 distinct, 4 total) ==
Aug 6 02:04:50 cheezit.cs.umd.edu sshd-session[1536948]: pam_access(sshd:auth): access denied for user `admin' from `34.79.217.97'
Aug 6 02:04:50 cheezit.cs.umd.edu krb5_child[1536950]: Client 'admin(a)UMD.EDU' not found in Kerberos database
Aug 6 02:04:50 cheezit.cs.umd.edu sshd-session[1536946]: error: PAM: System error for admin from 34.79.217.97
Aug 6 02:04:54 cheezit.cs.umd.edu sshd-session[1536959]: error: Protocol major versions differ: 2 vs. 1
== contest (12 distinct, 47 total) ==
Aug 6 01:05:42 contest goferd[1007]: [ERROR][worker-0] gofer.messaging.adapter.connect:33 - connect: proton+amqps://satellite8.cs.umd.edu:5647, failed: Connection amqps://satellite8.cs.umd.edu:5647 disconnected: Condition('proton.pythonio', 'Connection refused to all addresses') [x34]
Aug 6 01:48:18 contest setroubleshoot[702207]: SELinux is preventing /usr/libexec/platform-python3.6 from create access on the directory libdnf.Rwm2mo. For complete SELinux messages run: sealert -l cb6b25c6-4765-4cf2-88a0-9b3b508e94e9
Aug 6 01:48:18 contest setroubleshoot[702207]: SELinux is preventing /usr/bin/gpgconf from add_name access on the directory repodata. For complete SELinux messages run: sealert -l 41cf7b1b-0f34-4609-98f2-b66e7825fef7
Aug 6 01:48:18 contest setroubleshoot[702207]: SELinux is preventing /usr/libexec/platform-python3.6 from create access on the file mirrorlist. For complete SELinux messages run: sealert -l fc20ff92-ea83-4f38-a24b-ddfd737a3141
Aug 6 01:48:18 contest setroubleshoot[702207]: SELinux is preventing /usr/libexec/platform-python3.6 from setattr access on the file repomd.xml. For complete SELinux messages run: sealert -l ac675631-fa35-4e93-adc9-b692b18e53e5 [x2]
Aug 6 01:48:18 contest setroubleshoot[702207]: SELinux is preventing /usr/bin/gpgconf from add_name access on the directory repomd.xml.asc. For complete SELinux messages run: sealert -l 41cf7b1b-0f34-4609-98f2-b66e7825fef7
Aug 6 01:48:18 contest setroubleshoot[702207]: SELinux is preventing /usr/libexec/platform-python3.6 from read access on the directory libdnf.Rwm2mo. For complete SELinux messages run: sealert -l 45d103b6-0810-4890-a705-990118577ce8
Aug 6 01:48:18 contest setroubleshoot[702207]: SELinux is preventing /usr/libexec/platform-python3.6 from remove_name access on the directory repomd.xml. For complete SELinux messages run: sealert -l 7e499113-2fd7-4f67-bec6-3521efbe3637 [x2]
Aug 6 01:48:18 contest setroubleshoot[702207]: SELinux is preventing /usr/libexec/platform-python3.6 from rmdir access on the directory repodata. For complete SELinux messages run: sealert -l 3928930b-a1ed-448d-950b-0665ac2adef8
Aug 6 01:48:20 contest setroubleshoot[702207]: SELinux is preventing /usr/libexec/platform-python3.6 from create access on the directory libdnf.lhEdgW. For complete SELinux messages run: sealert -l cb6b25c6-4765-4cf2-88a0-9b3b508e94e9
Aug 6 01:48:26 contest setroubleshoot[702207]: SELinux is preventing /usr/libexec/platform-python3.6 from create access on the file repomd.xml. For complete SELinux messages run: sealert -l fc20ff92-ea83-4f38-a24b-ddfd737a3141
Aug 6 01:48:39 contest setroubleshoot[702275]: SELinux is preventing rhsmcertd-worke from unlink access on the file repomd.xml. For complete SELinux messages run: sealert -l 22835727-7fef-4cfb-b3b5-881f66888317
== csfw00a (1 distinct, 270 total) ==
Aug 6 01:04:44 csfw00a kernel: bnxt_en 0000:09:00.0 eth3: NIC Link is Down [x270]
== hackerman (1 distinct, 1 total) ==
Aug 6 01:19:01 hackerman gnome-software[2060381]: failed to commit changes to dconf: GDBus.Error:org.gtk.GDBus.UnmappedGError.Quark._g_2dfile_2derror_2dquark.Code2: Failed to create file “/adminhomes/sajith/.config/dconf/user.LY7NT3”: Permission denied
== hazfs.cs.umd.edu (11 distinct, 66 total) ==
Aug 6 01:51:53 hazfs.cs.umd.edu snmpd[1431]: send response: Failure in sendto [x6]
Aug 6 01:51:53 hazfs.cs.umd.edu snmpd[1431]: -- NET-SNMP-EXTEND-MIB::nsExtendStatus."userweb" [x6]
Aug 6 01:51:53 hazfs.cs.umd.edu snmpd[1431]: -- NET-SNMP-EXTEND-MIB::nsExtendStatus."zfslist" [x6]
Aug 6 01:51:53 hazfs.cs.umd.edu snmpd[1431]: -- NET-SNMP-EXTEND-MIB::nsExtendStatus."userhome" [x6]
Aug 6 01:51:53 hazfs.cs.umd.edu snmpd[1431]: -- NET-SNMP-EXTEND-MIB::nsExtendOutput1Line."userweb" [x6]
Aug 6 01:51:53 hazfs.cs.umd.edu snmpd[1431]: -- NET-SNMP-EXTEND-MIB::nsExtendOutput1Line."zfslist" [x6]
Aug 6 01:51:53 hazfs.cs.umd.edu snmpd[1431]: -- NET-SNMP-EXTEND-MIB::nsExtendOutput1Line."userhome" [x6]
Aug 6 01:51:53 hazfs.cs.umd.edu snmpd[1431]: -- NET-SNMP-EXTEND-MIB::nsExtendOutputFull."userweb" [x6]
Aug 6 01:51:53 hazfs.cs.umd.edu snmpd[1431]: -- NET-SNMP-EXTEND-MIB::nsExtendOutputFull."zfslist" [x6]
Aug 6 01:51:53 hazfs.cs.umd.edu snmpd[1431]: -- NET-SNMP-EXTEND-MIB::nsExtendOutputFull."userhome" [x6]
Aug 6 01:51:53 hazfs.cs.umd.edu snmpd[1431]: -- NET-SNMP-EXTEND-MIB::nsExtendOutNumLines."userweb" [x6]
== idm00 (2 distinct, 2 total) ==
Aug 6 01:24:07 idm00 named[1455]: client @0x7f3304b3d148 10.73.245.12#64323: update '73.10.in-addr.arpa/IN' denied
Aug 6 01:51:18 idm00 named[1455]: client @0x7f33048c7d98 10.73.240.42#63782: update '73.10.in-addr.arpa/IN' denied
== idmp0 (1 distinct, 1 total) ==
Aug 6 01:36:07 idmp0 named[5198]: client @0x7f9924011de8 10.73.240.43#50538: update '73.10.in-addr.arpa/IN' denied
== inbound00.cs.umd.edu (2 distinct, 2 total) ==
Aug 6 01:58:54 inbound00.cs.umd.edu krb5_child[3395650]: Client 'admin(a)UMD.EDU' not found in Kerberos database
Aug 6 01:59:08 inbound00.cs.umd.edu sshd-session[3395657]: error: Protocol major versions differ: 2 vs. 1
== itmon02 (1 distinct, 34 total) ==
Aug 6 01:07:49 itmon02 sshd[1750555]: error: beginning MaxStartups throttling [x34]
== krispykreme.cs.umd.edu (3 distinct, 3 total) ==
Aug 6 02:01:34 krispykreme.cs.umd.edu sshd-session[3830841]: pam_access(sshd:auth): access denied for user `admin' from `34.77.217.24'
Aug 6 02:01:35 krispykreme.cs.umd.edu krb5_child[3830843]: Client 'admin(a)UMD.EDU' not found in Kerberos database
Aug 6 02:01:35 krispykreme.cs.umd.edu sshd-session[3830839]: error: PAM: System error for admin from 34.77.217.24
== netman.cs.umd.edu (2 distinct, 5 total) ==
Aug 6 01:35:48 netman.cs.umd.edu krb5_child[1326278]: Client 'admin(a)UMD.EDU' not found in Kerberos database [x4]
Aug 6 01:35:53 netman.cs.umd.edu sshd[1326275]: error: PAM: Authentication failure for admin from 202.129.35.8
== newhonors2 (1 distinct, 24 total) ==
Aug 6 01:13:02 newhonors2 dhcpcd[795802]: dhcpcd is not running [x24]
== outbound00.cs.umd.edu (1 distinct, 6 total) ==
Aug 6 01:09:09 outbound00.cs.umd.edu python3[3335183]: ldapdb [x6]
== outbound01.cs.umd.edu (1 distinct, 6 total) ==
Aug 6 01:13:06 outbound01.cs.umd.edu python3[1369819]: ldapdb [x6]
== sentry-docker00.cs.umd.edu (40 distinct, 40 total) ==
Aug 6 01:05:48 sentry-docker00.cs.umd.edu systemd-udevd[2776740]: link_config: could not get ethtool features for vethbf9dc25
Aug 6 01:05:48 sentry-docker00.cs.umd.edu systemd-udevd[2776740]: Could not set offload features of vethbf9dc25: No such device
Aug 6 01:05:48 sentry-docker00.cs.umd.edu systemd-udevd[2776820]: Could not generate persistent MAC address for veth98d0e73: No such file or directory
Aug 6 01:05:48 sentry-docker00.cs.umd.edu systemd-udevd[2776821]: Could not generate persistent MAC address for veth9ed0b2c: No such file or directory
Aug 6 01:05:48 sentry-docker00.cs.umd.edu systemd-udevd[2776824]: Could not generate persistent MAC address for vethab254b5: No such file or directory
Aug 6 01:05:48 sentry-docker00.cs.umd.edu systemd-udevd[2776825]: Could not generate persistent MAC address for vethf246302: No such file or directory
Aug 6 01:05:48 sentry-docker00.cs.umd.edu systemd-udevd[2776826]: Could not generate persistent MAC address for vethf19b451: No such file or directory
Aug 6 01:05:48 sentry-docker00.cs.umd.edu systemd-udevd[2776842]: Could not generate persistent MAC address for veth2ea431d: No such file or directory
Aug 6 01:05:48 sentry-docker00.cs.umd.edu systemd-udevd[2776850]: Could not generate persistent MAC address for vethe957216: No such file or directory
Aug 6 01:05:48 sentry-docker00.cs.umd.edu systemd-udevd[2776851]: Could not generate persistent MAC address for vethe77ca4e: No such file or directory
Aug 6 01:05:48 sentry-docker00.cs.umd.edu systemd-udevd[2776875]: Could not generate persistent MAC address for veth9144038: No such file or directory
Aug 6 01:05:48 sentry-docker00.cs.umd.edu systemd-udevd[2776855]: Could not generate persistent MAC address for vethea89b40: No such file or directory
Aug 6 01:25:56 sentry-docker00.cs.umd.edu systemd-udevd[2786376]: link_config: could not get ethtool features for veth98d0e73
Aug 6 01:25:56 sentry-docker00.cs.umd.edu systemd-udevd[2786376]: Could not set offload features of veth98d0e73: No such device
Aug 6 01:25:56 sentry-docker00.cs.umd.edu systemd-udevd[2786381]: link_config: could not get ethtool features for vethab254b5
Aug 6 01:25:56 sentry-docker00.cs.umd.edu systemd-udevd[2786381]: Could not set offload features of vethab254b5: No such device
Aug 6 01:25:57 sentry-docker00.cs.umd.edu systemd-udevd[2786413]: Could not generate persistent MAC address for veth62d5ff4: No such file or directory
Aug 6 01:25:57 sentry-docker00.cs.umd.edu systemd-udevd[2786414]: Could not generate persistent MAC address for vethecc95ee: No such file or directory
Aug 6 01:25:57 sentry-docker00.cs.umd.edu systemd-udevd[2786417]: Could not generate persistent MAC address for veth7ec964a: No such file or directory
Aug 6 01:25:57 sentry-docker00.cs.umd.edu systemd-udevd[2786418]: Could not generate persistent MAC address for veth100b82a: No such file or directory
Aug 6 01:25:57 sentry-docker00.cs.umd.edu systemd-udevd[2786421]: Could not generate persistent MAC address for veth76c082e: No such file or directory
Aug 6 01:25:57 sentry-docker00.cs.umd.edu systemd-udevd[2786428]: Could not generate persistent MAC address for vethc3d1276: No such file or directory
Aug 6 01:25:57 sentry-docker00.cs.umd.edu systemd-udevd[2786443]: Could not generate persistent MAC address for vetheddddef: No such file or directory
Aug 6 01:25:57 sentry-docker00.cs.umd.edu systemd-udevd[2786444]: Could not generate persistent MAC address for veth2bf48d9: No such file or directory
Aug 6 01:25:57 sentry-docker00.cs.umd.edu systemd-udevd[2786528]: Could not generate persistent MAC address for vethf939ffc: No such file or directory
Aug 6 01:25:57 sentry-docker00.cs.umd.edu systemd-udevd[2786518]: Could not generate persistent MAC address for veth60f62d8: No such file or directory
Aug 6 01:46:05 sentry-docker00.cs.umd.edu systemd-udevd[2795818]: link_config: could not set ethtool features for veth60f62d8
Aug 6 01:46:05 sentry-docker00.cs.umd.edu systemd-udevd[2795818]: Could not set offload features of veth60f62d8: Operation not permitted
Aug 6 01:46:05 sentry-docker00.cs.umd.edu systemd-udevd[2795820]: link_config: could not get ethtool features for vetheddddef
Aug 6 01:46:05 sentry-docker00.cs.umd.edu systemd-udevd[2795820]: Could not set offload features of vetheddddef: No such device
... 10 more distinct messages not shown
== strawberry (2 distinct, 8 total) ==
Aug 6 01:09:44 strawberry udisksd[1067]: Error performing housekeeping for drive /org/freedesktop/UDisks2/drives/ST2000DM001_1CH164_W1E8J5KJ: Error updating SMART data: Error sending ATA command CHECK POWER MODE: Unexpected sense data returned:#0120000: 00 00 00 00 00 00 00 00 00 00 00 00 00 00 00 00 ................#0120010: 00 00 00 00 00 00 00 00 00 00 00 00 00 00 00 00 ................#012 (g-io-error-quark, 0) [x6]
Aug 6 01:34:42 strawberry smartd[5314]: Device: /dev/sda [SAT], failed to read SMART Attribute Data [x2]
== submit26-b9-2 (10 distinct, 14 total) ==
Aug 6 01:12:53 submit26-b9-2 setroubleshoot[1129889]: SELinux is preventing /usr/bin/python3.9 from create access on the directory /(null). For complete SELinux messages run: sealert -l d506243c-d61e-48f3-b42a-4592c913deb0 [x2]
Aug 6 01:12:53 submit26-b9-2 setroubleshoot[1129889]: SELinux is preventing /usr/bin/python3.9 from add_name access on the directory /(null). For complete SELinux messages run: sealert -l 3b4752ac-1b9a-4af9-a05b-32e4c2eb13ab [x2]
Aug 6 01:12:53 submit26-b9-2 setroubleshoot[1129889]: SELinux is preventing /usr/bin/python3.9 from create access on the file /(null). For complete SELinux messages run: sealert -l 29e5adbd-4381-4467-b40d-a2219101e096
Aug 6 01:12:53 submit26-b9-2 setroubleshoot[1129889]: SELinux is preventing /usr/bin/python3.9 from open access on the file /tmp/libdnf.0CYayg/repodata/repomd.xml. For complete SELinux messages run: sealert -l 1b38f2ec-01ce-4343-8059-ba7494ecc5c4
Aug 6 01:12:53 submit26-b9-2 setroubleshoot[1129889]: SELinux is preventing /usr/bin/python3.9 from setattr access on the file repomd.xml. For complete SELinux messages run: sealert -l e5f9af40-1f63-4924-b012-27ab2a7b2266
Aug 6 01:12:53 submit26-b9-2 setroubleshoot[1129889]: SELinux is preventing /usr/bin/python3.9 from read access on the directory libdnf.0CYayg. For complete SELinux messages run: sealert -l 5c54db87-54a3-4a7c-97b4-b5c48d6c3543
Aug 6 01:12:53 submit26-b9-2 setroubleshoot[1129889]: SELinux is preventing /usr/bin/python3.9 from remove_name access on the directory repomd.xml. For complete SELinux messages run: sealert -l 63cd60e1-1e61-4276-afea-dd8526ffe8b2 [x2]
Aug 6 01:12:53 submit26-b9-2 setroubleshoot[1129889]: SELinux is preventing /usr/bin/python3.9 from unlink access on the file repomd.xml. For complete SELinux messages run: sealert -l 81c7e9ec-e023-4c6d-b1ad-c02a242e655e
Aug 6 01:12:53 submit26-b9-2 setroubleshoot[1129889]: SELinux is preventing /usr/bin/python3.9 from rmdir access on the directory repodata. For complete SELinux messages run: sealert -l 6ae9a597-e123-4d74-8eec-a8ebe0f5e4d0 [x2]
Aug 6 01:12:53 submit26-b9-2 setroubleshoot[1129889]: SELinux is preventing /usr/bin/python3.9 from read access on the directory libdnf.6yVVeS. For complete SELinux messages run: sealert -l 5c54db87-54a3-4a7c-97b4-b5c48d6c3543
== submit26-b9-3 (9 distinct, 9 total) ==
Aug 6 01:20:39 submit26-b9-3 setroubleshoot[867611]: SELinux is preventing /usr/bin/python3.9 from create access on the directory /(null). For complete SELinux messages run: sealert -l 5b912a44-22fd-4560-b201-2a4e289b73f5
Aug 6 01:20:39 submit26-b9-3 setroubleshoot[867611]: SELinux is preventing /usr/bin/python3.9 from add_name access on the directory /(null). For complete SELinux messages run: sealert -l 7f1df1e4-725e-4953-98eb-1079f908f543
Aug 6 01:20:39 submit26-b9-3 setroubleshoot[867611]: SELinux is preventing /usr/bin/python3.9 from create access on the file /(null). For complete SELinux messages run: sealert -l 40b8852a-f77b-44b4-affe-5f11fa33de43
Aug 6 01:20:39 submit26-b9-3 setroubleshoot[867611]: SELinux is preventing /usr/bin/python3.9 from open access on the file /tmp/libdnf.osEymi/repodata/repomd.xml. For complete SELinux messages run: sealert -l 45a8019e-f6b5-4baa-92c1-862594b40d46
Aug 6 01:20:39 submit26-b9-3 setroubleshoot[867611]: SELinux is preventing /usr/bin/python3.9 from setattr access on the file repomd.xml. For complete SELinux messages run: sealert -l e9f0bfff-7784-4126-baa4-2bb06da56591
Aug 6 01:20:39 submit26-b9-3 setroubleshoot[867611]: SELinux is preventing /usr/bin/python3.9 from read access on the directory libdnf.osEymi. For complete SELinux messages run: sealert -l 0b17cc3d-cdc6-4fe2-a11f-3892e7c41dc7
Aug 6 01:20:39 submit26-b9-3 setroubleshoot[867611]: SELinux is preventing /usr/bin/python3.9 from remove_name access on the directory repomd.xml. For complete SELinux messages run: sealert -l 10e38c64-b65f-4cdd-901e-4375652d9a42
Aug 6 01:20:39 submit26-b9-3 setroubleshoot[867611]: SELinux is preventing /usr/bin/python3.9 from unlink access on the file repomd.xml. For complete SELinux messages run: sealert -l 7fd9cf72-ef38-48e1-b6aa-b571b26a7b22
Aug 6 01:20:39 submit26-b9-3 setroubleshoot[867611]: SELinux is preventing /usr/bin/python3.9 from rmdir access on the directory repodata. For complete SELinux messages run: sealert -l b9b11116-89bd-4a3c-980c-1d422c5dcee4
== submit26-clnb9 (10 distinct, 14 total) ==
Aug 6 01:31:58 submit26-clnb9 setroubleshoot[1859465]: SELinux is preventing /usr/bin/python3.9 from create access on the directory /(null). For complete SELinux messages run: sealert -l 6783ed2b-5ae4-42b5-975a-4bf50eec4658 [x2]
Aug 6 01:31:58 submit26-clnb9 setroubleshoot[1859465]: SELinux is preventing /usr/bin/python3.9 from add_name access on the directory /(null). For complete SELinux messages run: sealert -l 9e7fa955-cc30-4804-ac8c-e1779e85946c [x2]
Aug 6 01:31:58 submit26-clnb9 setroubleshoot[1859465]: SELinux is preventing /usr/bin/python3.9 from create access on the file /(null). For complete SELinux messages run: sealert -l 69bfa6e3-089c-40ff-9563-fd30787d0774
Aug 6 01:31:58 submit26-clnb9 setroubleshoot[1859465]: SELinux is preventing /usr/bin/python3.9 from open access on the file /tmp/libdnf.XevcMc/repodata/repomd.xml. For complete SELinux messages run: sealert -l 001acdb5-31ef-4e52-b10b-90f467a89ddc
Aug 6 01:31:58 submit26-clnb9 setroubleshoot[1859465]: SELinux is preventing /usr/bin/python3.9 from setattr access on the file repomd.xml. For complete SELinux messages run: sealert -l edacddcf-16ed-4dc3-8d82-7c597d5dee23
Aug 6 01:31:58 submit26-clnb9 setroubleshoot[1859465]: SELinux is preventing /usr/bin/python3.9 from read access on the directory libdnf.XevcMc. For complete SELinux messages run: sealert -l 62b3782e-4730-4488-8178-94dafe9b552c
Aug 6 01:31:58 submit26-clnb9 setroubleshoot[1859465]: SELinux is preventing /usr/bin/python3.9 from remove_name access on the directory repomd.xml. For complete SELinux messages run: sealert -l 81cb3698-78f8-440a-8e3c-e5d1041e6b78 [x2]
Aug 6 01:31:58 submit26-clnb9 setroubleshoot[1859465]: SELinux is preventing /usr/bin/python3.9 from unlink access on the file repomd.xml. For complete SELinux messages run: sealert -l 792b472a-115c-4799-9805-fc7436f916b9
Aug 6 01:31:58 submit26-clnb9 setroubleshoot[1859465]: SELinux is preventing /usr/bin/python3.9 from rmdir access on the directory repodata. For complete SELinux messages run: sealert -l 15c83a86-837b-41e2-b662-b39cd4e361cb [x2]
Aug 6 01:31:58 submit26-clnb9 setroubleshoot[1859465]: SELinux is preventing /usr/bin/python3.9 from read access on the directory libdnf.bOx0OB. For complete SELinux messages run: sealert -l 62b3782e-4730-4488-8178-94dafe9b552c
== teaching-awards (2 distinct, 4 total) ==
Aug 6 01:30:04 teaching-awards krb5_child[1952850]: Client 'admin(a)UMD.EDU' not found in Kerberos database
Aug 6 01:30:20 teaching-awards sshd-session[1952854]: error: Protocol major versions differ: 2 vs. 1 [x3]
== tma-0 (1 distinct, 1 total) ==
Aug 6 01:05:11 tma-0 sshd[3770]: error: PAM: Authentication failure for admin from 49.231.241.35.bc.googleusercontent.com
1
0