Command: /usr/local/sbin/syslog-digest.py
Time : 1.0081s
Status : exited 0
Output :
Syslog digest — 2026-08-07 07:05 EDT
Processed 7,672 lines, filtered 4,764 (62%). 2,908 unknown (313 distinct) from 20 host(s).
== abadi-computer (2 distinct, 2 total) ==
Aug 7 06:15:00 abadi-computer nologin[2147436]: Attempted login by UNKNOWN (UID: 65534) on UNKNOWN
Aug 7 06:15:00 abadi-computer pipewire[2147435]: mod.jackdbus-detect: Failed to receive jackdbus reply: org.freedesktop.DBus.Error.ServiceUnknown: The name org.jackaudio.service was not provided by any .service files
== abuse (3 distinct, 2252 total) ==
Aug 7 06:05:05 abuse rsyslogd[21745]: imjournal: open() failed for path: '/var/lib/rsyslog/imjournal.state.tmp': Input/output error [v8.2404.0 try https://www.rsyslog.com/e/2433 ] [x878]
Aug 7 06:05:05 abuse systemd[1]: Failed to load environment files: Input/output error [x687]
Aug 7 06:05:05 abuse systemd[1]: choria-server.service failed to run 'start' task: Input/output error [x687]
== b0b02.cs.umd.edu (4 distinct, 5 total) ==
Aug 7 06:47:40 b0b02.cs.umd.edu setroubleshoot[3861190]: SELinux is preventing /usr/bin/python3.9 from getattr access on the file /etc/authselect/nsswitch.conf. For complete SELinux messages run: sealert -l 9a1e2952-3fde-4937-a8ab-f7f59791a458 [x2]
Aug 7 06:47:43 b0b02.cs.umd.edu setroubleshoot[3861190]: SELinux is preventing /usr/bin/python3.9 from read access on the file /etc/authselect/nsswitch.conf. For complete SELinux messages run: sealert -l 97d74423-e027-4cd6-8810-ad80944900b5
Aug 7 06:47:46 b0b02.cs.umd.edu setroubleshoot[3861190]: SELinux is preventing /usr/bin/python3.9 from open access on the file /etc/authselect/nsswitch.conf. For complete SELinux messages run: sealert -l 4f253f6a-62d6-46dd-8eaf-0b4d29df41c6
Aug 7 06:48:52 b0b02.cs.umd.edu rustdesk[3861354]: cannot open display:
== contest (1 distinct, 33 total) ==
Aug 7 06:06:19 contest goferd[1007]: [ERROR][worker-0] gofer.messaging.adapter.connect:33 - connect: proton+amqps://satellite8.cs.umd.edu:5647, failed: Connection amqps://satellite8.cs.umd.edu:5647 disconnected: Condition('proton.pythonio', 'Connection refused to all addresses') [x33]
== csfw00a (1 distinct, 214 total) ==
Aug 7 06:04:53 csfw00a kernel: bnxt_en 0000:09:00.0 eth3: NIC Link is Down [x214]
== hackerman (6 distinct, 11 total) ==
Aug 7 06:20:04 hackerman gnome-software[2060381]: can't reliably fixup error code 4 in domain g-io-error-quark: Not a directory [x4]
Aug 7 06:20:13 hackerman gnome-software[2060381]: Only 0 apps for recent list, hiding
Aug 7 06:20:28 hackerman gnome-software[2060381]: failed to commit changes to dconf: GDBus.Error:org.gtk.GDBus.UnmappedGError.Quark._g_2dfile_2derror_2dquark.Code2: Failed to create file “/adminhomes/sajith/.config/dconf/user.ANLGT3”: Permission denied
Aug 7 06:20:28 hackerman packagekitd[501599]: Failed to get cache filename for libreoffice [x2]
Aug 7 06:20:28 hackerman packagekitd[501599]: Failed to get cache filename for kernel [x2]
Aug 7 06:20:38 hackerman packagekitd[501599]: failed to parse public key for /etc/pki/rpm-gpg/RPM-GPG-KEY-PQC-redhat-release
== idm00 (1 distinct, 1 total) ==
Aug 7 06:51:20 idm00 named[1455]: client @0x7f33151dc478 10.73.240.42#50459: update '73.10.in-addr.arpa/IN' denied
== idmp0 (1 distinct, 1 total) ==
Aug 7 06:36:02 idmp0 named[5198]: client @0x7f98f4021ea8 10.73.240.43#61486: update '73.10.in-addr.arpa/IN' denied
== inbound00.cs.umd.edu (1 distinct, 1 total) ==
Aug 7 06:07:12 inbound00.cs.umd.edu systemd[1]: Configuration file /usr/lib/systemd/system/authentication_milter.service is marked executable. Please remove executable permission bits. Proceeding anyway.
== inbound01.cs.umd.edu (1 distinct, 1 total) ==
Aug 7 06:18:12 inbound01.cs.umd.edu systemd[1]: Configuration file /usr/lib/systemd/system/authentication_milter.service is marked executable. Please remove executable permission bits. Proceeding anyway.
== itmon02 (1 distinct, 45 total) ==
Aug 7 06:08:09 itmon02 sshd[1750555]: error: beginning MaxStartups throttling [x45]
== neodontcare.cs.umd.edu (106 distinct, 112 total) ==
Aug 7 06:13:30 neodontcare.cs.umd.edu gnome-software[7556]: Only 0 apps for recent list, hiding
Aug 7 06:14:01 neodontcare.cs.umd.edu packagekitd[3245154]: Failed to get cache filename for gnu-free-mono-fonts
Aug 7 06:14:01 neodontcare.cs.umd.edu packagekitd[3245154]: Failed to get cache filename for gnu-free-serif-fonts
Aug 7 06:14:02 neodontcare.cs.umd.edu packagekitd[3245154]: Failed to get cache filename for cups-libs
Aug 7 06:14:02 neodontcare.cs.umd.edu packagekitd[3245154]: Failed to get cache filename for libsolv
Aug 7 06:14:02 neodontcare.cs.umd.edu packagekitd[3245154]: Failed to get cache filename for libxml2
Aug 7 06:14:02 neodontcare.cs.umd.edu packagekitd[3245154]: Failed to get cache filename for microcode_ctl
Aug 7 06:14:02 neodontcare.cs.umd.edu packagekitd[3245154]: Failed to get cache filename for python3-libxml2
Aug 7 06:14:02 neodontcare.cs.umd.edu packagekitd[3245154]: Failed to get cache filename for cifs-utils
Aug 7 06:14:02 neodontcare.cs.umd.edu packagekitd[3245154]: Failed to get cache filename for python3
Aug 7 06:14:02 neodontcare.cs.umd.edu packagekitd[3245154]: Failed to get cache filename for python3-libs
Aug 7 06:14:02 neodontcare.cs.umd.edu packagekitd[3245154]: Failed to get cache filename for glib2
Aug 7 06:14:02 neodontcare.cs.umd.edu packagekitd[3245154]: Failed to get cache filename for libipa_hbac
Aug 7 06:14:02 neodontcare.cs.umd.edu packagekitd[3245154]: Failed to get cache filename for libsss_autofs
Aug 7 06:14:02 neodontcare.cs.umd.edu packagekitd[3245154]: Failed to get cache filename for libsss_certmap
Aug 7 06:14:02 neodontcare.cs.umd.edu packagekitd[3245154]: Failed to get cache filename for libsss_idmap
Aug 7 06:14:02 neodontcare.cs.umd.edu packagekitd[3245154]: Failed to get cache filename for libsss_nss_idmap
Aug 7 06:14:02 neodontcare.cs.umd.edu packagekitd[3245154]: Failed to get cache filename for libsss_sudo
Aug 7 06:14:02 neodontcare.cs.umd.edu packagekitd[3245154]: Failed to get cache filename for python3-libipa_hbac
Aug 7 06:14:02 neodontcare.cs.umd.edu packagekitd[3245154]: Failed to get cache filename for python3-sss
Aug 7 06:14:02 neodontcare.cs.umd.edu packagekitd[3245154]: Failed to get cache filename for python3-sss-murmur
Aug 7 06:14:02 neodontcare.cs.umd.edu packagekitd[3245154]: Failed to get cache filename for python3-sssdconfig
Aug 7 06:14:02 neodontcare.cs.umd.edu packagekitd[3245154]: Failed to get cache filename for acl
Aug 7 06:14:02 neodontcare.cs.umd.edu packagekitd[3245154]: Failed to get cache filename for libacl
Aug 7 06:14:02 neodontcare.cs.umd.edu packagekitd[3245154]: Failed to get cache filename for tuned
Aug 7 06:14:02 neodontcare.cs.umd.edu packagekitd[3245154]: Failed to get cache filename for openssl
Aug 7 06:14:02 neodontcare.cs.umd.edu packagekitd[3245154]: Failed to get cache filename for openssl-libs
Aug 7 06:14:02 neodontcare.cs.umd.edu packagekitd[3245154]: Failed to get cache filename for vim-filesystem
Aug 7 06:14:02 neodontcare.cs.umd.edu packagekitd[3245154]: Failed to get cache filename for vim-minimal
Aug 7 06:14:02 neodontcare.cs.umd.edu packagekitd[3245154]: Failed to get cache filename for glibc
... 76 more distinct messages not shown
== netman.cs.umd.edu (1 distinct, 1 total) ==
Aug 7 06:32:51 netman.cs.umd.edu sshd[1948375]: error: PAM: Authentication failure for root from 201.163.73.88
== newhonors2 (38 distinct, 65 total) ==
Aug 7 06:13:03 newhonors2 dhcpcd[858976]: dhcpcd is not running [x28]
Aug 7 06:48:08 newhonors2 puppet-agent[860391]: Could not update: Execution of '/usr/bin/apt-get -q -y -o DPkg::Options::=--force-confold --force-yes install openvox-agent=8.27.0-1+ubuntu24.04' returned 100: Reading package lists...
Aug 7 06:48:08 newhonors2 puppet-agent[860391]: Building dependency tree...
Aug 7 06:48:08 newhonors2 puppet-agent[860391]: Reading state information...
Aug 7 06:48:08 newhonors2 puppet-agent[860391]: Package openvox-agent is not available, but is referred to by another package.
Aug 7 06:48:08 newhonors2 puppet-agent[860391]: This may mean that the package is missing, has been obsoleted, or
Aug 7 06:48:08 newhonors2 puppet-agent[860391]: is only available from another source
Aug 7 06:48:08 newhonors2 puppet-agent[860391]:
Aug 7 06:48:08 newhonors2 puppet-agent[860391]: W: --force-yes is deprecated, use one of the options starting with --allow instead.
Aug 7 06:48:08 newhonors2 puppet-agent[860391]: E: Version '8.27.0-1+ubuntu24.04' for 'openvox-agent' was not found
Aug 7 06:48:08 newhonors2 puppet-agent[860391]: (/Stage[main]/Puppet::Agent::Install/Package[openvox-agent]/ensure) change from '7.37.2-1+ubuntu24.04' to '8.27.0-1+ubuntu24.04' failed: Could not update: Execution of '/usr/bin/apt-get -q -y -o DPkg::Options::=--force-confold --force-yes install openvox-agent=8.27.0-1+ubuntu24.04' returned 100: Reading package lists...
Aug 7 06:48:08 newhonors2 puppet-agent[860391]: (/Stage[main]/Puppet::Agent::Install/Package[openvox-agent]/ensure) Building dependency tree...
Aug 7 06:48:08 newhonors2 puppet-agent[860391]: (/Stage[main]/Puppet::Agent::Install/Package[openvox-agent]/ensure) Reading state information...
Aug 7 06:48:08 newhonors2 puppet-agent[860391]: (/Stage[main]/Puppet::Agent::Install/Package[openvox-agent]/ensure) Package openvox-agent is not available, but is referred to by another package.
Aug 7 06:48:08 newhonors2 puppet-agent[860391]: (/Stage[main]/Puppet::Agent::Install/Package[openvox-agent]/ensure) This may mean that the package is missing, has been obsoleted, or
Aug 7 06:48:08 newhonors2 puppet-agent[860391]: (/Stage[main]/Puppet::Agent::Install/Package[openvox-agent]/ensure) is only available from another source
Aug 7 06:48:08 newhonors2 puppet-agent[860391]: (/Stage[main]/Puppet::Agent::Install/Package[openvox-agent]/ensure)
Aug 7 06:48:08 newhonors2 puppet-agent[860391]: (/Stage[main]/Puppet::Agent::Install/Package[openvox-agent]/ensure) W: --force-yes is deprecated, use one of the options starting with --allow instead.
Aug 7 06:48:08 newhonors2 puppet-agent[860391]: (/Stage[main]/Puppet::Agent::Install/Package[openvox-agent]/ensure) E: Version '8.27.0-1+ubuntu24.04' for 'openvox-agent' was not found
Aug 7 06:48:33 newhonors2 puppet-agent[860391]: (/Stage[main]/Puppet::Agent::Config/Puppet::Config::Agent[classfile]/Puppet::Config::Entry[agent_classfile]/Concat::Fragment[puppet.conf_agent]/Concat_fragment[puppet.conf_agent]) Skipping because of failed dependencies
Aug 7 06:48:33 newhonors2 puppet-agent[860391]: (/Stage[main]/Puppet::Agent::Config/Puppet::Config::Agent[classfile]/Puppet::Config::Entry[agent_classfile]/Concat::Fragment[puppet.conf_agent_end]/Concat_fragment[puppet.conf_agent_end]) Skipping because of failed dependencies
Aug 7 06:48:33 newhonors2 puppet-agent[860391]: (/Stage[main]/Puppet::Agent::Config/Puppet::Config::Agent[classfile]/Puppet::Config::Entry[agent_classfile]/Concat::Fragment[puppet.conf_agent_classfile]/Concat_fragment[puppet.conf_agent_classfile]) Skipping because of failed dependencies
Aug 7 06:48:33 newhonors2 puppet-agent[860391]: (/Stage[main]/Puppet::Agent::Config/Puppet::Config::Agent[default_schedules]/Puppet::Config::Entry[agent_default_schedules]/Concat::Fragment[puppet.conf_agent_default_schedules]/Concat_fragment[puppet.conf_agent_default_schedules]) Skipping because of failed dependencies
Aug 7 06:48:33 newhonors2 puppet-agent[860391]: (/Stage[main]/Puppet::Agent::Config/Puppet::Config::Agent[report]/Puppet::Config::Entry[agent_report]/Concat::Fragment[puppet.conf_agent_report]/Concat_fragment[puppet.conf_agent_report]) Skipping because of failed dependencies
Aug 7 06:48:33 newhonors2 puppet-agent[860391]: (/Stage[main]/Puppet::Agent::Config/Puppet::Config::Agent[masterport]/Puppet::Config::Entry[agent_masterport]/Concat::Fragment[puppet.conf_agent_masterport]/Concat_fragment[puppet.conf_agent_masterport]) Skipping because of failed dependencies
Aug 7 06:48:33 newhonors2 puppet-agent[860391]: (/Stage[main]/Puppet::Agent::Config/Puppet::Config::Agent[splay]/Puppet::Config::Entry[agent_splay]/Concat::Fragment[puppet.conf_agent_splay]/Concat_fragment[puppet.conf_agent_splay]) Skipping because of failed dependencies
Aug 7 06:48:33 newhonors2 puppet-agent[860391]: (/Stage[main]/Puppet::Agent::Config/Puppet::Config::Agent[splaylimit]/Puppet::Config::Entry[agent_splaylimit]/Concat::Fragment[puppet.conf_agent_splaylimit]/Concat_fragment[puppet.conf_agent_splaylimit]) Skipping because of failed dependencies
Aug 7 06:48:33 newhonors2 puppet-agent[860391]: (/Stage[main]/Puppet::Agent::Config/Puppet::Config::Agent[runinterval]/Puppet::Config::Entry[agent_runinterval]/Concat::Fragment[puppet.conf_agent_runinterval]/Concat_fragment[puppet.conf_agent_runinterval]) Skipping because of failed dependencies
Aug 7 06:48:33 newhonors2 puppet-agent[860391]: (/Stage[main]/Puppet::Agent::Config/Puppet::Config::Agent[noop]/Puppet::Config::Entry[agent_noop]/Concat::Fragment[puppet.conf_agent_noop]/Concat_fragment[puppet.conf_agent_noop]) Skipping because of failed dependencies
Aug 7 06:48:33 newhonors2 puppet-agent[860391]: (/Stage[main]/Puppet::Agent::Config/Puppet::Config::Agent[usecacheonfailure]/Puppet::Config::Entry[agent_usecacheonfailure]/Concat::Fragment[puppet.conf_agent_usecacheonfailure]/Concat_fragment[puppet.conf_agent_usecacheonfailure]) Skipping because of failed dependencies
... 8 more distinct messages not shown
== orchids (105 distinct, 107 total) ==
Aug 7 06:11:31 orchids gnome-software[1516991]: Only 0 apps for recent list, hiding
Aug 7 06:11:53 orchids packagekitd[510441]: Failed to get cache filename for libreoffice
Aug 7 06:11:53 orchids packagekitd[510441]: Failed to get cache filename for cups
Aug 7 06:11:53 orchids packagekitd[510441]: Failed to get cache filename for cups-client
Aug 7 06:11:53 orchids packagekitd[510441]: Failed to get cache filename for cups-filesystem
Aug 7 06:11:53 orchids packagekitd[510441]: Failed to get cache filename for cups-ipptool
Aug 7 06:11:53 orchids packagekitd[510441]: Failed to get cache filename for python-unversioned-command
Aug 7 06:11:53 orchids packagekitd[510441]: Failed to get cache filename for python3-devel
Aug 7 06:11:53 orchids packagekitd[510441]: Failed to get cache filename for pipewire-jack-audio-connection-kit-libs
Aug 7 06:11:53 orchids packagekitd[510441]: Failed to get cache filename for firefox
Aug 7 06:11:53 orchids packagekitd[510441]: Failed to get cache filename for gstreamer1-plugins-bad-free
Aug 7 06:11:53 orchids packagekitd[510441]: Failed to get cache filename for gstreamer1-plugins-bad-free-libs
Aug 7 06:11:53 orchids packagekitd[510441]: Failed to get cache filename for libXfont2
Aug 7 06:11:53 orchids packagekitd[510441]: Failed to get cache filename for pipewire
Aug 7 06:11:53 orchids packagekitd[510441]: Failed to get cache filename for pipewire-alsa
Aug 7 06:11:53 orchids packagekitd[510441]: Failed to get cache filename for pipewire-gstreamer
Aug 7 06:11:53 orchids packagekitd[510441]: Failed to get cache filename for pipewire-jack-audio-connection-kit
Aug 7 06:11:53 orchids packagekitd[510441]: Failed to get cache filename for pipewire-libs
Aug 7 06:11:53 orchids packagekitd[510441]: Failed to get cache filename for pipewire-utils
Aug 7 06:11:53 orchids packagekitd[510441]: Failed to get cache filename for yelp
Aug 7 06:11:53 orchids packagekitd[510441]: Failed to get cache filename for yelp-libs
Aug 7 06:11:53 orchids packagekitd[510441]: Failed to get cache filename for pipewire-pulseaudio
Aug 7 06:11:53 orchids packagekitd[510441]: Failed to get cache filename for vim-common
Aug 7 06:11:53 orchids packagekitd[510441]: Failed to get cache filename for vim-enhanced
Aug 7 06:11:53 orchids packagekitd[510441]: Failed to get cache filename for perl-Archive-Tar
Aug 7 06:11:53 orchids packagekitd[510441]: Failed to get cache filename for glibc-devel
Aug 7 06:11:53 orchids packagekitd[510441]: Failed to get cache filename for glibc-headers
Aug 7 06:11:53 orchids packagekitd[510441]: Failed to get cache filename for perl-DBI
Aug 7 06:11:53 orchids packagekitd[510441]: Failed to get cache filename for p11-kit-server
Aug 7 06:11:53 orchids packagekitd[510441]: Failed to get cache filename for conmon
... 75 more distinct messages not shown
== outbound00.cs.umd.edu (1 distinct, 6 total) ==
Aug 7 06:09:09 outbound00.cs.umd.edu python3[3772967]: ldapdb [x6]
== outbound01.cs.umd.edu (1 distinct, 6 total) ==
Aug 7 06:13:06 outbound01.cs.umd.edu python3[1809553]: ldapdb [x6]
== sentry-docker00.cs.umd.edu (34 distinct, 34 total) ==
Aug 7 06:17:52 sentry-docker00.cs.umd.edu systemd-udevd[3608487]: Could not generate persistent MAC address for vethb70f520: No such file or directory
Aug 7 06:17:52 sentry-docker00.cs.umd.edu systemd-udevd[3608488]: Could not generate persistent MAC address for veth18e9c81: No such file or directory
Aug 7 06:17:52 sentry-docker00.cs.umd.edu systemd-udevd[3608514]: Could not generate persistent MAC address for veth54b7740: No such file or directory
Aug 7 06:17:52 sentry-docker00.cs.umd.edu systemd-udevd[3608513]: Could not generate persistent MAC address for veth241823b: No such file or directory
Aug 7 06:17:52 sentry-docker00.cs.umd.edu systemd-udevd[3608513]: Could not generate persistent MAC address for veth824fd88: No such file or directory
Aug 7 06:17:52 sentry-docker00.cs.umd.edu systemd-udevd[3608517]: Could not generate persistent MAC address for veth9ebe8f2: No such file or directory
Aug 7 06:17:52 sentry-docker00.cs.umd.edu systemd-udevd[3608530]: Could not generate persistent MAC address for veth3d2712a: No such file or directory
Aug 7 06:17:52 sentry-docker00.cs.umd.edu systemd-udevd[3608519]: Could not generate persistent MAC address for veth20e8fde: No such file or directory
Aug 7 06:17:52 sentry-docker00.cs.umd.edu systemd-udevd[3608634]: Could not generate persistent MAC address for veth2460543: No such file or directory
Aug 7 06:17:52 sentry-docker00.cs.umd.edu systemd-udevd[3608635]: Could not generate persistent MAC address for veth31488c7: No such file or directory
Aug 7 06:38:00 sentry-docker00.cs.umd.edu systemd-udevd[3617881]: link_config: could not get ethtool features for veth241823b
Aug 7 06:38:00 sentry-docker00.cs.umd.edu systemd-udevd[3617881]: Could not set offload features of veth241823b: No such device
Aug 7 06:38:00 sentry-docker00.cs.umd.edu systemd-udevd[3617953]: Could not generate persistent MAC address for veth967a022: No such file or directory
Aug 7 06:38:00 sentry-docker00.cs.umd.edu systemd-udevd[3617954]: Could not generate persistent MAC address for vethe51fa5f: No such file or directory
Aug 7 06:38:00 sentry-docker00.cs.umd.edu systemd-udevd[3617957]: Could not generate persistent MAC address for vethdd841e4: No such file or directory
Aug 7 06:38:00 sentry-docker00.cs.umd.edu systemd-udevd[3617958]: Could not generate persistent MAC address for vethafa782b: No such file or directory
Aug 7 06:38:00 sentry-docker00.cs.umd.edu systemd-udevd[3617981]: Could not generate persistent MAC address for veth1ad2c3c: No such file or directory
Aug 7 06:38:00 sentry-docker00.cs.umd.edu systemd-udevd[3617982]: Could not generate persistent MAC address for veth06585f3: No such file or directory
Aug 7 06:38:00 sentry-docker00.cs.umd.edu systemd-udevd[3618000]: Could not generate persistent MAC address for veth8d20fd9: No such file or directory
Aug 7 06:38:00 sentry-docker00.cs.umd.edu systemd-udevd[3617987]: Could not generate persistent MAC address for veth1b76643: No such file or directory
Aug 7 06:38:00 sentry-docker00.cs.umd.edu systemd-udevd[3618009]: Could not generate persistent MAC address for vethf89d58c: No such file or directory
Aug 7 06:38:00 sentry-docker00.cs.umd.edu systemd-udevd[3618010]: Could not generate persistent MAC address for veth179d145: No such file or directory
Aug 7 06:58:08 sentry-docker00.cs.umd.edu systemd-udevd[3628040]: link_config: could not get ethtool features for vethdd841e4
Aug 7 06:58:08 sentry-docker00.cs.umd.edu systemd-udevd[3628040]: Could not set offload features of vethdd841e4: No such device
Aug 7 06:58:09 sentry-docker00.cs.umd.edu systemd-udevd[3628154]: Could not generate persistent MAC address for vethe24eeb0: No such file or directory
Aug 7 06:58:09 sentry-docker00.cs.umd.edu systemd-udevd[3628156]: Could not generate persistent MAC address for veth6a1a63b: No such file or directory
Aug 7 06:58:09 sentry-docker00.cs.umd.edu systemd-udevd[3628165]: Could not generate persistent MAC address for vethaf3bfbb: No such file or directory
Aug 7 06:58:09 sentry-docker00.cs.umd.edu systemd-udevd[3628166]: Could not generate persistent MAC address for veth208d2ee: No such file or directory
Aug 7 06:58:09 sentry-docker00.cs.umd.edu systemd-udevd[3628154]: Could not generate persistent MAC address for veth5a8ad5d: No such file or directory
Aug 7 06:58:09 sentry-docker00.cs.umd.edu systemd-udevd[3628175]: Could not generate persistent MAC address for vethd614333: No such file or directory
... 4 more distinct messages not shown
== strawberry (4 distinct, 10 total) ==
Aug 7 06:09:44 strawberry udisksd[1067]: Error performing housekeeping for drive /org/freedesktop/UDisks2/drives/ST2000DM001_1CH164_W1E8J5KJ: Error updating SMART data: Error sending ATA command CHECK POWER MODE: Unexpected sense data returned:#0120000: 00 00 00 00 00 00 00 00 00 00 00 00 00 00 00 00 ................#0120010: 00 00 00 00 00 00 00 00 00 00 00 00 00 00 00 00 ................#012 (g-io-error-quark, 0) [x6]
Aug 7 06:31:03 strawberry nologin[3754778]: Attempted login by UNKNOWN (UID: 65534) on UNKNOWN
Aug 7 06:31:03 strawberry pipewire[3754777]: mod.jackdbus-detect: Failed to receive jackdbus reply: org.freedesktop.DBus.Error.ServiceUnknown: The name org.jackaudio.service was not provided by any .service files
Aug 7 06:34:42 strawberry smartd[5314]: Device: /dev/sda [SAT], failed to read SMART Attribute Data [x2]
== tlsrpt (1 distinct, 1 total) ==
Aug 7 06:38:03 tlsrpt (httpd)[800150]: httpd.service: Referenced but unset environment variable evaluates to an empty string: OPTIONS
1
0
Command: /usr/local/sbin/syslog-digest.py
Time : 0.9875s
Status : exited 0
Output :
Syslog digest — 2026-08-07 06:05 EDT
Processed 7,663 lines, filtered 4,881 (63%). 2,782 unknown (98 distinct) from 20 host(s).
== abuse (3 distinct, 2261 total) ==
Aug 7 05:05:06 abuse systemd[1]: Failed to load environment files: Input/output error [x687]
Aug 7 05:05:06 abuse systemd[1]: choria-server.service failed to run 'start' task: Input/output error [x687]
Aug 7 05:05:06 abuse rsyslogd[21745]: imjournal: open() failed for path: '/var/lib/rsyslog/imjournal.state.tmp': Input/output error [v8.2404.0 try https://www.rsyslog.com/e/2433 ] [x887]
== b0b02.cs.umd.edu (4 distinct, 4 total) ==
Aug 7 05:47:36 b0b02.cs.umd.edu setroubleshoot[3846127]: SELinux is preventing /usr/bin/python3.9 from getattr access on the file /etc/authselect/nsswitch.conf. For complete SELinux messages run: sealert -l 9a1e2952-3fde-4937-a8ab-f7f59791a458
Aug 7 05:47:38 b0b02.cs.umd.edu setroubleshoot[3846127]: SELinux is preventing /usr/bin/python3.9 from read access on the file /etc/authselect/nsswitch.conf. For complete SELinux messages run: sealert -l 97d74423-e027-4cd6-8810-ad80944900b5
Aug 7 05:47:42 b0b02.cs.umd.edu setroubleshoot[3846127]: SELinux is preventing /usr/bin/python3.9 from open access on the file /etc/authselect/nsswitch.conf. For complete SELinux messages run: sealert -l 4f253f6a-62d6-46dd-8eaf-0b4d29df41c6
Aug 7 05:48:48 b0b02.cs.umd.edu rustdesk[3846294]: cannot open display:
== contest (10 distinct, 45 total) ==
Aug 7 05:05:37 contest goferd[1007]: [ERROR][worker-0] gofer.messaging.adapter.connect:33 - connect: proton+amqps://satellite8.cs.umd.edu:5647, failed: Connection amqps://satellite8.cs.umd.edu:5647 disconnected: Condition('proton.pythonio', 'Connection refused to all addresses') [x34]
Aug 7 05:48:19 contest setroubleshoot[766920]: SELinux is preventing /usr/libexec/platform-python3.6 from create access on the directory libdnf.eQqrOC. For complete SELinux messages run: sealert -l cb6b25c6-4765-4cf2-88a0-9b3b508e94e9
Aug 7 05:48:19 contest setroubleshoot[766920]: SELinux is preventing /usr/bin/gpgconf from add_name access on the directory repodata. For complete SELinux messages run: sealert -l 41cf7b1b-0f34-4609-98f2-b66e7825fef7
Aug 7 05:48:19 contest setroubleshoot[766920]: SELinux is preventing /usr/libexec/platform-python3.6 from create access on the file mirrorlist. For complete SELinux messages run: sealert -l fc20ff92-ea83-4f38-a24b-ddfd737a3141
Aug 7 05:48:19 contest setroubleshoot[766920]: SELinux is preventing /usr/libexec/platform-python3.6 from setattr access on the file repomd.xml. For complete SELinux messages run: sealert -l ac675631-fa35-4e93-adc9-b692b18e53e5 [x2]
Aug 7 05:48:19 contest setroubleshoot[766920]: SELinux is preventing /usr/libexec/platform-python3.6 from read access on the directory libdnf.eQqrOC. For complete SELinux messages run: sealert -l 45d103b6-0810-4890-a705-990118577ce8
Aug 7 05:48:19 contest setroubleshoot[766920]: SELinux is preventing /usr/libexec/platform-python3.6 from remove_name access on the directory repomd.xml. For complete SELinux messages run: sealert -l 7e499113-2fd7-4f67-bec6-3521efbe3637 [x2]
Aug 7 05:48:19 contest setroubleshoot[766920]: SELinux is preventing /usr/libexec/platform-python3.6 from rmdir access on the directory repodata. For complete SELinux messages run: sealert -l 3928930b-a1ed-448d-950b-0665ac2adef8
Aug 7 05:48:21 contest setroubleshoot[766920]: SELinux is preventing /usr/libexec/platform-python3.6 from create access on the file repomd.xml. For complete SELinux messages run: sealert -l fc20ff92-ea83-4f38-a24b-ddfd737a3141
Aug 7 05:48:34 contest setroubleshoot[766980]: SELinux is preventing rhsmcertd-worke from unlink access on the file repomd.xml. For complete SELinux messages run: sealert -l 22835727-7fef-4cfb-b3b5-881f66888317
== csfw00a (1 distinct, 290 total) ==
Aug 7 05:04:53 csfw00a kernel: bnxt_en 0000:09:00.0 eth3: NIC Link is Down [x290]
== grades01.cs.umd.edu (1 distinct, 1 total) ==
Aug 7 05:49:52 grades01.cs.umd.edu puppet-agent[2210]: The directory '/srv/grades' contains 2471 entries, which exceeds the default soft limit 1000 and may cause excessive resource consumption and degraded performance. To remove this warning set a value for `max_files` parameter or consider using an alternate method to manage large directory trees
== hackerman (1 distinct, 1 total) ==
Aug 7 05:19:01 hackerman gnome-software[2060381]: failed to commit changes to dconf: GDBus.Error:org.gtk.GDBus.UnmappedGError.Quark._g_2dfile_2derror_2dquark.Code2: Failed to create file “/adminhomes/sajith/.config/dconf/user.BQFST3”: Permission denied
== idm00 (1 distinct, 1 total) ==
Aug 7 05:51:20 idm00 named[1455]: client @0x7f330c1a9978 10.73.240.42#52119: update '73.10.in-addr.arpa/IN' denied
== idmp0 (1 distinct, 1 total) ==
Aug 7 05:36:02 idmp0 named[5198]: client @0x7f98fc00c058 10.73.240.43#63935: update '73.10.in-addr.arpa/IN' denied
== itmon02 (1 distinct, 55 total) ==
Aug 7 05:08:05 itmon02 sshd[1750555]: error: beginning MaxStartups throttling [x55]
== newhonors2 (1 distinct, 24 total) ==
Aug 7 05:13:03 newhonors2 dhcpcd[857129]: dhcpcd is not running [x24]
== outbound00.cs.umd.edu (1 distinct, 6 total) ==
Aug 7 05:09:09 outbound00.cs.umd.edu python3[3759110]: ldapdb [x6]
== outbound01.cs.umd.edu (2 distinct, 8 total) ==
Aug 7 05:08:18 outbound01.cs.umd.edu python3[1793889]: ldapdb [x7]
Aug 7 05:09:25 outbound01.cs.umd.edu systemd[1]: Configuration file /usr/lib/systemd/system/authentication_milter.service is marked executable. Please remove executable permission bits. Proceeding anyway.
== sentry-docker00.cs.umd.edu (36 distinct, 36 total) ==
Aug 7 05:17:27 sentry-docker00.cs.umd.edu systemd-udevd[3579989]: link_config: could not get ethtool features for veth551d70a
Aug 7 05:17:27 sentry-docker00.cs.umd.edu systemd-udevd[3579989]: Could not set offload features of veth551d70a: No such device
Aug 7 05:17:27 sentry-docker00.cs.umd.edu systemd-udevd[3580005]: Could not generate persistent MAC address for vetha367508: No such file or directory
Aug 7 05:17:27 sentry-docker00.cs.umd.edu systemd-udevd[3580006]: Could not generate persistent MAC address for veth4ade0b5: No such file or directory
Aug 7 05:17:27 sentry-docker00.cs.umd.edu systemd-udevd[3580055]: Could not generate persistent MAC address for veth8283607: No such file or directory
Aug 7 05:17:27 sentry-docker00.cs.umd.edu systemd-udevd[3580056]: Could not generate persistent MAC address for veth3fab831: No such file or directory
Aug 7 05:17:27 sentry-docker00.cs.umd.edu systemd-udevd[3580062]: Could not generate persistent MAC address for veth93c352a: No such file or directory
Aug 7 05:17:27 sentry-docker00.cs.umd.edu systemd-udevd[3580084]: Could not generate persistent MAC address for vethcecb929: No such file or directory
Aug 7 05:17:27 sentry-docker00.cs.umd.edu systemd-udevd[3580074]: Could not generate persistent MAC address for veth200263a: No such file or directory
Aug 7 05:17:27 sentry-docker00.cs.umd.edu systemd-udevd[3580079]: Could not generate persistent MAC address for veth3fdc4bb: No such file or directory
Aug 7 05:17:27 sentry-docker00.cs.umd.edu systemd-udevd[3580154]: Could not generate persistent MAC address for vethbeeda81: No such file or directory
Aug 7 05:17:27 sentry-docker00.cs.umd.edu systemd-udevd[3580152]: Could not generate persistent MAC address for veth2c8df7e: No such file or directory
Aug 7 05:37:35 sentry-docker00.cs.umd.edu systemd-udevd[3589592]: link_config: could not get ethtool features for veth93c352a
Aug 7 05:37:35 sentry-docker00.cs.umd.edu systemd-udevd[3589592]: Could not set offload features of veth93c352a: No such device
Aug 7 05:37:35 sentry-docker00.cs.umd.edu systemd-udevd[3589667]: Could not generate persistent MAC address for veth7198d10: No such file or directory
Aug 7 05:37:35 sentry-docker00.cs.umd.edu systemd-udevd[3589668]: Could not generate persistent MAC address for vethfdd50e1: No such file or directory
Aug 7 05:37:35 sentry-docker00.cs.umd.edu systemd-udevd[3589671]: Could not generate persistent MAC address for vethbaa4f16: No such file or directory
Aug 7 05:37:35 sentry-docker00.cs.umd.edu systemd-udevd[3589672]: Could not generate persistent MAC address for veth7fba3f3: No such file or directory
Aug 7 05:37:35 sentry-docker00.cs.umd.edu systemd-udevd[3589695]: Could not generate persistent MAC address for veth5f9740e: No such file or directory
Aug 7 05:37:35 sentry-docker00.cs.umd.edu systemd-udevd[3589696]: Could not generate persistent MAC address for veth4b5e65a: No such file or directory
Aug 7 05:37:35 sentry-docker00.cs.umd.edu systemd-udevd[3589712]: Could not generate persistent MAC address for veth60b11e3: No such file or directory
Aug 7 05:37:35 sentry-docker00.cs.umd.edu systemd-udevd[3589714]: Could not generate persistent MAC address for veth1913017: No such file or directory
Aug 7 05:37:35 sentry-docker00.cs.umd.edu systemd-udevd[3589712]: Could not generate persistent MAC address for veth24edacf: No such file or directory
Aug 7 05:37:35 sentry-docker00.cs.umd.edu systemd-udevd[3589719]: Could not generate persistent MAC address for vethf938a10: No such file or directory
Aug 7 05:57:43 sentry-docker00.cs.umd.edu systemd-udevd[3598972]: link_config: could not get ethtool features for veth7198d10
Aug 7 05:57:43 sentry-docker00.cs.umd.edu systemd-udevd[3598972]: Could not set offload features of veth7198d10: No such device
Aug 7 05:57:44 sentry-docker00.cs.umd.edu systemd-udevd[3599061]: Could not generate persistent MAC address for veth4b2bf4e: No such file or directory
Aug 7 05:57:44 sentry-docker00.cs.umd.edu systemd-udevd[3599062]: Could not generate persistent MAC address for vethc3b9eac: No such file or directory
Aug 7 05:57:44 sentry-docker00.cs.umd.edu systemd-udevd[3599071]: Could not generate persistent MAC address for veth23b1f34: No such file or directory
Aug 7 05:57:44 sentry-docker00.cs.umd.edu systemd-udevd[3599067]: Could not generate persistent MAC address for veth19c1070: No such file or directory
... 6 more distinct messages not shown
== strawberry (2 distinct, 8 total) ==
Aug 7 05:09:44 strawberry udisksd[1067]: Error performing housekeeping for drive /org/freedesktop/UDisks2/drives/ST2000DM001_1CH164_W1E8J5KJ: Error updating SMART data: Error sending ATA command CHECK POWER MODE: Unexpected sense data returned:#0120000: 00 00 00 00 00 00 00 00 00 00 00 00 00 00 00 00 ................#0120010: 00 00 00 00 00 00 00 00 00 00 00 00 00 00 00 00 ................#012 (g-io-error-quark, 0) [x6]
Aug 7 05:34:42 strawberry smartd[5314]: Device: /dev/sda [SAT], failed to read SMART Attribute Data [x2]
== submit26-b9-2 (10 distinct, 14 total) ==
Aug 7 05:12:53 submit26-b9-2 setroubleshoot[1314988]: SELinux is preventing /usr/bin/python3.9 from create access on the directory /(null). For complete SELinux messages run: sealert -l d506243c-d61e-48f3-b42a-4592c913deb0 [x2]
Aug 7 05:12:53 submit26-b9-2 setroubleshoot[1314988]: SELinux is preventing /usr/bin/python3.9 from add_name access on the directory /(null). For complete SELinux messages run: sealert -l 3b4752ac-1b9a-4af9-a05b-32e4c2eb13ab [x2]
Aug 7 05:12:53 submit26-b9-2 setroubleshoot[1314988]: SELinux is preventing /usr/bin/python3.9 from create access on the file /(null). For complete SELinux messages run: sealert -l 29e5adbd-4381-4467-b40d-a2219101e096
Aug 7 05:12:53 submit26-b9-2 setroubleshoot[1314988]: SELinux is preventing /usr/bin/python3.9 from open access on the file /tmp/libdnf.iEexGv/repodata/repomd.xml. For complete SELinux messages run: sealert -l 1b38f2ec-01ce-4343-8059-ba7494ecc5c4
Aug 7 05:12:53 submit26-b9-2 setroubleshoot[1314988]: SELinux is preventing /usr/bin/python3.9 from setattr access on the file repomd.xml. For complete SELinux messages run: sealert -l e5f9af40-1f63-4924-b012-27ab2a7b2266
Aug 7 05:12:53 submit26-b9-2 setroubleshoot[1314988]: SELinux is preventing /usr/bin/python3.9 from read access on the directory libdnf.iEexGv. For complete SELinux messages run: sealert -l 5c54db87-54a3-4a7c-97b4-b5c48d6c3543
Aug 7 05:12:53 submit26-b9-2 setroubleshoot[1314988]: SELinux is preventing /usr/bin/python3.9 from remove_name access on the directory repomd.xml. For complete SELinux messages run: sealert -l 63cd60e1-1e61-4276-afea-dd8526ffe8b2 [x2]
Aug 7 05:12:53 submit26-b9-2 setroubleshoot[1314988]: SELinux is preventing /usr/bin/python3.9 from unlink access on the file repomd.xml. For complete SELinux messages run: sealert -l 81c7e9ec-e023-4c6d-b1ad-c02a242e655e
Aug 7 05:12:53 submit26-b9-2 setroubleshoot[1314988]: SELinux is preventing /usr/bin/python3.9 from rmdir access on the directory repodata. For complete SELinux messages run: sealert -l 6ae9a597-e123-4d74-8eec-a8ebe0f5e4d0 [x2]
Aug 7 05:12:54 submit26-b9-2 setroubleshoot[1314988]: SELinux is preventing /usr/bin/python3.9 from read access on the directory libdnf.7xVNvQ. For complete SELinux messages run: sealert -l 5c54db87-54a3-4a7c-97b4-b5c48d6c3543
== submit26-b9-3 (9 distinct, 9 total) ==
Aug 7 05:20:40 submit26-b9-3 setroubleshoot[896416]: SELinux is preventing /usr/bin/python3.9 from create access on the directory /(null). For complete SELinux messages run: sealert -l 5b912a44-22fd-4560-b201-2a4e289b73f5
Aug 7 05:20:40 submit26-b9-3 setroubleshoot[896416]: SELinux is preventing /usr/bin/python3.9 from add_name access on the directory /(null). For complete SELinux messages run: sealert -l 7f1df1e4-725e-4953-98eb-1079f908f543
Aug 7 05:20:40 submit26-b9-3 setroubleshoot[896416]: SELinux is preventing /usr/bin/python3.9 from create access on the file /(null). For complete SELinux messages run: sealert -l 40b8852a-f77b-44b4-affe-5f11fa33de43
Aug 7 05:20:40 submit26-b9-3 setroubleshoot[896416]: SELinux is preventing /usr/bin/python3.9 from open access on the file /tmp/libdnf.xVA6a2/repodata/repomd.xml. For complete SELinux messages run: sealert -l 45a8019e-f6b5-4baa-92c1-862594b40d46
Aug 7 05:20:40 submit26-b9-3 setroubleshoot[896416]: SELinux is preventing /usr/bin/python3.9 from setattr access on the file repomd.xml. For complete SELinux messages run: sealert -l e9f0bfff-7784-4126-baa4-2bb06da56591
Aug 7 05:20:40 submit26-b9-3 setroubleshoot[896416]: SELinux is preventing /usr/bin/python3.9 from read access on the directory libdnf.xVA6a2. For complete SELinux messages run: sealert -l 0b17cc3d-cdc6-4fe2-a11f-3892e7c41dc7
Aug 7 05:20:40 submit26-b9-3 setroubleshoot[896416]: SELinux is preventing /usr/bin/python3.9 from remove_name access on the directory repomd.xml. For complete SELinux messages run: sealert -l 10e38c64-b65f-4cdd-901e-4375652d9a42
Aug 7 05:20:40 submit26-b9-3 setroubleshoot[896416]: SELinux is preventing /usr/bin/python3.9 from unlink access on the file repomd.xml. For complete SELinux messages run: sealert -l 7fd9cf72-ef38-48e1-b6aa-b571b26a7b22
Aug 7 05:20:40 submit26-b9-3 setroubleshoot[896416]: SELinux is preventing /usr/bin/python3.9 from rmdir access on the directory repodata. For complete SELinux messages run: sealert -l b9b11116-89bd-4a3c-980c-1d422c5dcee4
== submit26-clnb9 (9 distinct, 12 total) ==
Aug 7 05:31:59 submit26-clnb9 setroubleshoot[1916841]: SELinux is preventing /usr/bin/python3.9 from create access on the directory /(null). For complete SELinux messages run: sealert -l 6783ed2b-5ae4-42b5-975a-4bf50eec4658
Aug 7 05:31:59 submit26-clnb9 setroubleshoot[1916841]: SELinux is preventing /usr/bin/python3.9 from add_name access on the directory /(null). For complete SELinux messages run: sealert -l 9e7fa955-cc30-4804-ac8c-e1779e85946c
Aug 7 05:31:59 submit26-clnb9 setroubleshoot[1916841]: SELinux is preventing /usr/bin/python3.9 from create access on the file /(null). For complete SELinux messages run: sealert -l 69bfa6e3-089c-40ff-9563-fd30787d0774 [x2]
Aug 7 05:31:59 submit26-clnb9 setroubleshoot[1916841]: SELinux is preventing /usr/bin/python3.9 from open access on the file /tmp/libdnf.sGIS6D/repodata/repomd.xml. For complete SELinux messages run: sealert -l 001acdb5-31ef-4e52-b10b-90f467a89ddc [x2]
Aug 7 05:31:59 submit26-clnb9 setroubleshoot[1916841]: SELinux is preventing /usr/bin/python3.9 from setattr access on the file repomd.xml. For complete SELinux messages run: sealert -l edacddcf-16ed-4dc3-8d82-7c597d5dee23 [x2]
Aug 7 05:31:59 submit26-clnb9 setroubleshoot[1916841]: SELinux is preventing /usr/bin/python3.9 from read access on the directory libdnf.sGIS6D. For complete SELinux messages run: sealert -l 62b3782e-4730-4488-8178-94dafe9b552c
Aug 7 05:31:59 submit26-clnb9 setroubleshoot[1916841]: SELinux is preventing /usr/bin/python3.9 from remove_name access on the directory repomd.xml. For complete SELinux messages run: sealert -l 81cb3698-78f8-440a-8e3c-e5d1041e6b78
Aug 7 05:31:59 submit26-clnb9 setroubleshoot[1916841]: SELinux is preventing /usr/bin/python3.9 from unlink access on the file repomd.xml. For complete SELinux messages run: sealert -l 792b472a-115c-4799-9805-fc7436f916b9
Aug 7 05:31:59 submit26-clnb9 setroubleshoot[1916841]: SELinux is preventing /usr/bin/python3.9 from rmdir access on the directory repodata. For complete SELinux messages run: sealert -l 15c83a86-837b-41e2-b662-b39cd4e361cb
== talkhosts9 (1 distinct, 2 total) ==
Aug 7 05:10:21 talkhosts9 setroubleshoot[1847811]: SELinux is preventing /usr/bin/lsof from getattr access on the unix_stream_socket unix_stream_socket. For complete SELinux messages run: sealert -l a6df89b3-c497-469c-8232-c4fde0508abf [x2]
== tma-0 (1 distinct, 1 total) ==
Aug 7 05:25:47 tma-0 sshd[13717]: fatal: ssh_packet_get_string: incomplete message [preauth]
== updates00.cs.umd.edu (3 distinct, 3 total) ==
Aug 7 05:18:26 updates00.cs.umd.edu puppet-agent[8273]: Could not retrieve catalog from remote server: Error 500 on SERVER: Server Error: Function lookup() did not find a value for the name 'vault::kerberos' on node updates00.cs.umd.edu
Aug 7 05:18:26 updates00.cs.umd.edu puppet-agent[8273]: Not using cache on failed catalog
Aug 7 05:18:26 updates00.cs.umd.edu puppet-agent[8273]: Could not retrieve catalog; skipping run
1
0
Command: /usr/local/sbin/syslog-digest.py
Time : 1.2004s
Status : exited 0
Output :
Syslog digest — 2026-08-07 05:05 EDT
Processed 13,861 lines, filtered 11,127 (80%). 2,734 unknown (89 distinct) from 20 host(s).
== abadi-computer (2 distinct, 2 total) ==
Aug 7 04:15:01 abadi-computer nologin[2131773]: Attempted login by UNKNOWN (UID: 65534) on UNKNOWN
Aug 7 04:15:01 abadi-computer pipewire[2131772]: mod.jackdbus-detect: Failed to receive jackdbus reply: org.freedesktop.DBus.Error.ServiceUnknown: The name org.jackaudio.service was not provided by any .service files
== abuse (3 distinct, 2259 total) ==
Aug 7 04:05:04 abuse systemd[1]: Failed to load environment files: Input/output error [x688]
Aug 7 04:05:04 abuse systemd[1]: choria-server.service failed to run 'start' task: Input/output error [x688]
Aug 7 04:05:09 abuse rsyslogd[21745]: imjournal: open() failed for path: '/var/lib/rsyslog/imjournal.state.tmp': Input/output error [v8.2404.0 try https://www.rsyslog.com/e/2433 ] [x883]
== b0b02.cs.umd.edu (4 distinct, 4 total) ==
Aug 7 04:47:30 b0b02.cs.umd.edu setroubleshoot[3830983]: SELinux is preventing /usr/bin/python3.9 from getattr access on the file /etc/authselect/nsswitch.conf. For complete SELinux messages run: sealert -l 9a1e2952-3fde-4937-a8ab-f7f59791a458
Aug 7 04:47:33 b0b02.cs.umd.edu setroubleshoot[3830983]: SELinux is preventing /usr/bin/python3.9 from read access on the file /etc/authselect/nsswitch.conf. For complete SELinux messages run: sealert -l 97d74423-e027-4cd6-8810-ad80944900b5
Aug 7 04:47:36 b0b02.cs.umd.edu setroubleshoot[3830983]: SELinux is preventing /usr/bin/python3.9 from open access on the file /etc/authselect/nsswitch.conf. For complete SELinux messages run: sealert -l 4f253f6a-62d6-46dd-8eaf-0b4d29df41c6
Aug 7 04:48:44 b0b02.cs.umd.edu rustdesk[3831150]: cannot open display:
== cheezit.cs.umd.edu (6 distinct, 12 total) ==
Aug 7 04:19:26 cheezit.cs.umd.edu sshd-session[2015541]: error: kex_protocol_error: type 20 seq 2 [preauth] [x2]
Aug 7 04:19:26 cheezit.cs.umd.edu sshd-session[2015541]: error: kex_protocol_error: type 30 seq 3 [preauth] [x2]
Aug 7 04:19:28 cheezit.cs.umd.edu sshd-session[2015541]: error: kex_protocol_error: type 20 seq 4 [preauth] [x2]
Aug 7 04:19:28 cheezit.cs.umd.edu sshd-session[2015541]: error: kex_protocol_error: type 30 seq 5 [preauth] [x2]
Aug 7 04:19:30 cheezit.cs.umd.edu sshd-session[2015541]: error: kex_protocol_error: type 20 seq 6 [preauth] [x2]
Aug 7 04:19:30 cheezit.cs.umd.edu sshd-session[2015541]: error: kex_protocol_error: type 30 seq 7 [preauth] [x2]
== contest (1 distinct, 33 total) ==
Aug 7 04:06:42 contest goferd[1007]: [ERROR][worker-0] gofer.messaging.adapter.connect:33 - connect: proton+amqps://satellite8.cs.umd.edu:5647, failed: Connection amqps://satellite8.cs.umd.edu:5647 disconnected: Condition('proton.pythonio', 'Connection refused to all addresses') [x33]
== csfw00a (2 distinct, 266 total) ==
Aug 7 04:04:38 csfw00a kernel: bnxt_en 0000:09:00.0 eth3: NIC Link is Down [x254]
Aug 7 04:07:15 csfw00a ospf6d[1477]: [EC 100663307] Could not send entire message [x12]
== dojo (1 distinct, 1 total) ==
Aug 7 04:15:24 dojo nologin[1323872]: Attempted login by UNKNOWN (UID: 65534) on UNKNOWN
== forge00 (1 distinct, 1 total) ==
Aug 7 04:09:03 forge00 (httpd)[2194655]: httpd.service: Referenced but unset environment variable evaluates to an empty string: OPTIONS
== idm00 (1 distinct, 1 total) ==
Aug 7 04:51:20 idm00 named[1455]: client @0x7f33151e0448 10.73.240.42#61016: update '73.10.in-addr.arpa/IN' denied
== idmp0 (1 distinct, 1 total) ==
Aug 7 04:36:02 idmp0 named[5198]: client @0x7f9908014618 10.73.240.43#59500: update '73.10.in-addr.arpa/IN' denied
== itmon02 (1 distinct, 46 total) ==
Aug 7 04:08:09 itmon02 sshd[1750555]: error: beginning MaxStartups throttling [x46]
== matrix (11 distinct, 11 total) ==
Aug 7 04:06:25 matrix systemd[1]: networkd-dispatcher.service: Got notification message from PID 4084109, but reception only permitted for main PID 720
Aug 7 04:06:25 matrix systemd[1]: networkd-dispatcher.service: Got notification message from PID 4084120, but reception only permitted for main PID 720
Aug 7 04:06:33 matrix systemd[1]: networkd-dispatcher.service: Got notification message from PID 4084194, but reception only permitted for main PID 720
Aug 7 04:06:33 matrix systemd[1]: networkd-dispatcher.service: Got notification message from PID 4084201, but reception only permitted for main PID 720
Aug 7 04:06:33 matrix networkctl[4084214]: Interface "vethce2c45c" not found.
Aug 7 04:06:33 matrix systemd[1]: networkd-dispatcher.service: Got notification message from PID 4084274, but reception only permitted for main PID 720
Aug 7 04:06:33 matrix systemd[1]: networkd-dispatcher.service: Got notification message from PID 4084282, but reception only permitted for main PID 720
Aug 7 04:06:43 matrix systemd[1]: networkd-dispatcher.service: Got notification message from PID 4084416, but reception only permitted for main PID 720
Aug 7 04:06:43 matrix systemd[1]: networkd-dispatcher.service: Got notification message from PID 4084422, but reception only permitted for main PID 720
Aug 7 04:06:43 matrix networkctl[4084432]: Interface "vethf639ad3" not found.
Aug 7 04:06:43 matrix systemd[1]: networkd-dispatcher.service: Got notification message from PID 4084432, but reception only permitted for main PID 720
== netman.cs.umd.edu (3 distinct, 3 total) ==
Aug 7 04:30:01 netman.cs.umd.edu setroubleshoot[1914587]: SELinux is preventing /usr/bin/gpg from read access on the file gpg.conf. For complete SELinux messages run: sealert -l 019ad1da-a874-4814-8037-3b3e5f413ad2
Aug 7 04:30:02 netman.cs.umd.edu setroubleshoot[1914587]: SELinux is preventing /usr/bin/gpg from open access on the file /root/.gnupg/gpg.conf. For complete SELinux messages run: sealert -l cb54177e-d44c-46a1-b246-5c0bbb8343be
Aug 7 04:30:02 netman.cs.umd.edu setroubleshoot[1914587]: SELinux is preventing /usr/bin/gpg from getattr access on the file /root/.gnupg/gpg.conf. For complete SELinux messages run: sealert -l fbba2e30-b7ab-491c-9ec6-f553e9ef72af
== newhonors2 (1 distinct, 24 total) ==
Aug 7 04:13:03 newhonors2 dhcpcd[855261]: dhcpcd is not running [x24]
== outbound00.cs.umd.edu (1 distinct, 6 total) ==
Aug 7 04:09:09 outbound00.cs.umd.edu python3[3745206]: ldapdb [x6]
== outbound01.cs.umd.edu (1 distinct, 6 total) ==
Aug 7 04:13:06 outbound01.cs.umd.edu python3[1780753]: ldapdb [x6]
== sentry-docker00.cs.umd.edu (34 distinct, 34 total) ==
Aug 7 04:17:02 sentry-docker00.cs.umd.edu systemd-udevd[3551735]: link_config: could not get ethtool features for vethfc2bba2
Aug 7 04:17:02 sentry-docker00.cs.umd.edu systemd-udevd[3551735]: Could not set offload features of vethfc2bba2: No such device
Aug 7 04:17:02 sentry-docker00.cs.umd.edu systemd-udevd[3551809]: Could not generate persistent MAC address for vethc85e8a0: No such file or directory
Aug 7 04:17:02 sentry-docker00.cs.umd.edu systemd-udevd[3551810]: Could not generate persistent MAC address for veth40f82e4: No such file or directory
Aug 7 04:17:02 sentry-docker00.cs.umd.edu systemd-udevd[3551813]: Could not generate persistent MAC address for veth45b42e8: No such file or directory
Aug 7 04:17:02 sentry-docker00.cs.umd.edu systemd-udevd[3551831]: Could not generate persistent MAC address for veth53ba3a3: No such file or directory
Aug 7 04:17:02 sentry-docker00.cs.umd.edu systemd-udevd[3551832]: Could not generate persistent MAC address for veth7a2dfdf: No such file or directory
Aug 7 04:17:02 sentry-docker00.cs.umd.edu systemd-udevd[3551830]: Could not generate persistent MAC address for vethff49284: No such file or directory
Aug 7 04:17:02 sentry-docker00.cs.umd.edu systemd-udevd[3551824]: Could not generate persistent MAC address for vethe0faa6b: No such file or directory
Aug 7 04:17:02 sentry-docker00.cs.umd.edu systemd-udevd[3551833]: Could not generate persistent MAC address for veth4ca49cc: No such file or directory
Aug 7 04:17:02 sentry-docker00.cs.umd.edu systemd-udevd[3551831]: Could not generate persistent MAC address for veth437068e: No such file or directory
Aug 7 04:17:02 sentry-docker00.cs.umd.edu systemd-udevd[3551834]: Could not generate persistent MAC address for veth944d63f: No such file or directory
Aug 7 04:37:10 sentry-docker00.cs.umd.edu systemd-udevd[3561188]: Could not generate persistent MAC address for vethfd1ad54: No such file or directory
Aug 7 04:37:10 sentry-docker00.cs.umd.edu systemd-udevd[3561189]: Could not generate persistent MAC address for vethb595693: No such file or directory
Aug 7 04:37:10 sentry-docker00.cs.umd.edu systemd-udevd[3561192]: Could not generate persistent MAC address for veth24a512c: No such file or directory
Aug 7 04:37:10 sentry-docker00.cs.umd.edu systemd-udevd[3561214]: Could not generate persistent MAC address for vethe768683: No such file or directory
Aug 7 04:37:10 sentry-docker00.cs.umd.edu systemd-udevd[3561201]: Could not generate persistent MAC address for vethb3ad4d3: No such file or directory
Aug 7 04:37:10 sentry-docker00.cs.umd.edu systemd-udevd[3561210]: Could not generate persistent MAC address for veth883e1ee: No such file or directory
Aug 7 04:37:10 sentry-docker00.cs.umd.edu systemd-udevd[3561207]: Could not generate persistent MAC address for veth3774b78: No such file or directory
Aug 7 04:37:10 sentry-docker00.cs.umd.edu systemd-udevd[3561202]: Could not generate persistent MAC address for veth8e57614: No such file or directory
Aug 7 04:37:10 sentry-docker00.cs.umd.edu systemd-udevd[3561301]: Could not generate persistent MAC address for veth4cf6757: No such file or directory
Aug 7 04:37:10 sentry-docker00.cs.umd.edu systemd-udevd[3561300]: Could not generate persistent MAC address for veth328ff56: No such file or directory
Aug 7 04:57:18 sentry-docker00.cs.umd.edu systemd-udevd[3570556]: link_config: could not get ethtool features for veth8e57614
Aug 7 04:57:18 sentry-docker00.cs.umd.edu systemd-udevd[3570556]: Could not set offload features of veth8e57614: No such device
Aug 7 04:57:19 sentry-docker00.cs.umd.edu systemd-udevd[3570588]: Could not generate persistent MAC address for vethd9e6a38: No such file or directory
Aug 7 04:57:19 sentry-docker00.cs.umd.edu systemd-udevd[3570589]: Could not generate persistent MAC address for vethabf8c45: No such file or directory
Aug 7 04:57:19 sentry-docker00.cs.umd.edu systemd-udevd[3570592]: Could not generate persistent MAC address for vethf033d87: No such file or directory
Aug 7 04:57:19 sentry-docker00.cs.umd.edu systemd-udevd[3570593]: Could not generate persistent MAC address for veth0b684f5: No such file or directory
Aug 7 04:57:19 sentry-docker00.cs.umd.edu systemd-udevd[3570617]: Could not generate persistent MAC address for veth4449598: No such file or directory
Aug 7 04:57:19 sentry-docker00.cs.umd.edu systemd-udevd[3570616]: Could not generate persistent MAC address for veth6456b7f: No such file or directory
... 4 more distinct messages not shown
== smokeping-slave (1 distinct, 1 total) ==
Aug 7 04:15:01 smokeping-slave nologin[1089647]: Attempted login by UNKNOWN (UID: 65534) on UNKNOWN
== strawberry (4 distinct, 10 total) ==
Aug 7 04:09:44 strawberry udisksd[1067]: Error performing housekeeping for drive /org/freedesktop/UDisks2/drives/ST2000DM001_1CH164_W1E8J5KJ: Error updating SMART data: Error sending ATA command CHECK POWER MODE: Unexpected sense data returned:#0120000: 00 00 00 00 00 00 00 00 00 00 00 00 00 00 00 00 ................#0120010: 00 00 00 00 00 00 00 00 00 00 00 00 00 00 00 00 ................#012 (g-io-error-quark, 0) [x6]
Aug 7 04:15:03 strawberry nologin[3746070]: Attempted login by UNKNOWN (UID: 65534) on UNKNOWN
Aug 7 04:15:03 strawberry pipewire[3746069]: mod.jackdbus-detect: Failed to receive jackdbus reply: org.freedesktop.DBus.Error.ServiceUnknown: The name org.jackaudio.service was not provided by any .service files
Aug 7 04:34:42 strawberry smartd[5314]: Device: /dev/sda [SAT], failed to read SMART Attribute Data [x2]
== submit26-b9-4 (10 distinct, 13 total) ==
Aug 7 04:16:14 submit26-b9-4 setroubleshoot[1300969]: SELinux is preventing /usr/bin/python3.9 from create access on the directory /(null). For complete SELinux messages run: sealert -l a4e66030-8621-4da9-bd27-5988bb1bf8ad
Aug 7 04:16:14 submit26-b9-4 setroubleshoot[1300969]: SELinux is preventing /usr/bin/python3.9 from add_name access on the directory /(null). For complete SELinux messages run: sealert -l c055e37d-bbf5-4800-9083-d606f792c8c1
Aug 7 04:16:14 submit26-b9-4 setroubleshoot[1300969]: SELinux is preventing /usr/bin/python3.9 from create access on the file /(null). For complete SELinux messages run: sealert -l e5bc3a56-6d6f-4776-954f-ddde1579648f [x2]
Aug 7 04:16:14 submit26-b9-4 setroubleshoot[1300969]: SELinux is preventing /usr/bin/python3.9 from open access on the file /tmp/libdnf.iOPpBU/repodata/repomd.xml. For complete SELinux messages run: sealert -l a8ec5e1b-49f9-4fbc-a8ae-22e800f7abf2
Aug 7 04:16:14 submit26-b9-4 setroubleshoot[1300969]: SELinux is preventing /usr/bin/python3.9 from setattr access on the file repomd.xml. For complete SELinux messages run: sealert -l 945db714-d0c0-4402-911e-932978b8b036 [x2]
Aug 7 04:16:15 submit26-b9-4 setroubleshoot[1300969]: SELinux is preventing /usr/bin/python3.9 from read access on the directory libdnf.iOPpBU. For complete SELinux messages run: sealert -l 463998a0-fb0d-463c-82b1-471135710a14
Aug 7 04:16:15 submit26-b9-4 setroubleshoot[1300969]: SELinux is preventing /usr/bin/python3.9 from remove_name access on the directory repomd.xml. For complete SELinux messages run: sealert -l 473d2e21-15d8-407a-a9ee-2b842607fa00
Aug 7 04:16:15 submit26-b9-4 setroubleshoot[1300969]: SELinux is preventing /usr/bin/python3.9 from unlink access on the file repomd.xml. For complete SELinux messages run: sealert -l 80c54d4f-bf4b-4501-addb-1627383587d0 [x2]
Aug 7 04:16:15 submit26-b9-4 setroubleshoot[1300969]: SELinux is preventing /usr/bin/python3.9 from rmdir access on the directory repodata. For complete SELinux messages run: sealert -l c63d3890-151e-49a0-83f0-3dfb69d051e5
Aug 7 04:16:15 submit26-b9-4 setroubleshoot[1300969]: SELinux is preventing /usr/bin/python3.9 from open access on the file /tmp/libdnf.6btFyD/repodata/repomd.xml. For complete SELinux messages run: sealert -l a8ec5e1b-49f9-4fbc-a8ae-22e800f7abf2
1
0
Command: /usr/local/sbin/syslog-digest.py
Time : 0.9982s
Status : exited 0
Output :
Syslog digest — 2026-08-07 04:05 EDT
Processed 7,770 lines, filtered 5,016 (64%). 2,754 unknown (115 distinct) from 24 host(s).
== abuse (3 distinct, 2256 total) ==
Aug 7 03:05:06 abuse systemd[1]: Failed to load environment files: Input/output error [x687]
Aug 7 03:05:06 abuse systemd[1]: choria-server.service failed to run 'start' task: Input/output error [x687]
Aug 7 03:05:11 abuse rsyslogd[21745]: imjournal: open() failed for path: '/var/lib/rsyslog/imjournal.state.tmp': Input/output error [v8.2404.0 try https://www.rsyslog.com/e/2433 ] [x882]
== b0b02.cs.umd.edu (4 distinct, 4 total) ==
Aug 7 03:47:25 b0b02.cs.umd.edu setroubleshoot[3815608]: SELinux is preventing /usr/bin/python3.9 from getattr access on the file /etc/authselect/nsswitch.conf. For complete SELinux messages run: sealert -l 9a1e2952-3fde-4937-a8ab-f7f59791a458
Aug 7 03:47:28 b0b02.cs.umd.edu setroubleshoot[3815608]: SELinux is preventing /usr/bin/python3.9 from read access on the file /etc/authselect/nsswitch.conf. For complete SELinux messages run: sealert -l 97d74423-e027-4cd6-8810-ad80944900b5
Aug 7 03:47:30 b0b02.cs.umd.edu setroubleshoot[3815608]: SELinux is preventing /usr/bin/python3.9 from open access on the file /etc/authselect/nsswitch.conf. For complete SELinux messages run: sealert -l 4f253f6a-62d6-46dd-8eaf-0b4d29df41c6
Aug 7 03:48:42 b0b02.cs.umd.edu rustdesk[3815781]: cannot open display:
== bachata (10 distinct, 10 total) ==
Aug 7 03:18:34 bachata smbd[2605692]: [2026/08/07 03:18:34.872768, 0] ../../source3/smbd/smb2_service.c:117(chdir_current_service)
Aug 7 03:18:34 bachata smbd[2605692]: chdir_current_service: vfs_ChDir(/fs/junkfood/mount) failed: Permission denied. Current token: uid=11255, gid=11255, 12 groups: 11255 319000009 25038 15294 15229 755 25030 25025 30880 25029 770 15026
Aug 7 03:18:34 bachata smbd[2605692]: [2026/08/07 03:18:34.875248, 0] ../../source3/smbd/smbXsrv_tcon.c:914(smbXsrv_tcon_disconnect)
Aug 7 03:18:34 bachata smbd[2605692]: smbXsrv_tcon_disconnect: disconnect(0xa1677e06, 'mount'): chdir_current_service() failed: NT_STATUS_INTERNAL_ERROR
Aug 7 03:18:34 bachata smbd[2605692]: [2026/08/07 03:18:34.875517, 0] ../../source3/smbd/smbXsrv_tcon.c:1028(smbXsrv_tcon_disconnect_all)
Aug 7 03:18:34 bachata smbd[2605692]: smbXsrv_tcon_disconnect_all: count[2] errors[1] first[NT_STATUS_INTERNAL_ERROR]
Aug 7 03:18:34 bachata smbd[2605692]: [2026/08/07 03:18:34.875577, 0] ../../source3/smbd/smbXsrv_session.c:1900(smbXsrv_session_logoff)
Aug 7 03:18:34 bachata smbd[2605692]: smbXsrv_session_logoff: smbXsrv_session_logoff(0x007ebf95): smb2srv_tcon_disconnect_all() failed: NT_STATUS_INTERNAL_ERROR
Aug 7 03:18:34 bachata smbd[2605692]: [2026/08/07 03:18:34.875646, 0] ../../source3/smbd/smbXsrv_session.c:1728(smbXsrv_session_remove_channel_done)
Aug 7 03:18:34 bachata smbd[2605692]: smbXsrv_session_remove_channel_done: smbXsrv_session_logoff(8306581) failed: NT_STATUS_INTERNAL_ERROR
== biggulp.cs.umd.edu (17 distinct, 32 total) ==
Aug 7 03:23:28 biggulp.cs.umd.edu sshd-session[3653354]: pam_access(sshd:auth): access denied for user `root' from `171.243.150.99' [x2]
Aug 7 03:23:31 biggulp.cs.umd.edu sshd-session[3653348]: error: PAM: Authentication failure for root from 171.243.150.99 [x2]
Aug 7 03:25:04 biggulp.cs.umd.edu sshd-session[3653502]: pam_access(sshd:auth): access denied for user `admin' from `171.243.150.99' [x5]
Aug 7 03:25:04 biggulp.cs.umd.edu krb5_child[3653504]: Client 'admin(a)UMD.EDU' not found in Kerberos database [x6]
Aug 7 03:25:04 biggulp.cs.umd.edu sshd-session[3653500]: error: PAM: System error for admin from 171.243.150.99 [x5]
Aug 7 03:47:00 biggulp.cs.umd.edu sshd-session[3658061]: pam_access(sshd:auth): access denied for user `admin' from `116.99.168.223'
Aug 7 03:47:04 biggulp.cs.umd.edu sshd-session[3658051]: error: PAM: System error for admin from 116.99.168.223
Aug 7 03:53:51 biggulp.cs.umd.edu sshd-session[3659038]: pam_access(sshd:auth): access denied for user `ftp' from `171.243.150.99'
Aug 7 03:53:53 biggulp.cs.umd.edu sshd-session[3659009]: error: PAM: Authentication failure for ftp from 171.243.150.99
Aug 7 03:56:37 biggulp.cs.umd.edu sshd-session[3660260]: pam_access(sshd:auth): access denied for user `operator' from `171.243.150.99'
Aug 7 03:56:40 biggulp.cs.umd.edu sshd-session[3660254]: error: PAM: Authentication failure for operator from 171.243.150.99
Aug 7 04:03:48 biggulp.cs.umd.edu sshd-session[3661391]: error: kex_protocol_error: type 20 seq 2 [preauth]
Aug 7 04:03:48 biggulp.cs.umd.edu sshd-session[3661391]: error: kex_protocol_error: type 30 seq 3 [preauth]
Aug 7 04:03:50 biggulp.cs.umd.edu sshd-session[3661391]: error: kex_protocol_error: type 20 seq 4 [preauth]
Aug 7 04:03:50 biggulp.cs.umd.edu sshd-session[3661391]: error: kex_protocol_error: type 30 seq 5 [preauth]
Aug 7 04:03:52 biggulp.cs.umd.edu sshd-session[3661391]: error: kex_protocol_error: type 20 seq 6 [preauth]
Aug 7 04:03:52 biggulp.cs.umd.edu sshd-session[3661391]: error: kex_protocol_error: type 30 seq 7 [preauth]
== cheezit.cs.umd.edu (9 distinct, 21 total) ==
Aug 7 03:05:47 cheezit.cs.umd.edu sshd-session[1998724]: pam_access(sshd:auth): access denied for user `root' from `116.99.168.223' [x2]
Aug 7 03:05:50 cheezit.cs.umd.edu sshd-session[1998140]: error: PAM: Authentication failure for root from 116.99.168.223 [x2]
Aug 7 03:24:44 cheezit.cs.umd.edu sshd-session[2002280]: pam_access(sshd:auth): access denied for user `admin' from `116.99.168.223' [x3]
Aug 7 03:24:44 cheezit.cs.umd.edu krb5_child[2002282]: Client 'admin(a)UMD.EDU' not found in Kerberos database [x5]
Aug 7 03:24:44 cheezit.cs.umd.edu sshd-session[2002273]: error: PAM: System error for admin from 116.99.168.223 [x3]
Aug 7 03:45:00 cheezit.cs.umd.edu sshd-session[2007352]: pam_access(sshd:auth): access denied for user `admin' from `171.243.150.99' [x2]
Aug 7 03:45:01 cheezit.cs.umd.edu sshd-session[2007324]: error: PAM: System error for admin from 171.243.150.99 [x2]
Aug 7 03:53:00 cheezit.cs.umd.edu sshd-session[2009246]: pam_access(sshd:auth): access denied for user `ftp' from `171.243.150.99'
Aug 7 03:53:03 cheezit.cs.umd.edu sshd-session[2009219]: error: PAM: Authentication failure for ftp from 171.243.150.99
== contest (1 distinct, 34 total) ==
Aug 7 03:06:00 contest goferd[1007]: [ERROR][worker-0] gofer.messaging.adapter.connect:33 - connect: proton+amqps://satellite8.cs.umd.edu:5647, failed: Connection amqps://satellite8.cs.umd.edu:5647 disconnected: Condition('proton.pythonio', 'Connection refused to all addresses') [x34]
== csfw00a (1 distinct, 214 total) ==
Aug 7 03:05:06 csfw00a kernel: bnxt_en 0000:09:00.0 eth3: NIC Link is Down [x214]
== hackerman (1 distinct, 1 total) ==
Aug 7 03:19:01 hackerman gnome-software[2060381]: failed to commit changes to dconf: GDBus.Error:org.gtk.GDBus.UnmappedGError.Quark._g_2dfile_2derror_2dquark.Code2: Failed to create file “/adminhomes/sajith/.config/dconf/user.5PWWT3”: Permission denied
== idm00 (1 distinct, 1 total) ==
Aug 7 03:51:20 idm00 named[1455]: client @0x7f330c465cd8 10.73.240.42#56447: update '73.10.in-addr.arpa/IN' denied
== idmp0 (1 distinct, 1 total) ==
Aug 7 03:36:02 idmp0 named[5198]: client @0x7f98e88b6d98 10.73.240.43#51234: update '73.10.in-addr.arpa/IN' denied
== itmon02 (2 distinct, 33 total) ==
Aug 7 03:13:10 itmon02 sshd[1750555]: error: beginning MaxStartups throttling [x32]
Aug 7 03:15:03 itmon02 (httpd)[3040574]: httpd.service: Referenced but unset environment variable evaluates to an empty string: OPTIONS
== kadath.cs.umd.edu (1 distinct, 1 total) ==
Aug 7 03:47:30 kadath.cs.umd.edu puppet-agent[2668149]: (Facter) invalid or malformed lldp data: MalformedDataError: no lldp interface data found
== krispykreme.cs.umd.edu (13 distinct, 28 total) ==
Aug 7 03:05:22 krispykreme.cs.umd.edu sshd-session[151546]: pam_access(sshd:auth): access denied for user `root' from `116.99.168.223'
Aug 7 03:05:25 krispykreme.cs.umd.edu sshd-session[151511]: error: PAM: Authentication failure for root from 116.99.168.223
Aug 7 03:21:10 krispykreme.cs.umd.edu sshd-session[155950]: pam_access(sshd:auth): access denied for user `root' from `171.243.150.99' [x2]
Aug 7 03:21:13 krispykreme.cs.umd.edu sshd-session[155933]: error: PAM: Authentication failure for root from 171.243.150.99 [x2]
Aug 7 03:38:00 krispykreme.cs.umd.edu sshd-session[160425]: pam_access(sshd:auth): access denied for user `admin' from `116.99.168.223' [x2]
Aug 7 03:38:00 krispykreme.cs.umd.edu krb5_child[160427]: Client 'admin(a)UMD.EDU' not found in Kerberos database [x6]
Aug 7 03:38:00 krispykreme.cs.umd.edu sshd-session[160421]: error: PAM: System error for admin from 116.99.168.223 [x2]
Aug 7 03:39:31 krispykreme.cs.umd.edu sshd-session[160590]: pam_access(sshd:auth): access denied for user `admin' from `171.243.150.99' [x4]
Aug 7 03:39:32 krispykreme.cs.umd.edu sshd-session[160562]: error: PAM: System error for admin from 171.243.150.99 [x4]
Aug 7 03:54:42 krispykreme.cs.umd.edu sshd-session[164399]: pam_access(sshd:auth): access denied for user `ftp' from `171.243.150.99'
Aug 7 03:54:44 krispykreme.cs.umd.edu sshd-session[164397]: error: PAM: Authentication failure for ftp from 171.243.150.99
Aug 7 03:55:53 krispykreme.cs.umd.edu sshd-session[165745]: pam_access(sshd:auth): access denied for user `operator' from `116.99.168.223'
Aug 7 03:55:56 krispykreme.cs.umd.edu sshd-session[165739]: error: PAM: Authentication failure for operator from 116.99.168.223
== munin (2 distinct, 4 total) ==
Aug 7 03:27:57 munin sudo[2982814]: pam_systemd(sudo:session): Failed to stat() runtime directory '/run/user/0': No such file or directory [x2]
Aug 7 03:27:57 munin sudo[2982814]: pam_systemd(sudo:session): Not setting $XDG_RUNTIME_DIR, as the directory is not in order. [x2]
== netbox (1 distinct, 1 total) ==
Aug 7 03:08:02 netbox (httpd)[2027199]: httpd.service: Referenced but unset environment variable evaluates to an empty string: OPTIONS
== netman.cs.umd.edu (1 distinct, 10 total) ==
Aug 7 03:25:58 netman.cs.umd.edu krb5_child[1897066]: Client 'admin(a)UMD.EDU' not found in Kerberos database [x10]
== newhonors2 (1 distinct, 24 total) ==
Aug 7 03:13:02 newhonors2 dhcpcd[853420]: dhcpcd is not running [x24]
== outbound00.cs.umd.edu (3 distinct, 16 total) ==
Aug 7 03:09:09 outbound00.cs.umd.edu python3[3730513]: ldapdb [x7]
Aug 7 03:24:09 outbound00.cs.umd.edu systemd[1]: Configuration file /usr/lib/systemd/system/authentication_milter.service is marked executable. Please remove executable permission bits. Proceeding anyway.
Aug 7 03:26:40 outbound00.cs.umd.edu krb5_child[3735527]: Client 'admin(a)UMD.EDU' not found in Kerberos database [x8]
== outbound01.cs.umd.edu (2 distinct, 13 total) ==
Aug 7 03:13:06 outbound01.cs.umd.edu python3[1766817]: ldapdb [x6]
Aug 7 03:35:53 outbound01.cs.umd.edu krb5_child[1772469]: Client 'admin(a)UMD.EDU' not found in Kerberos database [x7]
== sentry-docker00.cs.umd.edu (36 distinct, 36 total) ==
Aug 7 03:16:37 sentry-docker00.cs.umd.edu systemd-udevd[3523339]: link_config: could not get ethtool features for vetha9840e9
Aug 7 03:16:37 sentry-docker00.cs.umd.edu systemd-udevd[3523339]: Could not set offload features of vetha9840e9: No such device
Aug 7 03:16:37 sentry-docker00.cs.umd.edu systemd-udevd[3523342]: link_config: could not get ethtool features for veth7db82f4
Aug 7 03:16:37 sentry-docker00.cs.umd.edu systemd-udevd[3523342]: Could not set offload features of veth7db82f4: No such device
Aug 7 03:16:37 sentry-docker00.cs.umd.edu systemd-udevd[3523378]: Could not generate persistent MAC address for veth8f8c64b: No such file or directory
Aug 7 03:16:37 sentry-docker00.cs.umd.edu systemd-udevd[3523379]: Could not generate persistent MAC address for veth19f3d08: No such file or directory
Aug 7 03:16:37 sentry-docker00.cs.umd.edu systemd-udevd[3523382]: Could not generate persistent MAC address for veth5bca678: No such file or directory
Aug 7 03:16:37 sentry-docker00.cs.umd.edu systemd-udevd[3523383]: Could not generate persistent MAC address for vethadcb447: No such file or directory
Aug 7 03:16:37 sentry-docker00.cs.umd.edu systemd-udevd[3523391]: Could not generate persistent MAC address for veth6a62697: No such file or directory
Aug 7 03:16:37 sentry-docker00.cs.umd.edu systemd-udevd[3523401]: Could not generate persistent MAC address for vethc753c5d: No such file or directory
Aug 7 03:16:37 sentry-docker00.cs.umd.edu systemd-udevd[3523408]: Could not generate persistent MAC address for veth2a8ae3d: No such file or directory
Aug 7 03:16:37 sentry-docker00.cs.umd.edu systemd-udevd[3523409]: Could not generate persistent MAC address for vethaecbb8e: No such file or directory
Aug 7 03:16:37 sentry-docker00.cs.umd.edu systemd-udevd[3523451]: Could not generate persistent MAC address for veth2c12c26: No such file or directory
Aug 7 03:16:37 sentry-docker00.cs.umd.edu systemd-udevd[3523452]: Could not generate persistent MAC address for veth9fc6b5b: No such file or directory
Aug 7 03:36:45 sentry-docker00.cs.umd.edu systemd-udevd[3532785]: link_config: could not get ethtool features for veth2a8ae3d
Aug 7 03:36:45 sentry-docker00.cs.umd.edu systemd-udevd[3532785]: Could not set offload features of veth2a8ae3d: No such device
Aug 7 03:36:45 sentry-docker00.cs.umd.edu systemd-udevd[3532818]: Could not generate persistent MAC address for vethc66ddb2: No such file or directory
Aug 7 03:36:45 sentry-docker00.cs.umd.edu systemd-udevd[3532819]: Could not generate persistent MAC address for veth92ca752: No such file or directory
Aug 7 03:36:45 sentry-docker00.cs.umd.edu systemd-udevd[3532822]: Could not generate persistent MAC address for vethdf5012d: No such file or directory
Aug 7 03:36:45 sentry-docker00.cs.umd.edu systemd-udevd[3532823]: Could not generate persistent MAC address for vethfab6691: No such file or directory
Aug 7 03:36:46 sentry-docker00.cs.umd.edu systemd-udevd[3532831]: Could not generate persistent MAC address for veth14332f8: No such file or directory
Aug 7 03:36:46 sentry-docker00.cs.umd.edu systemd-udevd[3532818]: Could not generate persistent MAC address for vethea3dd38: No such file or directory
Aug 7 03:36:46 sentry-docker00.cs.umd.edu systemd-udevd[3532837]: Could not generate persistent MAC address for veth776fa81: No such file or directory
Aug 7 03:36:46 sentry-docker00.cs.umd.edu systemd-udevd[3532828]: Could not generate persistent MAC address for veth46d11f5: No such file or directory
Aug 7 03:36:46 sentry-docker00.cs.umd.edu systemd-udevd[3532901]: Could not generate persistent MAC address for vethde94f3a: No such file or directory
Aug 7 03:36:46 sentry-docker00.cs.umd.edu systemd-udevd[3532900]: Could not generate persistent MAC address for veth4da3ae8: No such file or directory
Aug 7 03:56:54 sentry-docker00.cs.umd.edu systemd-udevd[3542208]: Could not generate persistent MAC address for vethfc2bba2: No such file or directory
Aug 7 03:56:54 sentry-docker00.cs.umd.edu systemd-udevd[3542209]: Could not generate persistent MAC address for vethafa326e: No such file or directory
Aug 7 03:56:54 sentry-docker00.cs.umd.edu systemd-udevd[3542212]: Could not generate persistent MAC address for veth3972b1c: No such file or directory
Aug 7 03:56:54 sentry-docker00.cs.umd.edu systemd-udevd[3542213]: Could not generate persistent MAC address for veth8c51838: No such file or directory
... 6 more distinct messages not shown
== strawberry (2 distinct, 8 total) ==
Aug 7 03:09:44 strawberry udisksd[1067]: Error performing housekeeping for drive /org/freedesktop/UDisks2/drives/ST2000DM001_1CH164_W1E8J5KJ: Error updating SMART data: Error sending ATA command CHECK POWER MODE: Unexpected sense data returned:#0120000: 00 00 00 00 00 00 00 00 00 00 00 00 00 00 00 00 ................#0120010: 00 00 00 00 00 00 00 00 00 00 00 00 00 00 00 00 ................#012 (g-io-error-quark, 0) [x6]
Aug 7 03:34:42 strawberry smartd[5314]: Device: /dev/sda [SAT], failed to read SMART Attribute Data [x2]
== submit26-b9-2 (1 distinct, 1 total) ==
Aug 7 03:20:06 submit26-b9-2 systemd[1]: user(a)1001.service: Main process exited, code=killed, status=9/KILL
== teaching-awards (1 distinct, 4 total) ==
Aug 7 03:24:32 teaching-awards krb5_child[2050039]: Client 'admin(a)UMD.EDU' not found in Kerberos database [x4]
== wraith (1 distinct, 1 total) ==
Aug 7 03:46:47 wraith kernel: workqueue: output_poll_execute hogged CPU for >10000us 2051 times, consider switching to WQ_UNBOUND
1
0
Command: /usr/local/sbin/syslog-digest.py
Time : 0.9912s
Status : exited 0
Output :
Syslog digest — 2026-08-07 03:05 EDT
Processed 7,938 lines, filtered 5,218 (65%). 2,720 unknown (81 distinct) from 22 host(s).
== abuse (3 distinct, 2255 total) ==
Aug 7 02:05:03 abuse rsyslogd[21745]: imjournal: open() failed for path: '/var/lib/rsyslog/imjournal.state.tmp': Input/output error [v8.2404.0 try https://www.rsyslog.com/e/2433 ] [x879]
Aug 7 02:05:03 abuse systemd[1]: Failed to load environment files: Input/output error [x688]
Aug 7 02:05:03 abuse systemd[1]: choria-server.service failed to run 'start' task: Input/output error [x688]
== b0b02.cs.umd.edu (1 distinct, 1 total) ==
Aug 7 02:48:38 b0b02.cs.umd.edu rustdesk[3800680]: cannot open display:
== biggulp.cs.umd.edu (5 distinct, 5 total) ==
Aug 7 03:02:51 biggulp.cs.umd.edu sshd-session[3650254]: pam_access(sshd:auth): access denied for user `admin' from `171.243.150.99'
Aug 7 03:02:51 biggulp.cs.umd.edu krb5_child[3650271]: Client 'admin(a)UMD.EDU' not found in Kerberos database
Aug 7 03:02:51 biggulp.cs.umd.edu sshd-session[3650236]: error: PAM: System error for admin from 171.243.150.99
Aug 7 03:04:24 biggulp.cs.umd.edu sshd-session[3650401]: pam_access(sshd:auth): access denied for user `root' from `116.99.168.223'
Aug 7 03:04:26 biggulp.cs.umd.edu sshd-session[3650396]: error: PAM: Authentication failure for root from 116.99.168.223
== cheezit.cs.umd.edu (3 distinct, 3 total) ==
Aug 7 03:04:08 cheezit.cs.umd.edu sshd-session[1998045]: pam_access(sshd:auth): access denied for user `admin' from `171.243.150.99'
Aug 7 03:04:18 cheezit.cs.umd.edu krb5_child[1998064]: Client 'admin(a)UMD.EDU' not found in Kerberos database
Aug 7 03:04:18 cheezit.cs.umd.edu sshd-session[1998043]: error: PAM: System error for admin from 171.243.150.99
== contest (1 distinct, 34 total) ==
Aug 7 02:05:19 contest goferd[1007]: [ERROR][worker-0] gofer.messaging.adapter.connect:33 - connect: proton+amqps://satellite8.cs.umd.edu:5647, failed: Connection amqps://satellite8.cs.umd.edu:5647 disconnected: Condition('proton.pythonio', 'Connection refused to all addresses') [x34]
== csfw00a (2 distinct, 272 total) ==
Aug 7 02:04:51 csfw00a kernel: bnxt_en 0000:09:00.0 eth3: NIC Link is Down [x244]
Aug 7 02:08:12 csfw00a ospf6d[1477]: [EC 100663307] Could not send entire message [x28]
== dojo (1 distinct, 1 total) ==
Aug 7 03:03:58 dojo sshd[1319538]: error: Protocol major versions differ: 2 vs. 1
== idm00 (1 distinct, 1 total) ==
Aug 7 02:51:19 idm00 named[1455]: client @0x7f33046c1f38 10.73.240.42#54239: update '73.10.in-addr.arpa/IN' denied
== idmp0 (1 distinct, 1 total) ==
Aug 7 02:36:02 idmp0 named[5198]: client @0x7f98e88d1c18 10.73.240.43#63040: update '73.10.in-addr.arpa/IN' denied
== inbound01.cs.umd.edu (1 distinct, 1 total) ==
Aug 7 02:57:17 inbound01.cs.umd.edu krb5_child[1794053]: Client 'admin(a)UMD.EDU' not found in Kerberos database
== itmon02 (1 distinct, 39 total) ==
Aug 7 02:08:08 itmon02 sshd[1750555]: error: beginning MaxStartups throttling [x39]
== krispykreme.cs.umd.edu (3 distinct, 3 total) ==
Aug 7 03:04:43 krispykreme.cs.umd.edu sshd-session[151482]: pam_access(sshd:auth): access denied for user `admin' from `116.99.168.223'
Aug 7 03:04:43 krispykreme.cs.umd.edu krb5_child[151485]: Client 'admin(a)UMD.EDU' not found in Kerberos database
Aug 7 03:04:43 krispykreme.cs.umd.edu sshd-session[151480]: error: PAM: System error for admin from 116.99.168.223
== munin (2 distinct, 4 total) ==
Aug 7 02:37:50 munin sudo[2964870]: pam_systemd(sudo:session): Failed to stat() runtime directory '/run/user/0': No such file or directory [x2]
Aug 7 02:37:50 munin sudo[2964870]: pam_systemd(sudo:session): Not setting $XDG_RUNTIME_DIR, as the directory is not in order. [x2]
== netman.cs.umd.edu (1 distinct, 2 total) ==
Aug 7 03:04:47 netman.cs.umd.edu krb5_child[1890914]: Client 'admin(a)UMD.EDU' not found in Kerberos database [x2]
== networkvm01.cs.umd.edu (10 distinct, 12 total) ==
Aug 7 02:15:54 networkvm01.cs.umd.edu setroubleshoot[1919724]: SELinux is preventing /usr/bin/gpg from write access on the directory /(null). For complete SELinux messages run: sealert -l 8ead1354-ae8a-4a17-bb3f-146ebf6c892c
Aug 7 02:15:54 networkvm01.cs.umd.edu setroubleshoot[1919724]: SELinux is preventing /usr/bin/gpg from add_name access on the directory /(null). For complete SELinux messages run: sealert -l f9b51e91-5dbc-455f-88c2-f0746a2f0f4c
Aug 7 02:15:54 networkvm01.cs.umd.edu setroubleshoot[1919724]: SELinux is preventing /usr/bin/gpg from create access on the file /(null). For complete SELinux messages run: sealert -l af0a60e6-c449-4bdd-bfb8-c69b58472884 [x2]
Aug 7 02:15:54 networkvm01.cs.umd.edu setroubleshoot[1919724]: SELinux is preventing /usr/bin/gpg from link access on the file /(null). For complete SELinux messages run: sealert -l 3df452f6-4d9e-4e38-946b-ea8e1edd356c [x2]
Aug 7 02:15:54 networkvm01.cs.umd.edu setroubleshoot[1919724]: SELinux is preventing /usr/bin/gpg from remove_name access on the directory .#lk0x0000561ea9a7aed0.networkvm01.cs.umd.edu.1919723x. For complete SELinux messages run: sealert -l fcac71c9-c7c0-45a9-9dc2-a8dcbeccfc75
Aug 7 02:15:54 networkvm01.cs.umd.edu setroubleshoot[1919724]: SELinux is preventing /usr/bin/gpg from unlink access on the file .#lk0x0000561ea9a7aed0.networkvm01.cs.umd.edu.1919723x. For complete SELinux messages run: sealert -l a672ebb7-fa69-419c-b1f0-fb386b8b48a6
Aug 7 02:15:54 networkvm01.cs.umd.edu setroubleshoot[1919724]: SELinux is preventing /usr/bin/gpg from write access on the directory /(null). For complete SELinux messages run: sealert -l fec9104e-d27a-4fd4-9872-6b17088c2951
Aug 7 02:15:55 networkvm01.cs.umd.edu setroubleshoot[1919724]: SELinux is preventing /usr/bin/gpg from add_name access on the directory /(null). For complete SELinux messages run: sealert -l 26718b2a-493d-457d-818c-244bd8d4ec9d
Aug 7 02:15:55 networkvm01.cs.umd.edu setroubleshoot[1919724]: SELinux is preventing /usr/bin/gpg from remove_name access on the directory .#lk0x000056399344bee0.networkvm01.cs.umd.edu.1919741x. For complete SELinux messages run: sealert -l 80e6efe4-93f3-4219-8132-b2b52db1f517
Aug 7 02:15:55 networkvm01.cs.umd.edu setroubleshoot[1919724]: SELinux is preventing /usr/bin/gpg from unlink access on the file .#lk0x000056399344bee0.networkvm01.cs.umd.edu.1919741x. For complete SELinux messages run: sealert -l a672ebb7-fa69-419c-b1f0-fb386b8b48a6
== newhonors2 (1 distinct, 24 total) ==
Aug 7 02:13:03 newhonors2 dhcpcd[851576]: dhcpcd is not running [x24]
== outbound00.cs.umd.edu (2 distinct, 7 total) ==
Aug 7 02:09:09 outbound00.cs.umd.edu python3[3716458]: ldapdb [x6]
Aug 7 03:03:36 outbound00.cs.umd.edu krb5_child[3729357]: Client 'admin(a)UMD.EDU' not found in Kerberos database
== outbound01.cs.umd.edu (2 distinct, 8 total) ==
Aug 7 02:13:07 outbound01.cs.umd.edu python3[1752940]: ldapdb [x6]
Aug 7 02:26:33 outbound01.cs.umd.edu krb5_child[1756474]: Client 'admin(a)UMD.EDU' not found in Kerberos database [x2]
== sentry-docker00.cs.umd.edu (36 distinct, 36 total) ==
Aug 7 02:16:12 sentry-docker00.cs.umd.edu systemd-udevd[3494572]: link_config: could not get ethtool features for vethc0fa054
Aug 7 02:16:12 sentry-docker00.cs.umd.edu systemd-udevd[3494572]: Could not set offload features of vethc0fa054: No such device
Aug 7 02:16:12 sentry-docker00.cs.umd.edu systemd-udevd[3494635]: Could not generate persistent MAC address for veth3a2acc6: No such file or directory
Aug 7 02:16:12 sentry-docker00.cs.umd.edu systemd-udevd[3494636]: Could not generate persistent MAC address for veth41dcd10: No such file or directory
Aug 7 02:16:12 sentry-docker00.cs.umd.edu systemd-udevd[3494639]: Could not generate persistent MAC address for veth4adccae: No such file or directory
Aug 7 02:16:12 sentry-docker00.cs.umd.edu systemd-udevd[3494636]: Could not generate persistent MAC address for vethb106aa5: No such file or directory
Aug 7 02:16:12 sentry-docker00.cs.umd.edu systemd-udevd[3494635]: Could not generate persistent MAC address for vethfa4e584: No such file or directory
Aug 7 02:16:12 sentry-docker00.cs.umd.edu systemd-udevd[3494650]: Could not generate persistent MAC address for vethad1f595: No such file or directory
Aug 7 02:16:12 sentry-docker00.cs.umd.edu systemd-udevd[3494636]: Could not generate persistent MAC address for vethe465961: No such file or directory
Aug 7 02:16:12 sentry-docker00.cs.umd.edu systemd-udevd[3494635]: Could not generate persistent MAC address for veth409b40e: No such file or directory
Aug 7 02:16:12 sentry-docker00.cs.umd.edu systemd-udevd[3494636]: Could not generate persistent MAC address for veth4af3a53: No such file or directory
Aug 7 02:16:12 sentry-docker00.cs.umd.edu systemd-udevd[3494635]: Could not generate persistent MAC address for vethbd34ce2: No such file or directory
Aug 7 02:36:20 sentry-docker00.cs.umd.edu systemd-udevd[3504355]: link_config: could not get ethtool features for vethb106aa5
Aug 7 02:36:20 sentry-docker00.cs.umd.edu systemd-udevd[3504355]: Could not set offload features of vethb106aa5: No such device
Aug 7 02:36:20 sentry-docker00.cs.umd.edu systemd-udevd[3504423]: Could not generate persistent MAC address for vethc5ee798: No such file or directory
Aug 7 02:36:20 sentry-docker00.cs.umd.edu systemd-udevd[3504424]: Could not generate persistent MAC address for veth279ef25: No such file or directory
Aug 7 02:36:20 sentry-docker00.cs.umd.edu systemd-udevd[3504427]: Could not generate persistent MAC address for veth6fc5db9: No such file or directory
Aug 7 02:36:20 sentry-docker00.cs.umd.edu systemd-udevd[3504435]: Could not generate persistent MAC address for veth6664036: No such file or directory
Aug 7 02:36:20 sentry-docker00.cs.umd.edu systemd-udevd[3504438]: Could not generate persistent MAC address for veth5db0b61: No such file or directory
Aug 7 02:36:20 sentry-docker00.cs.umd.edu systemd-udevd[3504441]: Could not generate persistent MAC address for vetha53bb25: No such file or directory
Aug 7 02:36:20 sentry-docker00.cs.umd.edu systemd-udevd[3504466]: Could not generate persistent MAC address for vethc75d38e: No such file or directory
Aug 7 02:36:20 sentry-docker00.cs.umd.edu systemd-udevd[3504470]: Could not generate persistent MAC address for veth83af6fe: No such file or directory
Aug 7 02:36:21 sentry-docker00.cs.umd.edu systemd-udevd[3504498]: Could not generate persistent MAC address for veth6f48636: No such file or directory
Aug 7 02:36:21 sentry-docker00.cs.umd.edu systemd-udevd[3504479]: Could not generate persistent MAC address for vethba3315c: No such file or directory
Aug 7 02:56:29 sentry-docker00.cs.umd.edu systemd-udevd[3513884]: link_config: could not get ethtool features for veth6f48636
Aug 7 02:56:29 sentry-docker00.cs.umd.edu systemd-udevd[3513884]: Could not set offload features of veth6f48636: No such device
Aug 7 02:56:29 sentry-docker00.cs.umd.edu systemd-udevd[3513908]: Could not generate persistent MAC address for veth5fa74cc: No such file or directory
Aug 7 02:56:29 sentry-docker00.cs.umd.edu systemd-udevd[3513909]: Could not generate persistent MAC address for veth226a84c: No such file or directory
Aug 7 02:56:29 sentry-docker00.cs.umd.edu systemd-udevd[3513912]: Could not generate persistent MAC address for veth7db82f4: No such file or directory
Aug 7 02:56:29 sentry-docker00.cs.umd.edu systemd-udevd[3513918]: Could not generate persistent MAC address for vethdff0a5b: No such file or directory
... 6 more distinct messages not shown
== strawberry (2 distinct, 8 total) ==
Aug 7 02:09:44 strawberry udisksd[1067]: Error performing housekeeping for drive /org/freedesktop/UDisks2/drives/ST2000DM001_1CH164_W1E8J5KJ: Error updating SMART data: Error sending ATA command CHECK POWER MODE: Unexpected sense data returned:#0120000: 00 00 00 00 00 00 00 00 00 00 00 00 00 00 00 00 ................#0120010: 00 00 00 00 00 00 00 00 00 00 00 00 00 00 00 00 ................#012 (g-io-error-quark, 0) [x6]
Aug 7 02:34:42 strawberry smartd[5314]: Device: /dev/sda [SAT], failed to read SMART Attribute Data [x2]
== submit26-b9-4 (1 distinct, 2 total) ==
Aug 7 02:40:01 submit26-b9-4 systemd[1]: user(a)1001.service: Main process exited, code=killed, status=9/KILL [x2]
== teaching-awards (1 distinct, 1 total) ==
Aug 7 03:02:34 teaching-awards krb5_child[2048817]: Client 'admin(a)UMD.EDU' not found in Kerberos database
1
0
Command: /usr/local/sbin/syslog-digest.py
Time : 1.0009s
Status : exited 0
Output :
Syslog digest — 2026-08-07 02:05 EDT
Processed 7,550 lines, filtered 4,717 (62%). 2,833 unknown (119 distinct) from 22 host(s).
== abuse (3 distinct, 2248 total) ==
Aug 7 01:05:05 abuse systemd[1]: Failed to load environment files: Input/output error [x687]
Aug 7 01:05:05 abuse systemd[1]: choria-server.service failed to run 'start' task: Input/output error [x687]
Aug 7 01:05:10 abuse rsyslogd[21745]: imjournal: open() failed for path: '/var/lib/rsyslog/imjournal.state.tmp': Input/output error [v8.2404.0 try https://www.rsyslog.com/e/2433 ] [x874]
== b0b02.cs.umd.edu (1 distinct, 1 total) ==
Aug 7 01:48:34 b0b02.cs.umd.edu rustdesk[3785605]: cannot open display:
== cheezit.cs.umd.edu (3 distinct, 3 total) ==
Aug 7 02:04:56 cheezit.cs.umd.edu sshd-session[1983806]: pam_access(sshd:auth): access denied for user `admin' from `35.241.181.19'
Aug 7 02:04:57 cheezit.cs.umd.edu krb5_child[1983808]: Client 'admin(a)UMD.EDU' not found in Kerberos database
Aug 7 02:04:57 cheezit.cs.umd.edu sshd-session[1983804]: error: PAM: System error for admin from 35.241.181.19
== cmsc436-0101-redis (3 distinct, 3 total) ==
Aug 7 01:39:31 cmsc436-0101-redis krb5_child[964095]: Client 'admin(a)UMD.EDU' not found in Kerberos database
Aug 7 01:39:32 cmsc436-0101-redis sshd-session[964091]: error: PAM: Authentication failure for admin from 35.241.181.19
Aug 7 01:39:44 cmsc436-0101-redis sshd-session[964097]: error: Protocol major versions differ: 2 vs. 1
== contest (12 distinct, 46 total) ==
Aug 7 01:06:24 contest goferd[1007]: [ERROR][worker-0] gofer.messaging.adapter.connect:33 - connect: proton+amqps://satellite8.cs.umd.edu:5647, failed: Connection amqps://satellite8.cs.umd.edu:5647 disconnected: Condition('proton.pythonio', 'Connection refused to all addresses') [x33]
Aug 7 01:48:19 contest setroubleshoot[757690]: SELinux is preventing /usr/libexec/platform-python3.6 from create access on the directory libdnf.WmYzxa. For complete SELinux messages run: sealert -l cb6b25c6-4765-4cf2-88a0-9b3b508e94e9
Aug 7 01:48:19 contest setroubleshoot[757690]: SELinux is preventing /usr/bin/gpgconf from add_name access on the directory repodata. For complete SELinux messages run: sealert -l 41cf7b1b-0f34-4609-98f2-b66e7825fef7
Aug 7 01:48:19 contest setroubleshoot[757690]: SELinux is preventing /usr/libexec/platform-python3.6 from create access on the file mirrorlist. For complete SELinux messages run: sealert -l fc20ff92-ea83-4f38-a24b-ddfd737a3141
Aug 7 01:48:19 contest setroubleshoot[757690]: SELinux is preventing /usr/libexec/platform-python3.6 from setattr access on the file repomd.xml. For complete SELinux messages run: sealert -l ac675631-fa35-4e93-adc9-b692b18e53e5 [x2]
Aug 7 01:48:19 contest setroubleshoot[757690]: SELinux is preventing /usr/bin/gpgconf from add_name access on the directory repomd.xml.asc. For complete SELinux messages run: sealert -l 41cf7b1b-0f34-4609-98f2-b66e7825fef7
Aug 7 01:48:19 contest setroubleshoot[757690]: SELinux is preventing /usr/libexec/platform-python3.6 from read access on the directory libdnf.WmYzxa. For complete SELinux messages run: sealert -l 45d103b6-0810-4890-a705-990118577ce8
Aug 7 01:48:19 contest setroubleshoot[757690]: SELinux is preventing /usr/libexec/platform-python3.6 from remove_name access on the directory repomd.xml. For complete SELinux messages run: sealert -l 7e499113-2fd7-4f67-bec6-3521efbe3637 [x2]
Aug 7 01:48:20 contest setroubleshoot[757690]: SELinux is preventing /usr/libexec/platform-python3.6 from rmdir access on the directory repodata. For complete SELinux messages run: sealert -l 3928930b-a1ed-448d-950b-0665ac2adef8
Aug 7 01:48:21 contest setroubleshoot[757690]: SELinux is preventing /usr/libexec/platform-python3.6 from create access on the directory libdnf.uENk5P. For complete SELinux messages run: sealert -l cb6b25c6-4765-4cf2-88a0-9b3b508e94e9
Aug 7 01:48:55 contest setroubleshoot[757762]: SELinux is preventing /usr/libexec/platform-python3.6 from create access on the file repomd.xml. For complete SELinux messages run: sealert -l fc20ff92-ea83-4f38-a24b-ddfd737a3141
Aug 7 01:48:57 contest setroubleshoot[757762]: SELinux is preventing rhsmcertd-worke from unlink access on the file repomd.xml. For complete SELinux messages run: sealert -l 22835727-7fef-4cfb-b3b5-881f66888317
== csfw00a (1 distinct, 274 total) ==
Aug 7 01:04:25 csfw00a kernel: bnxt_en 0000:09:00.0 eth3: NIC Link is Down [x274]
== hackerman (1 distinct, 1 total) ==
Aug 7 01:19:01 hackerman gnome-software[2060381]: failed to commit changes to dconf: GDBus.Error:org.gtk.GDBus.UnmappedGError.Quark._g_2dfile_2derror_2dquark.Code2: Failed to create file “/adminhomes/sajith/.config/dconf/user.U1XRT3”: Permission denied
== hazfs.cs.umd.edu (11 distinct, 66 total) ==
Aug 7 01:48:03 hazfs.cs.umd.edu snmpd[1431]: send response: Failure in sendto [x6]
Aug 7 01:48:03 hazfs.cs.umd.edu snmpd[1431]: -- NET-SNMP-EXTEND-MIB::nsExtendStatus."userweb" [x6]
Aug 7 01:48:03 hazfs.cs.umd.edu snmpd[1431]: -- NET-SNMP-EXTEND-MIB::nsExtendStatus."zfslist" [x6]
Aug 7 01:48:03 hazfs.cs.umd.edu snmpd[1431]: -- NET-SNMP-EXTEND-MIB::nsExtendStatus."userhome" [x6]
Aug 7 01:48:03 hazfs.cs.umd.edu snmpd[1431]: -- NET-SNMP-EXTEND-MIB::nsExtendOutput1Line."userweb" [x6]
Aug 7 01:48:03 hazfs.cs.umd.edu snmpd[1431]: -- NET-SNMP-EXTEND-MIB::nsExtendOutput1Line."zfslist" [x6]
Aug 7 01:48:03 hazfs.cs.umd.edu snmpd[1431]: -- NET-SNMP-EXTEND-MIB::nsExtendOutput1Line."userhome" [x6]
Aug 7 01:48:03 hazfs.cs.umd.edu snmpd[1431]: -- NET-SNMP-EXTEND-MIB::nsExtendOutputFull."userweb" [x6]
Aug 7 01:48:03 hazfs.cs.umd.edu snmpd[1431]: -- NET-SNMP-EXTEND-MIB::nsExtendOutputFull."zfslist" [x6]
Aug 7 01:48:03 hazfs.cs.umd.edu snmpd[1431]: -- NET-SNMP-EXTEND-MIB::nsExtendOutputFull."userhome" [x6]
Aug 7 01:48:03 hazfs.cs.umd.edu snmpd[1431]: -- NET-SNMP-EXTEND-MIB::nsExtendOutNumLines."userweb" [x6]
== idm00 (2 distinct, 2 total) ==
Aug 7 01:24:07 idm00 named[1455]: client @0x7f33043296c8 10.73.245.12#58487: update '73.10.in-addr.arpa/IN' denied
Aug 7 01:51:19 idm00 named[1455]: client @0x7f331017ba28 10.73.240.42#61503: update '73.10.in-addr.arpa/IN' denied
== idmp0 (1 distinct, 1 total) ==
Aug 7 01:36:01 idmp0 named[5198]: client @0x7f992003b158 10.73.240.43#64589: update '73.10.in-addr.arpa/IN' denied
== itmon02 (1 distinct, 48 total) ==
Aug 7 01:07:59 itmon02 sshd[1750555]: error: beginning MaxStartups throttling [x48]
== krispykreme.cs.umd.edu (3 distinct, 3 total) ==
Aug 7 01:14:54 krispykreme.cs.umd.edu sshd-session[121648]: pam_access(sshd:auth): access denied for user `admin' from `104.155.37.231'
Aug 7 01:14:54 krispykreme.cs.umd.edu krb5_child[121650]: Client 'admin(a)UMD.EDU' not found in Kerberos database
Aug 7 01:14:54 krispykreme.cs.umd.edu sshd-session[121646]: error: PAM: System error for admin from 104.155.37.231
== mcstic (3 distinct, 6 total) ==
Aug 7 01:54:06 mcstic krb5_child[2228042]: Client 'admin(a)UMD.EDU' not found in Kerberos database [x4]
Aug 7 01:54:12 mcstic sshd[2228037]: error: PAM: Authentication failure for admin from 35.241.181.19
Aug 7 01:58:05 mcstic sshd[2228283]: error: Protocol major versions differ: 2 vs. 1
== newhonors2 (1 distinct, 24 total) ==
Aug 7 01:13:03 newhonors2 dhcpcd[849151]: dhcpcd is not running [x24]
== outbound00.cs.umd.edu (1 distinct, 6 total) ==
Aug 7 01:09:09 outbound00.cs.umd.edu python3[3702621]: ldapdb [x6]
== outbound01.cs.umd.edu (1 distinct, 6 total) ==
Aug 7 01:13:07 outbound01.cs.umd.edu python3[1738918]: ldapdb [x6]
== sentry-docker00.cs.umd.edu (36 distinct, 36 total) ==
Aug 7 01:15:47 sentry-docker00.cs.umd.edu systemd-udevd[3466166]: link_config: could not get ethtool features for veth8784fb6
Aug 7 01:15:47 sentry-docker00.cs.umd.edu systemd-udevd[3466166]: Could not set offload features of veth8784fb6: No such device
Aug 7 01:15:47 sentry-docker00.cs.umd.edu systemd-udevd[3466196]: Could not generate persistent MAC address for veth3f8990d: No such file or directory
Aug 7 01:15:47 sentry-docker00.cs.umd.edu systemd-udevd[3466197]: Could not generate persistent MAC address for vethf7723a2: No such file or directory
Aug 7 01:15:47 sentry-docker00.cs.umd.edu systemd-udevd[3466215]: Could not generate persistent MAC address for veth5d52e4a: No such file or directory
Aug 7 01:15:47 sentry-docker00.cs.umd.edu systemd-udevd[3466200]: Could not generate persistent MAC address for vethba5c908: No such file or directory
Aug 7 01:15:47 sentry-docker00.cs.umd.edu systemd-udevd[3466213]: Could not generate persistent MAC address for vethe1ad6f9: No such file or directory
Aug 7 01:15:47 sentry-docker00.cs.umd.edu systemd-udevd[3466211]: Could not generate persistent MAC address for vethbd71e2a: No such file or directory
Aug 7 01:15:47 sentry-docker00.cs.umd.edu systemd-udevd[3466238]: Could not generate persistent MAC address for veth92ea9e8: No such file or directory
Aug 7 01:15:47 sentry-docker00.cs.umd.edu systemd-udevd[3466239]: Could not generate persistent MAC address for veth1cbc9a4: No such file or directory
Aug 7 01:15:47 sentry-docker00.cs.umd.edu systemd-udevd[3466249]: Could not generate persistent MAC address for veth82bddb2: No such file or directory
Aug 7 01:15:47 sentry-docker00.cs.umd.edu systemd-udevd[3466250]: Could not generate persistent MAC address for veth42c4a4e: No such file or directory
Aug 7 01:35:55 sentry-docker00.cs.umd.edu systemd-udevd[3475800]: link_config: could not get ethtool features for vethbd71e2a
Aug 7 01:35:55 sentry-docker00.cs.umd.edu systemd-udevd[3475800]: Could not set offload features of vethbd71e2a: No such device
Aug 7 01:35:55 sentry-docker00.cs.umd.edu systemd-udevd[3475835]: Could not generate persistent MAC address for vethbf9b0bd: No such file or directory
Aug 7 01:35:55 sentry-docker00.cs.umd.edu systemd-udevd[3475837]: Could not generate persistent MAC address for vetha941a7f: No such file or directory
Aug 7 01:35:55 sentry-docker00.cs.umd.edu systemd-udevd[3475847]: Could not generate persistent MAC address for veth775c6d0: No such file or directory
Aug 7 01:35:55 sentry-docker00.cs.umd.edu systemd-udevd[3475853]: Could not generate persistent MAC address for veth43ebb0b: No such file or directory
Aug 7 01:35:55 sentry-docker00.cs.umd.edu systemd-udevd[3475835]: Could not generate persistent MAC address for veth3e9eb4c: No such file or directory
Aug 7 01:35:55 sentry-docker00.cs.umd.edu systemd-udevd[3475844]: Could not generate persistent MAC address for veth8ebd9e2: No such file or directory
Aug 7 01:35:55 sentry-docker00.cs.umd.edu systemd-udevd[3475848]: Could not generate persistent MAC address for vethf6aa948: No such file or directory
Aug 7 01:35:55 sentry-docker00.cs.umd.edu systemd-udevd[3475847]: Could not generate persistent MAC address for veth4493845: No such file or directory
Aug 7 01:35:55 sentry-docker00.cs.umd.edu systemd-udevd[3475847]: Could not generate persistent MAC address for vethb05d445: No such file or directory
Aug 7 01:35:56 sentry-docker00.cs.umd.edu systemd-udevd[3475835]: Could not generate persistent MAC address for veth91a533c: No such file or directory
Aug 7 01:56:03 sentry-docker00.cs.umd.edu systemd-udevd[3485078]: link_config: could not get ethtool features for vethb05d445
Aug 7 01:56:03 sentry-docker00.cs.umd.edu systemd-udevd[3485078]: Could not set offload features of vethb05d445: No such device
Aug 7 01:56:04 sentry-docker00.cs.umd.edu systemd-udevd[3485204]: Could not generate persistent MAC address for veth78fd4a8: No such file or directory
Aug 7 01:56:04 sentry-docker00.cs.umd.edu systemd-udevd[3485205]: Could not generate persistent MAC address for veth79a9657: No such file or directory
Aug 7 01:56:04 sentry-docker00.cs.umd.edu systemd-udevd[3485225]: Could not generate persistent MAC address for veth02fc042: No such file or directory
Aug 7 01:56:04 sentry-docker00.cs.umd.edu systemd-udevd[3485211]: Could not generate persistent MAC address for vetha80c1fc: No such file or directory
... 6 more distinct messages not shown
== strawberry (2 distinct, 8 total) ==
Aug 7 01:09:44 strawberry udisksd[1067]: Error performing housekeeping for drive /org/freedesktop/UDisks2/drives/ST2000DM001_1CH164_W1E8J5KJ: Error updating SMART data: Error sending ATA command CHECK POWER MODE: Unexpected sense data returned:#0120000: 00 00 00 00 00 00 00 00 00 00 00 00 00 00 00 00 ................#0120010: 00 00 00 00 00 00 00 00 00 00 00 00 00 00 00 00 ................#012 (g-io-error-quark, 0) [x6]
Aug 7 01:34:42 strawberry smartd[5314]: Device: /dev/sda [SAT], failed to read SMART Attribute Data [x2]
== submit26-b9-2 (13 distinct, 27 total) ==
Aug 7 01:12:54 submit26-b9-2 setroubleshoot[1304843]: SELinux is preventing /usr/bin/python3.9 from create access on the directory /(null). For complete SELinux messages run: sealert -l d506243c-d61e-48f3-b42a-4592c913deb0 [x3]
Aug 7 01:12:54 submit26-b9-2 setroubleshoot[1304843]: SELinux is preventing /usr/bin/python3.9 from add_name access on the directory /(null). For complete SELinux messages run: sealert -l 3b4752ac-1b9a-4af9-a05b-32e4c2eb13ab [x3]
Aug 7 01:12:54 submit26-b9-2 setroubleshoot[1304843]: SELinux is preventing /usr/bin/python3.9 from create access on the file /(null). For complete SELinux messages run: sealert -l 29e5adbd-4381-4467-b40d-a2219101e096 [x3]
Aug 7 01:12:54 submit26-b9-2 setroubleshoot[1304843]: SELinux is preventing /usr/bin/python3.9 from open access on the file /tmp/libdnf.CM6Jzv/repodata/repomd.xml. For complete SELinux messages run: sealert -l 1b38f2ec-01ce-4343-8059-ba7494ecc5c4
Aug 7 01:12:54 submit26-b9-2 setroubleshoot[1304843]: SELinux is preventing /usr/bin/python3.9 from setattr access on the file repomd.xml. For complete SELinux messages run: sealert -l e5f9af40-1f63-4924-b012-27ab2a7b2266 [x3]
Aug 7 01:12:54 submit26-b9-2 setroubleshoot[1304843]: SELinux is preventing /usr/bin/python3.9 from read access on the directory libdnf.CM6Jzv. For complete SELinux messages run: sealert -l 5c54db87-54a3-4a7c-97b4-b5c48d6c3543
Aug 7 01:12:54 submit26-b9-2 setroubleshoot[1304843]: SELinux is preventing /usr/bin/python3.9 from remove_name access on the directory repomd.xml. For complete SELinux messages run: sealert -l 63cd60e1-1e61-4276-afea-dd8526ffe8b2 [x3]
Aug 7 01:12:54 submit26-b9-2 setroubleshoot[1304843]: SELinux is preventing /usr/bin/python3.9 from unlink access on the file repomd.xml. For complete SELinux messages run: sealert -l 81c7e9ec-e023-4c6d-b1ad-c02a242e655e [x3]
Aug 7 01:12:54 submit26-b9-2 setroubleshoot[1304843]: SELinux is preventing /usr/bin/python3.9 from rmdir access on the directory repodata. For complete SELinux messages run: sealert -l 6ae9a597-e123-4d74-8eec-a8ebe0f5e4d0 [x3]
Aug 7 01:13:40 submit26-b9-2 setroubleshoot[1304875]: SELinux is preventing /usr/bin/python3.9 from open access on the file /tmp/libdnf.CPYi9O/repodata/repomd.xml. For complete SELinux messages run: sealert -l 1b38f2ec-01ce-4343-8059-ba7494ecc5c4
Aug 7 01:14:40 submit26-b9-2 setroubleshoot[1305114]: SELinux is preventing /usr/bin/python3.9 from open access on the file /tmp/libdnf.i52vA9/repodata/repomd.xml. For complete SELinux messages run: sealert -l 1b38f2ec-01ce-4343-8059-ba7494ecc5c4
Aug 7 01:14:40 submit26-b9-2 setroubleshoot[1305114]: SELinux is preventing /usr/bin/python3.9 from read access on the directory libdnf.i52vA9. For complete SELinux messages run: sealert -l 5c54db87-54a3-4a7c-97b4-b5c48d6c3543
Aug 7 01:14:50 submit26-b9-2 setroubleshoot[1305114]: SELinux is preventing /usr/bin/python3.9 from read access on the directory libdnf.zsF3AO. For complete SELinux messages run: sealert -l 5c54db87-54a3-4a7c-97b4-b5c48d6c3543
== submit26-b9-3 (9 distinct, 9 total) ==
Aug 7 01:20:39 submit26-b9-3 setroubleshoot[892237]: SELinux is preventing /usr/bin/python3.9 from create access on the directory /(null). For complete SELinux messages run: sealert -l 5b912a44-22fd-4560-b201-2a4e289b73f5
Aug 7 01:20:39 submit26-b9-3 setroubleshoot[892237]: SELinux is preventing /usr/bin/python3.9 from add_name access on the directory /(null). For complete SELinux messages run: sealert -l 7f1df1e4-725e-4953-98eb-1079f908f543
Aug 7 01:20:39 submit26-b9-3 setroubleshoot[892237]: SELinux is preventing /usr/bin/python3.9 from create access on the file /(null). For complete SELinux messages run: sealert -l 40b8852a-f77b-44b4-affe-5f11fa33de43
Aug 7 01:20:39 submit26-b9-3 setroubleshoot[892237]: SELinux is preventing /usr/bin/python3.9 from open access on the file /tmp/libdnf.7q4VPc/repodata/repomd.xml. For complete SELinux messages run: sealert -l 45a8019e-f6b5-4baa-92c1-862594b40d46
Aug 7 01:20:39 submit26-b9-3 setroubleshoot[892237]: SELinux is preventing /usr/bin/python3.9 from setattr access on the file repomd.xml. For complete SELinux messages run: sealert -l e9f0bfff-7784-4126-baa4-2bb06da56591
Aug 7 01:20:39 submit26-b9-3 setroubleshoot[892237]: SELinux is preventing /usr/bin/python3.9 from read access on the directory libdnf.7q4VPc. For complete SELinux messages run: sealert -l 0b17cc3d-cdc6-4fe2-a11f-3892e7c41dc7
Aug 7 01:20:39 submit26-b9-3 setroubleshoot[892237]: SELinux is preventing /usr/bin/python3.9 from remove_name access on the directory repomd.xml. For complete SELinux messages run: sealert -l 10e38c64-b65f-4cdd-901e-4375652d9a42
Aug 7 01:20:39 submit26-b9-3 setroubleshoot[892237]: SELinux is preventing /usr/bin/python3.9 from unlink access on the file repomd.xml. For complete SELinux messages run: sealert -l 7fd9cf72-ef38-48e1-b6aa-b571b26a7b22
Aug 7 01:20:39 submit26-b9-3 setroubleshoot[892237]: SELinux is preventing /usr/bin/python3.9 from rmdir access on the directory repodata. For complete SELinux messages run: sealert -l b9b11116-89bd-4a3c-980c-1d422c5dcee4
== submit26-clnb9 (10 distinct, 14 total) ==
Aug 7 01:31:58 submit26-clnb9 setroubleshoot[1908480]: SELinux is preventing /usr/bin/python3.9 from create access on the directory /(null). For complete SELinux messages run: sealert -l 6783ed2b-5ae4-42b5-975a-4bf50eec4658 [x2]
Aug 7 01:31:58 submit26-clnb9 setroubleshoot[1908480]: SELinux is preventing /usr/bin/python3.9 from add_name access on the directory /(null). For complete SELinux messages run: sealert -l 9e7fa955-cc30-4804-ac8c-e1779e85946c [x2]
Aug 7 01:31:58 submit26-clnb9 setroubleshoot[1908480]: SELinux is preventing /usr/bin/python3.9 from create access on the file /(null). For complete SELinux messages run: sealert -l 69bfa6e3-089c-40ff-9563-fd30787d0774
Aug 7 01:31:58 submit26-clnb9 setroubleshoot[1908480]: SELinux is preventing /usr/bin/python3.9 from open access on the file /tmp/libdnf.vaKT93/repodata/repomd.xml. For complete SELinux messages run: sealert -l 001acdb5-31ef-4e52-b10b-90f467a89ddc
Aug 7 01:31:58 submit26-clnb9 setroubleshoot[1908480]: SELinux is preventing /usr/bin/python3.9 from setattr access on the file repomd.xml. For complete SELinux messages run: sealert -l edacddcf-16ed-4dc3-8d82-7c597d5dee23
Aug 7 01:31:58 submit26-clnb9 setroubleshoot[1908480]: SELinux is preventing /usr/bin/python3.9 from read access on the directory libdnf.vaKT93. For complete SELinux messages run: sealert -l 62b3782e-4730-4488-8178-94dafe9b552c
Aug 7 01:31:58 submit26-clnb9 setroubleshoot[1908480]: SELinux is preventing /usr/bin/python3.9 from remove_name access on the directory repomd.xml. For complete SELinux messages run: sealert -l 81cb3698-78f8-440a-8e3c-e5d1041e6b78 [x2]
Aug 7 01:31:58 submit26-clnb9 setroubleshoot[1908480]: SELinux is preventing /usr/bin/python3.9 from unlink access on the file repomd.xml. For complete SELinux messages run: sealert -l 792b472a-115c-4799-9805-fc7436f916b9
Aug 7 01:31:58 submit26-clnb9 setroubleshoot[1908480]: SELinux is preventing /usr/bin/python3.9 from rmdir access on the directory repodata. For complete SELinux messages run: sealert -l 15c83a86-837b-41e2-b662-b39cd4e361cb [x2]
Aug 7 01:32:23 submit26-clnb9 setroubleshoot[1908512]: SELinux is preventing /usr/bin/python3.9 from read access on the directory libdnf.mWHYJK. For complete SELinux messages run: sealert -l 62b3782e-4730-4488-8178-94dafe9b552c
== zebatinsky.cs.umd.edu (1 distinct, 1 total) ==
Aug 7 01:14:26 zebatinsky.cs.umd.edu setroubleshoot[1758267]: SELinux is preventing pdns/comm-main from name_bind access on the udp_socket port 10514. For complete SELinux messages run: sealert -l 606ba02b-0a21-433e-9c00-e94e15b5015c
1
0
Command: /usr/local/sbin/syslog-digest.py
Time : 0.9726s
Status : exited 0
Output :
Syslog digest — 2026-08-07 01:05 EDT
Processed 7,532 lines, filtered 4,758 (63%). 2,774 unknown (120 distinct) from 34 host(s).
== abuse (3 distinct, 2250 total) ==
Aug 7 00:05:02 abuse systemd[1]: Failed to load environment files: Input/output error [x688]
Aug 7 00:05:02 abuse systemd[1]: choria-server.service failed to run 'start' task: Input/output error [x689]
Aug 7 00:05:02 abuse rsyslogd[21745]: imjournal: open() failed for path: '/var/lib/rsyslog/imjournal.state.tmp': Input/output error [v8.2404.0 try https://www.rsyslog.com/e/2433 ] [x873]
== b0b02.cs.umd.edu (1 distinct, 1 total) ==
Aug 7 00:48:30 b0b02.cs.umd.edu rustdesk[3770494]: cannot open display:
== bachata (1 distinct, 1 total) ==
Aug 7 00:56:21 bachata setroubleshoot[2610202]: SELinux is preventing /usr/sbin/smbd from name_bind access on the udp_socket port 812. For complete SELinux messages run: sealert -l 8f7247f1-69a5-4a62-a4f0-88a324bfd75c
== cheezit.cs.umd.edu (11 distinct, 13 total) ==
Aug 7 00:29:34 cheezit.cs.umd.edu setroubleshoot[1960832]: failed to retrieve rpm info for path '/var/log/falconctl.log':
Aug 7 00:29:35 cheezit.cs.umd.edu setroubleshoot[1960832]: SELinux is preventing /opt/CrowdStrike/falconctl18708 from append access on the file /var/log/falconctl.log. For complete SELinux messages run: sealert -l 63f66d53-fcfc-44da-a79e-c789b1ce2ce8
Aug 7 00:29:37 cheezit.cs.umd.edu setroubleshoot[1960832]: SELinux is preventing /opt/CrowdStrike/falconctl18708 from write access on the file falconstore. For complete SELinux messages run: sealert -l 386506af-597f-4357-89de-bc382f369a6e
Aug 7 00:29:49 cheezit.cs.umd.edu setroubleshoot[1961208]: failed to retrieve rpm info for path '/var/lib/sss/pipes/nss': [x2]
Aug 7 00:29:50 cheezit.cs.umd.edu setroubleshoot[1961208]: SELinux is preventing /usr/bin/lsof from write access on the sock_file /var/lib/sss/pipes/nss. For complete SELinux messages run: sealert -l f570494d-54d2-4dac-97e2-28395659abf1 [x2]
Aug 7 00:29:50 cheezit.cs.umd.edu setroubleshoot[1961208]: SELinux is preventing /usr/bin/lsof from write access on the sock_file socket. For complete SELinux messages run: sealert -l 9ff2383b-9e1d-44ff-b8ae-af91637450ae
Aug 7 00:30:30 cheezit.cs.umd.edu setroubleshoot[1961727]: SELinux is preventing /usr/bin/python3.9 from read access on the file /etc/selinux/targeted/contexts/files/file_contexts.subs_dist. For complete SELinux messages run: sealert -l 679eb260-cf5d-4783-99f4-ce308edb3295
Aug 7 00:30:30 cheezit.cs.umd.edu setroubleshoot[1961727]: SELinux is preventing /usr/bin/python3.9 from open access on the file /etc/selinux/targeted/contexts/files/file_contexts.subs_dist. For complete SELinux messages run: sealert -l 77caba8a-5cd0-4e18-b188-6e35c461772d
Aug 7 00:30:30 cheezit.cs.umd.edu setroubleshoot[1961727]: SELinux is preventing /usr/bin/python3.9 from read access on the file /etc/selinux/targeted/contexts/files/file_contexts.subs. For complete SELinux messages run: sealert -l d9c6dd0d-0a34-4430-a5ff-e985c55cb064
Aug 7 00:30:30 cheezit.cs.umd.edu setroubleshoot[1961727]: SELinux is preventing /usr/bin/python3.9 from open access on the file /etc/selinux/targeted/contexts/files/file_contexts.subs. For complete SELinux messages run: sealert -l 8edbce57-8212-4ac8-af50-3fe403231eda
Aug 7 00:30:30 cheezit.cs.umd.edu setroubleshoot[1961727]: SELinux is preventing /usr/bin/python3.9 from map access on the file /etc/selinux/targeted/contexts/files/file_contexts.bin. For complete SELinux messages run: sealert -l 4a0cbe3b-6f49-4c7e-95c6-380f7aef806e
== contest (1 distinct, 34 total) ==
Aug 7 00:05:42 contest goferd[1007]: [ERROR][worker-0] gofer.messaging.adapter.connect:33 - connect: proton+amqps://satellite8.cs.umd.edu:5647, failed: Connection amqps://satellite8.cs.umd.edu:5647 disconnected: Condition('proton.pythonio', 'Connection refused to all addresses') [x34]
== csfw00a (2 distinct, 274 total) ==
Aug 7 00:04:47 csfw00a ospf6d[1477]: [EC 100663307] Could not send entire message [x12]
Aug 7 00:04:47 csfw00a kernel: bnxt_en 0000:09:00.0 eth3: NIC Link is Down [x262]
== frabjous (2 distinct, 2 total) ==
Aug 7 00:54:02 frabjous krb5_child[3511574]: Client 'admin(a)UMD.EDU' not found in Kerberos database
Aug 7 00:54:04 frabjous sshd-session[3511569]: error: PAM: Authentication failure for admin from 34.62.167.194
== grades01.cs.umd.edu (3 distinct, 4 total) ==
Aug 7 00:10:13 grades01.cs.umd.edu systemd[1]: New main PID 26768 does not belong to service, and PID file is not owned by root. Refusing. [x2]
Aug 7 00:10:34 grades01.cs.umd.edu systemd[1]: Daemon never wrote its PID file. Failing.
Aug 7 00:10:49 grades01.cs.umd.edu systemd[1]: pmlogger.service: Supervising process 1893 which is not our child. We'll most likely not notice when it exits.
== idm00 (1 distinct, 1 total) ==
Aug 7 00:51:19 idm00 named[1455]: client @0x7f3304251938 10.73.240.42#55022: update '73.10.in-addr.arpa/IN' denied
== idmp0 (1 distinct, 1 total) ==
Aug 7 00:36:01 idmp0 named[5198]: client @0x7f992801f628 10.73.240.43#51614: update '73.10.in-addr.arpa/IN' denied
== inbound00.cs.umd.edu (1 distinct, 1 total) ==
Aug 7 00:52:05 inbound00.cs.umd.edu krb5_child[3750976]: Client 'admin(a)UMD.EDU' not found in Kerberos database
== itmon02 (1 distinct, 46 total) ==
Aug 7 00:08:04 itmon02 sshd[1750555]: error: beginning MaxStartups throttling [x46]
== jubjub.cs.umd.edu (3 distinct, 4 total) ==
Aug 7 00:10:12 jubjub.cs.umd.edu systemd[1]: New main PID 2616092 does not belong to service, and PID file is not owned by root. Refusing. [x2]
Aug 7 00:10:31 jubjub.cs.umd.edu systemd[1]: Daemon never wrote its PID file. Failing.
Aug 7 00:10:39 jubjub.cs.umd.edu systemd[1]: pmlogger.service: Supervising process 2623611 which is not our child. We'll most likely not notice when it exits.
== matrix (2 distinct, 3 total) ==
Aug 7 00:16:34 matrix krb5_child[3951196]: Client 'admin(a)UMD.EDU' not found in Kerberos database [x2]
Aug 7 00:16:36 matrix sshd[3951190]: error: PAM: Authentication failure for admin from 34.38.40.242
== mirrors.cs.umd.edu (3 distinct, 4 total) ==
Aug 7 00:10:12 mirrors.cs.umd.edu systemd[1]: New main PID 28468 does not belong to service, and PID file is not owned by root. Refusing. [x2]
Aug 7 00:10:30 mirrors.cs.umd.edu systemd[1]: Daemon never wrote its PID file. Failing.
Aug 7 00:10:55 mirrors.cs.umd.edu systemd[1]: pmlogger.service: Supervising process 3224 which is not our child. We'll most likely not notice when it exits.
== misty.cs.umd.edu (3 distinct, 4 total) ==
Aug 7 00:10:15 misty.cs.umd.edu systemd[1]: New main PID 14735 does not belong to service, and PID file is not owned by root. Refusing. [x2]
Aug 7 00:10:35 misty.cs.umd.edu systemd[1]: Daemon never wrote its PID file. Failing.
Aug 7 00:10:51 misty.cs.umd.edu systemd[1]: pmlogger.service: Supervising process 22568 which is not our child. We'll most likely not notice when it exits.
== netman.cs.umd.edu (3 distinct, 3 total) ==
Aug 7 00:30:01 netman.cs.umd.edu setroubleshoot[1845972]: SELinux is preventing /usr/bin/gpg from read access on the file gpg.conf. For complete SELinux messages run: sealert -l 019ad1da-a874-4814-8037-3b3e5f413ad2
Aug 7 00:30:02 netman.cs.umd.edu setroubleshoot[1845972]: SELinux is preventing /usr/bin/gpg from open access on the file /root/.gnupg/gpg.conf. For complete SELinux messages run: sealert -l cb54177e-d44c-46a1-b246-5c0bbb8343be
Aug 7 00:30:02 netman.cs.umd.edu setroubleshoot[1845972]: SELinux is preventing /usr/bin/gpg from getattr access on the file /root/.gnupg/gpg.conf. For complete SELinux messages run: sealert -l fbba2e30-b7ab-491c-9ec6-f553e9ef72af
== newhonors2 (1 distinct, 24 total) ==
Aug 7 00:13:03 newhonors2 dhcpcd[847295]: dhcpcd is not running [x24]
== openrepo (1 distinct, 1 total) ==
Aug 7 00:26:27 openrepo (nin-node)[1537429]: munin-node.service: Referenced but unset environment variable evaluates to an empty string: DAEMON_ARGS
== outbound00.cs.umd.edu (1 distinct, 6 total) ==
Aug 7 00:09:09 outbound00.cs.umd.edu python3[3688247]: ldapdb [x6]
== outbound01.cs.umd.edu (1 distinct, 6 total) ==
Aug 7 00:13:06 outbound01.cs.umd.edu python3[1724990]: ldapdb [x6]
== peach.cs.umd.edu (2 distinct, 2 total) ==
Aug 7 00:22:08 peach.cs.umd.edu setroubleshoot[3140539]: SELinux is preventing /usr/bin/qemu-ga from search access on the directory /var/lib/containers/storage/overlay. For complete SELinux messages run: sealert -l ba415951-a2c6-424e-b17d-305c5300b9f3
Aug 7 00:22:08 peach.cs.umd.edu setroubleshoot[3140539]: SELinux is preventing /usr/bin/qemu-ga from search access on the directory /var/lib/containers/storage/overlay. For complete SELinux messages run: sealert -l 6aeb0956-fcf2-462a-ae4d-439b912c16d0
== sentry-docker00.cs.umd.edu (36 distinct, 36 total) ==
Aug 7 00:15:22 sentry-docker00.cs.umd.edu systemd-udevd[3437696]: link_config: could not get ethtool features for veth68691c4
Aug 7 00:15:22 sentry-docker00.cs.umd.edu systemd-udevd[3437696]: Could not set offload features of veth68691c4: No such device
Aug 7 00:15:22 sentry-docker00.cs.umd.edu systemd-udevd[3437727]: Could not generate persistent MAC address for veth4a083a5: No such file or directory
Aug 7 00:15:22 sentry-docker00.cs.umd.edu systemd-udevd[3437728]: Could not generate persistent MAC address for veth79ffe15: No such file or directory
Aug 7 00:15:22 sentry-docker00.cs.umd.edu systemd-udevd[3437731]: Could not generate persistent MAC address for veth62e3940: No such file or directory
Aug 7 00:15:22 sentry-docker00.cs.umd.edu systemd-udevd[3437732]: Could not generate persistent MAC address for veth6e863cb: No such file or directory
Aug 7 00:15:22 sentry-docker00.cs.umd.edu systemd-udevd[3437749]: Could not generate persistent MAC address for veth4ad599d: No such file or directory
Aug 7 00:15:22 sentry-docker00.cs.umd.edu systemd-udevd[3437734]: Could not generate persistent MAC address for veth0148437: No such file or directory
Aug 7 00:15:22 sentry-docker00.cs.umd.edu systemd-udevd[3437743]: Could not generate persistent MAC address for veth62e7c8d: No such file or directory
Aug 7 00:15:22 sentry-docker00.cs.umd.edu systemd-udevd[3437751]: Could not generate persistent MAC address for vethe5cec3c: No such file or directory
Aug 7 00:15:22 sentry-docker00.cs.umd.edu systemd-udevd[3437760]: Could not generate persistent MAC address for veth1fdc260: No such file or directory
Aug 7 00:15:22 sentry-docker00.cs.umd.edu systemd-udevd[3437764]: Could not generate persistent MAC address for vethcf283c3: No such file or directory
Aug 7 00:35:30 sentry-docker00.cs.umd.edu systemd-udevd[3447349]: link_config: could not get ethtool features for veth62e7c8d
Aug 7 00:35:30 sentry-docker00.cs.umd.edu systemd-udevd[3447349]: Could not set offload features of veth62e7c8d: No such device
Aug 7 00:35:31 sentry-docker00.cs.umd.edu systemd-udevd[3447381]: Could not generate persistent MAC address for veth3ac7a30: No such file or directory
Aug 7 00:35:31 sentry-docker00.cs.umd.edu systemd-udevd[3447382]: Could not generate persistent MAC address for veth0167ca4: No such file or directory
Aug 7 00:35:31 sentry-docker00.cs.umd.edu systemd-udevd[3447385]: Could not generate persistent MAC address for veth9674f23: No such file or directory
Aug 7 00:35:31 sentry-docker00.cs.umd.edu systemd-udevd[3447386]: Could not generate persistent MAC address for vethaf842b9: No such file or directory
Aug 7 00:35:31 sentry-docker00.cs.umd.edu systemd-udevd[3447386]: Could not generate persistent MAC address for vethd8c81ae: No such file or directory
Aug 7 00:35:31 sentry-docker00.cs.umd.edu systemd-udevd[3447398]: Could not generate persistent MAC address for vethf939ea1: No such file or directory
Aug 7 00:35:31 sentry-docker00.cs.umd.edu systemd-udevd[3447386]: Could not generate persistent MAC address for veth4718dc6: No such file or directory
Aug 7 00:35:31 sentry-docker00.cs.umd.edu systemd-udevd[3447395]: Could not generate persistent MAC address for veth6947581: No such file or directory
Aug 7 00:35:31 sentry-docker00.cs.umd.edu systemd-udevd[3447386]: Could not generate persistent MAC address for vethebfec42: No such file or directory
Aug 7 00:35:31 sentry-docker00.cs.umd.edu systemd-udevd[3447395]: Could not generate persistent MAC address for veth8cd458f: No such file or directory
Aug 7 00:55:39 sentry-docker00.cs.umd.edu systemd-udevd[3456703]: link_config: could not get ethtool features for veth8cd458f
Aug 7 00:55:39 sentry-docker00.cs.umd.edu systemd-udevd[3456703]: Could not set offload features of veth8cd458f: No such device
Aug 7 00:55:39 sentry-docker00.cs.umd.edu systemd-udevd[3456734]: Could not generate persistent MAC address for vetha162903: No such file or directory
Aug 7 00:55:39 sentry-docker00.cs.umd.edu systemd-udevd[3456735]: Could not generate persistent MAC address for vethbb53b3f: No such file or directory
Aug 7 00:55:39 sentry-docker00.cs.umd.edu systemd-udevd[3456759]: Could not generate persistent MAC address for veth16dd7f9: No such file or directory
Aug 7 00:55:39 sentry-docker00.cs.umd.edu systemd-udevd[3456753]: Could not generate persistent MAC address for veth2cfd2d5: No such file or directory
... 6 more distinct messages not shown
== soul (2 distinct, 2 total) ==
Aug 7 00:12:57 soul krb5_child[4030080]: Client 'admin(a)UMD.EDU' not found in Kerberos database
Aug 7 00:13:13 soul sshd-session[4030083]: error: Protocol major versions differ: 2 vs. 1
== strawberry (3 distinct, 9 total) ==
Aug 7 00:09:44 strawberry udisksd[1067]: Error performing housekeeping for drive /org/freedesktop/UDisks2/drives/ST2000DM001_1CH164_W1E8J5KJ: Error updating SMART data: Error sending ATA command CHECK POWER MODE: Unexpected sense data returned:#0120000: 00 00 00 00 00 00 00 00 00 00 00 00 00 00 00 00 ................#0120010: 00 00 00 00 00 00 00 00 00 00 00 00 00 00 00 00 ................#012 (g-io-error-quark, 0) [x6]
Aug 7 00:34:42 strawberry smartd[5314]: Device: /dev/sda [SAT], failed to read SMART Attribute Data [x2]
Aug 7 01:04:42 strawberry smartd[5314]: Device: /dev/sda [SAT], not capable of Offline or Self-Testing.
== submit10-cln25 (3 distinct, 4 total) ==
Aug 7 00:10:12 submit10-cln25 systemd: New main PID 12050 does not belong to service, and PID file is not owned by root. Refusing. [x2]
Aug 7 00:10:30 submit10-cln25 systemd: Daemon never wrote its PID file. Failing.
Aug 7 00:10:36 submit10-cln25 systemd: pmlogger.service: Supervising process 18952 which is not our child. We'll most likely not notice when it exits.
== submit26-b9-4 (10 distinct, 15 total) ==
Aug 7 00:15:31 submit26-b9-4 setroubleshoot[1290563]: SELinux is preventing /usr/bin/python3.9 from create access on the directory /(null). For complete SELinux messages run: sealert -l a4e66030-8621-4da9-bd27-5988bb1bf8ad [x2]
Aug 7 00:15:31 submit26-b9-4 setroubleshoot[1290563]: SELinux is preventing /usr/bin/python3.9 from add_name access on the directory /(null). For complete SELinux messages run: sealert -l c055e37d-bbf5-4800-9083-d606f792c8c1 [x2]
Aug 7 00:15:31 submit26-b9-4 setroubleshoot[1290563]: SELinux is preventing /usr/bin/python3.9 from create access on the file /(null). For complete SELinux messages run: sealert -l e5bc3a56-6d6f-4776-954f-ddde1579648f [x2]
Aug 7 00:15:31 submit26-b9-4 setroubleshoot[1290563]: SELinux is preventing /usr/bin/python3.9 from open access on the file /tmp/libdnf.7EgM7O/repodata/repomd.xml. For complete SELinux messages run: sealert -l a8ec5e1b-49f9-4fbc-a8ae-22e800f7abf2
Aug 7 00:15:31 submit26-b9-4 setroubleshoot[1290563]: SELinux is preventing /usr/bin/python3.9 from setattr access on the file repomd.xml. For complete SELinux messages run: sealert -l 945db714-d0c0-4402-911e-932978b8b036 [x2]
Aug 7 00:15:31 submit26-b9-4 setroubleshoot[1290563]: SELinux is preventing /usr/bin/python3.9 from read access on the directory libdnf.7EgM7O. For complete SELinux messages run: sealert -l 463998a0-fb0d-463c-82b1-471135710a14
Aug 7 00:15:31 submit26-b9-4 setroubleshoot[1290563]: SELinux is preventing /usr/bin/python3.9 from remove_name access on the directory repomd.xml. For complete SELinux messages run: sealert -l 473d2e21-15d8-407a-a9ee-2b842607fa00
Aug 7 00:15:31 submit26-b9-4 setroubleshoot[1290563]: SELinux is preventing /usr/bin/python3.9 from unlink access on the file repomd.xml. For complete SELinux messages run: sealert -l 80c54d4f-bf4b-4501-addb-1627383587d0 [x2]
Aug 7 00:15:31 submit26-b9-4 setroubleshoot[1290563]: SELinux is preventing /usr/bin/python3.9 from rmdir access on the directory repodata. For complete SELinux messages run: sealert -l c63d3890-151e-49a0-83f0-3dfb69d051e5
Aug 7 00:15:54 submit26-b9-4 setroubleshoot[1290596]: SELinux is preventing /usr/bin/python3.9 from open access on the file /tmp/libdnf.I6GAo1/repodata/repomd.xml. For complete SELinux messages run: sealert -l a8ec5e1b-49f9-4fbc-a8ae-22e800f7abf2
== teaching-awards (1 distinct, 1 total) ==
Aug 7 00:53:39 teaching-awards krb5_child[2043192]: Client 'admin(a)UMD.EDU' not found in Kerberos database
== tma-0 (4 distinct, 5 total) ==
Aug 7 00:10:12 tma-0 systemd[1]: New main PID 6281 does not belong to service, and PID file is not owned by root. Refusing. [x2]
Aug 7 00:10:29 tma-0 systemd[1]: Daemon never wrote its PID file. Failing.
Aug 7 00:10:37 tma-0 systemd[1]: pmlogger.service: Supervising process 13556 which is not our child. We'll most likely not notice when it exits.
Aug 7 00:30:58 tma-0 sshd[18528]: error: PAM: Authentication failure for admin from 3.226.38.34.bc.googleusercontent.com
== uffish.cs.umd.edu (3 distinct, 4 total) ==
Aug 7 00:10:12 uffish.cs.umd.edu systemd[1]: New main PID 1899246 does not belong to service, and PID file is not owned by root. Refusing. [x2]
Aug 7 00:10:32 uffish.cs.umd.edu systemd[1]: Daemon never wrote its PID file. Failing.
Aug 7 00:10:48 uffish.cs.umd.edu systemd[1]: pmlogger.service: Supervising process 1906782 which is not our child. We'll most likely not notice when it exits.
== updates00.cs.umd.edu (3 distinct, 4 total) ==
Aug 7 00:10:13 updates00.cs.umd.edu systemd[1]: New main PID 9463 does not belong to service, and PID file is not owned by root. Refusing. [x2]
Aug 7 00:10:30 updates00.cs.umd.edu systemd[1]: Daemon never wrote its PID file. Failing.
Aug 7 00:10:37 updates00.cs.umd.edu systemd[1]: pmlogger.service: Supervising process 16414 which is not our child. We'll most likely not notice when it exits.
== vacuum.cs.umd.edu (3 distinct, 4 total) ==
Aug 7 00:10:14 vacuum.cs.umd.edu systemd[1]: New main PID 11809 does not belong to service, and PID file is not owned by root. Refusing. [x2]
Aug 7 00:10:33 vacuum.cs.umd.edu systemd[1]: Daemon never wrote its PID file. Failing.
Aug 7 00:10:44 vacuum.cs.umd.edu systemd[1]: pmlogger.service: Supervising process 19458 which is not our child. We'll most likely not notice when it exits.
== whiffle.cs.umd.edu (3 distinct, 4 total) ==
Aug 7 00:10:13 whiffle.cs.umd.edu systemd[1]: New main PID 1678972 does not belong to service, and PID file is not owned by root. Refusing. [x2]
Aug 7 00:10:32 whiffle.cs.umd.edu systemd[1]: Daemon never wrote its PID file. Failing.
Aug 7 00:10:46 whiffle.cs.umd.edu systemd[1]: pmlogger.service: Supervising process 1686225 which is not our child. We'll most likely not notice when it exits.
== wraith (1 distinct, 1 total) ==
Aug 7 00:42:47 wraith kernel: workqueue: i915_hpd_poll_init_work [i915] hogged CPU for >10000us 2051 times, consider switching to WQ_UNBOUND
1
0
Command: /usr/local/sbin/syslog-digest.py
Time : 0.9549s
Status : exited 0
Output :
Syslog digest — 2026-08-07 00:05 EDT
Processed 7,789 lines, filtered 5,087 (65%). 2,702 unknown (80 distinct) from 23 host(s).
== abadi-computer (1 distinct, 1 total) ==
Aug 7 00:00:00 abadi-computer kernel: kauditd_printk_skb: 1 callbacks suppressed
== abuse (3 distinct, 2251 total) ==
Aug 6 23:05:04 abuse systemd[1]: Failed to load environment files: Input/output error [x687]
Aug 6 23:05:04 abuse systemd[1]: choria-server.service failed to run 'start' task: Input/output error [x687]
Aug 6 23:05:04 abuse rsyslogd[21745]: imjournal: open() failed for path: '/var/lib/rsyslog/imjournal.state.tmp': Input/output error [v8.2404.0 try https://www.rsyslog.com/e/2433 ] [x877]
== b0b02.cs.umd.edu (1 distinct, 1 total) ==
Aug 6 23:48:26 b0b02.cs.umd.edu rustdesk[3754482]: cannot open display:
== bachata (8 distinct, 8 total) ==
Aug 6 23:14:44 bachata setroubleshoot[2606463]: failed to retrieve rpm info for path '/fs/www/class/fall2026/cmsc616':
Aug 6 23:14:45 bachata setroubleshoot[2606463]: SELinux is preventing /usr/sbin/smbd from getattr access on the lnk_file /fs/www/class/fall2026/cmsc616. For complete SELinux messages run: sealert -l fcd56e6d-4082-40d2-8d07-7512890e4b51
Aug 6 23:14:45 bachata setroubleshoot[2606463]: SELinux is preventing /usr/sbin/smbd from read access on the lnk_file cmsc616. For complete SELinux messages run: sealert -l 8052e635-6f2f-45b1-a983-55d5d837ba65
Aug 6 23:14:45 bachata setroubleshoot[2606463]: failed to retrieve rpm info for path '/fs/www/class/fall2026/.csd_accessibility':
Aug 6 23:14:45 bachata setroubleshoot[2606463]: SELinux is preventing /usr/sbin/smbd from getattr access on the file /fs/www/class/fall2026/.csd_accessibility. For complete SELinux messages run: sealert -l 278fa2f7-7c6d-4613-8831-0c7902342a33
Aug 6 23:14:45 bachata setroubleshoot[2606463]: SELinux is preventing /usr/sbin/smbd from read access on the file .csd_accessibility. For complete SELinux messages run: sealert -l a2f5acec-ed56-4193-b84b-9c355ad24121
Aug 6 23:14:45 bachata setroubleshoot[2606463]: failed to retrieve rpm info for path '/fs/www':
Aug 6 23:14:45 bachata setroubleshoot[2606463]: SELinux is preventing /usr/libexec/samba/samba-dcerpcd from ioctl access on the directory /fs/www. For complete SELinux messages run: sealert -l e6152378-fd71-4efe-8359-f1f27dbb4780
== biggulp.cs.umd.edu (6 distinct, 8 total) ==
Aug 6 23:15:28 biggulp.cs.umd.edu sshd-session[3606482]: pam_access(sshd:auth): access denied for user `admin' from `34.38.226.3'
Aug 6 23:15:28 biggulp.cs.umd.edu krb5_child[3606486]: Client 'admin(a)UMD.EDU' not found in Kerberos database [x2]
Aug 6 23:15:28 biggulp.cs.umd.edu sshd-session[3606479]: error: PAM: System error for admin from 34.38.226.3
Aug 6 23:15:36 biggulp.cs.umd.edu sshd-session[3606502]: error: Protocol major versions differ: 2 vs. 1 [x2]
Aug 6 23:20:36 biggulp.cs.umd.edu sshd-session[3607744]: pam_access(sshd:auth): access denied for user `admin' from `35.233.1.9'
Aug 6 23:20:36 biggulp.cs.umd.edu sshd-session[3607728]: error: PAM: System error for admin from 35.233.1.9
== contest (1 distinct, 33 total) ==
Aug 6 23:06:47 contest goferd[1007]: [ERROR][worker-0] gofer.messaging.adapter.connect:33 - connect: proton+amqps://satellite8.cs.umd.edu:5647, failed: Connection amqps://satellite8.cs.umd.edu:5647 disconnected: Condition('proton.pythonio', 'Connection refused to all addresses') [x33]
== csfw00a (1 distinct, 250 total) ==
Aug 6 23:05:42 csfw00a kernel: bnxt_en 0000:09:00.0 eth3: NIC Link is Down [x250]
== hackerman (7 distinct, 12 total) ==
Aug 6 23:19:01 hackerman gnome-software[2060381]: failed to commit changes to dconf: GDBus.Error:org.gtk.GDBus.UnmappedGError.Quark._g_2dfile_2derror_2dquark.Code2: Failed to create file “/adminhomes/sajith/.config/dconf/user.5TYRT3”: Permission denied
Aug 6 23:20:04 hackerman gnome-software[2060381]: can't reliably fixup error code 4 in domain g-io-error-quark: Not a directory [x4]
Aug 6 23:20:12 hackerman gnome-software[2060381]: Only 0 apps for recent list, hiding
Aug 6 23:20:28 hackerman gnome-software[2060381]: failed to commit changes to dconf: GDBus.Error:org.gtk.GDBus.UnmappedGError.Quark._g_2dfile_2derror_2dquark.Code2: Failed to create file “/adminhomes/sajith/.config/dconf/user.5P8UT3”: Permission denied
Aug 6 23:20:28 hackerman packagekitd[405237]: Failed to get cache filename for libreoffice [x2]
Aug 6 23:20:28 hackerman packagekitd[405237]: Failed to get cache filename for kernel [x2]
Aug 6 23:20:37 hackerman packagekitd[405237]: failed to parse public key for /etc/pki/rpm-gpg/RPM-GPG-KEY-PQC-redhat-release
== hspc (1 distinct, 1 total) ==
Aug 7 00:00:04 hspc kernel: kauditd_printk_skb: 4 callbacks suppressed
== idm00 (1 distinct, 1 total) ==
Aug 6 23:51:19 idm00 named[1455]: client @0x7f33157e2a78 10.73.240.42#59688: update '73.10.in-addr.arpa/IN' denied
== idmp0 (1 distinct, 1 total) ==
Aug 6 23:36:01 idmp0 named[5198]: client @0x7f9924011de8 10.73.240.43#65186: update '73.10.in-addr.arpa/IN' denied
== itmon02 (1 distinct, 47 total) ==
Aug 6 23:07:49 itmon02 sshd[1750555]: error: beginning MaxStartups throttling [x47]
== matrix (1 distinct, 1 total) ==
Aug 7 00:00:22 matrix (nin-node)[3940312]: munin-node.service: Referenced but unset environment variable evaluates to an empty string: DAEMON_ARGS
== neo-gizmonic (1 distinct, 1 total) ==
Aug 7 00:00:14 neo-gizmonic (nin-node)[867205]: munin-node.service: Referenced but unset environment variable evaluates to an empty string: DAEMON_ARGS
== neoavion (1 distinct, 1 total) ==
Aug 7 00:00:25 neoavion (nin-node)[3890014]: munin-node.service: Referenced but unset environment variable evaluates to an empty string: DAEMON_ARGS
== newhonors.cs.umd.edu (3 distinct, 3 total) ==
Aug 6 23:10:45 newhonors.cs.umd.edu sshd[18656]: fatal: Unable to negotiate with 34.38.53.91 port 11968: no matching host key type found. Their offer: ssh-dss [preauth]
Aug 6 23:10:47 newhonors.cs.umd.edu sshd[18662]: fatal: Unable to negotiate with 34.38.53.91 port 11994: no matching host key type found. Their offer: ecdsa-sha2-nistp384 [preauth]
Aug 6 23:10:47 newhonors.cs.umd.edu sshd[18664]: fatal: Unable to negotiate with 34.38.53.91 port 12010: no matching host key type found. Their offer: ecdsa-sha2-nistp521 [preauth]
== newhonors2 (2 distinct, 25 total) ==
Aug 6 23:13:02 newhonors2 dhcpcd[845173]: dhcpcd is not running [x24]
Aug 7 00:00:16 newhonors2 (nin-node)[846760]: munin-node.service: Referenced but unset environment variable evaluates to an empty string: DAEMON_ARGS
== outbound00.cs.umd.edu (1 distinct, 6 total) ==
Aug 6 23:09:09 outbound00.cs.umd.edu python3[3674202]: ldapdb [x6]
== outbound01.cs.umd.edu (1 distinct, 6 total) ==
Aug 6 23:13:06 outbound01.cs.umd.edu python3[1710387]: ldapdb [x6]
== sentry-docker00.cs.umd.edu (34 distinct, 34 total) ==
Aug 6 23:14:57 sentry-docker00.cs.umd.edu systemd-udevd[3409345]: link_config: could not get ethtool features for veth27dfcfe
Aug 6 23:14:57 sentry-docker00.cs.umd.edu systemd-udevd[3409345]: Could not set offload features of veth27dfcfe: No such device
Aug 6 23:14:57 sentry-docker00.cs.umd.edu systemd-udevd[3409365]: Could not generate persistent MAC address for veth92a9abf: No such file or directory
Aug 6 23:14:57 sentry-docker00.cs.umd.edu systemd-udevd[3409367]: Could not generate persistent MAC address for veth5098ab8: No such file or directory
Aug 6 23:14:57 sentry-docker00.cs.umd.edu systemd-udevd[3409396]: Could not generate persistent MAC address for veth6f7493a: No such file or directory
Aug 6 23:14:57 sentry-docker00.cs.umd.edu systemd-udevd[3409397]: Could not generate persistent MAC address for veth4ac2650: No such file or directory
Aug 6 23:14:57 sentry-docker00.cs.umd.edu systemd-udevd[3409397]: Could not generate persistent MAC address for veth2c22561: No such file or directory
Aug 6 23:14:57 sentry-docker00.cs.umd.edu systemd-udevd[3409443]: Could not generate persistent MAC address for veth5eb8f1a: No such file or directory
Aug 6 23:14:57 sentry-docker00.cs.umd.edu systemd-udevd[3409458]: Could not generate persistent MAC address for veth674f5c4: No such file or directory
Aug 6 23:14:57 sentry-docker00.cs.umd.edu systemd-udevd[3409459]: Could not generate persistent MAC address for vethfcebeec: No such file or directory
Aug 6 23:14:57 sentry-docker00.cs.umd.edu systemd-udevd[3409515]: Could not generate persistent MAC address for vethd1346a0: No such file or directory
Aug 6 23:14:57 sentry-docker00.cs.umd.edu systemd-udevd[3409520]: Could not generate persistent MAC address for veth7407cc0: No such file or directory
Aug 6 23:35:05 sentry-docker00.cs.umd.edu systemd-udevd[3418784]: link_config: could not get ethtool features for veth674f5c4
Aug 6 23:35:05 sentry-docker00.cs.umd.edu systemd-udevd[3418784]: Could not set offload features of veth674f5c4: No such device
Aug 6 23:35:06 sentry-docker00.cs.umd.edu systemd-udevd[3418854]: Could not generate persistent MAC address for vethd165c40: No such file or directory
Aug 6 23:35:06 sentry-docker00.cs.umd.edu systemd-udevd[3418856]: Could not generate persistent MAC address for vethf7239c5: No such file or directory
Aug 6 23:35:06 sentry-docker00.cs.umd.edu systemd-udevd[3418858]: Could not generate persistent MAC address for vethb8561db: No such file or directory
Aug 6 23:35:06 sentry-docker00.cs.umd.edu systemd-udevd[3418859]: Could not generate persistent MAC address for veth7f7564c: No such file or directory
Aug 6 23:35:06 sentry-docker00.cs.umd.edu systemd-udevd[3418879]: Could not generate persistent MAC address for vethb066ae0: No such file or directory
Aug 6 23:35:06 sentry-docker00.cs.umd.edu systemd-udevd[3418880]: Could not generate persistent MAC address for vethad0c90d: No such file or directory
Aug 6 23:35:06 sentry-docker00.cs.umd.edu systemd-udevd[3418879]: Could not generate persistent MAC address for vethe675c1c: No such file or directory
Aug 6 23:35:06 sentry-docker00.cs.umd.edu systemd-udevd[3418867]: Could not generate persistent MAC address for veth0308523: No such file or directory
Aug 6 23:35:06 sentry-docker00.cs.umd.edu systemd-udevd[3418973]: Could not generate persistent MAC address for vethd3df222: No such file or directory
Aug 6 23:35:06 sentry-docker00.cs.umd.edu systemd-udevd[3418979]: Could not generate persistent MAC address for vethc5cbfa7: No such file or directory
Aug 6 23:55:14 sentry-docker00.cs.umd.edu systemd-udevd[3428510]: Could not generate persistent MAC address for vetha5f0f79: No such file or directory
Aug 6 23:55:14 sentry-docker00.cs.umd.edu systemd-udevd[3428511]: Could not generate persistent MAC address for vethc3c4f0a: No such file or directory
Aug 6 23:55:14 sentry-docker00.cs.umd.edu systemd-udevd[3428536]: Could not generate persistent MAC address for veth4d49a59: No such file or directory
Aug 6 23:55:14 sentry-docker00.cs.umd.edu systemd-udevd[3428537]: Could not generate persistent MAC address for vethd21c760: No such file or directory
Aug 6 23:55:14 sentry-docker00.cs.umd.edu systemd-udevd[3428587]: Could not generate persistent MAC address for veth9d43002: No such file or directory
Aug 6 23:55:14 sentry-docker00.cs.umd.edu systemd-udevd[3428582]: Could not generate persistent MAC address for vethdf53de8: No such file or directory
... 4 more distinct messages not shown
== strawberry (2 distinct, 8 total) ==
Aug 6 23:09:44 strawberry udisksd[1067]: Error performing housekeeping for drive /org/freedesktop/UDisks2/drives/ST2000DM001_1CH164_W1E8J5KJ: Error updating SMART data: Error sending ATA command CHECK POWER MODE: Unexpected sense data returned:#0120000: 00 00 00 00 00 00 00 00 00 00 00 00 00 00 00 00 ................#0120010: 00 00 00 00 00 00 00 00 00 00 00 00 00 00 00 00 ................#012 (g-io-error-quark, 0) [x6]
Aug 6 23:34:42 strawberry smartd[5314]: Device: /dev/sda [SAT], failed to read SMART Attribute Data [x2]
== talkhosts9 (1 distinct, 2 total) ==
Aug 6 23:10:10 talkhosts9 setroubleshoot[1794705]: SELinux is preventing /usr/bin/lsof from getattr access on the unix_stream_socket unix_stream_socket. For complete SELinux messages run: sealert -l a6df89b3-c497-469c-8232-c4fde0508abf [x2]
== wraith (1 distinct, 1 total) ==
Aug 7 00:00:10 wraith (nin-node)[45159]: munin-node.service: Referenced but unset environment variable evaluates to an empty string: DAEMON_ARGS
1
0
Command: /usr/local/sbin/syslog-digest.py
Time : 0.9496s
Status : exited 0
Output :
Syslog digest — 2026-08-06 23:05 EDT
Processed 7,332 lines, filtered 4,647 (63%). 2,685 unknown (65 distinct) from 18 host(s).
== abuse (3 distinct, 2248 total) ==
Aug 6 22:05:04 abuse systemd[1]: Failed to load environment files: Input/output error [x687]
Aug 6 22:05:04 abuse systemd[1]: choria-server.service failed to run 'start' task: Input/output error [x687]
Aug 6 22:05:04 abuse rsyslogd[21745]: imjournal: open() failed for path: '/var/lib/rsyslog/imjournal.state.tmp': Input/output error [v8.2404.0 try https://www.rsyslog.com/e/2433 ] [x874]
== atif01.cs.umd.edu (1 distinct, 1 total) ==
Aug 6 22:28:31 atif01.cs.umd.edu sshd[39136]: fatal: ssh_packet_get_string: incomplete message [preauth]
== b0b02.cs.umd.edu (1 distinct, 1 total) ==
Aug 6 22:48:23 b0b02.cs.umd.edu rustdesk[3739410]: cannot open display:
== bachata (1 distinct, 2 total) ==
Aug 6 22:55:49 bachata setroubleshoot[2605709]: SELinux is preventing /usr/sbin/smbd from name_bind access on the udp_socket port 812. For complete SELinux messages run: sealert -l 8f7247f1-69a5-4a62-a4f0-88a324bfd75c [x2]
== bale (1 distinct, 1 total) ==
Aug 6 22:05:40 bale setroubleshoot[731934]: SELinux is preventing /usr/bin/tar from using the fowner capability. For complete SELinux messages run: sealert -l 8f58859c-1c63-4aee-afff-7c8e1dd95f45
== contest (1 distinct, 34 total) ==
Aug 6 22:06:05 contest goferd[1007]: [ERROR][worker-0] gofer.messaging.adapter.connect:33 - connect: proton+amqps://satellite8.cs.umd.edu:5647, failed: Connection amqps://satellite8.cs.umd.edu:5647 disconnected: Condition('proton.pythonio', 'Connection refused to all addresses') [x34]
== csfw00a (1 distinct, 256 total) ==
Aug 6 22:04:59 csfw00a kernel: bnxt_en 0000:09:00.0 eth3: NIC Link is Down [x256]
== hackerman (6 distinct, 11 total) ==
Aug 6 22:20:04 hackerman gnome-software[2060381]: can't reliably fixup error code 4 in domain g-io-error-quark: Not a directory [x4]
Aug 6 22:20:12 hackerman gnome-software[2060381]: Only 0 apps for recent list, hiding
Aug 6 22:20:28 hackerman gnome-software[2060381]: failed to commit changes to dconf: GDBus.Error:org.gtk.GDBus.UnmappedGError.Quark._g_2dfile_2derror_2dquark.Code2: Failed to create file “/adminhomes/sajith/.config/dconf/user.5XCZT3”: Permission denied
Aug 6 22:20:29 hackerman packagekitd[391506]: Failed to get cache filename for libreoffice [x2]
Aug 6 22:20:29 hackerman packagekitd[391506]: Failed to get cache filename for kernel [x2]
Aug 6 22:20:38 hackerman packagekitd[391506]: failed to parse public key for /etc/pki/rpm-gpg/RPM-GPG-KEY-PQC-redhat-release
== idm00 (1 distinct, 1 total) ==
Aug 6 22:51:19 idm00 named[1455]: client @0x7f330c3b3e78 10.73.240.42#55662: update '73.10.in-addr.arpa/IN' denied
== idmp0 (1 distinct, 1 total) ==
Aug 6 22:36:01 idmp0 named[5198]: client @0x7f99000dfeb8 10.73.240.43#55359: update '73.10.in-addr.arpa/IN' denied
== itmon02 (1 distinct, 40 total) ==
Aug 6 22:07:48 itmon02 sshd[1750555]: error: beginning MaxStartups throttling [x40]
== netman.cs.umd.edu (2 distinct, 5 total) ==
Aug 6 22:34:30 netman.cs.umd.edu krb5_child[1813407]: Client 'admin(a)UMD.EDU' not found in Kerberos database [x4]
Aug 6 22:34:34 netman.cs.umd.edu sshd[1813404]: error: PAM: Authentication failure for admin from 104.155.37.231
== newhonors2 (1 distinct, 24 total) ==
Aug 6 22:13:03 newhonors2 dhcpcd[843311]: dhcpcd is not running [x24]
== outbound00.cs.umd.edu (3 distinct, 8 total) ==
Aug 6 22:09:09 outbound00.cs.umd.edu python3[3660137]: ldapdb [x6]
Aug 6 23:02:07 outbound00.cs.umd.edu krb5_child[3672907]: Client 'admin(a)UMD.EDU' not found in Kerberos database
Aug 6 23:02:24 outbound00.cs.umd.edu sshd-session[3672911]: error: Protocol major versions differ: 2 vs. 1
== outbound01.cs.umd.edu (1 distinct, 6 total) ==
Aug 6 22:13:06 outbound01.cs.umd.edu python3[1696525]: ldapdb [x6]
== sentry-docker00.cs.umd.edu (34 distinct, 34 total) ==
Aug 6 22:14:32 sentry-docker00.cs.umd.edu systemd-udevd[3381097]: Could not generate persistent MAC address for veth8ad12e7: No such file or directory
Aug 6 22:14:32 sentry-docker00.cs.umd.edu systemd-udevd[3381098]: Could not generate persistent MAC address for vethc24df08: No such file or directory
Aug 6 22:14:32 sentry-docker00.cs.umd.edu systemd-udevd[3381101]: Could not generate persistent MAC address for vethddafacc: No such file or directory
Aug 6 22:14:32 sentry-docker00.cs.umd.edu systemd-udevd[3381111]: Could not generate persistent MAC address for veth9332a40: No such file or directory
Aug 6 22:14:32 sentry-docker00.cs.umd.edu systemd-udevd[3381105]: Could not generate persistent MAC address for veth8fc7160: No such file or directory
Aug 6 22:14:32 sentry-docker00.cs.umd.edu systemd-udevd[3381121]: Could not generate persistent MAC address for veth239d5e5: No such file or directory
Aug 6 22:14:32 sentry-docker00.cs.umd.edu systemd-udevd[3381145]: Could not generate persistent MAC address for vethe57592a: No such file or directory
Aug 6 22:14:32 sentry-docker00.cs.umd.edu systemd-udevd[3381146]: Could not generate persistent MAC address for vethf64094c: No such file or directory
Aug 6 22:14:32 sentry-docker00.cs.umd.edu systemd-udevd[3381211]: Could not generate persistent MAC address for veth2f26f22: No such file or directory
Aug 6 22:14:32 sentry-docker00.cs.umd.edu systemd-udevd[3381209]: Could not generate persistent MAC address for veth9524f0c: No such file or directory
Aug 6 22:34:40 sentry-docker00.cs.umd.edu systemd-udevd[3390534]: link_config: could not get ethtool features for veth9524f0c
Aug 6 22:34:40 sentry-docker00.cs.umd.edu systemd-udevd[3390534]: Could not set offload features of veth9524f0c: No such device
Aug 6 22:34:41 sentry-docker00.cs.umd.edu systemd-udevd[3390563]: Could not generate persistent MAC address for veth0996391: No such file or directory
Aug 6 22:34:41 sentry-docker00.cs.umd.edu systemd-udevd[3390564]: Could not generate persistent MAC address for veth837d7f2: No such file or directory
Aug 6 22:34:41 sentry-docker00.cs.umd.edu systemd-udevd[3390567]: Could not generate persistent MAC address for veth29fb68d: No such file or directory
Aug 6 22:34:41 sentry-docker00.cs.umd.edu systemd-udevd[3390580]: Could not generate persistent MAC address for vethce1bc73: No such file or directory
Aug 6 22:34:41 sentry-docker00.cs.umd.edu systemd-udevd[3390591]: Could not generate persistent MAC address for veth6beebe3: No such file or directory
Aug 6 22:34:41 sentry-docker00.cs.umd.edu systemd-udevd[3390592]: Could not generate persistent MAC address for veth4f89d32: No such file or directory
Aug 6 22:34:41 sentry-docker00.cs.umd.edu systemd-udevd[3390654]: Could not generate persistent MAC address for veth304c840: No such file or directory
Aug 6 22:34:41 sentry-docker00.cs.umd.edu systemd-udevd[3390624]: Could not generate persistent MAC address for veth51f6208: No such file or directory
Aug 6 22:34:41 sentry-docker00.cs.umd.edu systemd-udevd[3390619]: Could not generate persistent MAC address for vethc74f07d: No such file or directory
Aug 6 22:34:41 sentry-docker00.cs.umd.edu systemd-udevd[3390622]: Could not generate persistent MAC address for veth1ed0fd8: No such file or directory
Aug 6 22:54:49 sentry-docker00.cs.umd.edu systemd-udevd[3399910]: link_config: could not get ethtool features for veth6beebe3
Aug 6 22:54:49 sentry-docker00.cs.umd.edu systemd-udevd[3399910]: Could not set offload features of veth6beebe3: No such device
Aug 6 22:54:49 sentry-docker00.cs.umd.edu systemd-udevd[3399995]: Could not generate persistent MAC address for veth560c876: No such file or directory
Aug 6 22:54:49 sentry-docker00.cs.umd.edu systemd-udevd[3399996]: Could not generate persistent MAC address for veth7390a94: No such file or directory
Aug 6 22:54:49 sentry-docker00.cs.umd.edu systemd-udevd[3399999]: Could not generate persistent MAC address for veth14fcb87: No such file or directory
Aug 6 22:54:49 sentry-docker00.cs.umd.edu systemd-udevd[3400000]: Could not generate persistent MAC address for vethdfbbf25: No such file or directory
Aug 6 22:54:49 sentry-docker00.cs.umd.edu systemd-udevd[3400021]: Could not generate persistent MAC address for veth36783ac: No such file or directory
Aug 6 22:54:49 sentry-docker00.cs.umd.edu systemd-udevd[3400001]: Could not generate persistent MAC address for vethfbb228d: No such file or directory
... 4 more distinct messages not shown
== strawberry (2 distinct, 8 total) ==
Aug 6 22:09:44 strawberry udisksd[1067]: Error performing housekeeping for drive /org/freedesktop/UDisks2/drives/ST2000DM001_1CH164_W1E8J5KJ: Error updating SMART data: Error sending ATA command CHECK POWER MODE: Unexpected sense data returned:#0120000: 00 00 00 00 00 00 00 00 00 00 00 00 00 00 00 00 ................#0120010: 00 00 00 00 00 00 00 00 00 00 00 00 00 00 00 00 ................#012 (g-io-error-quark, 0) [x6]
Aug 6 22:34:42 strawberry smartd[5314]: Device: /dev/sda [SAT], failed to read SMART Attribute Data [x2]
== vacuum.cs.umd.edu (4 distinct, 4 total) ==
Aug 6 22:11:58 vacuum.cs.umd.edu abrt-hook-ccpp[13584]: Process 9131 (driver) of user 33 killed by SIGABRT - dumping core
Aug 6 22:11:59 vacuum.cs.umd.edu abrt-server[13586]: Package 'amanda-backup_server' isn't signed with proper key
Aug 6 22:11:59 vacuum.cs.umd.edu abrt-server[13586]: 'post-create' on '/var/spool/abrt/ccpp-2026-08-06-22:11:58-9131' exited with 1
Aug 6 22:11:59 vacuum.cs.umd.edu abrt-server[13586]: Deleting problem directory '/var/spool/abrt/ccpp-2026-08-06-22:11:58-9131'
1
0
Command: /usr/local/sbin/syslog-digest.py
Time : 1.0200s
Status : exited 0
Output :
Syslog digest — 2026-08-06 22:05 EDT
Processed 7,714 lines, filtered 4,917 (63%). 2,797 unknown (132 distinct) from 20 host(s).
== abadi-computer (11 distinct, 25 total) ==
Aug 6 21:35:16 abadi-computer kernel: kauditd_printk_skb: 296 callbacks suppressed
Aug 6 21:35:21 abadi-computer kernel: kauditd_printk_skb: 143 callbacks suppressed
Aug 6 21:35:26 abadi-computer kernel: kauditd_printk_skb: 116 callbacks suppressed
Aug 6 21:35:31 abadi-computer kernel: kauditd_printk_skb: 77 callbacks suppressed
Aug 6 21:35:36 abadi-computer kernel: kauditd_printk_skb: 95 callbacks suppressed
Aug 6 21:35:42 abadi-computer kernel: kauditd_printk_skb: 92 callbacks suppressed
Aug 6 21:35:47 abadi-computer kernel: kauditd_printk_skb: 8 callbacks suppressed [x2]
Aug 6 21:38:11 abadi-computer krb5_child[1962409]: Preauthentication failed [x4]
Aug 6 21:38:59 abadi-computer kernel: kauditd_printk_skb: 1 callbacks suppressed [x11]
Aug 6 21:43:54 abadi-computer falcon-sensor-bpf[529]: CrowdStrike(4): Could not retrieve DisableProxy value: c0000225
Aug 6 21:43:54 abadi-computer falcon-sensor-bpf[529]: CrowdStrike(4): ConnectWithProxy: Unable to get application proxy host from CsConfig: c0000225
== abuse (3 distinct, 2239 total) ==
Aug 6 21:05:06 abuse systemd[1]: Failed to load environment files: Input/output error [x687]
Aug 6 21:05:06 abuse systemd[1]: choria-server.service failed to run 'start' task: Input/output error [x688]
Aug 6 21:05:06 abuse rsyslogd[21745]: imjournal: open() failed for path: '/var/lib/rsyslog/imjournal.state.tmp': Input/output error [v8.2404.0 try https://www.rsyslog.com/e/2433 ] [x864]
== atif01.cs.umd.edu (23 distinct, 47 total) ==
Aug 6 21:58:04 atif01.cs.umd.edu sshd[38526]: error: maximum authentication attempts exceeded for root from 45.15.226.100 port 38780 ssh2 [preauth]
Aug 6 21:58:04 atif01.cs.umd.edu sshd[38526]: PAM service(sshd) ignoring max retries; 6 > 3 [x21]
Aug 6 21:58:20 atif01.cs.umd.edu sshd[38534]: error: maximum authentication attempts exceeded for root from 45.15.226.100 port 39818 ssh2 [preauth]
Aug 6 21:58:34 atif01.cs.umd.edu sshd[38544]: error: maximum authentication attempts exceeded for root from 45.15.226.100 port 40832 ssh2 [preauth]
Aug 6 21:58:53 atif01.cs.umd.edu sshd[38565]: error: maximum authentication attempts exceeded for invalid user admin from 45.15.226.100 port 42042 ssh2 [preauth]
Aug 6 21:59:10 atif01.cs.umd.edu sshd[38576]: error: maximum authentication attempts exceeded for invalid user admin from 45.15.226.100 port 42982 ssh2 [preauth]
Aug 6 21:59:20 atif01.cs.umd.edu sshd[38580]: PAM service(sshd) ignoring max retries; 4 > 3 [x5]
Aug 6 21:59:35 atif01.cs.umd.edu sshd[38582]: error: maximum authentication attempts exceeded for invalid user oracle from 45.15.226.100 port 44666 ssh2 [preauth]
Aug 6 21:59:50 atif01.cs.umd.edu sshd[38594]: error: maximum authentication attempts exceeded for invalid user oracle from 45.15.226.100 port 45552 ssh2 [preauth]
Aug 6 22:00:13 atif01.cs.umd.edu sshd[38600]: error: maximum authentication attempts exceeded for invalid user usuario from 45.15.226.100 port 46888 ssh2 [preauth]
Aug 6 22:00:29 atif01.cs.umd.edu sshd[38626]: error: maximum authentication attempts exceeded for invalid user usuario from 45.15.226.100 port 47824 ssh2 [preauth]
Aug 6 22:00:52 atif01.cs.umd.edu sshd[38640]: error: maximum authentication attempts exceeded for invalid user test from 45.15.226.100 port 49344 ssh2 [preauth]
Aug 6 22:01:08 atif01.cs.umd.edu sshd[38644]: error: maximum authentication attempts exceeded for invalid user test from 45.15.226.100 port 50334 ssh2 [preauth]
Aug 6 22:01:30 atif01.cs.umd.edu sshd[38666]: error: maximum authentication attempts exceeded for invalid user user from 45.15.226.100 port 51702 ssh2 [preauth]
Aug 6 22:01:44 atif01.cs.umd.edu sshd[38668]: error: maximum authentication attempts exceeded for invalid user user from 45.15.226.100 port 52692 ssh2 [preauth]
Aug 6 22:02:12 atif01.cs.umd.edu sshd[38684]: error: maximum authentication attempts exceeded for invalid user ftpuser from 45.15.226.100 port 54334 ssh2 [preauth]
Aug 6 22:02:29 atif01.cs.umd.edu sshd[38688]: error: maximum authentication attempts exceeded for invalid user ftpuser from 45.15.226.100 port 55388 ssh2 [preauth]
Aug 6 22:02:55 atif01.cs.umd.edu sshd[38702]: error: maximum authentication attempts exceeded for invalid user test1 from 45.15.226.100 port 57152 ssh2 [preauth]
Aug 6 22:03:12 atif01.cs.umd.edu sshd[38712]: error: maximum authentication attempts exceeded for invalid user test1 from 45.15.226.100 port 58188 ssh2 [preauth]
Aug 6 22:03:34 atif01.cs.umd.edu sshd[38718]: error: maximum authentication attempts exceeded for invalid user test2 from 45.15.226.100 port 59638 ssh2 [preauth]
Aug 6 22:03:49 atif01.cs.umd.edu sshd[38731]: error: maximum authentication attempts exceeded for invalid user test2 from 45.15.226.100 port 60620 ssh2 [preauth]
Aug 6 22:04:09 atif01.cs.umd.edu sshd[38746]: error: maximum authentication attempts exceeded for invalid user ubuntu from 45.15.226.100 port 33724 ssh2 [preauth]
Aug 6 22:04:24 atif01.cs.umd.edu sshd[38748]: error: maximum authentication attempts exceeded for invalid user ubuntu from 45.15.226.100 port 34594 ssh2 [preauth]
== b0b02.cs.umd.edu (1 distinct, 1 total) ==
Aug 6 21:48:19 b0b02.cs.umd.edu rustdesk[3724342]: cannot open display:
== cheezit.cs.umd.edu (3 distinct, 3 total) ==
Aug 6 21:33:10 cheezit.cs.umd.edu sshd-session[1916118]: pam_access(sshd:auth): access denied for user `admin' from `94.183.177.21'
Aug 6 21:33:10 cheezit.cs.umd.edu krb5_child[1916120]: Client 'admin(a)UMD.EDU' not found in Kerberos database
Aug 6 21:33:10 cheezit.cs.umd.edu sshd-session[1916116]: error: PAM: System error for admin from 94.183.177.21
== contest (9 distinct, 42 total) ==
Aug 6 21:05:23 contest goferd[1007]: [ERROR][worker-0] gofer.messaging.adapter.connect:33 - connect: proton+amqps://satellite8.cs.umd.edu:5647, failed: Connection amqps://satellite8.cs.umd.edu:5647 disconnected: Condition('proton.pythonio', 'Connection refused to all addresses') [x34]
Aug 6 21:48:18 contest setroubleshoot[748455]: SELinux is preventing /usr/libexec/platform-python3.6 from create access on the directory libdnf.rSoWAn. For complete SELinux messages run: sealert -l cb6b25c6-4765-4cf2-88a0-9b3b508e94e9
Aug 6 21:48:18 contest setroubleshoot[748455]: SELinux is preventing /usr/bin/gpgconf from add_name access on the directory repodata. For complete SELinux messages run: sealert -l 41cf7b1b-0f34-4609-98f2-b66e7825fef7
Aug 6 21:48:18 contest setroubleshoot[748455]: SELinux is preventing /usr/libexec/platform-python3.6 from create access on the file mirrorlist. For complete SELinux messages run: sealert -l fc20ff92-ea83-4f38-a24b-ddfd737a3141
Aug 6 21:48:19 contest setroubleshoot[748455]: SELinux is preventing /usr/libexec/platform-python3.6 from setattr access on the file repomd.xml. For complete SELinux messages run: sealert -l ac675631-fa35-4e93-adc9-b692b18e53e5
Aug 6 21:48:19 contest setroubleshoot[748455]: SELinux is preventing /usr/libexec/platform-python3.6 from read access on the directory libdnf.rSoWAn. For complete SELinux messages run: sealert -l 45d103b6-0810-4890-a705-990118577ce8
Aug 6 21:48:23 contest setroubleshoot[748455]: SELinux is preventing /usr/libexec/platform-python3.6 from remove_name access on the directory repomd.xml. For complete SELinux messages run: sealert -l 7e499113-2fd7-4f67-bec6-3521efbe3637
Aug 6 21:48:26 contest setroubleshoot[748455]: SELinux is preventing rhsmcertd-worke from unlink access on the file repomd.xml. For complete SELinux messages run: sealert -l 22835727-7fef-4cfb-b3b5-881f66888317
Aug 6 21:48:39 contest setroubleshoot[748505]: SELinux is preventing /usr/libexec/platform-python3.6 from rmdir access on the directory repodata. For complete SELinux messages run: sealert -l 3928930b-a1ed-448d-950b-0665ac2adef8
== csfw00a (1 distinct, 270 total) ==
Aug 6 21:04:33 csfw00a kernel: bnxt_en 0000:09:00.0 eth3: NIC Link is Down [x270]
== hackerman (7 distinct, 12 total) ==
Aug 6 21:19:01 hackerman gnome-software[2060381]: failed to commit changes to dconf: GDBus.Error:org.gtk.GDBus.UnmappedGError.Quark._g_2dfile_2derror_2dquark.Code2: Failed to create file “/adminhomes/sajith/.config/dconf/user.5KD1T3”: Permission denied
Aug 6 21:20:04 hackerman gnome-software[2060381]: can't reliably fixup error code 4 in domain g-io-error-quark: Not a directory [x4]
Aug 6 21:20:12 hackerman gnome-software[2060381]: Only 0 apps for recent list, hiding
Aug 6 21:20:28 hackerman gnome-software[2060381]: failed to commit changes to dconf: GDBus.Error:org.gtk.GDBus.UnmappedGError.Quark._g_2dfile_2derror_2dquark.Code2: Failed to create file “/adminhomes/sajith/.config/dconf/user.I94GT3”: Permission denied
Aug 6 21:20:28 hackerman packagekitd[377765]: Failed to get cache filename for libreoffice [x2]
Aug 6 21:20:28 hackerman packagekitd[377765]: Failed to get cache filename for kernel [x2]
Aug 6 21:20:38 hackerman packagekitd[377765]: failed to parse public key for /etc/pki/rpm-gpg/RPM-GPG-KEY-PQC-redhat-release
== idm00 (1 distinct, 1 total) ==
Aug 6 21:51:19 idm00 named[1455]: client @0x7f33154dca68 10.73.240.42#62528: update '73.10.in-addr.arpa/IN' denied
== idmp0 (1 distinct, 1 total) ==
Aug 6 21:36:01 idmp0 named[5198]: client @0x7f993001d3f8 10.73.240.43#63528: update '73.10.in-addr.arpa/IN' denied
== itmon02 (1 distinct, 46 total) ==
Aug 6 21:07:57 itmon02 sshd[1750555]: error: beginning MaxStartups throttling [x46]
== krispykreme.cs.umd.edu (1 distinct, 1 total) ==
Aug 6 21:09:05 krispykreme.cs.umd.edu sshd-session[53921]: error: send_error: write: Connection reset by peer
== newhonors2 (1 distinct, 24 total) ==
Aug 6 21:13:03 newhonors2 dhcpcd[841468]: dhcpcd is not running [x24]
== outbound00.cs.umd.edu (1 distinct, 6 total) ==
Aug 6 21:09:09 outbound00.cs.umd.edu python3[3646270]: ldapdb [x6]
== outbound01.cs.umd.edu (1 distinct, 6 total) ==
Aug 6 21:13:06 outbound01.cs.umd.edu python3[1682430]: ldapdb [x6]
== sentry-docker00.cs.umd.edu (38 distinct, 38 total) ==
Aug 6 21:14:07 sentry-docker00.cs.umd.edu systemd-udevd[3352586]: link_config: could not get ethtool features for vethdd4b97d
Aug 6 21:14:07 sentry-docker00.cs.umd.edu systemd-udevd[3352586]: Could not set offload features of vethdd4b97d: No such device
Aug 6 21:14:07 sentry-docker00.cs.umd.edu systemd-udevd[3352660]: Could not generate persistent MAC address for vethf8331eb: No such file or directory
Aug 6 21:14:07 sentry-docker00.cs.umd.edu systemd-udevd[3352661]: Could not generate persistent MAC address for veth1f63e1d: No such file or directory
Aug 6 21:14:07 sentry-docker00.cs.umd.edu systemd-udevd[3352664]: Could not generate persistent MAC address for veth9211205: No such file or directory
Aug 6 21:14:07 sentry-docker00.cs.umd.edu systemd-udevd[3352665]: Could not generate persistent MAC address for vethf26ca9b: No such file or directory
Aug 6 21:14:07 sentry-docker00.cs.umd.edu systemd-udevd[3352688]: Could not generate persistent MAC address for veth972e848: No such file or directory
Aug 6 21:14:07 sentry-docker00.cs.umd.edu systemd-udevd[3352689]: Could not generate persistent MAC address for vethcb43b87: No such file or directory
Aug 6 21:14:07 sentry-docker00.cs.umd.edu systemd-udevd[3352706]: Could not generate persistent MAC address for veth66815f6: No such file or directory
Aug 6 21:14:07 sentry-docker00.cs.umd.edu systemd-udevd[3352700]: Could not generate persistent MAC address for veth156112a: No such file or directory
Aug 6 21:14:07 sentry-docker00.cs.umd.edu systemd-udevd[3352695]: Could not generate persistent MAC address for veth12f68e1: No such file or directory
Aug 6 21:14:07 sentry-docker00.cs.umd.edu systemd-udevd[3352696]: Could not generate persistent MAC address for vethb3bfab2: No such file or directory
Aug 6 21:34:15 sentry-docker00.cs.umd.edu systemd-udevd[3362176]: link_config: could not get ethtool features for veth9211205
Aug 6 21:34:15 sentry-docker00.cs.umd.edu systemd-udevd[3362176]: Could not set offload features of veth9211205: No such device
Aug 6 21:34:15 sentry-docker00.cs.umd.edu systemd-udevd[3362271]: link_config: could not set ethtool features for veth66815f6
Aug 6 21:34:15 sentry-docker00.cs.umd.edu systemd-udevd[3362271]: Could not set offload features of veth66815f6: Operation not permitted
Aug 6 21:34:16 sentry-docker00.cs.umd.edu systemd-udevd[3362291]: Could not generate persistent MAC address for veth745450d: No such file or directory
Aug 6 21:34:16 sentry-docker00.cs.umd.edu systemd-udevd[3362292]: Could not generate persistent MAC address for vethf4ec3e1: No such file or directory
Aug 6 21:34:16 sentry-docker00.cs.umd.edu systemd-udevd[3362310]: Could not generate persistent MAC address for vethf2a4822: No such file or directory
Aug 6 21:34:16 sentry-docker00.cs.umd.edu systemd-udevd[3362311]: Could not generate persistent MAC address for veth454c876: No such file or directory
Aug 6 21:34:16 sentry-docker00.cs.umd.edu systemd-udevd[3362387]: Could not generate persistent MAC address for veth7177f1d: No such file or directory
Aug 6 21:34:16 sentry-docker00.cs.umd.edu systemd-udevd[3362392]: Could not generate persistent MAC address for veth776fc71: No such file or directory
Aug 6 21:34:16 sentry-docker00.cs.umd.edu systemd-udevd[3362411]: Could not generate persistent MAC address for veth601e4ab: No such file or directory
Aug 6 21:34:16 sentry-docker00.cs.umd.edu systemd-udevd[3362407]: Could not generate persistent MAC address for veth5cd6209: No such file or directory
Aug 6 21:34:16 sentry-docker00.cs.umd.edu systemd-udevd[3362405]: Could not generate persistent MAC address for veth98edfe9: No such file or directory
Aug 6 21:34:16 sentry-docker00.cs.umd.edu systemd-udevd[3362410]: Could not generate persistent MAC address for veth9226a05: No such file or directory
Aug 6 21:54:24 sentry-docker00.cs.umd.edu systemd-udevd[3371644]: link_config: could not get ethtool features for vethf2a4822
Aug 6 21:54:24 sentry-docker00.cs.umd.edu systemd-udevd[3371644]: Could not set offload features of vethf2a4822: No such device
Aug 6 21:54:24 sentry-docker00.cs.umd.edu systemd-udevd[3371740]: Could not generate persistent MAC address for veth09de2cf: No such file or directory
Aug 6 21:54:24 sentry-docker00.cs.umd.edu systemd-udevd[3371741]: Could not generate persistent MAC address for veth741384d: No such file or directory
... 8 more distinct messages not shown
== strawberry (2 distinct, 8 total) ==
Aug 6 21:09:44 strawberry udisksd[1067]: Error performing housekeeping for drive /org/freedesktop/UDisks2/drives/ST2000DM001_1CH164_W1E8J5KJ: Error updating SMART data: Error sending ATA command CHECK POWER MODE: Unexpected sense data returned:#0120000: 00 00 00 00 00 00 00 00 00 00 00 00 00 00 00 00 ................#0120010: 00 00 00 00 00 00 00 00 00 00 00 00 00 00 00 00 ................#012 (g-io-error-quark, 0) [x6]
Aug 6 21:34:42 strawberry smartd[5314]: Device: /dev/sda [SAT], failed to read SMART Attribute Data [x2]
== submit26-b9-2 (9 distinct, 9 total) ==
Aug 6 21:12:53 submit26-b9-2 setroubleshoot[1295104]: SELinux is preventing /usr/bin/python3.9 from create access on the directory /(null). For complete SELinux messages run: sealert -l d506243c-d61e-48f3-b42a-4592c913deb0
Aug 6 21:12:53 submit26-b9-2 setroubleshoot[1295104]: SELinux is preventing /usr/bin/python3.9 from add_name access on the directory /(null). For complete SELinux messages run: sealert -l 3b4752ac-1b9a-4af9-a05b-32e4c2eb13ab
Aug 6 21:12:53 submit26-b9-2 setroubleshoot[1295104]: SELinux is preventing /usr/bin/python3.9 from create access on the file /(null). For complete SELinux messages run: sealert -l 29e5adbd-4381-4467-b40d-a2219101e096
Aug 6 21:12:53 submit26-b9-2 setroubleshoot[1295104]: SELinux is preventing /usr/bin/python3.9 from open access on the file /tmp/libdnf.6TTEO2/repodata/repomd.xml. For complete SELinux messages run: sealert -l 1b38f2ec-01ce-4343-8059-ba7494ecc5c4
Aug 6 21:12:53 submit26-b9-2 setroubleshoot[1295104]: SELinux is preventing /usr/bin/python3.9 from setattr access on the file repomd.xml. For complete SELinux messages run: sealert -l e5f9af40-1f63-4924-b012-27ab2a7b2266
Aug 6 21:12:53 submit26-b9-2 setroubleshoot[1295104]: SELinux is preventing /usr/bin/python3.9 from read access on the directory libdnf.6TTEO2. For complete SELinux messages run: sealert -l 5c54db87-54a3-4a7c-97b4-b5c48d6c3543
Aug 6 21:12:53 submit26-b9-2 setroubleshoot[1295104]: SELinux is preventing /usr/bin/python3.9 from remove_name access on the directory repomd.xml. For complete SELinux messages run: sealert -l 63cd60e1-1e61-4276-afea-dd8526ffe8b2
Aug 6 21:12:53 submit26-b9-2 setroubleshoot[1295104]: SELinux is preventing /usr/bin/python3.9 from unlink access on the file repomd.xml. For complete SELinux messages run: sealert -l 81c7e9ec-e023-4c6d-b1ad-c02a242e655e
Aug 6 21:12:53 submit26-b9-2 setroubleshoot[1295104]: SELinux is preventing /usr/bin/python3.9 from rmdir access on the directory repodata. For complete SELinux messages run: sealert -l 6ae9a597-e123-4d74-8eec-a8ebe0f5e4d0
== submit26-b9-3 (9 distinct, 9 total) ==
Aug 6 21:20:40 submit26-b9-3 setroubleshoot[888127]: SELinux is preventing /usr/bin/python3.9 from create access on the directory /(null). For complete SELinux messages run: sealert -l 5b912a44-22fd-4560-b201-2a4e289b73f5
Aug 6 21:20:40 submit26-b9-3 setroubleshoot[888127]: SELinux is preventing /usr/bin/python3.9 from add_name access on the directory /(null). For complete SELinux messages run: sealert -l 7f1df1e4-725e-4953-98eb-1079f908f543
Aug 6 21:20:40 submit26-b9-3 setroubleshoot[888127]: SELinux is preventing /usr/bin/python3.9 from create access on the file /(null). For complete SELinux messages run: sealert -l 40b8852a-f77b-44b4-affe-5f11fa33de43
Aug 6 21:20:40 submit26-b9-3 setroubleshoot[888127]: SELinux is preventing /usr/bin/python3.9 from open access on the file /tmp/libdnf.1wxTBi/repodata/repomd.xml. For complete SELinux messages run: sealert -l 45a8019e-f6b5-4baa-92c1-862594b40d46
Aug 6 21:20:40 submit26-b9-3 setroubleshoot[888127]: SELinux is preventing /usr/bin/python3.9 from setattr access on the file repomd.xml. For complete SELinux messages run: sealert -l e9f0bfff-7784-4126-baa4-2bb06da56591
Aug 6 21:20:40 submit26-b9-3 setroubleshoot[888127]: SELinux is preventing /usr/bin/python3.9 from read access on the directory libdnf.1wxTBi. For complete SELinux messages run: sealert -l 0b17cc3d-cdc6-4fe2-a11f-3892e7c41dc7
Aug 6 21:20:40 submit26-b9-3 setroubleshoot[888127]: SELinux is preventing /usr/bin/python3.9 from remove_name access on the directory repomd.xml. For complete SELinux messages run: sealert -l 10e38c64-b65f-4cdd-901e-4375652d9a42
Aug 6 21:20:40 submit26-b9-3 setroubleshoot[888127]: SELinux is preventing /usr/bin/python3.9 from unlink access on the file repomd.xml. For complete SELinux messages run: sealert -l 7fd9cf72-ef38-48e1-b6aa-b571b26a7b22
Aug 6 21:20:40 submit26-b9-3 setroubleshoot[888127]: SELinux is preventing /usr/bin/python3.9 from rmdir access on the directory repodata. For complete SELinux messages run: sealert -l b9b11116-89bd-4a3c-980c-1d422c5dcee4
== submit26-clnb9 (9 distinct, 9 total) ==
Aug 6 21:31:58 submit26-clnb9 setroubleshoot[1900323]: SELinux is preventing /usr/bin/python3.9 from create access on the directory /(null). For complete SELinux messages run: sealert -l 6783ed2b-5ae4-42b5-975a-4bf50eec4658
Aug 6 21:31:58 submit26-clnb9 setroubleshoot[1900323]: SELinux is preventing /usr/bin/python3.9 from add_name access on the directory /(null). For complete SELinux messages run: sealert -l 9e7fa955-cc30-4804-ac8c-e1779e85946c
Aug 6 21:31:58 submit26-clnb9 setroubleshoot[1900323]: SELinux is preventing /usr/bin/python3.9 from create access on the file /(null). For complete SELinux messages run: sealert -l 69bfa6e3-089c-40ff-9563-fd30787d0774
Aug 6 21:31:58 submit26-clnb9 setroubleshoot[1900323]: SELinux is preventing /usr/bin/python3.9 from open access on the file /tmp/libdnf.BSqBAc/repodata/repomd.xml. For complete SELinux messages run: sealert -l 001acdb5-31ef-4e52-b10b-90f467a89ddc
Aug 6 21:31:58 submit26-clnb9 setroubleshoot[1900323]: SELinux is preventing /usr/bin/python3.9 from setattr access on the file repomd.xml. For complete SELinux messages run: sealert -l edacddcf-16ed-4dc3-8d82-7c597d5dee23
Aug 6 21:31:58 submit26-clnb9 setroubleshoot[1900323]: SELinux is preventing /usr/bin/python3.9 from read access on the directory libdnf.BSqBAc. For complete SELinux messages run: sealert -l 62b3782e-4730-4488-8178-94dafe9b552c
Aug 6 21:31:58 submit26-clnb9 setroubleshoot[1900323]: SELinux is preventing /usr/bin/python3.9 from remove_name access on the directory repomd.xml. For complete SELinux messages run: sealert -l 81cb3698-78f8-440a-8e3c-e5d1041e6b78
Aug 6 21:31:58 submit26-clnb9 setroubleshoot[1900323]: SELinux is preventing /usr/bin/python3.9 from unlink access on the file repomd.xml. For complete SELinux messages run: sealert -l 792b472a-115c-4799-9805-fc7436f916b9
Aug 6 21:31:59 submit26-clnb9 setroubleshoot[1900323]: SELinux is preventing /usr/bin/python3.9 from rmdir access on the directory repodata. For complete SELinux messages run: sealert -l 15c83a86-837b-41e2-b662-b39cd4e361cb
1
0