Command: /usr/local/sbin/syslog-digest.py
Time : 0.1650s
Status : exited 0
Output :
Syslog digest — 2026-08-21 10:05 EDT
Processed 4,535 lines, filtered 2,196 (48%). 2,339 unknown (1697 distinct) from 24 host(s).
== amoeba (36 distinct, 37 total) ==
Aug 21 09:38:25 amoeba upowerd[1005]: treating change event as add on /sys/devices/pci0000:00/0000:00:14.0/usb1/1-10
Aug 21 09:38:25 amoeba upowerd[1005]: treating change event as add on /sys/devices/pci0000:00/0000:00:14.0/usb2/2-5
Aug 21 09:40:01 amoeba kernel: x86/cpu: SGX disabled or unsupported by BIOS.
Aug 21 09:40:01 amoeba kernel: MDS CPU bug present and SMT on, data leak possible. See https://www.kernel.org/doc/html/latest/admin-guide/hw-vuln/mds.html for more details.
Aug 21 09:40:01 amoeba kernel: TAA CPU bug present and SMT on, data leak possible. See https://www.kernel.org/doc/html/latest/admin-guide/hw-vuln/tsx_async_abort.… for more details.
Aug 21 09:40:01 amoeba kernel: MMIO Stale Data CPU bug present and SMT on, data leak possible. See https://www.kernel.org/doc/html/latest/admin-guide/hw-vuln/processor_mmio_s… for more details.
Aug 21 09:40:01 amoeba kernel: hpet_acpi_add: no address or irqs in _CRS
Aug 21 09:40:01 amoeba kernel: ENERGY_PERF_BIAS: Set to 'normal', was 'performance'
Aug 21 09:40:01 amoeba kernel: device-mapper: core: CONFIG_IMA_DISABLE_HTABLE is disabled. Duplicate IMA measurements will not be recorded in the IMA log.
Aug 21 09:40:01 amoeba systemd[1]: sys-module-fuse.device: Failed to enqueue SYSTEMD_WANTS= job, ignoring: Unit sys-fs-fuse-connections.mount not found.
Aug 21 09:40:01 amoeba kernel: acpi PNP0C14:02: duplicate WMI GUID 05901221-D566-11D1-B2F0-00A0C9062910 (first instance was on PNP0C14:00)
Aug 21 09:40:01 amoeba kernel: acpi PNP0C14:03: duplicate WMI GUID 05901221-D566-11D1-B2F0-00A0C9062910 (first instance was on PNP0C14:00)
Aug 21 09:40:01 amoeba kernel: wmi_bus wmi_bus-PNP0C14:04: WQBC data block query control method not found
Aug 21 09:40:01 amoeba kernel: acpi PNP0C14:04: duplicate WMI GUID 05901221-D566-11D1-B2F0-00A0C9062910 (first instance was on PNP0C14:00)
Aug 21 09:40:01 amoeba kernel: Warning: Unmaintained driver is detected: e1000_init_module
Aug 21 09:40:07 amoeba lvm[850]: PV /dev/sda3 online, VG rhel_dhcp-10-227-103-249 is complete.
Aug 21 09:40:07 amoeba rpc.idmapd[965]: Setting log level to 0
Aug 21 09:40:09 amoeba systemd[1]: resmon.service: Supervising process 1290 which is not our child. We'll most likely not notice when it exits.
Aug 21 09:40:11 amoeba setroubleshoot[1348]: SELinux is preventing /usr/libexec/power-profiles-daemon from read access on the file /etc/passwd. For complete SELinux messages run: sealert -l 0223563a-e532-409d-a375-8f975fa9b3bc
Aug 21 09:40:11 amoeba setroubleshoot[1348]: SELinux is preventing /usr/libexec/power-profiles-daemon from open access on the file /etc/passwd. For complete SELinux messages run: sealert -l 07ece3b3-3197-4431-a838-8ca412f7d16c
Aug 21 09:40:11 amoeba setroubleshoot[1348]: SELinux is preventing /usr/libexec/power-profiles-daemon from getattr access on the file /etc/passwd. For complete SELinux messages run: sealert -l 061a76a8-8b6d-4385-98ae-46b82a2cba54
Aug 21 09:40:11 amoeba setroubleshoot[1348]: SELinux is preventing /usr/libexec/power-profiles-daemon from using the dac_read_search capability. For complete SELinux messages run: sealert -l 3ab4c238-839d-4ec6-a515-fe7a79493526
Aug 21 09:40:12 amoeba rpc.statd[1401]: Flags: TI-RPC
Aug 21 09:40:12 amoeba rsyslogd[1400]: imjournal: filecreatemode is not set, using default 0644 [v8.2506.0-2.el9 try https://www.rsyslog.com/e/2186 ]
Aug 21 09:40:13 amoeba kernel: block dm-0: the capability attribute has been deprecated.
Aug 21 09:40:20 amoeba org.gnome.Shell.desktop[3199]: The XKEYBOARD keymap compiler (xkbcomp) reports:
Aug 21 09:40:20 amoeba org.gnome.Shell.desktop[3199]: > Warning: Unsupported maximum keycode 708, clipping.
Aug 21 09:40:20 amoeba org.gnome.Shell.desktop[3199]: > X11 cannot support keycodes above 255.
Aug 21 09:40:20 amoeba org.gnome.Shell.desktop[3199]: Errors from xkbcomp are not fatal to the X server
Aug 21 09:40:43 amoeba goa-identity-se[3629]: GoaKerberosIdentityManager: Using polling for change notification for credential cache type 'KCM'
... 6 more distinct messages not shown
== ar102 (1449 distinct, 1817 total) ==
Jul 21 15:42:24 ar102 spice-vdagentd[68313]: AIIEEE lost spice client connection, reconnecting (err: Error reading from file descriptor: No such device)
Jul 21 15:42:25 ar102 cosmic-comp[68129]: Failed to destroy old mode property blob: No such file or directory (os error 2) [x2]
Jul 21 15:42:25 ar102 cosmic-comp[68129]: `xrdb` not found, cannot update Xresources. [x7]
Jul 21 15:42:25 ar102 cosmic-comp[68129]: Failed to set xwayland primary output: The provided output wasn't known to Xwayland [x7]
Jul 21 15:42:25 ar102 cosmic-session[67961]: [2026-07-21T19:42:25Z ERROR cosmic_osd::components::audio] failed to connect to cosmic-settings's varlink service: Io(Os { code: 111, kind: ConnectionRefused, message: "Connection refused" })
Jul 21 15:42:26 ar102 setroubleshoot[82132]: SELinux is preventing /usr/sbin/spice-vdagentd from 'read, write' accesses on the chr_file vport8p0. For complete SELinux messages run: sealert -l 53d27bc5-6b85-42be-8843-716659bda2a4
Jul 21 15:42:26 ar102 setroubleshoot[82132]: failed to retrieve rpm info for path '/dev/vport8p0':
Jul 21 15:42:26 ar102 setroubleshoot[82132]: SELinux is preventing /usr/sbin/spice-vdagentd from open access on the chr_file /dev/vport8p0. For complete SELinux messages run: sealert -l 41f73442-797b-4a05-9a92-d4f6da078657
Jul 21 15:42:28 ar102 cosmic-session[67961]: [2026-07-21T19:42:28Z ERROR cosmic_osd::components::audio] failed to connect to cosmic-settings's varlink service: Io(Os { code: 111, kind: ConnectionRefused, message: "Connection refused" })
Jul 21 15:42:31 ar102 cosmic-session[67961]: [2026-07-21T19:42:31Z ERROR cosmic_osd::components::audio] failed to connect to cosmic-settings's varlink service: Io(Os { code: 111, kind: ConnectionRefused, message: "Connection refused" })
Jul 21 15:42:34 ar102 cosmic-session[67961]: [2026-07-21T19:42:34Z ERROR cosmic_osd::components::audio] failed to connect to cosmic-settings's varlink service: Io(Os { code: 111, kind: ConnectionRefused, message: "Connection refused" })
Jul 21 15:42:37 ar102 cosmic-session[67961]: [2026-07-21T19:42:37Z ERROR cosmic_osd::components::audio] failed to connect to cosmic-settings's varlink service: Io(Os { code: 111, kind: ConnectionRefused, message: "Connection refused" })
Jul 21 15:42:40 ar102 cosmic-session[67961]: [2026-07-21T19:42:40Z ERROR cosmic_osd::components::audio] failed to connect to cosmic-settings's varlink service: Io(Os { code: 111, kind: ConnectionRefused, message: "Connection refused" })
Jul 21 15:42:42 ar102 cosmic-launcher[82204]: error loading system dark theme [x3]
Jul 21 15:42:43 ar102 cosmic-session[67961]: [2026-07-21T19:42:43Z ERROR cosmic_osd::components::audio] failed to connect to cosmic-settings's varlink service: Io(Os { code: 111, kind: ConnectionRefused, message: "Connection refused" })
Jul 21 15:42:46 ar102 puppet-agent[82198]: (Facter) invalid or malformed lldp data: MalformedDataError: no lldp interface data found [x3]
Jul 21 15:42:46 ar102 cosmic-session[67961]: [2026-07-21T19:42:46Z ERROR cosmic_osd::components::audio] failed to connect to cosmic-settings's varlink service: Io(Os { code: 111, kind: ConnectionRefused, message: "Connection refused" })
Jul 21 15:42:49 ar102 cosmic-session[67961]: [2026-07-21T19:42:49Z ERROR cosmic_osd::components::audio] failed to connect to cosmic-settings's varlink service: Io(Os { code: 111, kind: ConnectionRefused, message: "Connection refused" })
Jul 21 15:42:52 ar102 cosmic-session[67961]: [2026-07-21T19:42:52Z ERROR cosmic_osd::components::audio] failed to connect to cosmic-settings's varlink service: Io(Os { code: 111, kind: ConnectionRefused, message: "Connection refused" })
Jul 21 15:42:55 ar102 cosmic-session[67961]: [2026-07-21T19:42:55Z ERROR cosmic_osd::components::audio] failed to connect to cosmic-settings's varlink service: Io(Os { code: 111, kind: ConnectionRefused, message: "Connection refused" })
Jul 21 15:42:58 ar102 cosmic-session[67961]: [2026-07-21T19:42:58Z ERROR cosmic_osd::components::audio] failed to connect to cosmic-settings's varlink service: Io(Os { code: 111, kind: ConnectionRefused, message: "Connection refused" })
Jul 21 15:43:01 ar102 cosmic-session[67961]: [2026-07-21T19:43:01Z ERROR cosmic_osd::components::audio] failed to connect to cosmic-settings's varlink service: Io(Os { code: 111, kind: ConnectionRefused, message: "Connection refused" })
Jul 21 15:43:04 ar102 cosmic-session[67961]: [2026-07-21T19:43:04Z ERROR cosmic_osd::components::audio] failed to connect to cosmic-settings's varlink service: Io(Os { code: 111, kind: ConnectionRefused, message: "Connection refused" })
Jul 21 15:43:07 ar102 cosmic-session[67961]: [2026-07-21T19:43:07Z ERROR cosmic_osd::components::audio] failed to connect to cosmic-settings's varlink service: Io(Os { code: 111, kind: ConnectionRefused, message: "Connection refused" })
Jul 21 15:43:10 ar102 cosmic-session[67961]: [2026-07-21T19:43:10Z ERROR cosmic_osd::components::audio] failed to connect to cosmic-settings's varlink service: Io(Os { code: 111, kind: ConnectionRefused, message: "Connection refused" })
Jul 21 15:43:13 ar102 cosmic-session[67961]: [2026-07-21T19:43:13Z ERROR cosmic_osd::components::audio] failed to connect to cosmic-settings's varlink service: Io(Os { code: 111, kind: ConnectionRefused, message: "Connection refused" })
Jul 21 15:43:16 ar102 cosmic-session[67961]: [2026-07-21T19:43:16Z ERROR cosmic_osd::components::audio] failed to connect to cosmic-settings's varlink service: Io(Os { code: 111, kind: ConnectionRefused, message: "Connection refused" })
Jul 21 15:43:17 ar102 puppet-agent[82198]: Last metadata expiration check: 1:29:57 ago on Tue Jul 21 14:13:10 2026.
Jul 21 15:43:17 ar102 puppet-agent[82198]: Dependencies resolved. [x8]
Jul 21 15:43:17 ar102 puppet-agent[82198]: ================================================================================ [x15]
... 1419 more distinct messages not shown
== b0b02.cs.umd.edu (1 distinct, 1 total) ==
Aug 21 09:07:15 b0b02.cs.umd.edu rustdesk[604217]: cannot open display:
== bachata (10 distinct, 10 total) ==
Aug 21 09:29:55 bachata smbd[3401795]: [2026/08/21 09:29:55.064621, 0] ../../source3/smbd/smb2_service.c:117(chdir_current_service)
Aug 21 09:29:55 bachata smbd[3401795]: chdir_current_service: vfs_ChDir(/fs/junkfood/mount) failed: Permission denied. Current token: uid=11255, gid=11255, 12 groups: 11255 319000009 25038 15294 15229 755 25030 25025 30880 25029 770 15026
Aug 21 09:29:55 bachata smbd[3401795]: [2026/08/21 09:29:55.066225, 0] ../../source3/smbd/smbXsrv_tcon.c:914(smbXsrv_tcon_disconnect)
Aug 21 09:29:55 bachata smbd[3401795]: smbXsrv_tcon_disconnect: disconnect(0x966534e3, 'mount'): chdir_current_service() failed: NT_STATUS_INTERNAL_ERROR
Aug 21 09:29:55 bachata smbd[3401795]: [2026/08/21 09:29:55.066552, 0] ../../source3/smbd/smbXsrv_tcon.c:1028(smbXsrv_tcon_disconnect_all)
Aug 21 09:29:55 bachata smbd[3401795]: smbXsrv_tcon_disconnect_all: count[2] errors[1] first[NT_STATUS_INTERNAL_ERROR]
Aug 21 09:29:55 bachata smbd[3401795]: [2026/08/21 09:29:55.066612, 0] ../../source3/smbd/smbXsrv_session.c:1900(smbXsrv_session_logoff)
Aug 21 09:29:55 bachata smbd[3401795]: smbXsrv_session_logoff: smbXsrv_session_logoff(0x2ddea142): smb2srv_tcon_disconnect_all() failed: NT_STATUS_INTERNAL_ERROR
Aug 21 09:29:55 bachata smbd[3401795]: [2026/08/21 09:29:55.066688, 0] ../../source3/smbd/smbXsrv_session.c:1728(smbXsrv_session_remove_channel_done)
Aug 21 09:29:55 bachata smbd[3401795]: smbXsrv_session_remove_channel_done: smbXsrv_session_logoff(769564994) failed: NT_STATUS_INTERNAL_ERROR
== bigtuna (22 distinct, 26 total) ==
Aug 21 09:56:04 bigtuna goa-identity-se[1077522]: GoaKerberosIdentityManager: Using polling for change notification for credential cache type 'KCM'
Aug 21 09:56:04 bigtuna vmware-user.desktop[1077625]: vmware-user: could not open /proc/fs/vmblock/dev
Aug 21 09:56:04 bigtuna gsd-usb-protect[1077689]: Failed to fetch USBGuard parameters: GDBus.Error:org.freedesktop.DBus.Error.ServiceUnknown: The name is not activatable
Aug 21 09:56:06 bigtuna gsd-datetime[1008859]: Error releasing name org.gnome.SettingsDaemon.Datetime: The connection is closed
Aug 21 09:56:06 bigtuna gsd-color[1077597]: failed to connect to device: Failed to connect to missing device /org/freedesktop/ColorManager/devices/xrandr_Dell_Inc__DELL_P2213_FJ44J3CTBTNM_gdm_42
Aug 21 09:56:06 bigtuna gsd-color[1077597]: failed to connect to device: Failed to connect to missing device /org/freedesktop/ColorManager/devices/xrandr_Dell_Inc__DELL_P2314H_7R1K347HA1US_gdm_42
Aug 21 09:56:06 bigtuna gsd-color[1077597]: failed to connect to device: Failed to connect to missing device /org/freedesktop/ColorManager/devices/xrandr_BenQ_Corporation_BenQ_XL2730Z_26G04807SL0_gdm_42
Aug 21 09:56:06 bigtuna gnome-software[1077656]: Only 0 apps for recent list, hiding [x2]
Aug 21 09:56:18 bigtuna setroubleshoot[1078078]: SELinux is preventing /usr/libexec/colord from map access on the file /adminhomes/sajith/.local/share/icc/edid-ec029a18b736cdaa70fc9ebcf9968402.icc. For complete SELinux messages run: sealert -l 90af4583-f62f-4524-a8e2-73df14bae658
Aug 21 09:56:28 bigtuna packagekitd[1077566]: Failed to get cache filename for gum
Aug 21 09:56:28 bigtuna packagekitd[1077566]: Failed to get cache filename for openvox-agent
Aug 21 09:56:40 bigtuna packagekitd[1077566]: failed to parse public key for /etc/pki/rpm-gpg/RPM-GPG-KEY-PQC-redhat-release [x4]
Aug 21 09:57:18 bigtuna packagekitd[1077566]: Failed to get cache filename for firefox
Aug 21 09:57:18 bigtuna packagekitd[1077566]: Failed to get cache filename for gstreamer1-plugins-bad-free
Aug 21 09:57:18 bigtuna packagekitd[1077566]: Failed to get cache filename for libreoffice-impress
Aug 21 09:57:18 bigtuna packagekitd[1077566]: Failed to get cache filename for gstreamer1-plugins-good
Aug 21 09:57:18 bigtuna packagekitd[1077566]: Failed to get cache filename for yelp
Aug 21 09:57:18 bigtuna packagekitd[1077566]: Failed to get cache filename for libreoffice-calc
Aug 21 09:57:18 bigtuna packagekitd[1077566]: Failed to get cache filename for libreoffice-writer
Aug 21 09:57:18 bigtuna packagekitd[1077566]: Failed to get cache filename for libreoffice-draw
Aug 21 09:57:18 bigtuna packagekitd[1077566]: Failed to get cache filename for libreoffice-base
Aug 21 09:57:18 bigtuna packagekitd[1077566]: Failed to get cache filename for gstreamer1-plugins-ugly-free
== borealis (12 distinct, 20 total) ==
Aug 21 10:02:48 borealis goa-identity-se[883918]: GoaKerberosIdentityManager: Using polling for change notification for credential cache type 'KCM'
Aug 21 10:02:49 borealis vmware-user.desktop[884075]: vmware-user: could not open /proc/fs/vmblock/dev
Aug 21 10:02:49 borealis gsd-usb-protect[884049]: Failed to fetch USBGuard parameters: GDBus.Error:org.freedesktop.DBus.Error.ServiceUnknown: The name is not activatable
Aug 21 10:02:51 borealis gsd-color[883974]: failed to connect to device: Failed to connect to missing device /org/freedesktop/ColorManager/devices/xrandr_Dell_Inc__DELL_U2412M_7WFG152E149L_gdm_42
Aug 21 10:02:51 borealis gsd-color[883974]: failed to connect to device: Failed to connect to missing device /org/freedesktop/ColorManager/devices/xrandr_Dell_Inc__DELL_U2412M_4V35D7133HNU_gdm_42
Aug 21 10:02:51 borealis gnome-software[884077]: Only 0 apps for recent list, hiding [x3]
Aug 21 10:02:57 borealis packagekitd[883947]: Failed to get cache filename for gum [x2]
Aug 21 10:02:57 borealis packagekitd[883947]: Failed to get cache filename for kernel-headers [x2]
Aug 21 10:02:57 borealis packagekitd[883947]: Failed to get cache filename for python3-perf [x2]
Aug 21 10:02:57 borealis packagekitd[883947]: Failed to get cache filename for openvox-agent [x2]
Aug 21 10:02:57 borealis packagekitd[883947]: Failed to get cache filename for kernel-devel [x2]
Aug 21 10:04:16 borealis packagekitd[883947]: failed to parse public key for /etc/pki/rpm-gpg/RPM-GPG-KEY-PQC-redhat-release [x2]
== csfw00a (2 distinct, 149 total) ==
Aug 21 09:04:08 csfw00a kernel: bnxt_en 0000:09:00.0 eth3: NIC Link is Down [x145]
Aug 21 09:44:50 csfw00a ospf6d[1477]: [EC 100663307] Could not send entire message [x4]
== emaar (1 distinct, 1 total) ==
Aug 21 09:11:17 emaar systemd[1]: insights-client.service: Start request repeated too quickly.
== gle-dind02.cs.umd.edu (10 distinct, 10 total) ==
Aug 21 09:48:16 gle-dind02.cs.umd.edu systemd-udevd[1884792]: Could not generate persistent MAC address for vethec26d00: No such file or directory
Aug 21 09:48:16 gle-dind02.cs.umd.edu systemd-udevd[1884793]: Could not generate persistent MAC address for vethe795d47: No such file or directory
Aug 21 09:48:23 gle-dind02.cs.umd.edu systemd-udevd[1885064]: Could not generate persistent MAC address for veth8ea3c53: No such file or directory
Aug 21 09:48:23 gle-dind02.cs.umd.edu systemd-udevd[1885063]: Could not generate persistent MAC address for vethfe51753: No such file or directory
Aug 21 09:48:45 gle-dind02.cs.umd.edu systemd-udevd[1885204]: Could not generate persistent MAC address for vethffd2f7c: No such file or directory
Aug 21 09:48:45 gle-dind02.cs.umd.edu systemd-udevd[1885205]: Could not generate persistent MAC address for vethb8d8a66: No such file or directory
Aug 21 09:48:46 gle-dind02.cs.umd.edu systemd-udevd[1885265]: Could not generate persistent MAC address for vetha058d06: No such file or directory
Aug 21 09:48:46 gle-dind02.cs.umd.edu systemd-udevd[1885266]: Could not generate persistent MAC address for veth0e263e7: No such file or directory
Aug 21 09:49:03 gle-dind02.cs.umd.edu systemd-udevd[1885479]: Could not generate persistent MAC address for veth04db5f8: No such file or directory
Aug 21 09:49:03 gle-dind02.cs.umd.edu systemd-udevd[1885478]: Could not generate persistent MAC address for veth0804725: No such file or directory
== gle-dind04 (14 distinct, 16 total) ==
Aug 21 10:04:44 gle-dind04 (dockerd)[570750]: docker.service: Referenced but unset environment variable evaluates to an empty string: BLOCK_REGISTRY, DOCKER_NETWORK_OPTIONS, INSECURE_REGISTRY [x3]
Aug 21 10:04:44 gle-dind04 firewalld[1069]: ERROR: NAME_CONFLICT: new_policy_object(): 'docker-forwarding'
Aug 21 10:04:44 gle-dind04 firewalld[1069]: WARNING: COMMAND_FAILED: '/usr/sbin/ip6tables -w10 -t nat -D OUTPUT -m addrtype --dst-type LOCAL -j DOCKER' failed: ip6tables: Bad rule (does a matching rule exist in that chain?).
Aug 21 10:04:44 gle-dind04 firewalld[1069]: WARNING: COMMAND_FAILED: '/usr/sbin/ip6tables -w10 -t nat -D PREROUTING' failed: ip6tables: Bad rule (does a matching rule exist in that chain?).
Aug 21 10:04:44 gle-dind04 firewalld[1069]: WARNING: COMMAND_FAILED: '/usr/sbin/ip6tables -w10 -t nat -D OUTPUT' failed: ip6tables: Bad rule (does a matching rule exist in that chain?).
Aug 21 10:04:44 gle-dind04 firewalld[1069]: WARNING: COMMAND_FAILED: '/usr/sbin/ip6tables -w10 -t filter -X DOCKER-FORWARD' failed: ip6tables v1.8.11 (nf_tables): CHAIN_DEL failed (Device or resource busy): chain DOCKER-FORWARD
Aug 21 10:04:44 gle-dind04 firewalld[1069]: WARNING: COMMAND_FAILED: '/usr/sbin/ip6tables -w10 -t filter -F DOCKER-ISOLATION-STAGE-1' failed: ip6tables: No chain/target/match by that name.
Aug 21 10:04:44 gle-dind04 firewalld[1069]: WARNING: COMMAND_FAILED: '/usr/sbin/ip6tables -w10 -t filter -X DOCKER-ISOLATION-STAGE-1' failed: ip6tables: No chain/target/match by that name.
Aug 21 10:04:44 gle-dind04 firewalld[1069]: WARNING: COMMAND_FAILED: '/usr/sbin/ip6tables -w10 -t filter -F DOCKER-ISOLATION-STAGE-2' failed: ip6tables: No chain/target/match by that name.
Aug 21 10:04:44 gle-dind04 firewalld[1069]: WARNING: COMMAND_FAILED: '/usr/sbin/ip6tables -w10 -t filter -X DOCKER-ISOLATION-STAGE-2' failed: ip6tables: No chain/target/match by that name.
Aug 21 10:04:44 gle-dind04 firewalld[1069]: WARNING: COMMAND_FAILED: '/usr/sbin/ip6tables -w10 -t filter -F DOCKER-ISOLATION' failed: ip6tables: No chain/target/match by that name.
Aug 21 10:04:44 gle-dind04 firewalld[1069]: WARNING: COMMAND_FAILED: '/usr/sbin/ip6tables -w10 -t filter -X DOCKER-ISOLATION' failed: ip6tables: No chain/target/match by that name.
Aug 21 10:04:44 gle-dind04 systemd[1]: iscsi.service: Unit cannot be reloaded because it is inactive.
Aug 21 10:04:59 gle-dind04 systemd[1]: docker.service: Start request repeated too quickly.
== hackerman (8 distinct, 16 total) ==
Aug 21 09:19:01 hackerman gnome-software[2060381]: failed to commit changes to dconf: GDBus.Error:org.gtk.GDBus.UnmappedGError.Quark._g_2dfile_2derror_2dquark.Code2: Failed to create file “/adminhomes/sajith/.config/dconf/user.9OP8T3”: Permission denied
Aug 21 09:20:04 hackerman gnome-software[2060381]: can't reliably fixup error code 4 in domain g-io-error-quark: Not a directory [x5]
Aug 21 09:20:12 hackerman gnome-software[2060381]: Only 0 apps for recent list, hiding
Aug 21 09:20:28 hackerman gnome-software[2060381]: failed to commit changes to dconf: GDBus.Error:org.gtk.GDBus.UnmappedGError.Quark._g_2dfile_2derror_2dquark.Code2: Failed to create file “/adminhomes/sajith/.config/dconf/user.CNCJU3”: Permission denied
Aug 21 09:20:28 hackerman packagekitd[963615]: Failed to get cache filename for libreoffice [x3]
Aug 21 09:20:28 hackerman packagekitd[963615]: Failed to get cache filename for kernel [x3]
Aug 21 09:20:38 hackerman packagekitd[963615]: failed to parse public key for /etc/pki/rpm-gpg/RPM-GPG-KEY-PQC-redhat-release
Aug 21 09:21:08 hackerman gnome-software[2060381]: failed to commit changes to dconf: GDBus.Error:org.gtk.GDBus.UnmappedGError.Quark._g_2dfile_2derror_2dquark.Code2: Failed to create file “/adminhomes/sajith/.config/dconf/user.18SAU3”: Permission denied
== idm00 (1 distinct, 1 total) ==
Aug 21 09:51:39 idm00 named[3810278]: client @0x7f48dd3dafe8 10.73.240.42#65483: update '73.10.in-addr.arpa/IN' denied
== idmp0 (1 distinct, 1 total) ==
Aug 21 09:35:57 idmp0 named[1121900]: client @0x7fe3e0023938 10.73.240.43#61918: update '73.10.in-addr.arpa/IN' denied
== itmon02 (1 distinct, 52 total) ==
Aug 21 09:07:48 itmon02 sshd[1750555]: error: beginning MaxStartups throttling [x52]
== itmon03 (1 distinct, 2 total) ==
Aug 21 09:20:02 itmon03 systemd-timedated[1771634]: /dev/rtc is busy. Is somebody keeping it open continuously? That's not a good idea... Returning a bogus RTC timestamp. [x2]
== librenms-test (1 distinct, 1 total) ==
Aug 21 09:26:41 librenms-test (httpd)[52874]: httpd.service: Referenced but unset environment variable evaluates to an empty string: OPTIONS
== newhonors2 (1 distinct, 24 total) ==
Aug 21 09:13:03 newhonors2 dhcpcd[1517905]: dhcpcd is not running [x24]
== nightingale (82 distinct, 94 total) ==
Aug 21 10:00:59 nightingale goa-identity-se[621847]: GoaKerberosIdentityManager: Using polling for change notification for credential cache type 'KCM'
Aug 21 10:01:00 nightingale vmware-user.desktop[621981]: vmware-user: could not open /proc/fs/vmblock/dev
Aug 21 10:01:00 nightingale gsd-usb-protect[621937]: Failed to fetch USBGuard parameters: GDBus.Error:org.freedesktop.DBus.Error.ServiceUnknown: The name is not activatable
Aug 21 10:01:01 nightingale gsd-color[621889]: failed to connect to device: Failed to connect to missing device /org/freedesktop/ColorManager/devices/xrandr_Acer_Technologies_B246WL_T1ZAA0012420_gdm_42
Aug 21 10:01:06 nightingale PanGPUI[621929]: QObject::connect: No such slot PanGPUIWebDialog::onReload()
Aug 21 10:01:06 nightingale PanGPUI[621929]: Setting a QCompleter on non-editable QComboBox is not allowed.
Aug 21 10:01:06 nightingale PanGPUI[621929]: QLayout: Attempting to add QLayout "" to ConnectionsTab "", which already has a layout [x5]
Aug 21 10:01:06 nightingale PanGPUI[621929]: QLayout: Attempting to add QLayout "" to TroubleShootingTab "", which already has a layout
Aug 21 10:01:06 nightingale PanGPUI[621929]: QLayout: Attempting to add QLayout "" to PanGPUIFedMandateDialog "", which already has a layout
Aug 21 10:01:06 nightingale PanGPUI[621929]: QLayout: Attempting to add QLayout "" to PanGPUIPreferredGwDialog "", which already has a layout
Aug 21 10:01:06 nightingale PanGPUI[621929]: QLayout: Attempting to add QLayout "" to PanGPUICertSelectDialog "", which already has a layout
Aug 21 10:01:13 nightingale gnome-software[621899]: Kind change on net.launchpad.Gnuclad from console-application to desktop-application is not OK
Aug 21 10:01:15 nightingale gnome-software[621899]: Kind change on io.github.sil_car.SqueezeVid from console-application to desktop-application is not OK
Aug 21 10:01:17 nightingale gnome-software[621899]: Kind change on net.mkiol.SpeechNote.Addon.amd from addon to runtime is not OK
Aug 21 10:01:17 nightingale gnome-software[621899]: Kind change on net.mkiol.SpeechNote.Addon.nvidia from addon to runtime is not OK
Aug 21 10:01:17 nightingale gnome-software[621899]: Kind change on org.videolan.VLC.Plugin.pause_click from addon to runtime is not OK
Aug 21 10:01:19 nightingale gnome-software[621899]: Kind change on org.nuspell.Nuspell from console-application to desktop-application is not OK
Aug 21 10:01:20 nightingale gnome-software[621899]: Kind change on com.freerdp.FreeRDP from console-application to desktop-application is not OK
Aug 21 10:01:20 nightingale gnome-software[621899]: Kind change on com.github.ilai_deutel.kibi from console-application to desktop-application is not OK
Aug 21 10:01:20 nightingale gnome-software[621899]: Kind change on dev.paullee.scraterpreter.Scrape from console-application to desktop-application is not OK
Aug 21 10:01:20 nightingale gnome-software[621899]: Kind change on dev.paullee.scraterpreter.Scrapec from console-application to desktop-application is not OK
Aug 21 10:01:21 nightingale gnome-software[621899]: Kind change on fr.inria.corese.CoreseCommand from console-application to desktop-application is not OK
Aug 21 10:01:21 nightingale gnome-software[621899]: Kind change on io.github.coccinelle.coccinelle from console-application to desktop-application is not OK
Aug 21 10:01:21 nightingale gnome-software[621899]: Kind change on io.github.erkin.ponysay from console-application to desktop-application is not OK
Aug 21 10:01:23 nightingale gnome-software[621899]: Kind change on net.imaginaryinfinity.Squiid from console-application to desktop-application is not OK
Aug 21 10:01:24 nightingale gnome-software[621899]: Kind change on org.eu.wabarc.wayback from console-application to desktop-application is not OK
Aug 21 10:01:25 nightingale gnome-software[621899]: Kind change on com.jeffser.Alpaca.Plugins.AMD from addon to runtime is not OK
Aug 21 10:01:25 nightingale gnome-software[621899]: Kind change on com.jeffser.Alpaca.Plugins.Ollama from addon to runtime is not OK
Aug 21 10:01:25 nightingale gnome-software[621899]: Kind change on com.sublimetext.three.DevUtils from addon to runtime is not OK [x4]
Aug 21 10:01:25 nightingale gnome-software[621899]: Kind change on com.valvesoftware.Steam.Utility.slonfig from addon to runtime is not OK
... 52 more distinct messages not shown
== outbound00.cs.umd.edu (1 distinct, 6 total) ==
Aug 21 09:09:09 outbound00.cs.umd.edu python3[181016]: ldapdb [x6]
== outbound01.cs.umd.edu (1 distinct, 6 total) ==
Aug 21 09:13:06 outbound01.cs.umd.edu python3[2415863]: ldapdb [x6]
== quiss (1 distinct, 2 total) ==
Aug 21 10:01:42 quiss nautilus[2301758]: Attempted to add a non-existent file to the view. [x2]
== sebatinsky.cs.umd.edu (1 distinct, 1 total) ==
Aug 21 10:00:14 sebatinsky.cs.umd.edu kernel: hpet1: lost 1 rtc interrupts
== sentry-docker00.cs.umd.edu (38 distinct, 38 total) ==
Aug 21 09:18:03 sentry-docker00.cs.umd.edu systemd-udevd[621012]: link_config: could not get ethtool features for vethb29fbce
Aug 21 09:18:03 sentry-docker00.cs.umd.edu systemd-udevd[621012]: Could not set offload features of vethb29fbce: No such device
Aug 21 09:18:03 sentry-docker00.cs.umd.edu systemd-udevd[621017]: link_config: could not get ethtool features for veth6a6cf26
Aug 21 09:18:03 sentry-docker00.cs.umd.edu systemd-udevd[621017]: Could not set offload features of veth6a6cf26: No such device
Aug 21 09:18:03 sentry-docker00.cs.umd.edu systemd-udevd[621044]: Could not generate persistent MAC address for veth982bbc9: No such file or directory
Aug 21 09:18:03 sentry-docker00.cs.umd.edu systemd-udevd[621045]: Could not generate persistent MAC address for veth8b27155: No such file or directory
Aug 21 09:18:03 sentry-docker00.cs.umd.edu systemd-udevd[621062]: Could not generate persistent MAC address for veth00c9410: No such file or directory
Aug 21 09:18:03 sentry-docker00.cs.umd.edu systemd-udevd[621066]: Could not generate persistent MAC address for vethd397999: No such file or directory
Aug 21 09:18:03 sentry-docker00.cs.umd.edu systemd-udevd[621045]: Could not generate persistent MAC address for veth4930628: No such file or directory
Aug 21 09:18:03 sentry-docker00.cs.umd.edu systemd-udevd[621068]: Could not generate persistent MAC address for vethb7d5875: No such file or directory
Aug 21 09:18:03 sentry-docker00.cs.umd.edu systemd-udevd[621062]: Could not generate persistent MAC address for veth714f1ea: No such file or directory
Aug 21 09:18:03 sentry-docker00.cs.umd.edu systemd-udevd[621066]: Could not generate persistent MAC address for vetheb4ab4e: No such file or directory
Aug 21 09:18:03 sentry-docker00.cs.umd.edu systemd-udevd[621112]: Could not generate persistent MAC address for veth8463926: No such file or directory
Aug 21 09:18:03 sentry-docker00.cs.umd.edu systemd-udevd[621117]: Could not generate persistent MAC address for veth81d8b9e: No such file or directory
Aug 21 09:38:11 sentry-docker00.cs.umd.edu systemd-udevd[631562]: link_config: could not get ethtool features for vethb7d5875
Aug 21 09:38:11 sentry-docker00.cs.umd.edu systemd-udevd[631562]: Could not set offload features of vethb7d5875: No such device
Aug 21 09:38:12 sentry-docker00.cs.umd.edu systemd-udevd[631614]: Could not generate persistent MAC address for vethf2546e3: No such file or directory
Aug 21 09:38:12 sentry-docker00.cs.umd.edu systemd-udevd[631615]: Could not generate persistent MAC address for veth15af27a: No such file or directory
Aug 21 09:38:12 sentry-docker00.cs.umd.edu systemd-udevd[631622]: Could not generate persistent MAC address for veth3551700: No such file or directory
Aug 21 09:38:12 sentry-docker00.cs.umd.edu systemd-udevd[631623]: Could not generate persistent MAC address for veth3e3a971: No such file or directory
Aug 21 09:38:12 sentry-docker00.cs.umd.edu systemd-udevd[631623]: Could not generate persistent MAC address for vethd59c48a: No such file or directory
Aug 21 09:38:12 sentry-docker00.cs.umd.edu systemd-udevd[631622]: Could not generate persistent MAC address for vethbee43b8: No such file or directory
Aug 21 09:38:12 sentry-docker00.cs.umd.edu systemd-udevd[631631]: Could not generate persistent MAC address for vethafe6b9d: No such file or directory
Aug 21 09:38:12 sentry-docker00.cs.umd.edu systemd-udevd[631636]: Could not generate persistent MAC address for veth81d9bac: No such file or directory
Aug 21 09:38:12 sentry-docker00.cs.umd.edu systemd-udevd[631623]: Could not generate persistent MAC address for veth25c7b9d: No such file or directory
Aug 21 09:38:12 sentry-docker00.cs.umd.edu systemd-udevd[631622]: Could not generate persistent MAC address for veth1de397a: No such file or directory
Aug 21 09:58:20 sentry-docker00.cs.umd.edu systemd-udevd[640990]: link_config: could not set ethtool features for veth81d9bac
Aug 21 09:58:20 sentry-docker00.cs.umd.edu systemd-udevd[640990]: Could not set offload features of veth81d9bac: Operation not permitted
Aug 21 09:58:20 sentry-docker00.cs.umd.edu systemd-udevd[641025]: Could not generate persistent MAC address for veth481d22c: No such file or directory
Aug 21 09:58:20 sentry-docker00.cs.umd.edu systemd-udevd[641026]: Could not generate persistent MAC address for veth62e12b1: No such file or directory
... 8 more distinct messages not shown
== strawberry (2 distinct, 8 total) ==
Aug 21 09:09:44 strawberry udisksd[1067]: Error performing housekeeping for drive /org/freedesktop/UDisks2/drives/ST2000DM001_1CH164_W1E8J5KJ: Error updating SMART data: Error sending ATA command CHECK POWER MODE: Unexpected sense data returned:#0120000: 00 00 00 00 00 00 00 00 00 00 00 00 00 00 00 00 ................#0120010: 00 00 00 00 00 00 00 00 00 00 00 00 00 00 00 00 ................#012 (g-io-error-quark, 0) [x6]
Aug 21 09:34:42 strawberry smartd[5314]: Device: /dev/sda [SAT], failed to read SMART Attribute Data [x2]
1
0
Command: /usr/local/sbin/syslog-digest.py
Time : 0.0549s
Status : exited 0
Output :
Syslog digest — 2026-08-21 09:05 EDT
Processed 4,144 lines, filtered 3,856 (93%). 288 unknown (64 distinct) from 18 host(s).
== b0b02.cs.umd.edu (2 distinct, 2 total) ==
Aug 21 08:07:11 b0b02.cs.umd.edu rustdesk[589129]: cannot open display:
Aug 21 08:59:10 b0b02.cs.umd.edu systemd[1]: insights-client.service: Start request repeated too quickly.
== cheezit.cs.umd.edu (1 distinct, 1 total) ==
Aug 21 08:50:10 cheezit.cs.umd.edu systemd[1]: insights-client.service: Start request repeated too quickly.
== csfw00a (2 distinct, 143 total) ==
Aug 21 08:04:46 csfw00a kernel: bnxt_en 0000:09:00.0 eth3: NIC Link is Down [x139]
Aug 21 08:13:38 csfw00a ospf6d[1477]: [EC 100663307] Could not send entire message [x4]
== emaar (1 distinct, 1 total) ==
Aug 21 08:43:21 emaar puppet-agent[3176052]: (Facter) invalid or malformed lldp data: MalformedDataError: no lldp interface data found
== grades01.cs.umd.edu (1 distinct, 1 total) ==
Aug 21 08:55:53 grades01.cs.umd.edu sudo[5697]: csdlocaladmin : problem with defaults entries ; TTY=pts/0 ; PWD=/home/csdlocaladmin ; USER=root ;
== hackerman (6 distinct, 11 total) ==
Aug 21 08:20:04 hackerman gnome-software[2060381]: can't reliably fixup error code 4 in domain g-io-error-quark: Not a directory [x4]
Aug 21 08:20:12 hackerman gnome-software[2060381]: Only 0 apps for recent list, hiding
Aug 21 08:20:28 hackerman gnome-software[2060381]: failed to commit changes to dconf: GDBus.Error:org.gtk.GDBus.UnmappedGError.Quark._g_2dfile_2derror_2dquark.Code2: Failed to create file “/adminhomes/sajith/.config/dconf/user.CC9EU3”: Permission denied
Aug 21 08:20:28 hackerman packagekitd[950692]: Failed to get cache filename for libreoffice [x2]
Aug 21 08:20:28 hackerman packagekitd[950692]: Failed to get cache filename for kernel [x2]
Aug 21 08:20:38 hackerman packagekitd[950692]: failed to parse public key for /etc/pki/rpm-gpg/RPM-GPG-KEY-PQC-redhat-release
== idm00 (1 distinct, 1 total) ==
Aug 21 08:51:39 idm00 named[3810278]: client @0x7f48cc0a1888 10.73.240.42#55356: update '73.10.in-addr.arpa/IN' denied
== idmp0 (1 distinct, 1 total) ==
Aug 21 08:35:57 idmp0 named[1121900]: client @0x7fe40800d248 10.73.240.43#60183: update '73.10.in-addr.arpa/IN' denied
== itmon02 (1 distinct, 40 total) ==
Aug 21 08:08:08 itmon02 sshd[1750555]: error: beginning MaxStartups throttling [x40]
== itmon03 (1 distinct, 1 total) ==
Aug 21 08:20:02 itmon03 systemd-timedated[1768671]: /dev/rtc is busy. Is somebody keeping it open continuously? That's not a good idea... Returning a bogus RTC timestamp.
== librenms-test (4 distinct, 4 total) ==
Aug 21 08:05:08 librenms-test (httpd)[44254]: httpd.service: Referenced but unset environment variable evaluates to an empty string: OPTIONS
Aug 21 08:09:13 librenms-test puppet-agent[44716]: Could not retrieve catalog from remote server: Error 500 on SERVER: Server Error: Evaluation Error: Error while evaluating a Function Call, You are using the empty role, but the csd-puppet-run fact exists. This will break things! (file: /etc/puppetlabs/code/environments/production/site/profile/manifests/empty.pp, line: 6, column: 5) on node librenms-test.devpve.cs.umd.edu
Aug 21 08:09:13 librenms-test puppet-agent[44716]: Not using cache on failed catalog
Aug 21 08:09:13 librenms-test puppet-agent[44716]: Could not retrieve catalog; skipping run
== netman.cs.umd.edu (1 distinct, 1 total) ==
Aug 21 08:31:47 netman.cs.umd.edu sshd[3379354]: error: PAM: Authentication failure for operator from 65.20.189.52
== newhonors2 (1 distinct, 24 total) ==
Aug 21 08:13:03 newhonors2 dhcpcd[1516077]: dhcpcd is not running [x24]
== outbound00.cs.umd.edu (1 distinct, 6 total) ==
Aug 21 08:09:09 outbound00.cs.umd.edu python3[167075]: ldapdb [x6]
== outbound01.cs.umd.edu (1 distinct, 6 total) ==
Aug 21 08:13:06 outbound01.cs.umd.edu python3[2401860]: ldapdb [x6]
== sentry-docker00.cs.umd.edu (36 distinct, 36 total) ==
Aug 21 08:17:38 sentry-docker00.cs.umd.edu systemd-udevd[591199]: link_config: could not get ethtool features for veth440e59c
Aug 21 08:17:38 sentry-docker00.cs.umd.edu systemd-udevd[591199]: Could not set offload features of veth440e59c: No such device
Aug 21 08:17:38 sentry-docker00.cs.umd.edu systemd-udevd[591245]: Could not generate persistent MAC address for vethd367d06: No such file or directory
Aug 21 08:17:38 sentry-docker00.cs.umd.edu systemd-udevd[591246]: Could not generate persistent MAC address for vethc6c4563: No such file or directory
Aug 21 08:17:38 sentry-docker00.cs.umd.edu systemd-udevd[591249]: Could not generate persistent MAC address for vethe975cd0: No such file or directory
Aug 21 08:17:38 sentry-docker00.cs.umd.edu systemd-udevd[591267]: Could not generate persistent MAC address for veth9f80bcd: No such file or directory
Aug 21 08:17:38 sentry-docker00.cs.umd.edu systemd-udevd[591268]: Could not generate persistent MAC address for veth8ab16a1: No such file or directory
Aug 21 08:17:38 sentry-docker00.cs.umd.edu systemd-udevd[591252]: Could not generate persistent MAC address for veth3c9cfe2: No such file or directory
Aug 21 08:17:38 sentry-docker00.cs.umd.edu systemd-udevd[591259]: Could not generate persistent MAC address for vetha608042: No such file or directory
Aug 21 08:17:38 sentry-docker00.cs.umd.edu systemd-udevd[591249]: Could not generate persistent MAC address for veth7d2fe73: No such file or directory
Aug 21 08:17:38 sentry-docker00.cs.umd.edu systemd-udevd[591260]: Could not generate persistent MAC address for vethd204012: No such file or directory
Aug 21 08:17:38 sentry-docker00.cs.umd.edu systemd-udevd[591246]: Could not generate persistent MAC address for veth8548cc7: No such file or directory
Aug 21 08:37:46 sentry-docker00.cs.umd.edu systemd-udevd[600517]: link_config: could not get ethtool features for vetha608042
Aug 21 08:37:46 sentry-docker00.cs.umd.edu systemd-udevd[600517]: Could not set offload features of vetha608042: No such device
Aug 21 08:37:47 sentry-docker00.cs.umd.edu systemd-udevd[600591]: Could not generate persistent MAC address for veth95a2ce5: No such file or directory
Aug 21 08:37:47 sentry-docker00.cs.umd.edu systemd-udevd[600592]: Could not generate persistent MAC address for veth378a687: No such file or directory
Aug 21 08:37:47 sentry-docker00.cs.umd.edu systemd-udevd[600610]: Could not generate persistent MAC address for vethd53acce: No such file or directory
Aug 21 08:37:47 sentry-docker00.cs.umd.edu systemd-udevd[600605]: Could not generate persistent MAC address for vethfb34b4b: No such file or directory
Aug 21 08:37:47 sentry-docker00.cs.umd.edu systemd-udevd[600619]: Could not generate persistent MAC address for vethd02780b: No such file or directory
Aug 21 08:37:47 sentry-docker00.cs.umd.edu systemd-udevd[600620]: Could not generate persistent MAC address for veth9832be7: No such file or directory
Aug 21 08:37:47 sentry-docker00.cs.umd.edu systemd-udevd[600639]: Could not generate persistent MAC address for veth4db6e60: No such file or directory
Aug 21 08:37:47 sentry-docker00.cs.umd.edu systemd-udevd[600624]: Could not generate persistent MAC address for veth0440a71: No such file or directory
Aug 21 08:37:47 sentry-docker00.cs.umd.edu systemd-udevd[600648]: Could not generate persistent MAC address for veth3e9b0e2: No such file or directory
Aug 21 08:37:47 sentry-docker00.cs.umd.edu systemd-udevd[600649]: Could not generate persistent MAC address for veth8bc3f70: No such file or directory
Aug 21 08:57:55 sentry-docker00.cs.umd.edu systemd-udevd[611494]: link_config: could not get ethtool features for veth4db6e60
Aug 21 08:57:55 sentry-docker00.cs.umd.edu systemd-udevd[611494]: Could not set offload features of veth4db6e60: No such device
Aug 21 08:57:55 sentry-docker00.cs.umd.edu systemd-udevd[611554]: Could not generate persistent MAC address for veth6a6cf26: No such file or directory
Aug 21 08:57:55 sentry-docker00.cs.umd.edu systemd-udevd[611555]: Could not generate persistent MAC address for veth02b08b0: No such file or directory
Aug 21 08:57:55 sentry-docker00.cs.umd.edu systemd-udevd[611558]: Could not generate persistent MAC address for veth954d093: No such file or directory
Aug 21 08:57:55 sentry-docker00.cs.umd.edu systemd-udevd[611559]: Could not generate persistent MAC address for veth350cf6d: No such file or directory
... 6 more distinct messages not shown
== smokeping-slave (1 distinct, 1 total) ==
Aug 21 08:58:18 smokeping-slave nologin[2723805]: Attempted login by UNKNOWN (UID: 65534) on UNKNOWN
== strawberry (2 distinct, 8 total) ==
Aug 21 08:09:44 strawberry udisksd[1067]: Error performing housekeeping for drive /org/freedesktop/UDisks2/drives/ST2000DM001_1CH164_W1E8J5KJ: Error updating SMART data: Error sending ATA command CHECK POWER MODE: Unexpected sense data returned:#0120000: 00 00 00 00 00 00 00 00 00 00 00 00 00 00 00 00 ................#0120010: 00 00 00 00 00 00 00 00 00 00 00 00 00 00 00 00 ................#012 (g-io-error-quark, 0) [x6]
Aug 21 08:34:42 strawberry smartd[5314]: Device: /dev/sda [SAT], failed to read SMART Attribute Data [x2]
1
0
Command: /usr/local/sbin/syslog-digest.py
Time : 0.0481s
Status : exited 0
Output :
Syslog digest — 2026-08-21 08:05 EDT
Processed 2,156 lines, filtered 1,786 (82%). 370 unknown (74 distinct) from 18 host(s).
== b0b02.cs.umd.edu (1 distinct, 1 total) ==
Aug 21 07:07:07 b0b02.cs.umd.edu rustdesk[573974]: cannot open display:
== bachata (1 distinct, 2 total) ==
Aug 21 07:17:43 bachata setroubleshoot[3402976]: SELinux is preventing /usr/sbin/smbd from name_bind access on the udp_socket port 643. For complete SELinux messages run: sealert -l 8f7247f1-69a5-4a62-a4f0-88a324bfd75c [x2]
== csfw00a (2 distinct, 150 total) ==
Aug 21 07:05:50 csfw00a kernel: bnxt_en 0000:09:00.0 eth3: NIC Link is Down [x148]
Aug 21 08:02:23 csfw00a ospf6d[1477]: [EC 100663307] Could not send entire message [x2]
== hackerman (8 distinct, 13 total) ==
Aug 21 07:19:01 hackerman gnome-software[2060381]: failed to commit changes to dconf: GDBus.Error:org.gtk.GDBus.UnmappedGError.Quark._g_2dfile_2derror_2dquark.Code2: Failed to create file “/adminhomes/sajith/.config/dconf/user.LIY8T3”: Permission denied
Aug 21 07:20:04 hackerman gnome-software[2060381]: can't reliably fixup error code 4 in domain g-io-error-quark: Not a directory [x4]
Aug 21 07:20:12 hackerman gnome-software[2060381]: Only 0 apps for recent list, hiding
Aug 21 07:20:32 hackerman packagekitd[937808]: Failed to get cache filename for libreoffice [x2]
Aug 21 07:20:32 hackerman packagekitd[937808]: Failed to get cache filename for kernel [x2]
Aug 21 07:20:37 hackerman gnome-software[2060381]: failed to commit changes to dconf: GDBus.Error:org.gtk.GDBus.UnmappedGError.Quark._g_2dfile_2derror_2dquark.Code2: Failed to create file “/adminhomes/sajith/.config/dconf/user.VPT3T3”: Permission denied
Aug 21 07:20:40 hackerman packagekitd[937808]: failed to parse public key for /etc/pki/rpm-gpg/RPM-GPG-KEY-PQC-redhat-release
Aug 21 07:27:23 hackerman systemd[1]: insights-client.service: Start request repeated too quickly.
== hazfs.cs.umd.edu (11 distinct, 66 total) ==
Aug 21 07:49:20 hazfs.cs.umd.edu snmpd[1431]: send response: Failure in sendto [x6]
Aug 21 07:49:20 hazfs.cs.umd.edu snmpd[1431]: -- NET-SNMP-EXTEND-MIB::nsExtendStatus."userweb" [x6]
Aug 21 07:49:20 hazfs.cs.umd.edu snmpd[1431]: -- NET-SNMP-EXTEND-MIB::nsExtendStatus."zfslist" [x6]
Aug 21 07:49:20 hazfs.cs.umd.edu snmpd[1431]: -- NET-SNMP-EXTEND-MIB::nsExtendStatus."userhome" [x6]
Aug 21 07:49:20 hazfs.cs.umd.edu snmpd[1431]: -- NET-SNMP-EXTEND-MIB::nsExtendOutput1Line."userweb" [x6]
Aug 21 07:49:20 hazfs.cs.umd.edu snmpd[1431]: -- NET-SNMP-EXTEND-MIB::nsExtendOutput1Line."zfslist" [x6]
Aug 21 07:49:20 hazfs.cs.umd.edu snmpd[1431]: -- NET-SNMP-EXTEND-MIB::nsExtendOutput1Line."userhome" [x6]
Aug 21 07:49:20 hazfs.cs.umd.edu snmpd[1431]: -- NET-SNMP-EXTEND-MIB::nsExtendOutputFull."userweb" [x6]
Aug 21 07:49:20 hazfs.cs.umd.edu snmpd[1431]: -- NET-SNMP-EXTEND-MIB::nsExtendOutputFull."zfslist" [x6]
Aug 21 07:49:20 hazfs.cs.umd.edu snmpd[1431]: -- NET-SNMP-EXTEND-MIB::nsExtendOutputFull."userhome" [x6]
Aug 21 07:49:20 hazfs.cs.umd.edu snmpd[1431]: -- NET-SNMP-EXTEND-MIB::nsExtendOutNumLines."userweb" [x6]
== idm00 (1 distinct, 1 total) ==
Aug 21 07:51:38 idm00 named[3810278]: client @0x7f48cc17cec8 10.73.240.42#63227: update '73.10.in-addr.arpa/IN' denied
== idmp0 (1 distinct, 1 total) ==
Aug 21 07:35:57 idmp0 named[1121900]: client @0x7fe42177c198 10.73.240.43#59399: update '73.10.in-addr.arpa/IN' denied
== irb2156 (1 distinct, 1 total) ==
Aug 21 07:29:12 irb2156 systemd-resolved[3467]: Using degraded feature set TCP instead of UDP for DNS server 128.8.76.3.
== itmon02 (1 distinct, 48 total) ==
Aug 21 07:07:54 itmon02 sshd[1750555]: error: beginning MaxStartups throttling [x48]
== itmon03 (1 distinct, 2 total) ==
Aug 21 07:20:02 itmon03 systemd-timedated[1765717]: /dev/rtc is busy. Is somebody keeping it open continuously? That's not a good idea... Returning a bogus RTC timestamp. [x2]
== newhonors.cs.umd.edu (1 distinct, 1 total) ==
Aug 21 07:54:07 newhonors.cs.umd.edu sshd[32600]: fatal: ssh_dispatch_run_fatal: Connection from 178.62.225.165 port 52888: message authentication code incorrect [preauth]
== newhonors2 (1 distinct, 24 total) ==
Aug 21 07:13:03 newhonors2 dhcpcd[1514221]: dhcpcd is not running [x24]
== outbound00.cs.umd.edu (1 distinct, 6 total) ==
Aug 21 07:09:08 outbound00.cs.umd.edu python3[153154]: ldapdb [x6]
== outbound01.cs.umd.edu (1 distinct, 6 total) ==
Aug 21 07:13:06 outbound01.cs.umd.edu python3[2387884]: ldapdb [x6]
== sentry-docker00.cs.umd.edu (38 distinct, 38 total) ==
Aug 21 07:17:13 sentry-docker00.cs.umd.edu systemd-udevd[562888]: link_config: could not get ethtool features for vethfbc9337
Aug 21 07:17:13 sentry-docker00.cs.umd.edu systemd-udevd[562888]: Could not set offload features of vethfbc9337: No such device
Aug 21 07:17:13 sentry-docker00.cs.umd.edu systemd-udevd[562919]: Could not generate persistent MAC address for veth2fe2ea4: No such file or directory
Aug 21 07:17:13 sentry-docker00.cs.umd.edu systemd-udevd[562920]: Could not generate persistent MAC address for veth0dc37e9: No such file or directory
Aug 21 07:17:13 sentry-docker00.cs.umd.edu systemd-udevd[562938]: Could not generate persistent MAC address for veth5259b13: No such file or directory
Aug 21 07:17:13 sentry-docker00.cs.umd.edu systemd-udevd[562929]: Could not generate persistent MAC address for veth56b62c5: No such file or directory
Aug 21 07:17:13 sentry-docker00.cs.umd.edu systemd-udevd[562929]: Could not generate persistent MAC address for veth9397c5b: No such file or directory
Aug 21 07:17:13 sentry-docker00.cs.umd.edu systemd-udevd[562945]: Could not generate persistent MAC address for veth3dbae7f: No such file or directory
Aug 21 07:17:13 sentry-docker00.cs.umd.edu systemd-udevd[562949]: Could not generate persistent MAC address for veth259c271: No such file or directory
Aug 21 07:17:13 sentry-docker00.cs.umd.edu systemd-udevd[562950]: Could not generate persistent MAC address for veth8f0d71b: No such file or directory
Aug 21 07:17:13 sentry-docker00.cs.umd.edu systemd-udevd[563016]: Could not generate persistent MAC address for veth51af1cb: No such file or directory
Aug 21 07:17:13 sentry-docker00.cs.umd.edu systemd-udevd[563020]: Could not generate persistent MAC address for veth240da1f: No such file or directory
Aug 21 07:37:22 sentry-docker00.cs.umd.edu systemd-udevd[572339]: link_config: could not get ethtool features for veth51af1cb
Aug 21 07:37:22 sentry-docker00.cs.umd.edu systemd-udevd[572339]: Could not set offload features of veth51af1cb: No such device
Aug 21 07:37:22 sentry-docker00.cs.umd.edu systemd-udevd[572376]: Could not generate persistent MAC address for veth6d88ad5: No such file or directory
Aug 21 07:37:22 sentry-docker00.cs.umd.edu systemd-udevd[572377]: Could not generate persistent MAC address for veth33da6a9: No such file or directory
Aug 21 07:37:22 sentry-docker00.cs.umd.edu systemd-udevd[572402]: Could not generate persistent MAC address for veth32bb4ca: No such file or directory
Aug 21 07:37:22 sentry-docker00.cs.umd.edu systemd-udevd[572403]: Could not generate persistent MAC address for vethf880551: No such file or directory
Aug 21 07:37:22 sentry-docker00.cs.umd.edu systemd-udevd[572421]: Could not generate persistent MAC address for veth6feabe6: No such file or directory
Aug 21 07:37:22 sentry-docker00.cs.umd.edu systemd-udevd[572409]: Could not generate persistent MAC address for veth3dc47d4: No such file or directory
Aug 21 07:37:22 sentry-docker00.cs.umd.edu systemd-udevd[572419]: Could not generate persistent MAC address for veth288df67: No such file or directory
Aug 21 07:37:22 sentry-docker00.cs.umd.edu systemd-udevd[572427]: Could not generate persistent MAC address for veth3919c25: No such file or directory
Aug 21 07:37:22 sentry-docker00.cs.umd.edu systemd-udevd[572436]: Could not generate persistent MAC address for vethca5e1c1: No such file or directory
Aug 21 07:37:22 sentry-docker00.cs.umd.edu systemd-udevd[572437]: Could not generate persistent MAC address for veth20d2187: No such file or directory
Aug 21 07:57:30 sentry-docker00.cs.umd.edu systemd-udevd[581725]: link_config: could not get ethtool features for vethca5e1c1
Aug 21 07:57:30 sentry-docker00.cs.umd.edu systemd-udevd[581725]: Could not set offload features of vethca5e1c1: No such device
Aug 21 07:57:30 sentry-docker00.cs.umd.edu systemd-udevd[581822]: link_config: could not set ethtool features for veth6d88ad5
Aug 21 07:57:30 sentry-docker00.cs.umd.edu systemd-udevd[581822]: Could not set offload features of veth6d88ad5: Operation not permitted
Aug 21 07:57:30 sentry-docker00.cs.umd.edu systemd-udevd[581847]: Could not generate persistent MAC address for veth440e59c: No such file or directory
Aug 21 07:57:30 sentry-docker00.cs.umd.edu systemd-udevd[581848]: Could not generate persistent MAC address for veth50469eb: No such file or directory
... 8 more distinct messages not shown
== soul (1 distinct, 1 total) ==
Aug 21 07:58:15 soul krb5_child[2410560]: Preauthentication failed
== strawberry (2 distinct, 8 total) ==
Aug 21 07:09:44 strawberry udisksd[1067]: Error performing housekeeping for drive /org/freedesktop/UDisks2/drives/ST2000DM001_1CH164_W1E8J5KJ: Error updating SMART data: Error sending ATA command CHECK POWER MODE: Unexpected sense data returned:#0120000: 00 00 00 00 00 00 00 00 00 00 00 00 00 00 00 00 ................#0120010: 00 00 00 00 00 00 00 00 00 00 00 00 00 00 00 00 ................#012 (g-io-error-quark, 0) [x6]
Aug 21 07:34:42 strawberry smartd[5314]: Device: /dev/sda [SAT], failed to read SMART Attribute Data [x2]
== submit10-cln25 (1 distinct, 1 total) ==
Aug 21 07:37:00 submit10-cln25 systemd: Failed at step EXEC spawning /usr/local/bin/cronjob: No such file or directory
1
0
Command: /usr/local/sbin/syslog-digest.py
Time : 0.0503s
Status : exited 0
Output :
Syslog digest — 2026-08-21 07:05 EDT
Processed 2,255 lines, filtered 1,881 (83%). 374 unknown (115 distinct) from 22 host(s).
== abadi-computer (2 distinct, 2 total) ==
Aug 21 06:15:00 abadi-computer nologin[376906]: Attempted login by UNKNOWN (UID: 65534) on UNKNOWN
Aug 21 06:15:00 abadi-computer pipewire[376904]: mod.jackdbus-detect: Failed to receive jackdbus reply: org.freedesktop.DBus.Error.ServiceUnknown: The name org.jackaudio.service was not provided by any .service files
== b0b02.cs.umd.edu (1 distinct, 1 total) ==
Aug 21 06:07:03 b0b02.cs.umd.edu rustdesk[558095]: cannot open display:
== csfw00a (1 distinct, 152 total) ==
Aug 21 06:04:19 csfw00a kernel: bnxt_en 0000:09:00.0 eth3: NIC Link is Down [x152]
== hackerman (6 distinct, 11 total) ==
Aug 21 06:20:04 hackerman gnome-software[2060381]: can't reliably fixup error code 4 in domain g-io-error-quark: Not a directory [x4]
Aug 21 06:20:12 hackerman gnome-software[2060381]: Only 0 apps for recent list, hiding
Aug 21 06:20:27 hackerman gnome-software[2060381]: failed to commit changes to dconf: GDBus.Error:org.gtk.GDBus.UnmappedGError.Quark._g_2dfile_2derror_2dquark.Code2: Failed to create file “/adminhomes/sajith/.config/dconf/user.1R57T3”: Permission denied
Aug 21 06:20:28 hackerman packagekitd[924947]: Failed to get cache filename for libreoffice [x2]
Aug 21 06:20:28 hackerman packagekitd[924947]: Failed to get cache filename for kernel [x2]
Aug 21 06:20:38 hackerman packagekitd[924947]: failed to parse public key for /etc/pki/rpm-gpg/RPM-GPG-KEY-PQC-redhat-release
== idm00 (1 distinct, 1 total) ==
Aug 21 06:51:38 idm00 named[3810278]: client @0x7f48dd461058 10.73.240.42#56957: update '73.10.in-addr.arpa/IN' denied
== idmp0 (1 distinct, 1 total) ==
Aug 21 06:35:57 idmp0 named[1121900]: client @0x7fe3d48903f8 10.73.240.43#56923: update '73.10.in-addr.arpa/IN' denied
== inbound00.cs.umd.edu (1 distinct, 1 total) ==
Aug 21 06:07:01 inbound00.cs.umd.edu systemd[1]: Configuration file /usr/lib/systemd/system/authentication_milter.service is marked executable. Please remove executable permission bits. Proceeding anyway.
== inbound01.cs.umd.edu (1 distinct, 1 total) ==
Aug 21 06:17:56 inbound01.cs.umd.edu systemd[1]: Configuration file /usr/lib/systemd/system/authentication_milter.service is marked executable. Please remove executable permission bits. Proceeding anyway.
== irb2156 (1 distinct, 1 total) ==
Aug 21 06:40:52 irb2156 systemd[1]: insights-client.service: Start request repeated too quickly.
== itmon02 (1 distinct, 51 total) ==
Aug 21 06:07:54 itmon02 sshd[1750555]: error: beginning MaxStartups throttling [x51]
== itmon03 (1 distinct, 2 total) ==
Aug 21 06:20:02 itmon03 systemd-timedated[1762158]: /dev/rtc is busy. Is somebody keeping it open continuously? That's not a good idea... Returning a bogus RTC timestamp. [x2]
== neodontcare.cs.umd.edu (9 distinct, 16 total) ==
Aug 21 06:13:30 neodontcare.cs.umd.edu gnome-software[7556]: Only 0 apps for recent list, hiding
Aug 21 06:13:39 neodontcare.cs.umd.edu packagekitd[3726885]: Failed to get cache filename for gnu-free-mono-fonts
Aug 21 06:13:39 neodontcare.cs.umd.edu packagekitd[3726885]: Failed to get cache filename for gnu-free-serif-fonts
Aug 21 06:13:40 neodontcare.cs.umd.edu packagekitd[3726885]: Failed to get cache filename for libnfs
Aug 21 06:13:40 neodontcare.cs.umd.edu packagekitd[3726885]: Failed to get cache filename for google-chrome-stable
Aug 21 06:13:40 neodontcare.cs.umd.edu packagekitd[3726885]: Failed to get cache filename for libreoffice [x3]
Aug 21 06:13:40 neodontcare.cs.umd.edu packagekitd[3726885]: Failed to get cache filename for cups-filesystem [x3]
Aug 21 06:13:40 neodontcare.cs.umd.edu packagekitd[3726885]: Failed to get cache filename for kernel [x3]
Aug 21 06:13:45 neodontcare.cs.umd.edu packagekitd[3726885]: failed to parse public key for /etc/pki/rpm-gpg/RPM-GPG-KEY-PQC-redhat-release [x2]
== netman.cs.umd.edu (1 distinct, 1 total) ==
Aug 21 07:02:51 netman.cs.umd.edu sshd[3354961]: error: PAM: Authentication failure for operator from 194.59.245.3
== newhonors2 (38 distinct, 65 total) ==
Aug 21 06:13:02 newhonors2 dhcpcd[1512004]: dhcpcd is not running [x28]
Aug 21 06:48:18 newhonors2 puppet-agent[1513145]: Could not update: Execution of '/usr/bin/apt-get -q -y -o DPkg::Options::=--force-confold --force-yes install openvox-agent=8.27.0-1+ubuntu24.04' returned 100: Reading package lists...
Aug 21 06:48:18 newhonors2 puppet-agent[1513145]: Building dependency tree...
Aug 21 06:48:18 newhonors2 puppet-agent[1513145]: Reading state information...
Aug 21 06:48:18 newhonors2 puppet-agent[1513145]: Package openvox-agent is not available, but is referred to by another package.
Aug 21 06:48:18 newhonors2 puppet-agent[1513145]: This may mean that the package is missing, has been obsoleted, or
Aug 21 06:48:18 newhonors2 puppet-agent[1513145]: is only available from another source
Aug 21 06:48:18 newhonors2 puppet-agent[1513145]:
Aug 21 06:48:18 newhonors2 puppet-agent[1513145]: W: --force-yes is deprecated, use one of the options starting with --allow instead.
Aug 21 06:48:18 newhonors2 puppet-agent[1513145]: E: Version '8.27.0-1+ubuntu24.04' for 'openvox-agent' was not found
Aug 21 06:48:18 newhonors2 puppet-agent[1513145]: (/Stage[main]/Puppet::Agent::Install/Package[openvox-agent]/ensure) change from '7.37.2-1+ubuntu24.04' to '8.27.0-1+ubuntu24.04' failed: Could not update: Execution of '/usr/bin/apt-get -q -y -o DPkg::Options::=--force-confold --force-yes install openvox-agent=8.27.0-1+ubuntu24.04' returned 100: Reading package lists...
Aug 21 06:48:18 newhonors2 puppet-agent[1513145]: (/Stage[main]/Puppet::Agent::Install/Package[openvox-agent]/ensure) Building dependency tree...
Aug 21 06:48:18 newhonors2 puppet-agent[1513145]: (/Stage[main]/Puppet::Agent::Install/Package[openvox-agent]/ensure) Reading state information...
Aug 21 06:48:18 newhonors2 puppet-agent[1513145]: (/Stage[main]/Puppet::Agent::Install/Package[openvox-agent]/ensure) Package openvox-agent is not available, but is referred to by another package.
Aug 21 06:48:18 newhonors2 puppet-agent[1513145]: (/Stage[main]/Puppet::Agent::Install/Package[openvox-agent]/ensure) This may mean that the package is missing, has been obsoleted, or
Aug 21 06:48:18 newhonors2 puppet-agent[1513145]: (/Stage[main]/Puppet::Agent::Install/Package[openvox-agent]/ensure) is only available from another source
Aug 21 06:48:18 newhonors2 puppet-agent[1513145]: (/Stage[main]/Puppet::Agent::Install/Package[openvox-agent]/ensure)
Aug 21 06:48:18 newhonors2 puppet-agent[1513145]: (/Stage[main]/Puppet::Agent::Install/Package[openvox-agent]/ensure) W: --force-yes is deprecated, use one of the options starting with --allow instead.
Aug 21 06:48:18 newhonors2 puppet-agent[1513145]: (/Stage[main]/Puppet::Agent::Install/Package[openvox-agent]/ensure) E: Version '8.27.0-1+ubuntu24.04' for 'openvox-agent' was not found
Aug 21 06:48:42 newhonors2 puppet-agent[1513145]: (/Stage[main]/Puppet::Agent::Config/Puppet::Config::Agent[classfile]/Puppet::Config::Entry[agent_classfile]/Concat::Fragment[puppet.conf_agent]/Concat_fragment[puppet.conf_agent]) Skipping because of failed dependencies
Aug 21 06:48:42 newhonors2 puppet-agent[1513145]: (/Stage[main]/Puppet::Agent::Config/Puppet::Config::Agent[classfile]/Puppet::Config::Entry[agent_classfile]/Concat::Fragment[puppet.conf_agent_end]/Concat_fragment[puppet.conf_agent_end]) Skipping because of failed dependencies
Aug 21 06:48:42 newhonors2 puppet-agent[1513145]: (/Stage[main]/Puppet::Agent::Config/Puppet::Config::Agent[classfile]/Puppet::Config::Entry[agent_classfile]/Concat::Fragment[puppet.conf_agent_classfile]/Concat_fragment[puppet.conf_agent_classfile]) Skipping because of failed dependencies
Aug 21 06:48:42 newhonors2 puppet-agent[1513145]: (/Stage[main]/Puppet::Agent::Config/Puppet::Config::Agent[default_schedules]/Puppet::Config::Entry[agent_default_schedules]/Concat::Fragment[puppet.conf_agent_default_schedules]/Concat_fragment[puppet.conf_agent_default_schedules]) Skipping because of failed dependencies
Aug 21 06:48:42 newhonors2 puppet-agent[1513145]: (/Stage[main]/Puppet::Agent::Config/Puppet::Config::Agent[report]/Puppet::Config::Entry[agent_report]/Concat::Fragment[puppet.conf_agent_report]/Concat_fragment[puppet.conf_agent_report]) Skipping because of failed dependencies
Aug 21 06:48:42 newhonors2 puppet-agent[1513145]: (/Stage[main]/Puppet::Agent::Config/Puppet::Config::Agent[masterport]/Puppet::Config::Entry[agent_masterport]/Concat::Fragment[puppet.conf_agent_masterport]/Concat_fragment[puppet.conf_agent_masterport]) Skipping because of failed dependencies
Aug 21 06:48:42 newhonors2 puppet-agent[1513145]: (/Stage[main]/Puppet::Agent::Config/Puppet::Config::Agent[splay]/Puppet::Config::Entry[agent_splay]/Concat::Fragment[puppet.conf_agent_splay]/Concat_fragment[puppet.conf_agent_splay]) Skipping because of failed dependencies
Aug 21 06:48:42 newhonors2 puppet-agent[1513145]: (/Stage[main]/Puppet::Agent::Config/Puppet::Config::Agent[splaylimit]/Puppet::Config::Entry[agent_splaylimit]/Concat::Fragment[puppet.conf_agent_splaylimit]/Concat_fragment[puppet.conf_agent_splaylimit]) Skipping because of failed dependencies
Aug 21 06:48:42 newhonors2 puppet-agent[1513145]: (/Stage[main]/Puppet::Agent::Config/Puppet::Config::Agent[runinterval]/Puppet::Config::Entry[agent_runinterval]/Concat::Fragment[puppet.conf_agent_runinterval]/Concat_fragment[puppet.conf_agent_runinterval]) Skipping because of failed dependencies
Aug 21 06:48:42 newhonors2 puppet-agent[1513145]: (/Stage[main]/Puppet::Agent::Config/Puppet::Config::Agent[noop]/Puppet::Config::Entry[agent_noop]/Concat::Fragment[puppet.conf_agent_noop]/Concat_fragment[puppet.conf_agent_noop]) Skipping because of failed dependencies
Aug 21 06:48:42 newhonors2 puppet-agent[1513145]: (/Stage[main]/Puppet::Agent::Config/Puppet::Config::Agent[usecacheonfailure]/Puppet::Config::Entry[agent_usecacheonfailure]/Concat::Fragment[puppet.conf_agent_usecacheonfailure]/Concat_fragment[puppet.conf_agent_usecacheonfailure]) Skipping because of failed dependencies
... 8 more distinct messages not shown
== orchids (6 distinct, 7 total) ==
Aug 21 06:11:31 orchids gnome-software[1516991]: Only 0 apps for recent list, hiding
Aug 21 06:11:38 orchids packagekitd[326975]: Failed to get cache filename for google-chrome-stable
Aug 21 06:11:38 orchids packagekitd[326975]: Failed to get cache filename for libreoffice
Aug 21 06:11:38 orchids packagekitd[326975]: Failed to get cache filename for cups-filesystem
Aug 21 06:11:38 orchids packagekitd[326975]: Failed to get cache filename for kernel
Aug 21 06:11:42 orchids packagekitd[326975]: failed to parse public key for /etc/pki/rpm-gpg/RPM-GPG-KEY-PQC-redhat-release [x2]
== outbound00.cs.umd.edu (1 distinct, 6 total) ==
Aug 21 06:09:08 outbound00.cs.umd.edu python3[139011]: ldapdb [x6]
== outbound01.cs.umd.edu (2 distinct, 7 total) ==
Aug 21 06:13:06 outbound01.cs.umd.edu python3[2373931]: ldapdb [x6]
Aug 21 06:51:31 outbound01.cs.umd.edu krb5_child[2382553]: Client 'admin(a)UMD.EDU' not found in Kerberos database
== quiss (1 distinct, 2 total) ==
Aug 21 06:21:55 quiss nautilus[2301758]: Attempted to add a non-existent file to the view. [x2]
== sentry-docker00.cs.umd.edu (34 distinct, 34 total) ==
Aug 21 06:16:48 sentry-docker00.cs.umd.edu systemd-udevd[534629]: Could not generate persistent MAC address for vethb8c6367: No such file or directory
Aug 21 06:16:48 sentry-docker00.cs.umd.edu systemd-udevd[534630]: Could not generate persistent MAC address for veth92e1e5a: No such file or directory
Aug 21 06:16:48 sentry-docker00.cs.umd.edu systemd-udevd[534634]: Could not generate persistent MAC address for vethc299b69: No such file or directory
Aug 21 06:16:48 sentry-docker00.cs.umd.edu systemd-udevd[534633]: Could not generate persistent MAC address for vethf76ad4d: No such file or directory
Aug 21 06:16:48 sentry-docker00.cs.umd.edu systemd-udevd[534657]: Could not generate persistent MAC address for veth8793ae2: No such file or directory
Aug 21 06:16:48 sentry-docker00.cs.umd.edu systemd-udevd[534658]: Could not generate persistent MAC address for veth6bc367d: No such file or directory
Aug 21 06:16:48 sentry-docker00.cs.umd.edu systemd-udevd[534676]: Could not generate persistent MAC address for veth5a92885: No such file or directory
Aug 21 06:16:48 sentry-docker00.cs.umd.edu systemd-udevd[534683]: Could not generate persistent MAC address for veth6aef3be: No such file or directory
Aug 21 06:16:48 sentry-docker00.cs.umd.edu systemd-udevd[534705]: Could not generate persistent MAC address for veth1b319d2: No such file or directory
Aug 21 06:16:48 sentry-docker00.cs.umd.edu systemd-udevd[534711]: Could not generate persistent MAC address for veth781a390: No such file or directory
Aug 21 06:36:57 sentry-docker00.cs.umd.edu systemd-udevd[544021]: link_config: could not get ethtool features for veth5a92885
Aug 21 06:36:57 sentry-docker00.cs.umd.edu systemd-udevd[544021]: Could not set offload features of veth5a92885: No such device
Aug 21 06:36:57 sentry-docker00.cs.umd.edu systemd-udevd[544053]: Could not generate persistent MAC address for vethdbe0a3d: No such file or directory
Aug 21 06:36:57 sentry-docker00.cs.umd.edu systemd-udevd[544054]: Could not generate persistent MAC address for veth2015721: No such file or directory
Aug 21 06:36:57 sentry-docker00.cs.umd.edu systemd-udevd[544057]: Could not generate persistent MAC address for veth40b51f9: No such file or directory
Aug 21 06:36:57 sentry-docker00.cs.umd.edu systemd-udevd[544058]: Could not generate persistent MAC address for veth07828ce: No such file or directory
Aug 21 06:36:57 sentry-docker00.cs.umd.edu systemd-udevd[544069]: Could not generate persistent MAC address for vethead15f4: No such file or directory
Aug 21 06:36:57 sentry-docker00.cs.umd.edu systemd-udevd[544054]: Could not generate persistent MAC address for vetha06ea82: No such file or directory
Aug 21 06:36:57 sentry-docker00.cs.umd.edu systemd-udevd[544054]: Could not generate persistent MAC address for veth692c665: No such file or directory
Aug 21 06:36:57 sentry-docker00.cs.umd.edu systemd-udevd[544069]: Could not generate persistent MAC address for vethc5e2dad: No such file or directory
Aug 21 06:36:57 sentry-docker00.cs.umd.edu systemd-udevd[544069]: Could not generate persistent MAC address for veth25b09a1: No such file or directory
Aug 21 06:36:57 sentry-docker00.cs.umd.edu systemd-udevd[544080]: Could not generate persistent MAC address for veth63f046b: No such file or directory
Aug 21 06:57:05 sentry-docker00.cs.umd.edu systemd-udevd[553462]: link_config: could not get ethtool features for veth40b51f9
Aug 21 06:57:05 sentry-docker00.cs.umd.edu systemd-udevd[553462]: Could not set offload features of veth40b51f9: No such device
Aug 21 06:57:05 sentry-docker00.cs.umd.edu systemd-udevd[553500]: Could not generate persistent MAC address for vethf4efe67: No such file or directory
Aug 21 06:57:05 sentry-docker00.cs.umd.edu systemd-udevd[553501]: Could not generate persistent MAC address for veth4b917c4: No such file or directory
Aug 21 06:57:05 sentry-docker00.cs.umd.edu systemd-udevd[553504]: Could not generate persistent MAC address for vethaf05834: No such file or directory
Aug 21 06:57:05 sentry-docker00.cs.umd.edu systemd-udevd[553505]: Could not generate persistent MAC address for vethdf1a2ea: No such file or directory
Aug 21 06:57:05 sentry-docker00.cs.umd.edu systemd-udevd[553524]: Could not generate persistent MAC address for vethbe0a32b: No such file or directory
Aug 21 06:57:05 sentry-docker00.cs.umd.edu systemd-udevd[553523]: Could not generate persistent MAC address for vethfbc9337: No such file or directory
... 4 more distinct messages not shown
== soul (1 distinct, 1 total) ==
Aug 21 06:58:06 soul krb5_child[2402927]: Preauthentication failed
== strawberry (4 distinct, 10 total) ==
Aug 21 06:09:44 strawberry udisksd[1067]: Error performing housekeeping for drive /org/freedesktop/UDisks2/drives/ST2000DM001_1CH164_W1E8J5KJ: Error updating SMART data: Error sending ATA command CHECK POWER MODE: Unexpected sense data returned:#0120000: 00 00 00 00 00 00 00 00 00 00 00 00 00 00 00 00 ................#0120010: 00 00 00 00 00 00 00 00 00 00 00 00 00 00 00 00 ................#012 (g-io-error-quark, 0) [x6]
Aug 21 06:31:00 strawberry nologin[715241]: Attempted login by UNKNOWN (UID: 65534) on UNKNOWN
Aug 21 06:31:01 strawberry pipewire[715240]: mod.jackdbus-detect: Failed to receive jackdbus reply: org.freedesktop.DBus.Error.ServiceUnknown: The name org.jackaudio.service was not provided by any .service files
Aug 21 06:34:42 strawberry smartd[5314]: Device: /dev/sda [SAT], failed to read SMART Attribute Data [x2]
== tlsrpt (1 distinct, 1 total) ==
Aug 21 06:38:03 tlsrpt (httpd)[1477671]: httpd.service: Referenced but unset environment variable evaluates to an empty string: OPTIONS
1
0
Command: /usr/local/sbin/syslog-digest.py
Time : 0.0486s
Status : exited 0
Output :
Syslog digest — 2026-08-21 06:05 EDT
Processed 2,454 lines, filtered 2,112 (86%). 342 unknown (82 distinct) from 21 host(s).
== b0b02.cs.umd.edu (1 distinct, 1 total) ==
Aug 21 05:07:00 b0b02.cs.umd.edu rustdesk[542963]: cannot open display:
== biggulp.cs.umd.edu (6 distinct, 6 total) ==
Aug 21 05:17:34 biggulp.cs.umd.edu sshd-session[3143422]: error: kex_protocol_error: type 20 seq 2 [preauth]
Aug 21 05:17:34 biggulp.cs.umd.edu sshd-session[3143422]: error: kex_protocol_error: type 30 seq 3 [preauth]
Aug 21 05:17:35 biggulp.cs.umd.edu sshd-session[3143422]: error: kex_protocol_error: type 20 seq 4 [preauth]
Aug 21 05:17:35 biggulp.cs.umd.edu sshd-session[3143422]: error: kex_protocol_error: type 30 seq 5 [preauth]
Aug 21 05:17:37 biggulp.cs.umd.edu sshd-session[3143422]: error: kex_protocol_error: type 20 seq 6 [preauth]
Aug 21 05:17:37 biggulp.cs.umd.edu sshd-session[3143422]: error: kex_protocol_error: type 30 seq 7 [preauth]
== cheezit.cs.umd.edu (6 distinct, 6 total) ==
Aug 21 05:05:05 cheezit.cs.umd.edu sshd-session[2672728]: error: kex_protocol_error: type 20 seq 2 [preauth]
Aug 21 05:05:05 cheezit.cs.umd.edu sshd-session[2672728]: error: kex_protocol_error: type 30 seq 3 [preauth]
Aug 21 05:05:05 cheezit.cs.umd.edu sshd-session[2672728]: error: kex_protocol_error: type 20 seq 4 [preauth]
Aug 21 05:05:05 cheezit.cs.umd.edu sshd-session[2672728]: error: kex_protocol_error: type 30 seq 5 [preauth]
Aug 21 05:05:07 cheezit.cs.umd.edu sshd-session[2672728]: error: kex_protocol_error: type 20 seq 6 [preauth]
Aug 21 05:05:07 cheezit.cs.umd.edu sshd-session[2672728]: error: kex_protocol_error: type 30 seq 7 [preauth]
== csfw00a (2 distinct, 158 total) ==
Aug 21 05:04:51 csfw00a kernel: bnxt_en 0000:09:00.0 eth3: NIC Link is Down [x146]
Aug 21 05:11:32 csfw00a ospf6d[1477]: [EC 100663307] Could not send entire message [x12]
== grades01.cs.umd.edu (1 distinct, 1 total) ==
Aug 21 05:48:36 grades01.cs.umd.edu puppet-agent[31815]: The directory '/srv/grades' contains 2471 entries, which exceeds the default soft limit 1000 and may cause excessive resource consumption and degraded performance. To remove this warning set a value for `max_files` parameter or consider using an alternate method to manage large directory trees
== hackerman (1 distinct, 1 total) ==
Aug 21 05:19:01 hackerman gnome-software[2060381]: failed to commit changes to dconf: GDBus.Error:org.gtk.GDBus.UnmappedGError.Quark._g_2dfile_2derror_2dquark.Code2: Failed to create file “/adminhomes/sajith/.config/dconf/user.OPNEU3”: Permission denied
== idm00 (1 distinct, 1 total) ==
Aug 21 05:51:38 idm00 named[3810278]: client @0x7f48cc074748 10.73.240.42#64280: update '73.10.in-addr.arpa/IN' denied
== idmp0 (1 distinct, 1 total) ==
Aug 21 05:35:57 idmp0 named[1121900]: client @0x7fe3ec00e068 10.73.240.43#52969: update '73.10.in-addr.arpa/IN' denied
== itmon02 (1 distinct, 59 total) ==
Aug 21 05:07:47 itmon02 sshd[1750555]: error: beginning MaxStartups throttling [x59]
== itmon03 (1 distinct, 2 total) ==
Aug 21 05:20:02 itmon03 systemd-timedated[1759182]: /dev/rtc is busy. Is somebody keeping it open continuously? That's not a good idea... Returning a bogus RTC timestamp. [x2]
== krispykreme.cs.umd.edu (6 distinct, 6 total) ==
Aug 21 05:15:19 krispykreme.cs.umd.edu sshd-session[1388475]: error: kex_protocol_error: type 20 seq 2 [preauth]
Aug 21 05:15:19 krispykreme.cs.umd.edu sshd-session[1388475]: error: kex_protocol_error: type 30 seq 3 [preauth]
Aug 21 05:15:20 krispykreme.cs.umd.edu sshd-session[1388475]: error: kex_protocol_error: type 20 seq 4 [preauth]
Aug 21 05:15:20 krispykreme.cs.umd.edu sshd-session[1388475]: error: kex_protocol_error: type 30 seq 5 [preauth]
Aug 21 05:15:22 krispykreme.cs.umd.edu sshd-session[1388475]: error: kex_protocol_error: type 20 seq 6 [preauth]
Aug 21 05:15:22 krispykreme.cs.umd.edu sshd-session[1388475]: error: kex_protocol_error: type 30 seq 7 [preauth]
== matrix (1 distinct, 1 total) ==
Aug 21 06:02:56 matrix kernel: workqueue: xfs_reclaim_worker [xfs] hogged CPU for >10000us 5 times, consider switching to WQ_UNBOUND
== munin (2 distinct, 4 total) ==
Aug 21 05:18:01 munin sudo[1864905]: pam_systemd(sudo:session): Failed to stat() runtime directory '/run/user/0': No such file or directory [x2]
Aug 21 05:18:01 munin sudo[1864905]: pam_systemd(sudo:session): Not setting $XDG_RUNTIME_DIR, as the directory is not in order. [x2]
== newhonors2 (1 distinct, 24 total) ==
Aug 21 05:13:03 newhonors2 dhcpcd[1509134]: dhcpcd is not running [x24]
== outbound00.cs.umd.edu (1 distinct, 6 total) ==
Aug 21 05:09:09 outbound00.cs.umd.edu python3[125033]: ldapdb [x6]
== outbound01.cs.umd.edu (2 distinct, 8 total) ==
Aug 21 05:08:18 outbound01.cs.umd.edu python3[2358116]: ldapdb [x7]
Aug 21 05:09:24 outbound01.cs.umd.edu systemd[1]: Configuration file /usr/lib/systemd/system/authentication_milter.service is marked executable. Please remove executable permission bits. Proceeding anyway.
== quiss (8 distinct, 10 total) ==
Aug 21 06:00:18 quiss packagekitd[2650085]: Failed to get cache filename for gstreamer1-plugins-bad-free
Aug 21 06:00:18 quiss packagekitd[2650085]: Failed to get cache filename for gstreamer1-plugins-good
Aug 21 06:00:18 quiss packagekitd[2650085]: Failed to get cache filename for gstreamer1-plugins-ugly-free
Aug 21 06:00:18 quiss packagekitd[2650085]: Failed to get cache filename for cups-filesystem [x2]
Aug 21 06:00:18 quiss packagekitd[2650085]: Failed to get cache filename for kbd
Aug 21 06:00:18 quiss packagekitd[2650085]: Failed to get cache filename for kbd-legacy
Aug 21 06:00:18 quiss packagekitd[2650085]: Failed to get cache filename for kbd-misc
Aug 21 06:00:18 quiss packagekitd[2650085]: Failed to get cache filename for kernel [x2]
== sentry-docker00.cs.umd.edu (36 distinct, 36 total) ==
Aug 21 05:16:23 sentry-docker00.cs.umd.edu systemd-udevd[506137]: Could not generate persistent MAC address for veth8fa93c8: No such file or directory
Aug 21 05:16:23 sentry-docker00.cs.umd.edu systemd-udevd[506138]: Could not generate persistent MAC address for vethca6c8df: No such file or directory
Aug 21 05:16:23 sentry-docker00.cs.umd.edu systemd-udevd[506141]: Could not generate persistent MAC address for veth3830d6c: No such file or directory
Aug 21 05:16:23 sentry-docker00.cs.umd.edu systemd-udevd[506142]: Could not generate persistent MAC address for vetheb50151: No such file or directory
Aug 21 05:16:24 sentry-docker00.cs.umd.edu systemd-udevd[506159]: Could not generate persistent MAC address for vetha9b8d2b: No such file or directory
Aug 21 05:16:24 sentry-docker00.cs.umd.edu systemd-udevd[506158]: Could not generate persistent MAC address for vethf57f2c6: No such file or directory
Aug 21 05:16:24 sentry-docker00.cs.umd.edu systemd-udevd[506158]: Could not generate persistent MAC address for veth55ca6b1: No such file or directory
Aug 21 05:16:24 sentry-docker00.cs.umd.edu systemd-udevd[506159]: Could not generate persistent MAC address for veth4e0ecff: No such file or directory
Aug 21 05:16:24 sentry-docker00.cs.umd.edu systemd-udevd[506169]: Could not generate persistent MAC address for veth840ec98: No such file or directory
Aug 21 05:16:24 sentry-docker00.cs.umd.edu systemd-udevd[506170]: Could not generate persistent MAC address for veth6588ea4: No such file or directory
Aug 21 05:36:32 sentry-docker00.cs.umd.edu systemd-udevd[515710]: link_config: could not get ethtool features for veth8fa93c8
Aug 21 05:36:32 sentry-docker00.cs.umd.edu systemd-udevd[515710]: Could not set offload features of veth8fa93c8: No such device
Aug 21 05:36:32 sentry-docker00.cs.umd.edu systemd-udevd[515712]: link_config: could not get ethtool features for veth55ca6b1
Aug 21 05:36:32 sentry-docker00.cs.umd.edu systemd-udevd[515712]: Could not set offload features of veth55ca6b1: No such device
Aug 21 05:36:32 sentry-docker00.cs.umd.edu systemd-udevd[515785]: Could not generate persistent MAC address for veth4e73790: No such file or directory
Aug 21 05:36:32 sentry-docker00.cs.umd.edu systemd-udevd[515786]: Could not generate persistent MAC address for veth2737395: No such file or directory
Aug 21 05:36:32 sentry-docker00.cs.umd.edu systemd-udevd[515789]: Could not generate persistent MAC address for veth6c109c3: No such file or directory
Aug 21 05:36:32 sentry-docker00.cs.umd.edu systemd-udevd[515790]: Could not generate persistent MAC address for veth0473877: No such file or directory
Aug 21 05:36:32 sentry-docker00.cs.umd.edu systemd-udevd[515792]: Could not generate persistent MAC address for vethf98339a: No such file or directory
Aug 21 05:36:32 sentry-docker00.cs.umd.edu systemd-udevd[515796]: Could not generate persistent MAC address for veth2dac51b: No such file or directory
Aug 21 05:36:32 sentry-docker00.cs.umd.edu systemd-udevd[515815]: Could not generate persistent MAC address for veth3ad0725: No such file or directory
Aug 21 05:36:32 sentry-docker00.cs.umd.edu systemd-udevd[515816]: Could not generate persistent MAC address for veth0fe6be9: No such file or directory
Aug 21 05:36:32 sentry-docker00.cs.umd.edu systemd-udevd[515835]: Could not generate persistent MAC address for vethe68bac8: No such file or directory
Aug 21 05:36:32 sentry-docker00.cs.umd.edu systemd-udevd[515828]: Could not generate persistent MAC address for veth5cdf663: No such file or directory
Aug 21 05:56:40 sentry-docker00.cs.umd.edu systemd-udevd[525101]: link_config: could not get ethtool features for veth4e73790
Aug 21 05:56:40 sentry-docker00.cs.umd.edu systemd-udevd[525101]: Could not set offload features of veth4e73790: No such device
Aug 21 05:56:40 sentry-docker00.cs.umd.edu systemd-udevd[525226]: Could not generate persistent MAC address for vethaa3e5a9: No such file or directory
Aug 21 05:56:40 sentry-docker00.cs.umd.edu systemd-udevd[525227]: Could not generate persistent MAC address for vethd045b17: No such file or directory
Aug 21 05:56:40 sentry-docker00.cs.umd.edu systemd-udevd[525253]: Could not generate persistent MAC address for veth19d3330: No such file or directory
Aug 21 05:56:40 sentry-docker00.cs.umd.edu systemd-udevd[525252]: Could not generate persistent MAC address for veth79a42f3: No such file or directory
... 6 more distinct messages not shown
== soul (1 distinct, 1 total) ==
Aug 21 05:47:35 soul krb5_child[2393416]: Client 'peer(a)UMD.EDU' not found in Kerberos database
== strawberry (2 distinct, 8 total) ==
Aug 21 05:09:44 strawberry udisksd[1067]: Error performing housekeeping for drive /org/freedesktop/UDisks2/drives/ST2000DM001_1CH164_W1E8J5KJ: Error updating SMART data: Error sending ATA command CHECK POWER MODE: Unexpected sense data returned:#0120000: 00 00 00 00 00 00 00 00 00 00 00 00 00 00 00 00 ................#0120010: 00 00 00 00 00 00 00 00 00 00 00 00 00 00 00 00 ................#012 (g-io-error-quark, 0) [x6]
Aug 21 05:34:42 strawberry smartd[5314]: Device: /dev/sda [SAT], failed to read SMART Attribute Data [x2]
== talkhosts9 (1 distinct, 2 total) ==
Aug 21 05:17:15 talkhosts9 setroubleshoot[524485]: SELinux is preventing /usr/bin/lsof from getattr access on the unix_stream_socket unix_stream_socket. For complete SELinux messages run: sealert -l a6df89b3-c497-469c-8232-c4fde0508abf [x2]
1
0
Command: /usr/local/sbin/syslog-digest.py
Time : 0.0475s
Status : exited 0
Output :
Syslog digest — 2026-08-21 05:05 EDT
Processed 2,095 lines, filtered 1,774 (84%). 321 unknown (86 distinct) from 19 host(s).
== abadi-computer (2 distinct, 2 total) ==
Aug 21 04:15:01 abadi-computer nologin[367147]: Attempted login by UNKNOWN (UID: 65534) on UNKNOWN
Aug 21 04:15:01 abadi-computer pipewire[367145]: mod.jackdbus-detect: Failed to receive jackdbus reply: org.freedesktop.DBus.Error.ServiceUnknown: The name org.jackaudio.service was not provided by any .service files
== b0b02.cs.umd.edu (1 distinct, 1 total) ==
Aug 21 04:06:55 b0b02.cs.umd.edu rustdesk[527800]: cannot open display:
== biggulp.cs.umd.edu (6 distinct, 6 total) ==
Aug 21 04:27:36 biggulp.cs.umd.edu sshd-session[3135109]: error: kex_protocol_error: type 20 seq 2 [preauth]
Aug 21 04:27:36 biggulp.cs.umd.edu sshd-session[3135109]: error: kex_protocol_error: type 30 seq 3 [preauth]
Aug 21 04:27:38 biggulp.cs.umd.edu sshd-session[3135109]: error: kex_protocol_error: type 20 seq 4 [preauth]
Aug 21 04:27:38 biggulp.cs.umd.edu sshd-session[3135109]: error: kex_protocol_error: type 30 seq 5 [preauth]
Aug 21 04:27:40 biggulp.cs.umd.edu sshd-session[3135109]: error: kex_protocol_error: type 20 seq 6 [preauth]
Aug 21 04:27:40 biggulp.cs.umd.edu sshd-session[3135109]: error: kex_protocol_error: type 30 seq 7 [preauth]
== cheezit.cs.umd.edu (6 distinct, 6 total) ==
Aug 21 04:47:17 cheezit.cs.umd.edu sshd-session[2668646]: error: kex_protocol_error: type 20 seq 2 [preauth]
Aug 21 04:47:17 cheezit.cs.umd.edu sshd-session[2668646]: error: kex_protocol_error: type 30 seq 3 [preauth]
Aug 21 04:47:19 cheezit.cs.umd.edu sshd-session[2668646]: error: kex_protocol_error: type 20 seq 4 [preauth]
Aug 21 04:47:19 cheezit.cs.umd.edu sshd-session[2668646]: error: kex_protocol_error: type 30 seq 5 [preauth]
Aug 21 04:47:21 cheezit.cs.umd.edu sshd-session[2668646]: error: kex_protocol_error: type 20 seq 6 [preauth]
Aug 21 04:47:21 cheezit.cs.umd.edu sshd-session[2668646]: error: kex_protocol_error: type 30 seq 7 [preauth]
== csfw00a (1 distinct, 142 total) ==
Aug 21 04:04:09 csfw00a kernel: bnxt_en 0000:09:00.0 eth3: NIC Link is Down [x142]
== forge00 (1 distinct, 1 total) ==
Aug 21 04:09:06 forge00 (httpd)[211828]: httpd.service: Referenced but unset environment variable evaluates to an empty string: OPTIONS
== gle-dind04 (1 distinct, 1 total) ==
Aug 21 04:23:05 gle-dind04 setroubleshoot[525316]: failed to retrieve rpm info for path '/etc/aliases.lmdb':
== idm00 (1 distinct, 1 total) ==
Aug 21 04:51:38 idm00 named[3810278]: client @0x7f48cc0721c8 10.73.240.42#62632: update '73.10.in-addr.arpa/IN' denied
== idmp0 (1 distinct, 1 total) ==
Aug 21 04:35:57 idmp0 named[1121900]: client @0x7fe41c00ab48 10.73.240.43#62201: update '73.10.in-addr.arpa/IN' denied
== itmon02 (1 distinct, 55 total) ==
Aug 21 04:07:49 itmon02 sshd[1750555]: error: beginning MaxStartups throttling [x55]
== jaws.cs.umd.edu (1 distinct, 1 total) ==
Aug 21 04:59:31 jaws.cs.umd.edu systemd-coredump[1146597]: Process 1146594 (identify) of user 48 dumped core.#012#012Stack trace of thread 1146594:#012#0 0x00007f2fe6a8d38c __pthread_kill_implementation (libc.so.6 + 0x8d38c)#012#1 0x00007f2fe6a3fa86 raise (libc.so.6 + 0x3fa86)#012#2 0x00007f2fe6a29873 abort (libc.so.6 + 0x29873)#012#3 0x00007f2fe6e351e7 MagickSignalHandler.cold (libMagickCore-6.Q16.so.7 + 0x351e7)#012#4 0x00007f2fe6a3fb30 __restore_rt (libc.so.6 + 0x3fb30)#012#5 0x00007f2fe6a8d38c __pthread_kill_implementation (libc.so.6 + 0x8d38c)#012#6 0x00007f2fe6a3fa86 raise (libc.so.6 + 0x3fa86)#012#7 0x00007f2fe6a29873 abort (libc.so.6 + 0x29873)#012#8 0x00007f2fe6e351e7 MagickSignalHandler.cold (libMagickCore-6.Q16.so.7 + 0x351e7)#012#9 0x00007f2fe6a3fb30 __restore_rt (libc.so.6 + 0x3fb30)#012#10 0x00007f2fe6aa5650 __memmove_sse2_unaligned_erms (libc.so.6 + 0xa5650)#012#11 0x00007f2fe6e48eae ReadBlob (libMagickCore-6.Q16.so.7 + 0x48eae)#012#12 0x00007f2fe621cac6 png_
get_data (png.so + 0x5ac6)#012#13 0x00007f2fe62e80fa png_crc_finish (libpng16.so.16 + 0x190fa)#012#14 0x00007f2fe62dcee9 png_read_row (libpng16.so.16 + 0xdee9)#012#15 0x00007f2fe621f0c8 ReadOnePNGImage (png.so + 0x80c8)#012#16 0x00007f2fe6221711 ReadPNGImage (png.so + 0xa711)#012#17 0x00007f2fe6e86c08 ReadImage (libMagickCore-6.Q16.so.7 + 0x86c08)#012#18 0x00007f2fe6e87eb3 ReadImages (libMagickCore-6.Q16.so.7 + 0x87eb3)#012#19 0x00007f2fe71d688f IdentifyImageCommand (libMagickWand-6.Q16.so.7 + 0x7f88f)#012#20 0x00007f2fe7202990 MagickCommandGenesis (libMagickWand-6.Q16.so.7 + 0xab990)#012#21 0x000056299b9101fb main (identify + 0x11fb)#012#22 0x00007f2fe6a2a610 __libc_start_call_main (libc.so.6 + 0x2a610)#012#23 0x00007f2fe6a2a6c0 __libc_start_main@@GLIBC_2.34 (libc.so.6 + 0x2a6c0)#012#24 0x000056299b910275 _start (identify + 0x1275)#012ELF object binary architecture: AMD x86-64
== krispykreme.cs.umd.edu (6 distinct, 6 total) ==
Aug 21 04:43:47 krispykreme.cs.umd.edu sshd-session[1379824]: error: kex_protocol_error: type 20 seq 2 [preauth]
Aug 21 04:43:47 krispykreme.cs.umd.edu sshd-session[1379824]: error: kex_protocol_error: type 30 seq 3 [preauth]
Aug 21 04:43:47 krispykreme.cs.umd.edu sshd-session[1379824]: error: kex_protocol_error: type 20 seq 4 [preauth]
Aug 21 04:43:47 krispykreme.cs.umd.edu sshd-session[1379824]: error: kex_protocol_error: type 30 seq 5 [preauth]
Aug 21 04:43:50 krispykreme.cs.umd.edu sshd-session[1379824]: error: kex_protocol_error: type 20 seq 6 [preauth]
Aug 21 04:43:50 krispykreme.cs.umd.edu sshd-session[1379824]: error: kex_protocol_error: type 30 seq 7 [preauth]
== matrix (12 distinct, 13 total) ==
Aug 21 04:22:59 matrix systemd[1]: networkd-dispatcher.service: Got notification message from PID 3140268, but reception only permitted for main PID 720
Aug 21 04:22:59 matrix systemd[1]: networkd-dispatcher.service: Got notification message from PID 3140280, but reception only permitted for main PID 720
Aug 21 04:23:07 matrix systemd[1]: networkd-dispatcher.service: Got notification message from PID 3140373, but reception only permitted for main PID 720
Aug 21 04:23:07 matrix systemd[1]: networkd-dispatcher.service: Got notification message from PID 3140378, but reception only permitted for main PID 720
Aug 21 04:23:07 matrix networkctl[3140388]: Interface "veth106ee82" not found.
Aug 21 04:23:07 matrix systemd[1]: networkd-dispatcher.service: Got notification message from PID 3140388, but reception only permitted for main PID 720
Aug 21 04:23:07 matrix systemd[1]: networkd-dispatcher.service: Got notification message from PID 3140451, but reception only permitted for main PID 720
Aug 21 04:23:07 matrix systemd[1]: networkd-dispatcher.service: Got notification message from PID 3140459, but reception only permitted for main PID 720
Aug 21 04:25:26 matrix systemd[1]: networkd-dispatcher.service: Got notification message from PID 3142239, but reception only permitted for main PID 720
Aug 21 04:25:26 matrix systemd[1]: networkd-dispatcher.service: Got notification message from PID 3142245, but reception only permitted for main PID 720
Aug 21 04:25:26 matrix networkctl[3142258]: Interface "vethad6b78b" not found.
Aug 21 04:25:26 matrix systemd[1]: networkd-dispatcher.service: Got notification message from PID 3142258, but reception only permitted for main PID 720 [x2]
== newhonors2 (1 distinct, 24 total) ==
Aug 21 04:13:03 newhonors2 dhcpcd[1507272]: dhcpcd is not running [x24]
== outbound00.cs.umd.edu (1 distinct, 6 total) ==
Aug 21 04:09:09 outbound00.cs.umd.edu python3[111017]: ldapdb [x6]
== outbound01.cs.umd.edu (1 distinct, 6 total) ==
Aug 21 04:13:06 outbound01.cs.umd.edu python3[2344952]: ldapdb [x6]
== sentry-docker00.cs.umd.edu (38 distinct, 38 total) ==
Aug 21 04:15:58 sentry-docker00.cs.umd.edu systemd-udevd[477692]: link_config: could not get ethtool features for vethd5359f6
Aug 21 04:15:58 sentry-docker00.cs.umd.edu systemd-udevd[477692]: Could not set offload features of vethd5359f6: No such device
Aug 21 04:16:00 sentry-docker00.cs.umd.edu systemd-udevd[477816]: Could not generate persistent MAC address for vethbbb3db3: No such file or directory
Aug 21 04:16:00 sentry-docker00.cs.umd.edu systemd-udevd[477817]: Could not generate persistent MAC address for vethe793541: No such file or directory
Aug 21 04:16:00 sentry-docker00.cs.umd.edu systemd-udevd[477820]: Could not generate persistent MAC address for vethba40932: No such file or directory
Aug 21 04:16:00 sentry-docker00.cs.umd.edu systemd-udevd[477821]: Could not generate persistent MAC address for vethc85e00e: No such file or directory
Aug 21 04:16:00 sentry-docker00.cs.umd.edu systemd-udevd[477823]: Could not generate persistent MAC address for veth73002b7: No such file or directory
Aug 21 04:16:00 sentry-docker00.cs.umd.edu systemd-udevd[477833]: Could not generate persistent MAC address for veth85293a0: No such file or directory
Aug 21 04:16:00 sentry-docker00.cs.umd.edu systemd-udevd[477846]: Could not generate persistent MAC address for veth573ecda: No such file or directory
Aug 21 04:16:00 sentry-docker00.cs.umd.edu systemd-udevd[477847]: Could not generate persistent MAC address for veth13c4a46: No such file or directory
Aug 21 04:16:00 sentry-docker00.cs.umd.edu systemd-udevd[477876]: Could not generate persistent MAC address for veth872bb54: No such file or directory
Aug 21 04:16:00 sentry-docker00.cs.umd.edu systemd-udevd[477878]: Could not generate persistent MAC address for vethc56f67a: No such file or directory
Aug 21 04:36:07 sentry-docker00.cs.umd.edu systemd-udevd[487261]: link_config: could not get ethtool features for veth85293a0
Aug 21 04:36:07 sentry-docker00.cs.umd.edu systemd-udevd[487261]: Could not set offload features of veth85293a0: No such device
Aug 21 04:36:07 sentry-docker00.cs.umd.edu systemd-udevd[487273]: link_config: could not get ethtool features for veth573ecda
Aug 21 04:36:07 sentry-docker00.cs.umd.edu systemd-udevd[487273]: Could not set offload features of veth573ecda: No such device
Aug 21 04:36:07 sentry-docker00.cs.umd.edu systemd-udevd[487304]: Could not generate persistent MAC address for vethf55f3a2: No such file or directory
Aug 21 04:36:07 sentry-docker00.cs.umd.edu systemd-udevd[487305]: Could not generate persistent MAC address for veth08380db: No such file or directory
Aug 21 04:36:07 sentry-docker00.cs.umd.edu systemd-udevd[487308]: Could not generate persistent MAC address for vethad78309: No such file or directory
Aug 21 04:36:07 sentry-docker00.cs.umd.edu systemd-udevd[487309]: Could not generate persistent MAC address for vethb5d666f: No such file or directory
Aug 21 04:36:07 sentry-docker00.cs.umd.edu systemd-udevd[487318]: Could not generate persistent MAC address for veth7103181: No such file or directory
Aug 21 04:36:07 sentry-docker00.cs.umd.edu systemd-udevd[487327]: Could not generate persistent MAC address for vethedda68a: No such file or directory
Aug 21 04:36:07 sentry-docker00.cs.umd.edu systemd-udevd[487329]: Could not generate persistent MAC address for vethf7eba65: No such file or directory
Aug 21 04:36:07 sentry-docker00.cs.umd.edu systemd-udevd[487319]: Could not generate persistent MAC address for veth2a1b0ce: No such file or directory
Aug 21 04:36:07 sentry-docker00.cs.umd.edu systemd-udevd[487327]: Could not generate persistent MAC address for veth6c7b15d: No such file or directory
Aug 21 04:36:07 sentry-docker00.cs.umd.edu systemd-udevd[487319]: Could not generate persistent MAC address for vethd4aa8c5: No such file or directory
Aug 21 04:56:15 sentry-docker00.cs.umd.edu systemd-udevd[496625]: link_config: could not get ethtool features for vethd4aa8c5
Aug 21 04:56:15 sentry-docker00.cs.umd.edu systemd-udevd[496625]: Could not set offload features of vethd4aa8c5: No such device
Aug 21 04:56:15 sentry-docker00.cs.umd.edu systemd-udevd[496651]: Could not generate persistent MAC address for veth8ff5d98: No such file or directory
Aug 21 04:56:15 sentry-docker00.cs.umd.edu systemd-udevd[496650]: Could not generate persistent MAC address for vethed46ec4: No such file or directory
... 8 more distinct messages not shown
== smokeping-slave (1 distinct, 1 total) ==
Aug 21 04:15:31 smokeping-slave nologin[2701250]: Attempted login by UNKNOWN (UID: 65534) on UNKNOWN
== strawberry (4 distinct, 10 total) ==
Aug 21 04:09:44 strawberry udisksd[1067]: Error performing housekeeping for drive /org/freedesktop/UDisks2/drives/ST2000DM001_1CH164_W1E8J5KJ: Error updating SMART data: Error sending ATA command CHECK POWER MODE: Unexpected sense data returned:#0120000: 00 00 00 00 00 00 00 00 00 00 00 00 00 00 00 00 ................#0120010: 00 00 00 00 00 00 00 00 00 00 00 00 00 00 00 00 ................#012 (g-io-error-quark, 0) [x6]
Aug 21 04:15:04 strawberry nologin[709590]: Attempted login by UNKNOWN (UID: 65534) on UNKNOWN
Aug 21 04:15:04 strawberry pipewire[709589]: mod.jackdbus-detect: Failed to receive jackdbus reply: org.freedesktop.DBus.Error.ServiceUnknown: The name org.jackaudio.service was not provided by any .service files
Aug 21 04:34:42 strawberry smartd[5314]: Device: /dev/sda [SAT], failed to read SMART Attribute Data [x2]
1
0
Command: /usr/local/sbin/syslog-digest.py
Time : 0.0455s
Status : exited 0
Output :
Syslog digest — 2026-08-21 04:05 EDT
Processed 1,943 lines, filtered 1,665 (85%). 278 unknown (70 distinct) from 17 host(s).
== b0b02.cs.umd.edu (1 distinct, 1 total) ==
Aug 21 03:06:51 b0b02.cs.umd.edu rustdesk[512693]: cannot open display:
== biggulp.cs.umd.edu (6 distinct, 6 total) ==
Aug 21 03:29:45 biggulp.cs.umd.edu sshd-session[3124560]: error: kex_protocol_error: type 20 seq 2 [preauth]
Aug 21 03:29:45 biggulp.cs.umd.edu sshd-session[3124560]: error: kex_protocol_error: type 30 seq 3 [preauth]
Aug 21 03:29:46 biggulp.cs.umd.edu sshd-session[3124560]: error: kex_protocol_error: type 20 seq 4 [preauth]
Aug 21 03:29:46 biggulp.cs.umd.edu sshd-session[3124560]: error: kex_protocol_error: type 30 seq 5 [preauth]
Aug 21 03:29:48 biggulp.cs.umd.edu sshd-session[3124560]: error: kex_protocol_error: type 20 seq 6 [preauth]
Aug 21 03:29:48 biggulp.cs.umd.edu sshd-session[3124560]: error: kex_protocol_error: type 30 seq 7 [preauth]
== cheezit.cs.umd.edu (6 distinct, 6 total) ==
Aug 21 03:30:08 cheezit.cs.umd.edu sshd-session[2651189]: error: kex_protocol_error: type 20 seq 2 [preauth]
Aug 21 03:30:08 cheezit.cs.umd.edu sshd-session[2651189]: error: kex_protocol_error: type 30 seq 3 [preauth]
Aug 21 03:30:08 cheezit.cs.umd.edu sshd-session[2651189]: error: kex_protocol_error: type 20 seq 4 [preauth]
Aug 21 03:30:08 cheezit.cs.umd.edu sshd-session[2651189]: error: kex_protocol_error: type 30 seq 5 [preauth]
Aug 21 03:30:10 cheezit.cs.umd.edu sshd-session[2651189]: error: kex_protocol_error: type 20 seq 6 [preauth]
Aug 21 03:30:10 cheezit.cs.umd.edu sshd-session[2651189]: error: kex_protocol_error: type 30 seq 7 [preauth]
== csfw00a (1 distinct, 119 total) ==
Aug 21 03:05:01 csfw00a kernel: bnxt_en 0000:09:00.0 eth3: NIC Link is Down [x119]
== hackerman (1 distinct, 1 total) ==
Aug 21 03:19:01 hackerman gnome-software[2060381]: failed to commit changes to dconf: GDBus.Error:org.gtk.GDBus.UnmappedGError.Quark._g_2dfile_2derror_2dquark.Code2: Failed to create file “/adminhomes/sajith/.config/dconf/user.7HUHU3”: Permission denied
== idm00 (1 distinct, 1 total) ==
Aug 21 03:51:38 idm00 named[3810278]: client @0x7f48d8001508 10.73.240.42#55835: update '73.10.in-addr.arpa/IN' denied
== idmp0 (1 distinct, 1 total) ==
Aug 21 03:35:57 idmp0 named[1121900]: client @0x7fe3e0023938 10.73.240.43#56701: update '73.10.in-addr.arpa/IN' denied
== itmon02 (2 distinct, 51 total) ==
Aug 21 03:07:58 itmon02 sshd[1750555]: error: beginning MaxStartups throttling [x50]
Aug 21 03:15:16 itmon02 (httpd)[2175803]: httpd.service: Referenced but unset environment variable evaluates to an empty string: OPTIONS
== itmon03 (1 distinct, 2 total) ==
Aug 21 03:20:02 itmon03 systemd-timedated[1753200]: /dev/rtc is busy. Is somebody keeping it open continuously? That's not a good idea... Returning a bogus RTC timestamp. [x2]
== kadath.cs.umd.edu (1 distinct, 1 total) ==
Aug 21 03:47:30 kadath.cs.umd.edu puppet-agent[2188695]: (Facter) invalid or malformed lldp data: MalformedDataError: no lldp interface data found
== krispykreme.cs.umd.edu (6 distinct, 6 total) ==
Aug 21 03:35:10 krispykreme.cs.umd.edu sshd-session[1362115]: error: kex_protocol_error: type 20 seq 2 [preauth]
Aug 21 03:35:10 krispykreme.cs.umd.edu sshd-session[1362115]: error: kex_protocol_error: type 30 seq 3 [preauth]
Aug 21 03:35:12 krispykreme.cs.umd.edu sshd-session[1362115]: error: kex_protocol_error: type 20 seq 4 [preauth]
Aug 21 03:35:12 krispykreme.cs.umd.edu sshd-session[1362115]: error: kex_protocol_error: type 30 seq 5 [preauth]
Aug 21 03:35:14 krispykreme.cs.umd.edu sshd-session[1362115]: error: kex_protocol_error: type 20 seq 6 [preauth]
Aug 21 03:35:14 krispykreme.cs.umd.edu sshd-session[1362115]: error: kex_protocol_error: type 30 seq 7 [preauth]
== netbox (1 distinct, 1 total) ==
Aug 21 03:08:02 netbox (httpd)[3978074]: httpd.service: Referenced but unset environment variable evaluates to an empty string: OPTIONS
== newhonors2 (1 distinct, 24 total) ==
Aug 21 03:13:03 newhonors2 dhcpcd[1504830]: dhcpcd is not running [x24]
== outbound00.cs.umd.edu (2 distinct, 8 total) ==
Aug 21 03:09:09 outbound00.cs.umd.edu python3[96362]: ldapdb [x7]
Aug 21 03:24:16 outbound00.cs.umd.edu systemd[1]: Configuration file /usr/lib/systemd/system/authentication_milter.service is marked executable. Please remove executable permission bits. Proceeding anyway.
== outbound01.cs.umd.edu (1 distinct, 6 total) ==
Aug 21 03:13:06 outbound01.cs.umd.edu python3[2330982]: ldapdb [x6]
== sentry-docker00.cs.umd.edu (36 distinct, 36 total) ==
Aug 21 03:15:33 sentry-docker00.cs.umd.edu systemd-udevd[449378]: link_config: could not get ethtool features for veth75336dd
Aug 21 03:15:33 sentry-docker00.cs.umd.edu systemd-udevd[449378]: Could not set offload features of veth75336dd: No such device
Aug 21 03:15:34 sentry-docker00.cs.umd.edu systemd-udevd[449412]: Could not generate persistent MAC address for veth51f61a1: No such file or directory
Aug 21 03:15:34 sentry-docker00.cs.umd.edu systemd-udevd[449413]: Could not generate persistent MAC address for vetha024d22: No such file or directory
Aug 21 03:15:34 sentry-docker00.cs.umd.edu systemd-udevd[449416]: Could not generate persistent MAC address for vetha373b22: No such file or directory
Aug 21 03:15:34 sentry-docker00.cs.umd.edu systemd-udevd[449436]: Could not generate persistent MAC address for veth41b6a4c: No such file or directory
Aug 21 03:15:34 sentry-docker00.cs.umd.edu systemd-udevd[449418]: Could not generate persistent MAC address for veth6318461: No such file or directory
Aug 21 03:15:34 sentry-docker00.cs.umd.edu systemd-udevd[449430]: Could not generate persistent MAC address for vethca7e9de: No such file or directory
Aug 21 03:15:34 sentry-docker00.cs.umd.edu systemd-udevd[449442]: Could not generate persistent MAC address for vetha36bf7a: No such file or directory
Aug 21 03:15:34 sentry-docker00.cs.umd.edu systemd-udevd[449443]: Could not generate persistent MAC address for veth0d98cc4: No such file or directory
Aug 21 03:15:34 sentry-docker00.cs.umd.edu systemd-udevd[449462]: Could not generate persistent MAC address for veth85ce802: No such file or directory
Aug 21 03:15:34 sentry-docker00.cs.umd.edu systemd-udevd[449461]: Could not generate persistent MAC address for veth2155974: No such file or directory
Aug 21 03:35:42 sentry-docker00.cs.umd.edu systemd-udevd[458806]: link_config: could not get ethtool features for vetha36bf7a
Aug 21 03:35:42 sentry-docker00.cs.umd.edu systemd-udevd[458806]: Could not set offload features of vetha36bf7a: No such device
Aug 21 03:35:42 sentry-docker00.cs.umd.edu systemd-udevd[458874]: Could not generate persistent MAC address for vethdb93edb: No such file or directory
Aug 21 03:35:42 sentry-docker00.cs.umd.edu systemd-udevd[458875]: Could not generate persistent MAC address for veth640e83a: No such file or directory
Aug 21 03:35:42 sentry-docker00.cs.umd.edu systemd-udevd[458901]: Could not generate persistent MAC address for veth3c86cdc: No such file or directory
Aug 21 03:35:42 sentry-docker00.cs.umd.edu systemd-udevd[458900]: Could not generate persistent MAC address for veth9ae3107: No such file or directory
Aug 21 03:35:42 sentry-docker00.cs.umd.edu systemd-udevd[458919]: Could not generate persistent MAC address for veth7cb7791: No such file or directory
Aug 21 03:35:42 sentry-docker00.cs.umd.edu systemd-udevd[458923]: Could not generate persistent MAC address for veth4c0f925: No such file or directory
Aug 21 03:35:42 sentry-docker00.cs.umd.edu systemd-udevd[458939]: Could not generate persistent MAC address for veth3f28883: No such file or directory
Aug 21 03:35:42 sentry-docker00.cs.umd.edu systemd-udevd[458948]: Could not generate persistent MAC address for veth0f02cfa: No such file or directory
Aug 21 03:35:42 sentry-docker00.cs.umd.edu systemd-udevd[458955]: Could not generate persistent MAC address for veth84e696b: No such file or directory
Aug 21 03:35:42 sentry-docker00.cs.umd.edu systemd-udevd[458971]: Could not generate persistent MAC address for vethafde9c9: No such file or directory
Aug 21 03:55:50 sentry-docker00.cs.umd.edu systemd-udevd[468244]: link_config: could not get ethtool features for veth9ae3107
Aug 21 03:55:50 sentry-docker00.cs.umd.edu systemd-udevd[468244]: Could not set offload features of veth9ae3107: No such device
Aug 21 03:55:50 sentry-docker00.cs.umd.edu systemd-udevd[468284]: Could not generate persistent MAC address for vethce470dd: No such file or directory
Aug 21 03:55:50 sentry-docker00.cs.umd.edu systemd-udevd[468285]: Could not generate persistent MAC address for veth0bbb0fe: No such file or directory
Aug 21 03:55:50 sentry-docker00.cs.umd.edu systemd-udevd[468288]: Could not generate persistent MAC address for veth888be20: No such file or directory
Aug 21 03:55:50 sentry-docker00.cs.umd.edu systemd-udevd[468289]: Could not generate persistent MAC address for veth7d8eb02: No such file or directory
... 6 more distinct messages not shown
== strawberry (2 distinct, 8 total) ==
Aug 21 03:09:44 strawberry udisksd[1067]: Error performing housekeeping for drive /org/freedesktop/UDisks2/drives/ST2000DM001_1CH164_W1E8J5KJ: Error updating SMART data: Error sending ATA command CHECK POWER MODE: Unexpected sense data returned:#0120000: 00 00 00 00 00 00 00 00 00 00 00 00 00 00 00 00 ................#0120010: 00 00 00 00 00 00 00 00 00 00 00 00 00 00 00 00 ................#012 (g-io-error-quark, 0) [x6]
Aug 21 03:34:42 strawberry smartd[5314]: Device: /dev/sda [SAT], failed to read SMART Attribute Data [x2]
1
0
Command: /usr/local/sbin/syslog-digest.py
Time : 0.0490s
Status : exited 0
Output :
Syslog digest — 2026-08-21 03:05 EDT
Processed 2,175 lines, filtered 1,807 (83%). 368 unknown (154 distinct) from 51 host(s).
== abadi-computer (2 distinct, 2 total) ==
Aug 21 02:26:18 abadi-computer falcon-sensor-bpf[529]: CrowdStrike(4): Could not retrieve DisableProxy value: c0000225
Aug 21 02:26:18 abadi-computer falcon-sensor-bpf[529]: CrowdStrike(4): ConnectWithProxy: Unable to get application proxy host from CsConfig: c0000225
== ai-course (2 distinct, 2 total) ==
Aug 21 02:31:48 ai-course falcon-sensor-bpf[2859051]: CrowdStrike(4): Could not retrieve DisableProxy value: c0000225
Aug 21 02:31:48 ai-course falcon-sensor-bpf[2859051]: CrowdStrike(4): ConnectWithProxy: Unable to get application proxy host from CsConfig: c0000225
== b0b02.cs.umd.edu (1 distinct, 1 total) ==
Aug 21 02:06:47 b0b02.cs.umd.edu rustdesk[497571]: cannot open display:
== biggulp.cs.umd.edu (8 distinct, 8 total) ==
Aug 21 02:23:37 biggulp.cs.umd.edu falcon-sensor-bpf[834]: CrowdStrike(4): Could not retrieve DisableProxy value: c0000225
Aug 21 02:23:37 biggulp.cs.umd.edu falcon-sensor-bpf[834]: CrowdStrike(4): ConnectWithProxy: Unable to get application proxy host from CsConfig: c0000225
Aug 21 02:52:30 biggulp.cs.umd.edu sshd-session[3117451]: error: kex_protocol_error: type 20 seq 2 [preauth]
Aug 21 02:52:30 biggulp.cs.umd.edu sshd-session[3117451]: error: kex_protocol_error: type 30 seq 3 [preauth]
Aug 21 02:52:31 biggulp.cs.umd.edu sshd-session[3117451]: error: kex_protocol_error: type 20 seq 4 [preauth]
Aug 21 02:52:31 biggulp.cs.umd.edu sshd-session[3117451]: error: kex_protocol_error: type 30 seq 5 [preauth]
Aug 21 02:52:33 biggulp.cs.umd.edu sshd-session[3117451]: error: kex_protocol_error: type 20 seq 6 [preauth]
Aug 21 02:52:33 biggulp.cs.umd.edu sshd-session[3117451]: error: kex_protocol_error: type 30 seq 7 [preauth]
== bigtuna (2 distinct, 2 total) ==
Aug 21 02:30:50 bigtuna falcon-sensor-bpf[876]: CrowdStrike(4): Could not retrieve DisableProxy value: c0000225
Aug 21 02:30:50 bigtuna falcon-sensor-bpf[876]: CrowdStrike(4): ConnectWithProxy: Unable to get application proxy host from CsConfig: c0000225
== borealis (2 distinct, 2 total) ==
Aug 21 02:29:38 borealis falcon-sensor-bpf[917]: CrowdStrike(4): Could not retrieve DisableProxy value: c0000225
Aug 21 02:29:38 borealis falcon-sensor-bpf[917]: CrowdStrike(4): ConnectWithProxy: Unable to get application proxy host from CsConfig: c0000225
== borogove.cs.umd.edu (2 distinct, 2 total) ==
Aug 21 02:28:30 borogove.cs.umd.edu falcon-sensor-bpf[1404]: CrowdStrike(4): Could not retrieve DisableProxy value: c0000225
Aug 21 02:28:30 borogove.cs.umd.edu falcon-sensor-bpf[1404]: CrowdStrike(4): ConnectWithProxy: Unable to get application proxy host from CsConfig: c0000225
== cheezit.cs.umd.edu (8 distinct, 8 total) ==
Aug 21 02:31:40 cheezit.cs.umd.edu sshd-session[2638318]: error: kex_protocol_error: type 20 seq 2 [preauth]
Aug 21 02:31:40 cheezit.cs.umd.edu sshd-session[2638318]: error: kex_protocol_error: type 30 seq 3 [preauth]
Aug 21 02:31:42 cheezit.cs.umd.edu sshd-session[2638318]: error: kex_protocol_error: type 20 seq 4 [preauth]
Aug 21 02:31:42 cheezit.cs.umd.edu sshd-session[2638318]: error: kex_protocol_error: type 30 seq 5 [preauth]
Aug 21 02:31:44 cheezit.cs.umd.edu sshd-session[2638318]: error: kex_protocol_error: type 20 seq 6 [preauth]
Aug 21 02:31:44 cheezit.cs.umd.edu sshd-session[2638318]: error: kex_protocol_error: type 30 seq 7 [preauth]
Aug 21 02:34:18 cheezit.cs.umd.edu falcon-sensor-bpf[1347]: CrowdStrike(4): Could not retrieve DisableProxy value: c0000225
Aug 21 02:34:18 cheezit.cs.umd.edu falcon-sensor-bpf[1347]: CrowdStrike(4): ConnectWithProxy: Unable to get application proxy host from CsConfig: c0000225
== cmsc436-0101-redis (3 distinct, 3 total) ==
Aug 21 02:45:57 cmsc436-0101-redis krb5_child[1714159]: Client 'admin(a)UMD.EDU' not found in Kerberos database
Aug 21 02:45:59 cmsc436-0101-redis sshd-session[1714155]: error: PAM: Authentication failure for admin from 34.156.216.240
Aug 21 02:46:10 cmsc436-0101-redis sshd-session[1714163]: error: Protocol major versions differ: 2 vs. 1
== csfw00a (1 distinct, 123 total) ==
Aug 21 02:04:33 csfw00a kernel: bnxt_en 0000:09:00.0 eth3: NIC Link is Down [x123]
== cskayako (2 distinct, 2 total) ==
Aug 21 02:34:01 cskayako falcon-sensor-bpf[746]: CrowdStrike(4): Could not retrieve DisableProxy value: c0000225
Aug 21 02:34:01 cskayako falcon-sensor-bpf[746]: CrowdStrike(4): ConnectWithProxy: Unable to get application proxy host from CsConfig: c0000225
== defer (2 distinct, 2 total) ==
Aug 21 02:24:09 defer falcon-sensor-bpf[811]: CrowdStrike(4): Could not retrieve DisableProxy value: c0000225
Aug 21 02:24:09 defer falcon-sensor-bpf[811]: CrowdStrike(4): ConnectWithProxy: Unable to get application proxy host from CsConfig: c0000225
== emaar (2 distinct, 2 total) ==
Aug 21 02:30:07 emaar falcon-sensor-bpf[971]: CrowdStrike(4): Could not retrieve DisableProxy value: c0000225
Aug 21 02:30:07 emaar falcon-sensor-bpf[971]: CrowdStrike(4): ConnectWithProxy: Unable to get application proxy host from CsConfig: c0000225
== frozone (2 distinct, 2 total) ==
Aug 21 02:35:03 frozone falcon-sensor-bpf[1052]: CrowdStrike(4): Could not retrieve DisableProxy value: c0000225
Aug 21 02:35:03 frozone falcon-sensor-bpf[1052]: CrowdStrike(4): ConnectWithProxy: Unable to get application proxy host from CsConfig: c0000225
== galahad.cs.umd.edu (2 distinct, 2 total) ==
Aug 21 02:17:00 galahad.cs.umd.edu falcon-sensor-bpf[970]: CrowdStrike(4): Could not retrieve DisableProxy value: c0000225
Aug 21 02:17:00 galahad.cs.umd.edu falcon-sensor-bpf[970]: CrowdStrike(4): ConnectWithProxy: Unable to get application proxy host from CsConfig: c0000225
== gle-omnibus00.cs.umd.edu (2 distinct, 2 total) ==
Aug 21 02:31:23 gle-omnibus00.cs.umd.edu falcon-sensor-bpf[974]: CrowdStrike(4): Could not retrieve DisableProxy value: c0000225
Aug 21 02:31:23 gle-omnibus00.cs.umd.edu falcon-sensor-bpf[974]: CrowdStrike(4): ConnectWithProxy: Unable to get application proxy host from CsConfig: c0000225
== hackerman (2 distinct, 2 total) ==
Aug 21 02:12:21 hackerman falcon-sensor-bpf[896]: CrowdStrike(4): Could not retrieve DisableProxy value: c0000225
Aug 21 02:12:21 hackerman falcon-sensor-bpf[896]: CrowdStrike(4): ConnectWithProxy: Unable to get application proxy host from CsConfig: c0000225
== haproxy02.cs.umd.edu (2 distinct, 2 total) ==
Aug 21 02:17:14 haproxy02.cs.umd.edu falcon-sensor-bpf[990]: CrowdStrike(4): Could not retrieve DisableProxy value: c0000225
Aug 21 02:17:14 haproxy02.cs.umd.edu falcon-sensor-bpf[990]: CrowdStrike(4): ConnectWithProxy: Unable to get application proxy host from CsConfig: c0000225
== haproxy03.cs.umd.edu (2 distinct, 2 total) ==
Aug 21 02:40:15 haproxy03.cs.umd.edu falcon-sensor-bpf[1401]: CrowdStrike(4): Could not retrieve DisableProxy value: c0000225
Aug 21 02:40:15 haproxy03.cs.umd.edu falcon-sensor-bpf[1401]: CrowdStrike(4): ConnectWithProxy: Unable to get application proxy host from CsConfig: c0000225
== hasaraumd (2 distinct, 2 total) ==
Aug 21 02:14:33 hasaraumd falcon-sensor-bpf[730]: CrowdStrike(4): Could not retrieve DisableProxy value: c0000225
Aug 21 02:14:33 hasaraumd falcon-sensor-bpf[730]: CrowdStrike(4): ConnectWithProxy: Unable to get application proxy host from CsConfig: c0000225
== hspc (2 distinct, 2 total) ==
Aug 21 02:35:13 hspc falcon-sensor-bpf[1008]: CrowdStrike(4): Could not retrieve DisableProxy value: c0000225
Aug 21 02:35:13 hspc falcon-sensor-bpf[1008]: CrowdStrike(4): ConnectWithProxy: Unable to get application proxy host from CsConfig: c0000225
== idm00 (1 distinct, 1 total) ==
Aug 21 02:51:38 idm00 named[3810278]: client @0x7f48d402a4b8 10.73.240.42#51401: update '73.10.in-addr.arpa/IN' denied
== idmp0 (1 distinct, 1 total) ==
Aug 21 02:35:57 idmp0 named[1121900]: client @0x7fe3f402e768 10.73.240.43#62657: update '73.10.in-addr.arpa/IN' denied
== inbound00.cs.umd.edu (2 distinct, 2 total) ==
Aug 21 02:50:14 inbound00.cs.umd.edu krb5_child[155298]: Client 'admin(a)UMD.EDU' not found in Kerberos database
Aug 21 02:50:32 inbound00.cs.umd.edu sshd-session[155425]: error: Protocol major versions differ: 2 vs. 1
== irb2156 (2 distinct, 2 total) ==
Aug 21 02:30:30 irb2156 falcon-sensor-bpf[3792]: CrowdStrike(4): Could not retrieve DisableProxy value: c0000225
Aug 21 02:30:30 irb2156 falcon-sensor-bpf[3792]: CrowdStrike(4): ConnectWithProxy: Unable to get application proxy host from CsConfig: c0000225
== itmon02 (1 distinct, 52 total) ==
Aug 21 02:07:48 itmon02 sshd[1750555]: error: beginning MaxStartups throttling [x52]
== itmon03 (1 distinct, 2 total) ==
Aug 21 02:20:02 itmon03 systemd-timedated[1750243]: /dev/rtc is busy. Is somebody keeping it open continuously? That's not a good idea... Returning a bogus RTC timestamp. [x2]
== jaws.cs.umd.edu (2 distinct, 2 total) ==
Aug 21 02:17:15 jaws.cs.umd.edu falcon-sensor-bpf[1192]: CrowdStrike(4): Could not retrieve DisableProxy value: c0000225
Aug 21 02:17:15 jaws.cs.umd.edu falcon-sensor-bpf[1192]: CrowdStrike(4): ConnectWithProxy: Unable to get application proxy host from CsConfig: c0000225
== kadath.cs.umd.edu (2 distinct, 2 total) ==
Aug 21 02:22:26 kadath.cs.umd.edu falcon-sensor-bpf[938]: CrowdStrike(4): Could not retrieve DisableProxy value: c0000225
Aug 21 02:22:26 kadath.cs.umd.edu falcon-sensor-bpf[938]: CrowdStrike(4): ConnectWithProxy: Unable to get application proxy host from CsConfig: c0000225
== krispykreme.cs.umd.edu (8 distinct, 8 total) ==
Aug 21 02:36:56 krispykreme.cs.umd.edu falcon-sensor-bpf[1298]: CrowdStrike(4): Could not retrieve DisableProxy value: c0000225
Aug 21 02:36:56 krispykreme.cs.umd.edu falcon-sensor-bpf[1298]: CrowdStrike(4): ConnectWithProxy: Unable to get application proxy host from CsConfig: c0000225
Aug 21 02:49:39 krispykreme.cs.umd.edu sshd-session[1349191]: error: kex_protocol_error: type 20 seq 2 [preauth]
Aug 21 02:49:39 krispykreme.cs.umd.edu sshd-session[1349191]: error: kex_protocol_error: type 30 seq 3 [preauth]
Aug 21 02:49:41 krispykreme.cs.umd.edu sshd-session[1349191]: error: kex_protocol_error: type 20 seq 4 [preauth]
Aug 21 02:49:41 krispykreme.cs.umd.edu sshd-session[1349191]: error: kex_protocol_error: type 30 seq 5 [preauth]
Aug 21 02:49:42 krispykreme.cs.umd.edu sshd-session[1349191]: error: kex_protocol_error: type 20 seq 6 [preauth]
Aug 21 02:49:42 krispykreme.cs.umd.edu sshd-session[1349191]: error: kex_protocol_error: type 30 seq 7 [preauth]
== mashie (2 distinct, 2 total) ==
Aug 21 02:35:44 mashie falcon-sensor-bpf[786]: CrowdStrike(4): Could not retrieve DisableProxy value: c0000225
Aug 21 02:35:44 mashie falcon-sensor-bpf[786]: CrowdStrike(4): ConnectWithProxy: Unable to get application proxy host from CsConfig: c0000225
== matrix (3 distinct, 4 total) ==
Aug 21 02:49:43 matrix krb5_child[3085034]: Client 'admin(a)UMD.EDU' not found in Kerberos database [x2]
Aug 21 02:49:45 matrix sshd[3085028]: error: PAM: Authentication failure for admin from 207.175.46.217
Aug 21 02:50:37 matrix sshd[3086289]: error: Protocol major versions differ: 2 vs. 1
== neodontcare.cs.umd.edu (2 distinct, 2 total) ==
Aug 21 02:40:37 neodontcare.cs.umd.edu falcon-sensor-bpf[950]: CrowdStrike(4): Could not retrieve DisableProxy value: c0000225
Aug 21 02:40:37 neodontcare.cs.umd.edu falcon-sensor-bpf[950]: CrowdStrike(4): ConnectWithProxy: Unable to get application proxy host from CsConfig: c0000225
== neograd (2 distinct, 2 total) ==
Aug 21 02:30:11 neograd falcon-sensor-bpf[697]: CrowdStrike(4): Could not retrieve DisableProxy value: c0000225
Aug 21 02:30:11 neograd falcon-sensor-bpf[697]: CrowdStrike(4): ConnectWithProxy: Unable to get application proxy host from CsConfig: c0000225
== netman.cs.umd.edu (2 distinct, 2 total) ==
Aug 21 02:38:48 netman.cs.umd.edu falcon-sensor-bpf[1129]: CrowdStrike(4): Could not retrieve DisableProxy value: c0000225
Aug 21 02:38:48 netman.cs.umd.edu falcon-sensor-bpf[1129]: CrowdStrike(4): ConnectWithProxy: Unable to get application proxy host from CsConfig: c0000225
== networkvm01.cs.umd.edu (9 distinct, 9 total) ==
Aug 21 02:32:58 networkvm01.cs.umd.edu setroubleshoot[1794465]: SELinux is preventing /usr/bin/gpg from write access on the directory /(null). For complete SELinux messages run: sealert -l 8ead1354-ae8a-4a17-bb3f-146ebf6c892c
Aug 21 02:32:58 networkvm01.cs.umd.edu setroubleshoot[1794465]: SELinux is preventing /usr/bin/gpg from add_name access on the directory /(null). For complete SELinux messages run: sealert -l f9b51e91-5dbc-455f-88c2-f0746a2f0f4c
Aug 21 02:32:58 networkvm01.cs.umd.edu setroubleshoot[1794465]: SELinux is preventing /usr/bin/gpg from create access on the file /(null). For complete SELinux messages run: sealert -l af0a60e6-c449-4bdd-bfb8-c69b58472884
Aug 21 02:32:58 networkvm01.cs.umd.edu setroubleshoot[1794465]: SELinux is preventing /usr/bin/gpg from link access on the file /(null). For complete SELinux messages run: sealert -l 3df452f6-4d9e-4e38-946b-ea8e1edd356c
Aug 21 02:32:58 networkvm01.cs.umd.edu setroubleshoot[1794465]: SELinux is preventing /usr/bin/gpg from remove_name access on the directory .#lk0x0000556a405d8ed0.networkvm01.cs.umd.edu.1794464x. For complete SELinux messages run: sealert -l fcac71c9-c7c0-45a9-9dc2-a8dcbeccfc75
Aug 21 02:32:58 networkvm01.cs.umd.edu setroubleshoot[1794465]: SELinux is preventing /usr/bin/gpg from unlink access on the file .#lk0x0000556a405d8ed0.networkvm01.cs.umd.edu.1794464x. For complete SELinux messages run: sealert -l a672ebb7-fa69-419c-b1f0-fb386b8b48a6
Aug 21 02:32:58 networkvm01.cs.umd.edu setroubleshoot[1794465]: SELinux is preventing /usr/bin/gpg from write access on the directory /(null). For complete SELinux messages run: sealert -l fec9104e-d27a-4fd4-9872-6b17088c2951
Aug 21 02:32:58 networkvm01.cs.umd.edu setroubleshoot[1794465]: SELinux is preventing /usr/bin/gpg from add_name access on the directory /(null). For complete SELinux messages run: sealert -l 26718b2a-493d-457d-818c-244bd8d4ec9d
Aug 21 02:32:59 networkvm01.cs.umd.edu setroubleshoot[1794465]: SELinux is preventing /usr/bin/gpg from remove_name access on the directory .#lk0x0000559ae3ae1ee0.networkvm01.cs.umd.edu.1794482x. For complete SELinux messages run: sealert -l 80e6efe4-93f3-4219-8132-b2b52db1f517
== newhonors2 (1 distinct, 24 total) ==
Aug 21 02:13:02 newhonors2 dhcpcd[1502985]: dhcpcd is not running [x24]
== nightingale (2 distinct, 2 total) ==
Aug 21 02:21:44 nightingale falcon-sensor-bpf[909]: CrowdStrike(4): Could not retrieve DisableProxy value: c0000225
Aug 21 02:21:44 nightingale falcon-sensor-bpf[909]: CrowdStrike(4): ConnectWithProxy: Unable to get application proxy host from CsConfig: c0000225
== orchids (2 distinct, 2 total) ==
Aug 21 02:11:37 orchids falcon-sensor-bpf[1099]: CrowdStrike(4): Could not retrieve DisableProxy value: c0000225
Aug 21 02:11:37 orchids falcon-sensor-bpf[1099]: CrowdStrike(4): ConnectWithProxy: Unable to get application proxy host from CsConfig: c0000225
== outbound00.cs.umd.edu (1 distinct, 6 total) ==
Aug 21 02:09:09 outbound00.cs.umd.edu python3[82295]: ldapdb [x6]
== outbound01.cs.umd.edu (1 distinct, 6 total) ==
Aug 21 02:13:06 outbound01.cs.umd.edu python3[2317015]: ldapdb [x6]
== quiss (2 distinct, 2 total) ==
Aug 21 02:35:49 quiss falcon-sensor-bpf[1284]: CrowdStrike(4): Could not retrieve DisableProxy value: c0000225
Aug 21 02:35:49 quiss falcon-sensor-bpf[1284]: CrowdStrike(4): ConnectWithProxy: Unable to get application proxy host from CsConfig: c0000225
== sentry-docker00.cs.umd.edu (32 distinct, 32 total) ==
Aug 21 02:15:09 sentry-docker00.cs.umd.edu systemd-udevd[420221]: Could not generate persistent MAC address for vethed2fc94: No such file or directory
Aug 21 02:15:09 sentry-docker00.cs.umd.edu systemd-udevd[420222]: Could not generate persistent MAC address for veth79b4270: No such file or directory
Aug 21 02:15:09 sentry-docker00.cs.umd.edu systemd-udevd[420225]: Could not generate persistent MAC address for veth43ac774: No such file or directory
Aug 21 02:15:09 sentry-docker00.cs.umd.edu systemd-udevd[420226]: Could not generate persistent MAC address for vethccd9c58: No such file or directory
Aug 21 02:15:09 sentry-docker00.cs.umd.edu systemd-udevd[420247]: Could not generate persistent MAC address for veth17c5f19: No such file or directory
Aug 21 02:15:09 sentry-docker00.cs.umd.edu systemd-udevd[420242]: Could not generate persistent MAC address for veth3580589: No such file or directory
Aug 21 02:15:09 sentry-docker00.cs.umd.edu systemd-udevd[420252]: Could not generate persistent MAC address for vethbe417e3: No such file or directory
Aug 21 02:15:09 sentry-docker00.cs.umd.edu systemd-udevd[420251]: Could not generate persistent MAC address for vethe5528f6: No such file or directory
Aug 21 02:15:09 sentry-docker00.cs.umd.edu systemd-udevd[420310]: Could not generate persistent MAC address for veth9b4c374: No such file or directory
Aug 21 02:15:09 sentry-docker00.cs.umd.edu systemd-udevd[420316]: Could not generate persistent MAC address for veth8bb3f8e: No such file or directory
Aug 21 02:35:17 sentry-docker00.cs.umd.edu systemd-udevd[430254]: Could not generate persistent MAC address for vethbdcec22: No such file or directory
Aug 21 02:35:17 sentry-docker00.cs.umd.edu systemd-udevd[430255]: Could not generate persistent MAC address for veth69aed2d: No such file or directory
Aug 21 02:35:17 sentry-docker00.cs.umd.edu systemd-udevd[430285]: Could not generate persistent MAC address for vetha3a89ca: No such file or directory
Aug 21 02:35:17 sentry-docker00.cs.umd.edu systemd-udevd[430286]: Could not generate persistent MAC address for vethf45b790: No such file or directory
Aug 21 02:35:17 sentry-docker00.cs.umd.edu systemd-udevd[430289]: Could not generate persistent MAC address for vethf7b0c8f: No such file or directory
Aug 21 02:35:17 sentry-docker00.cs.umd.edu systemd-udevd[430290]: Could not generate persistent MAC address for veth1956654: No such file or directory
Aug 21 02:35:17 sentry-docker00.cs.umd.edu systemd-udevd[430314]: Could not generate persistent MAC address for veth2edb033: No such file or directory
Aug 21 02:35:17 sentry-docker00.cs.umd.edu systemd-udevd[430315]: Could not generate persistent MAC address for veth0a89084: No such file or directory
Aug 21 02:35:17 sentry-docker00.cs.umd.edu systemd-udevd[430318]: Could not generate persistent MAC address for vetheda269b: No such file or directory
Aug 21 02:35:17 sentry-docker00.cs.umd.edu systemd-udevd[430323]: Could not generate persistent MAC address for veth7888401: No such file or directory
Aug 21 02:55:25 sentry-docker00.cs.umd.edu systemd-udevd[439902]: link_config: could not get ethtool features for veth2edb033
Aug 21 02:55:25 sentry-docker00.cs.umd.edu systemd-udevd[439902]: Could not set offload features of veth2edb033: No such device
Aug 21 02:55:25 sentry-docker00.cs.umd.edu systemd-udevd[440029]: Could not generate persistent MAC address for veth14e3c6b: No such file or directory
Aug 21 02:55:25 sentry-docker00.cs.umd.edu systemd-udevd[440030]: Could not generate persistent MAC address for veth4bbb9cf: No such file or directory
Aug 21 02:55:25 sentry-docker00.cs.umd.edu systemd-udevd[440048]: Could not generate persistent MAC address for vethf754df1: No such file or directory
Aug 21 02:55:25 sentry-docker00.cs.umd.edu systemd-udevd[440030]: Could not generate persistent MAC address for vethb3e2b64: No such file or directory
Aug 21 02:55:25 sentry-docker00.cs.umd.edu systemd-udevd[440034]: Could not generate persistent MAC address for veth75336dd: No such file or directory
Aug 21 02:55:25 sentry-docker00.cs.umd.edu systemd-udevd[440046]: Could not generate persistent MAC address for veth500c983: No such file or directory
Aug 21 02:55:25 sentry-docker00.cs.umd.edu systemd-udevd[440059]: Could not generate persistent MAC address for vethfee7706: No such file or directory
Aug 21 02:55:25 sentry-docker00.cs.umd.edu systemd-udevd[440060]: Could not generate persistent MAC address for veth6520c4c: No such file or directory
... 2 more distinct messages not shown
== strawberry (4 distinct, 10 total) ==
Aug 21 02:09:44 strawberry udisksd[1067]: Error performing housekeeping for drive /org/freedesktop/UDisks2/drives/ST2000DM001_1CH164_W1E8J5KJ: Error updating SMART data: Error sending ATA command CHECK POWER MODE: Unexpected sense data returned:#0120000: 00 00 00 00 00 00 00 00 00 00 00 00 00 00 00 00 ................#0120010: 00 00 00 00 00 00 00 00 00 00 00 00 00 00 00 00 ................#012 (g-io-error-quark, 0) [x6]
Aug 21 02:11:22 strawberry falcon-sensor-bpf[808]: CrowdStrike(4): Could not retrieve DisableProxy value: c0000225
Aug 21 02:11:22 strawberry falcon-sensor-bpf[808]: CrowdStrike(4): ConnectWithProxy: Unable to get application proxy host from CsConfig: c0000225
Aug 21 02:34:42 strawberry smartd[5314]: Device: /dev/sda [SAT], failed to read SMART Attribute Data [x2]
== stuckeys (2 distinct, 2 total) ==
Aug 21 02:35:03 stuckeys falcon-sensor-bpf[1493]: CrowdStrike(4): Could not retrieve DisableProxy value: c0000225
Aug 21 02:35:03 stuckeys falcon-sensor-bpf[1493]: CrowdStrike(4): ConnectWithProxy: Unable to get application proxy host from CsConfig: c0000225
== talkhosts9 (2 distinct, 2 total) ==
Aug 21 02:17:18 talkhosts9 falcon-sensor-bpf[714]: CrowdStrike(4): Could not retrieve DisableProxy value: c0000225
Aug 21 02:17:18 talkhosts9 falcon-sensor-bpf[714]: CrowdStrike(4): ConnectWithProxy: Unable to get application proxy host from CsConfig: c0000225
== teaching-awards (4 distinct, 4 total) ==
Aug 21 02:12:23 teaching-awards falcon-sensor-bpf[782]: CrowdStrike(4): Could not retrieve DisableProxy value: c0000225
Aug 21 02:12:23 teaching-awards falcon-sensor-bpf[782]: CrowdStrike(4): ConnectWithProxy: Unable to get application proxy host from CsConfig: c0000225
Aug 21 02:12:35 teaching-awards krb5_child[3238482]: Client 'admin(a)UMD.EDU' not found in Kerberos database
Aug 21 02:12:48 teaching-awards sshd-session[3238489]: error: Protocol major versions differ: 2 vs. 1
== tulgey.cs.umd.edu (2 distinct, 2 total) ==
Aug 21 02:31:31 tulgey.cs.umd.edu falcon-sensor-bpf[1526]: CrowdStrike(4): Could not retrieve DisableProxy value: c0000225
Aug 21 02:31:31 tulgey.cs.umd.edu falcon-sensor-bpf[1526]: CrowdStrike(4): ConnectWithProxy: Unable to get application proxy host from CsConfig: c0000225
== tumtum.cs.umd.edu (2 distinct, 2 total) ==
Aug 21 02:18:01 tumtum.cs.umd.edu falcon-sensor-bpf[1360]: CrowdStrike(4): Could not retrieve DisableProxy value: c0000225
Aug 21 02:18:01 tumtum.cs.umd.edu falcon-sensor-bpf[1360]: CrowdStrike(4): ConnectWithProxy: Unable to get application proxy host from CsConfig: c0000225
== yogurt (2 distinct, 2 total) ==
Aug 21 02:29:09 yogurt falcon-sensor-bpf[947]: CrowdStrike(4): Could not retrieve DisableProxy value: c0000225
Aug 21 02:29:09 yogurt falcon-sensor-bpf[947]: CrowdStrike(4): ConnectWithProxy: Unable to get application proxy host from CsConfig: c0000225
== zwicker-computer (2 distinct, 2 total) ==
Aug 21 02:18:48 zwicker-computer falcon-sensor-bpf[718]: CrowdStrike(4): Could not retrieve DisableProxy value: c0000225
Aug 21 02:18:48 zwicker-computer falcon-sensor-bpf[718]: CrowdStrike(4): ConnectWithProxy: Unable to get application proxy host from CsConfig: c0000225
1
0
Command: /usr/local/sbin/syslog-digest.py
Time : 0.0501s
Status : exited 0
Output :
Syslog digest — 2026-08-21 02:05 EDT
Processed 2,774 lines, filtered 2,405 (86%). 369 unknown (72 distinct) from 17 host(s).
== atif01.cs.umd.edu (4 distinct, 4 total) ==
Aug 21 01:31:21 atif01.cs.umd.edu kernel: net_ratelimit: 14 callbacks suppressed
Aug 21 01:43:26 atif01.cs.umd.edu kernel: net_ratelimit: 32 callbacks suppressed
Aug 21 02:04:23 atif01.cs.umd.edu xinetd[10230]: warning: can't get client address: Connection reset by peer
Aug 21 02:04:24 atif01.cs.umd.edu kernel: nfsd: peername failed (err 107)!
== b0b02.cs.umd.edu (1 distinct, 1 total) ==
Aug 21 01:06:44 b0b02.cs.umd.edu rustdesk[482499]: cannot open display:
== csfw00a (1 distinct, 147 total) ==
Aug 21 01:04:21 csfw00a kernel: bnxt_en 0000:09:00.0 eth3: NIC Link is Down [x147]
== hackerman (1 distinct, 1 total) ==
Aug 21 01:19:01 hackerman gnome-software[2060381]: failed to commit changes to dconf: GDBus.Error:org.gtk.GDBus.UnmappedGError.Quark._g_2dfile_2derror_2dquark.Code2: Failed to create file “/adminhomes/sajith/.config/dconf/user.F2LJU3”: Permission denied
== hazfs.cs.umd.edu (11 distinct, 66 total) ==
Aug 21 01:56:06 hazfs.cs.umd.edu snmpd[1431]: send response: Failure in sendto [x6]
Aug 21 01:56:06 hazfs.cs.umd.edu snmpd[1431]: -- NET-SNMP-EXTEND-MIB::nsExtendStatus."userweb" [x6]
Aug 21 01:56:06 hazfs.cs.umd.edu snmpd[1431]: -- NET-SNMP-EXTEND-MIB::nsExtendStatus."zfslist" [x6]
Aug 21 01:56:06 hazfs.cs.umd.edu snmpd[1431]: -- NET-SNMP-EXTEND-MIB::nsExtendStatus."userhome" [x6]
Aug 21 01:56:06 hazfs.cs.umd.edu snmpd[1431]: -- NET-SNMP-EXTEND-MIB::nsExtendOutput1Line."userweb" [x6]
Aug 21 01:56:06 hazfs.cs.umd.edu snmpd[1431]: -- NET-SNMP-EXTEND-MIB::nsExtendOutput1Line."zfslist" [x6]
Aug 21 01:56:06 hazfs.cs.umd.edu snmpd[1431]: -- NET-SNMP-EXTEND-MIB::nsExtendOutput1Line."userhome" [x6]
Aug 21 01:56:06 hazfs.cs.umd.edu snmpd[1431]: -- NET-SNMP-EXTEND-MIB::nsExtendOutputFull."userweb" [x6]
Aug 21 01:56:06 hazfs.cs.umd.edu snmpd[1431]: -- NET-SNMP-EXTEND-MIB::nsExtendOutputFull."zfslist" [x6]
Aug 21 01:56:06 hazfs.cs.umd.edu snmpd[1431]: -- NET-SNMP-EXTEND-MIB::nsExtendOutputFull."userhome" [x6]
Aug 21 01:56:06 hazfs.cs.umd.edu snmpd[1431]: -- NET-SNMP-EXTEND-MIB::nsExtendOutNumLines."userweb" [x6]
== idm00 (2 distinct, 2 total) ==
Aug 21 01:24:28 idm00 named[3810278]: client @0x7f48d408c8c8 10.73.245.12#63840: update '73.10.in-addr.arpa/IN' denied
Aug 21 01:51:38 idm00 named[3810278]: client @0x7f48d4036628 10.73.240.42#58906: update '73.10.in-addr.arpa/IN' denied
== idmp0 (1 distinct, 1 total) ==
Aug 21 01:35:57 idmp0 named[1121900]: client @0x7fe3e0000cc8 10.73.240.43#62760: update '73.10.in-addr.arpa/IN' denied
== itmon02 (1 distinct, 53 total) ==
Aug 21 01:07:48 itmon02 sshd[1750555]: error: beginning MaxStartups throttling [x53]
== itmon03 (1 distinct, 2 total) ==
Aug 21 01:20:02 itmon03 systemd-timedated[1747260]: /dev/rtc is busy. Is somebody keeping it open continuously? That's not a good idea... Returning a bogus RTC timestamp. [x2]
== librenms-test (1 distinct, 1 total) ==
Aug 21 01:09:03 librenms-test (httpd)[16455]: httpd.service: Referenced but unset environment variable evaluates to an empty string: OPTIONS
== netman.cs.umd.edu (3 distinct, 6 total) ==
Aug 21 01:06:39 netman.cs.umd.edu sshd[3256020]: error: PAM: Authentication failure for root from 200.170.213.9
Aug 21 01:15:35 netman.cs.umd.edu journal[3258063]: /usr/share/cockpit/static/login.js/favicon.ico: Failed to open file “/usr/share/cockpit/static/login.js/favicon.ico”: open() failed: Not a directory [x4]
Aug 21 02:01:28 netman.cs.umd.edu systemd[1]: resmon.service: Supervising process 3272343 which is not our child. We'll most likely not notice when it exits.
== newhonors2 (1 distinct, 24 total) ==
Aug 21 01:13:03 newhonors2 dhcpcd[1501142]: dhcpcd is not running [x24]
== outbound00.cs.umd.edu (1 distinct, 6 total) ==
Aug 21 01:09:09 outbound00.cs.umd.edu python3[67785]: ldapdb [x6]
== outbound01.cs.umd.edu (2 distinct, 8 total) ==
Aug 21 01:13:06 outbound01.cs.umd.edu python3[2301845]: ldapdb [x6]
Aug 21 01:24:46 outbound01.cs.umd.edu cockpit-ws[2304163]: /usr/share/cockpit/static/login.js/favicon.ico: Failed to open file “/usr/share/cockpit/static/login.js/favicon.ico”: open() failed: Not a directory [x2]
== sebatinsky.cs.umd.edu (1 distinct, 1 total) ==
Aug 21 01:50:13 sebatinsky.cs.umd.edu kernel: hpet1: lost 1 rtc interrupts
== sentry-docker00.cs.umd.edu (38 distinct, 38 total) ==
Aug 21 01:14:44 sentry-docker00.cs.umd.edu systemd-udevd[391610]: link_config: could not get ethtool features for veth057eeaa
Aug 21 01:14:44 sentry-docker00.cs.umd.edu systemd-udevd[391610]: Could not set offload features of veth057eeaa: No such device
Aug 21 01:14:44 sentry-docker00.cs.umd.edu systemd-udevd[391664]: Could not generate persistent MAC address for veth45ea6f7: No such file or directory
Aug 21 01:14:44 sentry-docker00.cs.umd.edu systemd-udevd[391665]: Could not generate persistent MAC address for vethce84fc7: No such file or directory
Aug 21 01:14:44 sentry-docker00.cs.umd.edu systemd-udevd[391708]: Could not generate persistent MAC address for veth6d65ed8: No such file or directory
Aug 21 01:14:44 sentry-docker00.cs.umd.edu systemd-udevd[391709]: Could not generate persistent MAC address for veth12c01f0: No such file or directory
Aug 21 01:14:44 sentry-docker00.cs.umd.edu systemd-udevd[391734]: Could not generate persistent MAC address for vethf694ae3: No such file or directory
Aug 21 01:14:44 sentry-docker00.cs.umd.edu systemd-udevd[391735]: Could not generate persistent MAC address for vethcc791a9: No such file or directory
Aug 21 01:14:44 sentry-docker00.cs.umd.edu systemd-udevd[391753]: Could not generate persistent MAC address for vethdc77ffa: No such file or directory
Aug 21 01:14:44 sentry-docker00.cs.umd.edu systemd-udevd[391748]: Could not generate persistent MAC address for veth1d5a16d: No such file or directory
Aug 21 01:14:44 sentry-docker00.cs.umd.edu systemd-udevd[391762]: Could not generate persistent MAC address for vethd1fcf2b: No such file or directory
Aug 21 01:14:44 sentry-docker00.cs.umd.edu systemd-udevd[391763]: Could not generate persistent MAC address for vethe5eee6d: No such file or directory
Aug 21 01:34:52 sentry-docker00.cs.umd.edu systemd-udevd[401293]: link_config: could not get ethtool features for vethdc77ffa
Aug 21 01:34:52 sentry-docker00.cs.umd.edu systemd-udevd[401293]: Could not set offload features of vethdc77ffa: No such device
Aug 21 01:34:52 sentry-docker00.cs.umd.edu systemd-udevd[401325]: Could not generate persistent MAC address for vethbed9627: No such file or directory
Aug 21 01:34:52 sentry-docker00.cs.umd.edu systemd-udevd[401326]: Could not generate persistent MAC address for veth366eaf6: No such file or directory
Aug 21 01:34:52 sentry-docker00.cs.umd.edu systemd-udevd[401329]: Could not generate persistent MAC address for vethe76e7fd: No such file or directory
Aug 21 01:34:52 sentry-docker00.cs.umd.edu systemd-udevd[401330]: Could not generate persistent MAC address for veth7015df3: No such file or directory
Aug 21 01:34:52 sentry-docker00.cs.umd.edu systemd-udevd[401345]: Could not generate persistent MAC address for veth412554f: No such file or directory
Aug 21 01:34:52 sentry-docker00.cs.umd.edu systemd-udevd[401344]: Could not generate persistent MAC address for vethe526e83: No such file or directory
Aug 21 01:34:52 sentry-docker00.cs.umd.edu systemd-udevd[401340]: Could not generate persistent MAC address for veth6f3a7f7: No such file or directory
Aug 21 01:34:52 sentry-docker00.cs.umd.edu systemd-udevd[401343]: Could not generate persistent MAC address for veth3c8e537: No such file or directory
Aug 21 01:34:52 sentry-docker00.cs.umd.edu systemd-udevd[401448]: Could not generate persistent MAC address for veth2826cda: No such file or directory
Aug 21 01:34:52 sentry-docker00.cs.umd.edu systemd-udevd[401454]: Could not generate persistent MAC address for veth0777b5d: No such file or directory
Aug 21 01:55:00 sentry-docker00.cs.umd.edu systemd-udevd[410708]: link_config: could not get ethtool features for vethe76e7fd
Aug 21 01:55:00 sentry-docker00.cs.umd.edu systemd-udevd[410708]: Could not set offload features of vethe76e7fd: No such device
Aug 21 01:55:00 sentry-docker00.cs.umd.edu systemd-udevd[410710]: link_config: could not get ethtool features for veth2826cda
Aug 21 01:55:00 sentry-docker00.cs.umd.edu systemd-udevd[410710]: Could not set offload features of veth2826cda: No such device
Aug 21 01:55:01 sentry-docker00.cs.umd.edu systemd-udevd[410746]: Could not generate persistent MAC address for veth00dd042: No such file or directory
Aug 21 01:55:01 sentry-docker00.cs.umd.edu systemd-udevd[410747]: Could not generate persistent MAC address for veth9298c07: No such file or directory
... 8 more distinct messages not shown
== strawberry (2 distinct, 8 total) ==
Aug 21 01:09:44 strawberry udisksd[1067]: Error performing housekeeping for drive /org/freedesktop/UDisks2/drives/ST2000DM001_1CH164_W1E8J5KJ: Error updating SMART data: Error sending ATA command CHECK POWER MODE: Unexpected sense data returned:#0120000: 00 00 00 00 00 00 00 00 00 00 00 00 00 00 00 00 ................#0120010: 00 00 00 00 00 00 00 00 00 00 00 00 00 00 00 00 ................#012 (g-io-error-quark, 0) [x6]
Aug 21 01:34:42 strawberry smartd[5314]: Device: /dev/sda [SAT], failed to read SMART Attribute Data [x2]
1
0
Command: /usr/local/sbin/syslog-digest.py
Time : 0.0515s
Status : exited 0
Output :
Syslog digest — 2026-08-21 01:05 EDT
Processed 3,001 lines, filtered 2,656 (88%). 345 unknown (92 distinct) from 27 host(s).
== abuse (3 distinct, 4 total) ==
Aug 21 00:10:14 abuse systemd[1]: New main PID 30112 does not belong to service, and PID file is not owned by root. Refusing. [x2]
Aug 21 00:10:32 abuse systemd[1]: Daemon never wrote its PID file. Failing.
Aug 21 00:10:42 abuse systemd[1]: pmlogger.service: Supervising process 5174 which is not our child. We'll most likely not notice when it exits.
== b0b02.cs.umd.edu (1 distinct, 1 total) ==
Aug 21 00:06:41 b0b02.cs.umd.edu rustdesk[466640]: cannot open display:
== csfw00a (2 distinct, 156 total) ==
Aug 21 00:04:17 csfw00a kernel: bnxt_en 0000:09:00.0 eth3: NIC Link is Down [x154]
Aug 21 00:15:35 csfw00a ospf6d[1477]: [EC 100663307] Could not send entire message [x2]
== grades01.cs.umd.edu (3 distinct, 4 total) ==
Aug 21 00:10:14 grades01.cs.umd.edu systemd[1]: New main PID 24331 does not belong to service, and PID file is not owned by root. Refusing. [x2]
Aug 21 00:10:34 grades01.cs.umd.edu systemd[1]: Daemon never wrote its PID file. Failing.
Aug 21 00:10:50 grades01.cs.umd.edu systemd[1]: pmlogger.service: Supervising process 31529 which is not our child. We'll most likely not notice when it exits.
== idm00 (1 distinct, 1 total) ==
Aug 21 00:51:38 idm00 named[3810278]: client @0x7f48d40561e8 10.73.240.42#60250: update '73.10.in-addr.arpa/IN' denied
== idmp0 (1 distinct, 1 total) ==
Aug 21 00:35:56 idmp0 named[1121900]: client @0x7fe40802cb18 10.73.240.43#65472: update '73.10.in-addr.arpa/IN' denied
== inbound00.cs.umd.edu (1 distinct, 3 total) ==
Aug 21 01:03:00 inbound00.cs.umd.edu cockpit-ws[129858]: /usr/share/cockpit/static/login.js/favicon.ico: Failed to open file “/usr/share/cockpit/static/login.js/favicon.ico”: open() failed: Not a directory [x3]
== inbound01.cs.umd.edu (1 distinct, 2 total) ==
Aug 21 01:03:04 inbound01.cs.umd.edu cockpit-ws[2349423]: /usr/share/cockpit/static/login.js/favicon.ico: Failed to open file “/usr/share/cockpit/static/login.js/favicon.ico”: open() failed: Not a directory [x2]
== itmon02 (1 distinct, 45 total) ==
Aug 21 00:07:54 itmon02 sshd[1750555]: error: beginning MaxStartups throttling [x45]
== itmon03 (1 distinct, 2 total) ==
Aug 21 00:20:02 itmon03 systemd-timedated[1744311]: /dev/rtc is busy. Is somebody keeping it open continuously? That's not a good idea... Returning a bogus RTC timestamp. [x2]
== jubjub.cs.umd.edu (3 distinct, 4 total) ==
Aug 21 00:10:13 jubjub.cs.umd.edu systemd[1]: New main PID 2736858 does not belong to service, and PID file is not owned by root. Refusing. [x2]
Aug 21 00:10:32 jubjub.cs.umd.edu systemd[1]: Daemon never wrote its PID file. Failing.
Aug 21 00:10:40 jubjub.cs.umd.edu systemd[1]: pmlogger.service: Supervising process 2744431 which is not our child. We'll most likely not notice when it exits.
== krispykreme.cs.umd.edu (4 distinct, 4 total) ==
Aug 21 00:50:23 krispykreme.cs.umd.edu sshd-session[1317934]: pam_access(sshd:auth): access denied for user `admin' from `130.211.85.173'
Aug 21 00:50:23 krispykreme.cs.umd.edu krb5_child[1317940]: Client 'admin(a)UMD.EDU' not found in Kerberos database
Aug 21 00:50:23 krispykreme.cs.umd.edu sshd-session[1317898]: error: PAM: System error for admin from 130.211.85.173
Aug 21 00:50:33 krispykreme.cs.umd.edu sshd-session[1317982]: error: Protocol major versions differ: 2 vs. 1
== mirrors.cs.umd.edu (3 distinct, 4 total) ==
Aug 21 00:10:24 mirrors.cs.umd.edu systemd[1]: New main PID 10883 does not belong to service, and PID file is not owned by root. Refusing. [x2]
Aug 21 00:10:42 mirrors.cs.umd.edu systemd[1]: Daemon never wrote its PID file. Failing.
Aug 21 00:10:56 mirrors.cs.umd.edu systemd[1]: pmlogger.service: Supervising process 17923 which is not our child. We'll most likely not notice when it exits.
== misty.cs.umd.edu (3 distinct, 4 total) ==
Aug 21 00:10:15 misty.cs.umd.edu systemd[1]: New main PID 40346 does not belong to service, and PID file is not owned by root. Refusing. [x2]
Aug 21 00:10:35 misty.cs.umd.edu systemd[1]: Daemon never wrote its PID file. Failing.
Aug 21 00:10:50 misty.cs.umd.edu systemd[1]: pmlogger.service: Supervising process 7670 which is not our child. We'll most likely not notice when it exits.
== newhonors2 (1 distinct, 24 total) ==
Aug 21 00:13:03 newhonors2 dhcpcd[1499320]: dhcpcd is not running [x24]
== openrepo (1 distinct, 1 total) ==
Aug 21 00:19:27 openrepo (nin-node)[3367011]: munin-node.service: Referenced but unset environment variable evaluates to an empty string: DAEMON_ARGS
== outbound00.cs.umd.edu (2 distinct, 8 total) ==
Aug 21 00:09:08 outbound00.cs.umd.edu python3[53030]: ldapdb [x6]
Aug 21 01:01:31 outbound00.cs.umd.edu cockpit-ws[66146]: /usr/share/cockpit/static/login.js/favicon.ico: Failed to open file “/usr/share/cockpit/static/login.js/favicon.ico”: open() failed: Not a directory [x2]
== outbound01.cs.umd.edu (4 distinct, 9 total) ==
Aug 21 00:13:06 outbound01.cs.umd.edu python3[2287714]: ldapdb [x6]
Aug 21 00:50:02 outbound01.cs.umd.edu krb5_child[2295958]: Client 'admin(a)UMD.EDU' not found in Kerberos database
Aug 21 00:50:51 outbound01.cs.umd.edu sshd-session[2296353]: error: Protocol major versions differ: 2 vs. 1
Aug 21 01:01:35 outbound01.cs.umd.edu cockpit-ws[2299315]: /usr/share/cockpit/static/login.js/favicon.ico: Failed to open file “/usr/share/cockpit/static/login.js/favicon.ico”: open() failed: Not a directory
== quiss (1 distinct, 2 total) ==
Aug 21 00:21:54 quiss nautilus[2301758]: Attempted to add a non-existent file to the view. [x2]
== sentry-docker00.cs.umd.edu (36 distinct, 36 total) ==
Aug 21 00:14:19 sentry-docker00.cs.umd.edu systemd-udevd[363334]: link_config: could not set ethtool features for vethe4e8bed
Aug 21 00:14:19 sentry-docker00.cs.umd.edu systemd-udevd[363334]: Could not set offload features of vethe4e8bed: Operation not permitted
Aug 21 00:14:19 sentry-docker00.cs.umd.edu systemd-udevd[363368]: Could not generate persistent MAC address for vethbadaf2b: No such file or directory
Aug 21 00:14:19 sentry-docker00.cs.umd.edu systemd-udevd[363369]: Could not generate persistent MAC address for vethc08dcc5: No such file or directory
Aug 21 00:14:19 sentry-docker00.cs.umd.edu systemd-udevd[363394]: Could not generate persistent MAC address for vethe386c4e: No such file or directory
Aug 21 00:14:19 sentry-docker00.cs.umd.edu systemd-udevd[363395]: Could not generate persistent MAC address for veth5eee316: No such file or directory
Aug 21 00:14:19 sentry-docker00.cs.umd.edu systemd-udevd[363398]: Could not generate persistent MAC address for vethc26a963: No such file or directory
Aug 21 00:14:19 sentry-docker00.cs.umd.edu systemd-udevd[363399]: Could not generate persistent MAC address for veth5559aa6: No such file or directory
Aug 21 00:14:19 sentry-docker00.cs.umd.edu systemd-udevd[363422]: Could not generate persistent MAC address for vetha4211da: No such file or directory
Aug 21 00:14:19 sentry-docker00.cs.umd.edu systemd-udevd[363423]: Could not generate persistent MAC address for veth35ce2bb: No such file or directory
Aug 21 00:14:19 sentry-docker00.cs.umd.edu systemd-udevd[363443]: Could not generate persistent MAC address for veth2c1c3a5: No such file or directory
Aug 21 00:14:19 sentry-docker00.cs.umd.edu systemd-udevd[363439]: Could not generate persistent MAC address for veth0a3b6bb: No such file or directory
Aug 21 00:34:27 sentry-docker00.cs.umd.edu systemd-udevd[372800]: link_config: could not get ethtool features for vethe386c4e
Aug 21 00:34:27 sentry-docker00.cs.umd.edu systemd-udevd[372800]: Could not set offload features of vethe386c4e: No such device
Aug 21 00:34:28 sentry-docker00.cs.umd.edu systemd-udevd[372839]: Could not generate persistent MAC address for veth6a7d6ad: No such file or directory
Aug 21 00:34:28 sentry-docker00.cs.umd.edu systemd-udevd[372840]: Could not generate persistent MAC address for veth84ecabc: No such file or directory
Aug 21 00:34:28 sentry-docker00.cs.umd.edu systemd-udevd[372843]: Could not generate persistent MAC address for veth0efa7d7: No such file or directory
Aug 21 00:34:28 sentry-docker00.cs.umd.edu systemd-udevd[372844]: Could not generate persistent MAC address for veth3935740: No such file or directory
Aug 21 00:34:28 sentry-docker00.cs.umd.edu systemd-udevd[372851]: Could not generate persistent MAC address for veth7be797b: No such file or directory
Aug 21 00:34:28 sentry-docker00.cs.umd.edu systemd-udevd[372864]: Could not generate persistent MAC address for veth14e84ff: No such file or directory
Aug 21 00:34:28 sentry-docker00.cs.umd.edu systemd-udevd[372858]: Could not generate persistent MAC address for vethb0d0773: No such file or directory
Aug 21 00:34:28 sentry-docker00.cs.umd.edu systemd-udevd[372840]: Could not generate persistent MAC address for veth04bd651: No such file or directory
Aug 21 00:34:28 sentry-docker00.cs.umd.edu systemd-udevd[372925]: Could not generate persistent MAC address for veth943a101: No such file or directory
Aug 21 00:34:28 sentry-docker00.cs.umd.edu systemd-udevd[372926]: Could not generate persistent MAC address for vethc1ac548: No such file or directory
Aug 21 00:54:35 sentry-docker00.cs.umd.edu systemd-udevd[382167]: link_config: could not get ethtool features for veth7be797b
Aug 21 00:54:35 sentry-docker00.cs.umd.edu systemd-udevd[382167]: Could not set offload features of veth7be797b: No such device
Aug 21 00:54:36 sentry-docker00.cs.umd.edu systemd-udevd[382203]: Could not generate persistent MAC address for veth057eeaa: No such file or directory
Aug 21 00:54:36 sentry-docker00.cs.umd.edu systemd-udevd[382204]: Could not generate persistent MAC address for vethc4d074a: No such file or directory
Aug 21 00:54:36 sentry-docker00.cs.umd.edu systemd-udevd[382207]: Could not generate persistent MAC address for vethbf33eef: No such file or directory
Aug 21 00:54:36 sentry-docker00.cs.umd.edu systemd-udevd[382208]: Could not generate persistent MAC address for vethc9232b9: No such file or directory
... 6 more distinct messages not shown
== strawberry (3 distinct, 9 total) ==
Aug 21 00:09:44 strawberry udisksd[1067]: Error performing housekeeping for drive /org/freedesktop/UDisks2/drives/ST2000DM001_1CH164_W1E8J5KJ: Error updating SMART data: Error sending ATA command CHECK POWER MODE: Unexpected sense data returned:#0120000: 00 00 00 00 00 00 00 00 00 00 00 00 00 00 00 00 ................#0120010: 00 00 00 00 00 00 00 00 00 00 00 00 00 00 00 00 ................#012 (g-io-error-quark, 0) [x6]
Aug 21 00:34:42 strawberry smartd[5314]: Device: /dev/sda [SAT], failed to read SMART Attribute Data [x2]
Aug 21 01:04:43 strawberry smartd[5314]: Device: /dev/sda [SAT], not capable of Offline or Self-Testing.
== submit10-cln25 (3 distinct, 4 total) ==
Aug 21 00:10:11 submit10-cln25 systemd: New main PID 7575 does not belong to service, and PID file is not owned by root. Refusing. [x2]
Aug 21 00:10:30 submit10-cln25 systemd: Daemon never wrote its PID file. Failing.
Aug 21 00:10:35 submit10-cln25 systemd: pmlogger.service: Supervising process 14473 which is not our child. We'll most likely not notice when it exits.
== teaching-awards (1 distinct, 1 total) ==
Aug 21 00:05:40 teaching-awards sshd-session[3233252]: error: Bad remote protocol version identification: 'SSH-1337-OpenSSH_9.0'
== tma-0 (3 distinct, 4 total) ==
Aug 21 00:10:13 tma-0 systemd[1]: New main PID 8142 does not belong to service, and PID file is not owned by root. Refusing. [x2]
Aug 21 00:10:30 tma-0 systemd[1]: Daemon never wrote its PID file. Failing.
Aug 21 00:10:38 tma-0 systemd[1]: pmlogger.service: Supervising process 15465 which is not our child. We'll most likely not notice when it exits.
== uffish.cs.umd.edu (3 distinct, 4 total) ==
Aug 21 00:10:12 uffish.cs.umd.edu systemd[1]: New main PID 1762486 does not belong to service, and PID file is not owned by root. Refusing. [x2]
Aug 21 00:10:38 uffish.cs.umd.edu systemd[1]: Daemon never wrote its PID file. Failing.
Aug 21 00:10:54 uffish.cs.umd.edu systemd[1]: pmlogger.service: Supervising process 1770210 which is not our child. We'll most likely not notice when it exits.
== vacuum.cs.umd.edu (3 distinct, 4 total) ==
Aug 21 00:10:14 vacuum.cs.umd.edu systemd[1]: New main PID 15363 does not belong to service, and PID file is not owned by root. Refusing. [x2]
Aug 21 00:10:33 vacuum.cs.umd.edu systemd[1]: Daemon never wrote its PID file. Failing.
Aug 21 00:10:44 vacuum.cs.umd.edu systemd[1]: pmlogger.service: Supervising process 22465 which is not our child. We'll most likely not notice when it exits.
== whiffle.cs.umd.edu (3 distinct, 4 total) ==
Aug 21 00:10:18 whiffle.cs.umd.edu systemd[1]: New main PID 1458770 does not belong to service, and PID file is not owned by root. Refusing. [x2]
Aug 21 00:10:43 whiffle.cs.umd.edu systemd[1]: Daemon never wrote its PID file. Failing.
Aug 21 00:10:57 whiffle.cs.umd.edu systemd[1]: pmlogger.service: Supervising process 1466076 which is not our child. We'll most likely not notice when it exits.
1
0