Command: /usr/local/sbin/syslog-digest.py
Time : 0.0520s
Status : exited 0
Output :
Syslog digest — 2026-08-21 20:05 EDT
Processed 2,228 lines, filtered 1,794 (80%). 434 unknown (147 distinct) from 18 host(s).
== ar102 (72 distinct, 72 total) ==
Aug 21 17:23:05 ar102 cosmic-session[6072]: [2026-08-21T21:23:05Z ERROR cosmic_osd::components::audio] failed to connect to cosmic-settings's varlink service: Io(Os { code: 111, kind: ConnectionRefused, message: "Connection refused" })
Aug 21 17:23:08 ar102 cosmic-session[6072]: [2026-08-21T21:23:08Z ERROR cosmic_osd::components::audio] failed to connect to cosmic-settings's varlink service: Io(Os { code: 111, kind: ConnectionRefused, message: "Connection refused" })
Aug 21 17:23:11 ar102 cosmic-session[6072]: [2026-08-21T21:23:11Z ERROR cosmic_osd::components::audio] failed to connect to cosmic-settings's varlink service: Io(Os { code: 111, kind: ConnectionRefused, message: "Connection refused" })
Aug 21 17:23:14 ar102 cosmic-session[6072]: [2026-08-21T21:23:14Z ERROR cosmic_osd::components::audio] failed to connect to cosmic-settings's varlink service: Io(Os { code: 111, kind: ConnectionRefused, message: "Connection refused" })
Aug 21 17:23:17 ar102 cosmic-session[6072]: [2026-08-21T21:23:17Z ERROR cosmic_osd::components::audio] failed to connect to cosmic-settings's varlink service: Io(Os { code: 111, kind: ConnectionRefused, message: "Connection refused" })
Aug 21 17:23:20 ar102 cosmic-session[6072]: [2026-08-21T21:23:20Z ERROR cosmic_osd::components::audio] failed to connect to cosmic-settings's varlink service: Io(Os { code: 111, kind: ConnectionRefused, message: "Connection refused" })
Aug 21 17:23:23 ar102 cosmic-session[6072]: [2026-08-21T21:23:23Z ERROR cosmic_osd::components::audio] failed to connect to cosmic-settings's varlink service: Io(Os { code: 111, kind: ConnectionRefused, message: "Connection refused" })
Aug 21 17:23:26 ar102 cosmic-session[6072]: [2026-08-21T21:23:26Z ERROR cosmic_osd::components::audio] failed to connect to cosmic-settings's varlink service: Io(Os { code: 111, kind: ConnectionRefused, message: "Connection refused" })
Aug 21 17:23:29 ar102 cosmic-session[6072]: [2026-08-21T21:23:29Z ERROR cosmic_osd::components::audio] failed to connect to cosmic-settings's varlink service: Io(Os { code: 111, kind: ConnectionRefused, message: "Connection refused" })
Aug 21 17:23:32 ar102 cosmic-session[6072]: [2026-08-21T21:23:32Z ERROR cosmic_osd::components::audio] failed to connect to cosmic-settings's varlink service: Io(Os { code: 111, kind: ConnectionRefused, message: "Connection refused" })
Aug 21 17:23:35 ar102 cosmic-session[6072]: [2026-08-21T21:23:35Z ERROR cosmic_osd::components::audio] failed to connect to cosmic-settings's varlink service: Io(Os { code: 111, kind: ConnectionRefused, message: "Connection refused" })
Aug 21 17:23:38 ar102 cosmic-session[6072]: [2026-08-21T21:23:38Z ERROR cosmic_osd::components::audio] failed to connect to cosmic-settings's varlink service: Io(Os { code: 111, kind: ConnectionRefused, message: "Connection refused" })
Aug 21 17:23:41 ar102 cosmic-session[6072]: [2026-08-21T21:23:41Z ERROR cosmic_osd::components::audio] failed to connect to cosmic-settings's varlink service: Io(Os { code: 111, kind: ConnectionRefused, message: "Connection refused" })
Aug 21 17:23:44 ar102 cosmic-session[6072]: [2026-08-21T21:23:44Z ERROR cosmic_osd::components::audio] failed to connect to cosmic-settings's varlink service: Io(Os { code: 111, kind: ConnectionRefused, message: "Connection refused" })
Aug 21 17:23:47 ar102 cosmic-session[6072]: [2026-08-21T21:23:47Z ERROR cosmic_osd::components::audio] failed to connect to cosmic-settings's varlink service: Io(Os { code: 111, kind: ConnectionRefused, message: "Connection refused" })
Aug 21 17:23:50 ar102 cosmic-session[6072]: [2026-08-21T21:23:50Z ERROR cosmic_osd::components::audio] failed to connect to cosmic-settings's varlink service: Io(Os { code: 111, kind: ConnectionRefused, message: "Connection refused" })
Aug 21 17:23:53 ar102 cosmic-session[6072]: [2026-08-21T21:23:53Z ERROR cosmic_osd::components::audio] failed to connect to cosmic-settings's varlink service: Io(Os { code: 111, kind: ConnectionRefused, message: "Connection refused" })
Aug 21 17:23:56 ar102 cosmic-session[6072]: [2026-08-21T21:23:56Z ERROR cosmic_osd::components::audio] failed to connect to cosmic-settings's varlink service: Io(Os { code: 111, kind: ConnectionRefused, message: "Connection refused" })
Aug 21 17:23:59 ar102 cosmic-session[6072]: [2026-08-21T21:23:59Z ERROR cosmic_osd::components::audio] failed to connect to cosmic-settings's varlink service: Io(Os { code: 111, kind: ConnectionRefused, message: "Connection refused" })
Aug 21 17:24:02 ar102 cosmic-session[6072]: [2026-08-21T21:24:02Z ERROR cosmic_osd::components::audio] failed to connect to cosmic-settings's varlink service: Io(Os { code: 111, kind: ConnectionRefused, message: "Connection refused" })
Aug 21 17:24:05 ar102 cosmic-session[6072]: [2026-08-21T21:24:05Z ERROR cosmic_osd::components::audio] failed to connect to cosmic-settings's varlink service: Io(Os { code: 111, kind: ConnectionRefused, message: "Connection refused" })
Aug 21 17:24:08 ar102 cosmic-session[6072]: [2026-08-21T21:24:08Z ERROR cosmic_osd::components::audio] failed to connect to cosmic-settings's varlink service: Io(Os { code: 111, kind: ConnectionRefused, message: "Connection refused" })
Aug 21 17:24:11 ar102 cosmic-session[6072]: [2026-08-21T21:24:11Z ERROR cosmic_osd::components::audio] failed to connect to cosmic-settings's varlink service: Io(Os { code: 111, kind: ConnectionRefused, message: "Connection refused" })
Aug 21 17:24:14 ar102 cosmic-session[6072]: [2026-08-21T21:24:14Z ERROR cosmic_osd::components::audio] failed to connect to cosmic-settings's varlink service: Io(Os { code: 111, kind: ConnectionRefused, message: "Connection refused" })
Aug 21 17:24:17 ar102 cosmic-session[6072]: [2026-08-21T21:24:17Z ERROR cosmic_osd::components::audio] failed to connect to cosmic-settings's varlink service: Io(Os { code: 111, kind: ConnectionRefused, message: "Connection refused" })
Aug 21 17:24:20 ar102 cosmic-session[6072]: [2026-08-21T21:24:20Z ERROR cosmic_osd::components::audio] failed to connect to cosmic-settings's varlink service: Io(Os { code: 111, kind: ConnectionRefused, message: "Connection refused" })
Aug 21 17:24:23 ar102 cosmic-session[6072]: [2026-08-21T21:24:23Z ERROR cosmic_osd::components::audio] failed to connect to cosmic-settings's varlink service: Io(Os { code: 111, kind: ConnectionRefused, message: "Connection refused" })
Aug 21 17:24:26 ar102 cosmic-session[6072]: [2026-08-21T21:24:26Z ERROR cosmic_osd::components::audio] failed to connect to cosmic-settings's varlink service: Io(Os { code: 111, kind: ConnectionRefused, message: "Connection refused" })
Aug 21 17:24:29 ar102 cosmic-session[6072]: [2026-08-21T21:24:29Z ERROR cosmic_osd::components::audio] failed to connect to cosmic-settings's varlink service: Io(Os { code: 111, kind: ConnectionRefused, message: "Connection refused" })
Aug 21 17:24:32 ar102 cosmic-session[6072]: [2026-08-21T21:24:32Z ERROR cosmic_osd::components::audio] failed to connect to cosmic-settings's varlink service: Io(Os { code: 111, kind: ConnectionRefused, message: "Connection refused" })
... 42 more distinct messages not shown
== b0b02.cs.umd.edu (1 distinct, 1 total) ==
Aug 21 19:07:55 b0b02.cs.umd.edu rustdesk[755023]: cannot open display:
== biggulp.cs.umd.edu (6 distinct, 6 total) ==
Aug 21 19:55:53 biggulp.cs.umd.edu sshd-session[3301124]: error: kex_protocol_error: type 20 seq 2 [preauth]
Aug 21 19:55:53 biggulp.cs.umd.edu sshd-session[3301124]: error: kex_protocol_error: type 30 seq 3 [preauth]
Aug 21 19:55:54 biggulp.cs.umd.edu sshd-session[3301124]: error: kex_protocol_error: type 20 seq 4 [preauth]
Aug 21 19:55:54 biggulp.cs.umd.edu sshd-session[3301124]: error: kex_protocol_error: type 30 seq 5 [preauth]
Aug 21 19:55:56 biggulp.cs.umd.edu sshd-session[3301124]: error: kex_protocol_error: type 20 seq 6 [preauth]
Aug 21 19:55:56 biggulp.cs.umd.edu sshd-session[3301124]: error: kex_protocol_error: type 30 seq 7 [preauth]
== cheezit.cs.umd.edu (6 distinct, 6 total) ==
Aug 21 20:04:43 cheezit.cs.umd.edu sshd-session[2883673]: error: kex_protocol_error: type 20 seq 2 [preauth]
Aug 21 20:04:43 cheezit.cs.umd.edu sshd-session[2883673]: error: kex_protocol_error: type 30 seq 3 [preauth]
Aug 21 20:04:44 cheezit.cs.umd.edu sshd-session[2883673]: error: kex_protocol_error: type 20 seq 4 [preauth]
Aug 21 20:04:44 cheezit.cs.umd.edu sshd-session[2883673]: error: kex_protocol_error: type 30 seq 5 [preauth]
Aug 21 20:04:46 cheezit.cs.umd.edu sshd-session[2883673]: error: kex_protocol_error: type 20 seq 6 [preauth]
Aug 21 20:04:46 cheezit.cs.umd.edu sshd-session[2883673]: error: kex_protocol_error: type 30 seq 7 [preauth]
== csfw00a (1 distinct, 146 total) ==
Aug 21 19:04:19 csfw00a kernel: bnxt_en 0000:09:00.0 eth3: NIC Link is Down [x146]
== hackerman (7 distinct, 12 total) ==
Aug 21 19:19:01 hackerman gnome-software[2060381]: failed to commit changes to dconf: GDBus.Error:org.gtk.GDBus.UnmappedGError.Quark._g_2dfile_2derror_2dquark.Code2: Failed to create file “/adminhomes/sajith/.config/dconf/user.45GBU3”: Permission denied
Aug 21 19:20:04 hackerman gnome-software[2060381]: can't reliably fixup error code 4 in domain g-io-error-quark: Not a directory [x4]
Aug 21 19:20:12 hackerman gnome-software[2060381]: Only 0 apps for recent list, hiding
Aug 21 19:20:28 hackerman gnome-software[2060381]: failed to commit changes to dconf: GDBus.Error:org.gtk.GDBus.UnmappedGError.Quark._g_2dfile_2derror_2dquark.Code2: Failed to create file “/adminhomes/sajith/.config/dconf/user.Q1X4T3”: Permission denied
Aug 21 19:20:29 hackerman packagekitd[1094557]: Failed to get cache filename for libreoffice [x2]
Aug 21 19:20:29 hackerman packagekitd[1094557]: Failed to get cache filename for kernel [x2]
Aug 21 19:20:39 hackerman packagekitd[1094557]: failed to parse public key for /etc/pki/rpm-gpg/RPM-GPG-KEY-PQC-redhat-release
== hazfs.cs.umd.edu (11 distinct, 66 total) ==
Aug 21 19:34:47 hazfs.cs.umd.edu snmpd[1431]: send response: Failure in sendto [x6]
Aug 21 19:34:47 hazfs.cs.umd.edu snmpd[1431]: -- NET-SNMP-EXTEND-MIB::nsExtendStatus."userweb" [x6]
Aug 21 19:34:47 hazfs.cs.umd.edu snmpd[1431]: -- NET-SNMP-EXTEND-MIB::nsExtendStatus."zfslist" [x6]
Aug 21 19:34:47 hazfs.cs.umd.edu snmpd[1431]: -- NET-SNMP-EXTEND-MIB::nsExtendStatus."userhome" [x6]
Aug 21 19:34:47 hazfs.cs.umd.edu snmpd[1431]: -- NET-SNMP-EXTEND-MIB::nsExtendOutput1Line."userweb" [x6]
Aug 21 19:34:47 hazfs.cs.umd.edu snmpd[1431]: -- NET-SNMP-EXTEND-MIB::nsExtendOutput1Line."zfslist" [x6]
Aug 21 19:34:47 hazfs.cs.umd.edu snmpd[1431]: -- NET-SNMP-EXTEND-MIB::nsExtendOutput1Line."userhome" [x6]
Aug 21 19:34:47 hazfs.cs.umd.edu snmpd[1431]: -- NET-SNMP-EXTEND-MIB::nsExtendOutputFull."userweb" [x6]
Aug 21 19:34:47 hazfs.cs.umd.edu snmpd[1431]: -- NET-SNMP-EXTEND-MIB::nsExtendOutputFull."zfslist" [x6]
Aug 21 19:34:47 hazfs.cs.umd.edu snmpd[1431]: -- NET-SNMP-EXTEND-MIB::nsExtendOutputFull."userhome" [x6]
Aug 21 19:34:47 hazfs.cs.umd.edu snmpd[1431]: -- NET-SNMP-EXTEND-MIB::nsExtendOutNumLines."userweb" [x6]
== idm00 (1 distinct, 1 total) ==
Aug 21 19:51:38 idm00 named[3810278]: client @0x7f48d4040ee8 10.73.240.42#59418: update '73.10.in-addr.arpa/IN' denied
== idmp0 (1 distinct, 1 total) ==
Aug 21 19:35:55 idmp0 named[1121900]: client @0x7fe3e002f0d8 10.73.240.43#53588: update '73.10.in-addr.arpa/IN' denied
== itmon02 (1 distinct, 44 total) ==
Aug 21 19:07:55 itmon02 sshd[1750555]: error: beginning MaxStartups throttling [x44]
== itmon03 (1 distinct, 1 total) ==
Aug 21 19:20:02 itmon03 systemd-timedated[1801741]: /dev/rtc is busy. Is somebody keeping it open continuously? That's not a good idea... Returning a bogus RTC timestamp.
== newhonors2 (1 distinct, 24 total) ==
Aug 21 19:13:03 newhonors2 dhcpcd[1536470]: dhcpcd is not running [x24]
== outbound00.cs.umd.edu (1 distinct, 6 total) ==
Aug 21 19:09:09 outbound00.cs.umd.edu python3[321508]: ldapdb [x6]
== outbound01.cs.umd.edu (1 distinct, 6 total) ==
Aug 21 19:13:06 outbound01.cs.umd.edu python3[2556620]: ldapdb [x6]
== sentry-docker00.cs.umd.edu (32 distinct, 32 total) ==
Aug 21 19:22:13 sentry-docker00.cs.umd.edu systemd-udevd[905850]: Could not generate persistent MAC address for veth80e9865: No such file or directory
Aug 21 19:22:13 sentry-docker00.cs.umd.edu systemd-udevd[905851]: Could not generate persistent MAC address for vethd7998fe: No such file or directory
Aug 21 19:22:13 sentry-docker00.cs.umd.edu systemd-udevd[905877]: Could not generate persistent MAC address for veth61f9dea: No such file or directory
Aug 21 19:22:13 sentry-docker00.cs.umd.edu systemd-udevd[905876]: Could not generate persistent MAC address for veth24e8de1: No such file or directory
Aug 21 19:22:13 sentry-docker00.cs.umd.edu systemd-udevd[905895]: Could not generate persistent MAC address for vethad4e072: No such file or directory
Aug 21 19:22:13 sentry-docker00.cs.umd.edu systemd-udevd[905896]: Could not generate persistent MAC address for vethbd4f8ce: No such file or directory
Aug 21 19:22:13 sentry-docker00.cs.umd.edu systemd-udevd[905905]: Could not generate persistent MAC address for veth6c5ab2e: No such file or directory
Aug 21 19:22:13 sentry-docker00.cs.umd.edu systemd-udevd[905904]: Could not generate persistent MAC address for veth7fcc3a4: No such file or directory
Aug 21 19:22:13 sentry-docker00.cs.umd.edu systemd-udevd[905946]: Could not generate persistent MAC address for veth5388584: No such file or directory
Aug 21 19:22:13 sentry-docker00.cs.umd.edu systemd-udevd[905948]: Could not generate persistent MAC address for vethf737dac: No such file or directory
Aug 21 19:42:21 sentry-docker00.cs.umd.edu systemd-udevd[915320]: Could not generate persistent MAC address for veth52b9103: No such file or directory
Aug 21 19:42:21 sentry-docker00.cs.umd.edu systemd-udevd[915321]: Could not generate persistent MAC address for veth0f35165: No such file or directory
Aug 21 19:42:21 sentry-docker00.cs.umd.edu systemd-udevd[915324]: Could not generate persistent MAC address for veth83c2624: No such file or directory
Aug 21 19:42:21 sentry-docker00.cs.umd.edu systemd-udevd[915324]: Could not generate persistent MAC address for veth63ddbc6: No such file or directory
Aug 21 19:42:21 sentry-docker00.cs.umd.edu systemd-udevd[915343]: Could not generate persistent MAC address for veth430f105: No such file or directory
Aug 21 19:42:21 sentry-docker00.cs.umd.edu systemd-udevd[915335]: Could not generate persistent MAC address for veth2246da9: No such file or directory
Aug 21 19:42:21 sentry-docker00.cs.umd.edu systemd-udevd[915343]: Could not generate persistent MAC address for veth5b2117c: No such file or directory
Aug 21 19:42:21 sentry-docker00.cs.umd.edu systemd-udevd[915335]: Could not generate persistent MAC address for veth6b7a048: No such file or directory
Aug 21 19:42:21 sentry-docker00.cs.umd.edu systemd-udevd[915329]: Could not generate persistent MAC address for veth7f63290: No such file or directory
Aug 21 19:42:21 sentry-docker00.cs.umd.edu systemd-udevd[915340]: Could not generate persistent MAC address for vethf00abf9: No such file or directory
Aug 21 20:02:29 sentry-docker00.cs.umd.edu systemd-udevd[924677]: link_config: could not set ethtool features for veth6b7a048
Aug 21 20:02:29 sentry-docker00.cs.umd.edu systemd-udevd[924677]: Could not set offload features of veth6b7a048: Operation not permitted
Aug 21 20:02:29 sentry-docker00.cs.umd.edu systemd-udevd[924697]: Could not generate persistent MAC address for veth5fafccf: No such file or directory
Aug 21 20:02:29 sentry-docker00.cs.umd.edu systemd-udevd[924698]: Could not generate persistent MAC address for veth1f82171: No such file or directory
Aug 21 20:02:29 sentry-docker00.cs.umd.edu systemd-udevd[924727]: Could not generate persistent MAC address for veth9ab91f1: No such file or directory
Aug 21 20:02:29 sentry-docker00.cs.umd.edu systemd-udevd[924728]: Could not generate persistent MAC address for veth1ad9626: No such file or directory
Aug 21 20:02:29 sentry-docker00.cs.umd.edu systemd-udevd[924731]: Could not generate persistent MAC address for vethc827c36: No such file or directory
Aug 21 20:02:29 sentry-docker00.cs.umd.edu systemd-udevd[924738]: Could not generate persistent MAC address for veth534dca9: No such file or directory
Aug 21 20:02:29 sentry-docker00.cs.umd.edu systemd-udevd[924755]: Could not generate persistent MAC address for vethf1a0302: No such file or directory
Aug 21 20:02:29 sentry-docker00.cs.umd.edu systemd-udevd[924756]: Could not generate persistent MAC address for veth5ac1b94: No such file or directory
... 2 more distinct messages not shown
== strawberry (2 distinct, 8 total) ==
Aug 21 19:09:44 strawberry udisksd[1067]: Error performing housekeeping for drive /org/freedesktop/UDisks2/drives/ST2000DM001_1CH164_W1E8J5KJ: Error updating SMART data: Error sending ATA command CHECK POWER MODE: Unexpected sense data returned:#0120000: 00 00 00 00 00 00 00 00 00 00 00 00 00 00 00 00 ................#0120010: 00 00 00 00 00 00 00 00 00 00 00 00 00 00 00 00 ................#012 (g-io-error-quark, 0) [x6]
Aug 21 19:34:42 strawberry smartd[5314]: Device: /dev/sda [SAT], failed to read SMART Attribute Data [x2]
== wraith (1 distinct, 1 total) ==
Aug 21 19:35:24 wraith kernel: workqueue: i915_hpd_poll_init_work [i915] hogged CPU for >10000us 8195 times, consider switching to WQ_UNBOUND
== zebatinsky.cs.umd.edu (1 distinct, 1 total) ==
Aug 21 19:05:44 zebatinsky.cs.umd.edu setroubleshoot[771840]: SELinux is preventing pdns/comm-main from name_bind access on the udp_socket port 16509. For complete SELinux messages run: sealert -l d9886900-6794-4791-81d0-2ebdb3459096
1
0
Command: /usr/local/sbin/syslog-digest.py
Time : 0.0538s
Status : exited 0
Output :
Syslog digest — 2026-08-21 19:05 EDT
Processed 2,960 lines, filtered 2,554 (86%). 406 unknown (146 distinct) from 18 host(s).
== ar102 (70 distinct, 70 total) ==
Aug 21 17:19:35 ar102 cosmic-session[6072]: [2026-08-21T21:19:35Z ERROR cosmic_osd::components::audio] failed to connect to cosmic-settings's varlink service: Io(Os { code: 111, kind: ConnectionRefused, message: "Connection refused" })
Aug 21 17:19:38 ar102 cosmic-session[6072]: [2026-08-21T21:19:38Z ERROR cosmic_osd::components::audio] failed to connect to cosmic-settings's varlink service: Io(Os { code: 111, kind: ConnectionRefused, message: "Connection refused" })
Aug 21 17:19:41 ar102 cosmic-session[6072]: [2026-08-21T21:19:41Z ERROR cosmic_osd::components::audio] failed to connect to cosmic-settings's varlink service: Io(Os { code: 111, kind: ConnectionRefused, message: "Connection refused" })
Aug 21 17:19:44 ar102 cosmic-session[6072]: [2026-08-21T21:19:44Z ERROR cosmic_osd::components::audio] failed to connect to cosmic-settings's varlink service: Io(Os { code: 111, kind: ConnectionRefused, message: "Connection refused" })
Aug 21 17:19:47 ar102 cosmic-session[6072]: [2026-08-21T21:19:47Z ERROR cosmic_osd::components::audio] failed to connect to cosmic-settings's varlink service: Io(Os { code: 111, kind: ConnectionRefused, message: "Connection refused" })
Aug 21 17:19:50 ar102 cosmic-session[6072]: [2026-08-21T21:19:50Z ERROR cosmic_osd::components::audio] failed to connect to cosmic-settings's varlink service: Io(Os { code: 111, kind: ConnectionRefused, message: "Connection refused" })
Aug 21 17:19:53 ar102 cosmic-session[6072]: [2026-08-21T21:19:53Z ERROR cosmic_osd::components::audio] failed to connect to cosmic-settings's varlink service: Io(Os { code: 111, kind: ConnectionRefused, message: "Connection refused" })
Aug 21 17:19:56 ar102 cosmic-session[6072]: [2026-08-21T21:19:56Z ERROR cosmic_osd::components::audio] failed to connect to cosmic-settings's varlink service: Io(Os { code: 111, kind: ConnectionRefused, message: "Connection refused" })
Aug 21 17:19:59 ar102 cosmic-session[6072]: [2026-08-21T21:19:59Z ERROR cosmic_osd::components::audio] failed to connect to cosmic-settings's varlink service: Io(Os { code: 111, kind: ConnectionRefused, message: "Connection refused" })
Aug 21 17:20:02 ar102 cosmic-session[6072]: [2026-08-21T21:20:02Z ERROR cosmic_osd::components::audio] failed to connect to cosmic-settings's varlink service: Io(Os { code: 111, kind: ConnectionRefused, message: "Connection refused" })
Aug 21 17:20:05 ar102 cosmic-session[6072]: [2026-08-21T21:20:05Z ERROR cosmic_osd::components::audio] failed to connect to cosmic-settings's varlink service: Io(Os { code: 111, kind: ConnectionRefused, message: "Connection refused" })
Aug 21 17:20:08 ar102 cosmic-session[6072]: [2026-08-21T21:20:08Z ERROR cosmic_osd::components::audio] failed to connect to cosmic-settings's varlink service: Io(Os { code: 111, kind: ConnectionRefused, message: "Connection refused" })
Aug 21 17:20:11 ar102 cosmic-session[6072]: [2026-08-21T21:20:11Z ERROR cosmic_osd::components::audio] failed to connect to cosmic-settings's varlink service: Io(Os { code: 111, kind: ConnectionRefused, message: "Connection refused" })
Aug 21 17:20:14 ar102 cosmic-session[6072]: [2026-08-21T21:20:14Z ERROR cosmic_osd::components::audio] failed to connect to cosmic-settings's varlink service: Io(Os { code: 111, kind: ConnectionRefused, message: "Connection refused" })
Aug 21 17:20:17 ar102 cosmic-session[6072]: [2026-08-21T21:20:17Z ERROR cosmic_osd::components::audio] failed to connect to cosmic-settings's varlink service: Io(Os { code: 111, kind: ConnectionRefused, message: "Connection refused" })
Aug 21 17:20:20 ar102 cosmic-session[6072]: [2026-08-21T21:20:20Z ERROR cosmic_osd::components::audio] failed to connect to cosmic-settings's varlink service: Io(Os { code: 111, kind: ConnectionRefused, message: "Connection refused" })
Aug 21 17:20:23 ar102 cosmic-session[6072]: [2026-08-21T21:20:23Z ERROR cosmic_osd::components::audio] failed to connect to cosmic-settings's varlink service: Io(Os { code: 111, kind: ConnectionRefused, message: "Connection refused" })
Aug 21 17:20:26 ar102 cosmic-session[6072]: [2026-08-21T21:20:26Z ERROR cosmic_osd::components::audio] failed to connect to cosmic-settings's varlink service: Io(Os { code: 111, kind: ConnectionRefused, message: "Connection refused" })
Aug 21 17:20:29 ar102 cosmic-session[6072]: [2026-08-21T21:20:29Z ERROR cosmic_osd::components::audio] failed to connect to cosmic-settings's varlink service: Io(Os { code: 111, kind: ConnectionRefused, message: "Connection refused" })
Aug 21 17:20:32 ar102 cosmic-session[6072]: [2026-08-21T21:20:32Z ERROR cosmic_osd::components::audio] failed to connect to cosmic-settings's varlink service: Io(Os { code: 111, kind: ConnectionRefused, message: "Connection refused" })
Aug 21 17:20:35 ar102 cosmic-session[6072]: [2026-08-21T21:20:35Z ERROR cosmic_osd::components::audio] failed to connect to cosmic-settings's varlink service: Io(Os { code: 111, kind: ConnectionRefused, message: "Connection refused" })
Aug 21 17:20:38 ar102 cosmic-session[6072]: [2026-08-21T21:20:38Z ERROR cosmic_osd::components::audio] failed to connect to cosmic-settings's varlink service: Io(Os { code: 111, kind: ConnectionRefused, message: "Connection refused" })
Aug 21 17:20:41 ar102 cosmic-session[6072]: [2026-08-21T21:20:41Z ERROR cosmic_osd::components::audio] failed to connect to cosmic-settings's varlink service: Io(Os { code: 111, kind: ConnectionRefused, message: "Connection refused" })
Aug 21 17:20:44 ar102 cosmic-session[6072]: [2026-08-21T21:20:44Z ERROR cosmic_osd::components::audio] failed to connect to cosmic-settings's varlink service: Io(Os { code: 111, kind: ConnectionRefused, message: "Connection refused" })
Aug 21 17:20:47 ar102 cosmic-session[6072]: [2026-08-21T21:20:47Z ERROR cosmic_osd::components::audio] failed to connect to cosmic-settings's varlink service: Io(Os { code: 111, kind: ConnectionRefused, message: "Connection refused" })
Aug 21 17:20:50 ar102 cosmic-session[6072]: [2026-08-21T21:20:50Z ERROR cosmic_osd::components::audio] failed to connect to cosmic-settings's varlink service: Io(Os { code: 111, kind: ConnectionRefused, message: "Connection refused" })
Aug 21 17:20:53 ar102 cosmic-session[6072]: [2026-08-21T21:20:53Z ERROR cosmic_osd::components::audio] failed to connect to cosmic-settings's varlink service: Io(Os { code: 111, kind: ConnectionRefused, message: "Connection refused" })
Aug 21 17:20:56 ar102 cosmic-session[6072]: [2026-08-21T21:20:56Z ERROR cosmic_osd::components::audio] failed to connect to cosmic-settings's varlink service: Io(Os { code: 111, kind: ConnectionRefused, message: "Connection refused" })
Aug 21 17:20:59 ar102 cosmic-session[6072]: [2026-08-21T21:20:59Z ERROR cosmic_osd::components::audio] failed to connect to cosmic-settings's varlink service: Io(Os { code: 111, kind: ConnectionRefused, message: "Connection refused" })
Aug 21 17:21:02 ar102 cosmic-session[6072]: [2026-08-21T21:21:02Z ERROR cosmic_osd::components::audio] failed to connect to cosmic-settings's varlink service: Io(Os { code: 111, kind: ConnectionRefused, message: "Connection refused" })
... 40 more distinct messages not shown
== b0b02.cs.umd.edu (4 distinct, 4 total) ==
Aug 21 18:07:51 b0b02.cs.umd.edu rustdesk[739935]: cannot open display:
Aug 21 18:10:59 b0b02.cs.umd.edu csregistry[5224]: time="2026-08-21T22:10:59.404843269Z" level=info msg="PurgeUploads starting: olderThan=2026-08-14 22:10:59.40474387 +0000 UTC m=+1557420.164672191, actuallyDelete=true"
Aug 21 18:10:59 b0b02.cs.umd.edu csregistry[5224]: time="2026-08-21T22:10:59.405350154Z" level=info msg="Purge uploads finished. Num deleted=0, num errors=1"
Aug 21 18:10:59 b0b02.cs.umd.edu csregistry[5224]: time="2026-08-21T22:10:59.405371648Z" level=info msg="Starting upload purge in 24h0m0s" go.version=go1.11.2 instance.id=68469aa4-7857-4a69-bf12-c2190b4f96d8 service=registry version=v2.7.1
== biggulp.cs.umd.edu (6 distinct, 6 total) ==
Aug 21 18:59:56 biggulp.cs.umd.edu sshd-session[3290968]: error: kex_protocol_error: type 20 seq 2 [preauth]
Aug 21 18:59:56 biggulp.cs.umd.edu sshd-session[3290968]: error: kex_protocol_error: type 30 seq 3 [preauth]
Aug 21 18:59:56 biggulp.cs.umd.edu sshd-session[3290968]: error: kex_protocol_error: type 20 seq 4 [preauth]
Aug 21 18:59:56 biggulp.cs.umd.edu sshd-session[3290968]: error: kex_protocol_error: type 30 seq 5 [preauth]
Aug 21 18:59:58 biggulp.cs.umd.edu sshd-session[3290968]: error: kex_protocol_error: type 20 seq 6 [preauth]
Aug 21 18:59:58 biggulp.cs.umd.edu sshd-session[3290968]: error: kex_protocol_error: type 30 seq 7 [preauth]
== cheezit.cs.umd.edu (6 distinct, 6 total) ==
Aug 21 18:36:20 cheezit.cs.umd.edu sshd-session[2862963]: error: kex_protocol_error: type 20 seq 2 [preauth]
Aug 21 18:36:20 cheezit.cs.umd.edu sshd-session[2862963]: error: kex_protocol_error: type 30 seq 3 [preauth]
Aug 21 18:36:23 cheezit.cs.umd.edu sshd-session[2862963]: error: kex_protocol_error: type 20 seq 4 [preauth]
Aug 21 18:36:23 cheezit.cs.umd.edu sshd-session[2862963]: error: kex_protocol_error: type 30 seq 5 [preauth]
Aug 21 18:36:25 cheezit.cs.umd.edu sshd-session[2862963]: error: kex_protocol_error: type 20 seq 6 [preauth]
Aug 21 18:36:25 cheezit.cs.umd.edu sshd-session[2862963]: error: kex_protocol_error: type 30 seq 7 [preauth]
== csfw00a (1 distinct, 165 total) ==
Aug 21 18:05:14 csfw00a kernel: bnxt_en 0000:09:00.0 eth3: NIC Link is Down [x165]
== hackerman (6 distinct, 11 total) ==
Aug 21 18:20:04 hackerman gnome-software[2060381]: can't reliably fixup error code 4 in domain g-io-error-quark: Not a directory [x4]
Aug 21 18:20:12 hackerman gnome-software[2060381]: Only 0 apps for recent list, hiding
Aug 21 18:20:27 hackerman gnome-software[2060381]: failed to commit changes to dconf: GDBus.Error:org.gtk.GDBus.UnmappedGError.Quark._g_2dfile_2derror_2dquark.Code2: Failed to create file “/adminhomes/sajith/.config/dconf/user.SHH4T3”: Permission denied
Aug 21 18:20:28 hackerman packagekitd[1080945]: Failed to get cache filename for libreoffice [x2]
Aug 21 18:20:28 hackerman packagekitd[1080945]: Failed to get cache filename for kernel [x2]
Aug 21 18:20:38 hackerman packagekitd[1080945]: failed to parse public key for /etc/pki/rpm-gpg/RPM-GPG-KEY-PQC-redhat-release
== idm00 (1 distinct, 1 total) ==
Aug 21 18:51:38 idm00 named[3810278]: client @0x7f48d4030288 10.73.240.42#60446: update '73.10.in-addr.arpa/IN' denied
== idmp0 (1 distinct, 1 total) ==
Aug 21 18:35:56 idmp0 named[1121900]: client @0x7fe40c0115c8 10.73.240.43#56816: update '73.10.in-addr.arpa/IN' denied
== itmon02 (1 distinct, 52 total) ==
Aug 21 18:08:10 itmon02 sshd[1750555]: error: beginning MaxStartups throttling [x52]
== itmon03 (1 distinct, 2 total) ==
Aug 21 18:20:02 itmon03 systemd-timedated[1798782]: /dev/rtc is busy. Is somebody keeping it open continuously? That's not a good idea... Returning a bogus RTC timestamp. [x2]
== krispykreme.cs.umd.edu (6 distinct, 6 total) ==
Aug 21 18:41:57 krispykreme.cs.umd.edu sshd-session[1606516]: error: kex_protocol_error: type 20 seq 2 [preauth]
Aug 21 18:41:57 krispykreme.cs.umd.edu sshd-session[1606516]: error: kex_protocol_error: type 30 seq 3 [preauth]
Aug 21 18:41:59 krispykreme.cs.umd.edu sshd-session[1606516]: error: kex_protocol_error: type 20 seq 4 [preauth]
Aug 21 18:41:59 krispykreme.cs.umd.edu sshd-session[1606516]: error: kex_protocol_error: type 30 seq 5 [preauth]
Aug 21 18:42:01 krispykreme.cs.umd.edu sshd-session[1606516]: error: kex_protocol_error: type 20 seq 6 [preauth]
Aug 21 18:42:01 krispykreme.cs.umd.edu sshd-session[1606516]: error: kex_protocol_error: type 30 seq 7 [preauth]
== netman.cs.umd.edu (1 distinct, 1 total) ==
Aug 21 18:31:14 netman.cs.umd.edu sshd[3543728]: error: PAM: Authentication failure for root from 65.20.216.133
== newhonors2 (1 distinct, 24 total) ==
Aug 21 18:13:03 newhonors2 dhcpcd[1534643]: dhcpcd is not running [x24]
== outbound00.cs.umd.edu (1 distinct, 6 total) ==
Aug 21 18:09:09 outbound00.cs.umd.edu python3[307376]: ldapdb [x6]
== outbound01.cs.umd.edu (1 distinct, 6 total) ==
Aug 21 18:13:06 outbound01.cs.umd.edu python3[2542622]: ldapdb [x6]
== quiss (1 distinct, 1 total) ==
Aug 21 18:21:55 quiss nautilus[2301758]: Attempted to add a non-existent file to the view.
== sentry-docker00.cs.umd.edu (36 distinct, 36 total) ==
Aug 21 18:21:48 sentry-docker00.cs.umd.edu systemd-udevd[877484]: link_config: could not get ethtool features for veth29e4447
Aug 21 18:21:48 sentry-docker00.cs.umd.edu systemd-udevd[877484]: Could not set offload features of veth29e4447: No such device
Aug 21 18:21:48 sentry-docker00.cs.umd.edu systemd-udevd[877514]: Could not generate persistent MAC address for veth35dbd2b: No such file or directory
Aug 21 18:21:48 sentry-docker00.cs.umd.edu systemd-udevd[877515]: Could not generate persistent MAC address for veth7315e44: No such file or directory
Aug 21 18:21:48 sentry-docker00.cs.umd.edu systemd-udevd[877518]: Could not generate persistent MAC address for vetha3dbebd: No such file or directory
Aug 21 18:21:48 sentry-docker00.cs.umd.edu systemd-udevd[877519]: Could not generate persistent MAC address for veth85908f7: No such file or directory
Aug 21 18:21:48 sentry-docker00.cs.umd.edu systemd-udevd[877531]: Could not generate persistent MAC address for vethff473ac: No such file or directory
Aug 21 18:21:48 sentry-docker00.cs.umd.edu systemd-udevd[877527]: Could not generate persistent MAC address for veth229b31c: No such file or directory
Aug 21 18:21:48 sentry-docker00.cs.umd.edu systemd-udevd[877527]: Could not generate persistent MAC address for veth228179c: No such file or directory
Aug 21 18:21:48 sentry-docker00.cs.umd.edu systemd-udevd[877524]: Could not generate persistent MAC address for veth503cc56: No such file or directory
Aug 21 18:21:48 sentry-docker00.cs.umd.edu systemd-udevd[877572]: Could not generate persistent MAC address for veth98b1197: No such file or directory
Aug 21 18:21:48 sentry-docker00.cs.umd.edu systemd-udevd[877573]: Could not generate persistent MAC address for veth41fcbbe: No such file or directory
Aug 21 18:41:56 sentry-docker00.cs.umd.edu systemd-udevd[886839]: link_config: could not get ethtool features for vethff473ac
Aug 21 18:41:56 sentry-docker00.cs.umd.edu systemd-udevd[886839]: Could not set offload features of vethff473ac: No such device
Aug 21 18:41:56 sentry-docker00.cs.umd.edu systemd-udevd[886902]: Could not generate persistent MAC address for veth39c2c8e: No such file or directory
Aug 21 18:41:56 sentry-docker00.cs.umd.edu systemd-udevd[886903]: Could not generate persistent MAC address for vethaabf43e: No such file or directory
Aug 21 18:41:56 sentry-docker00.cs.umd.edu systemd-udevd[886921]: Could not generate persistent MAC address for vethc86bb91: No such file or directory
Aug 21 18:41:56 sentry-docker00.cs.umd.edu systemd-udevd[886903]: Could not generate persistent MAC address for veth12e039a: No such file or directory
Aug 21 18:41:56 sentry-docker00.cs.umd.edu systemd-udevd[886903]: Could not generate persistent MAC address for vethab7aac9: No such file or directory
Aug 21 18:41:56 sentry-docker00.cs.umd.edu systemd-udevd[886907]: Could not generate persistent MAC address for veth0c3c77f: No such file or directory
Aug 21 18:41:56 sentry-docker00.cs.umd.edu systemd-udevd[886903]: Could not generate persistent MAC address for veth7419955: No such file or directory
Aug 21 18:41:56 sentry-docker00.cs.umd.edu systemd-udevd[886907]: Could not generate persistent MAC address for vethf1f69cb: No such file or directory
Aug 21 18:41:56 sentry-docker00.cs.umd.edu systemd-udevd[886942]: Could not generate persistent MAC address for veth38ee459: No such file or directory
Aug 21 18:41:56 sentry-docker00.cs.umd.edu systemd-udevd[886943]: Could not generate persistent MAC address for vethfc810fa: No such file or directory
Aug 21 19:02:04 sentry-docker00.cs.umd.edu systemd-udevd[896355]: link_config: could not get ethtool features for veth38ee459
Aug 21 19:02:04 sentry-docker00.cs.umd.edu systemd-udevd[896355]: Could not set offload features of veth38ee459: No such device
Aug 21 19:02:05 sentry-docker00.cs.umd.edu systemd-udevd[896387]: Could not generate persistent MAC address for veth3500ab4: No such file or directory
Aug 21 19:02:05 sentry-docker00.cs.umd.edu systemd-udevd[896386]: Could not generate persistent MAC address for veth1f029e1: No such file or directory
Aug 21 19:02:05 sentry-docker00.cs.umd.edu systemd-udevd[896390]: Could not generate persistent MAC address for vethf16299a: No such file or directory
Aug 21 19:02:05 sentry-docker00.cs.umd.edu systemd-udevd[896391]: Could not generate persistent MAC address for vethb0e8b23: No such file or directory
... 6 more distinct messages not shown
== strawberry (2 distinct, 8 total) ==
Aug 21 18:09:44 strawberry udisksd[1067]: Error performing housekeeping for drive /org/freedesktop/UDisks2/drives/ST2000DM001_1CH164_W1E8J5KJ: Error updating SMART data: Error sending ATA command CHECK POWER MODE: Unexpected sense data returned:#0120000: 00 00 00 00 00 00 00 00 00 00 00 00 00 00 00 00 ................#0120010: 00 00 00 00 00 00 00 00 00 00 00 00 00 00 00 00 ................#012 (g-io-error-quark, 0) [x6]
Aug 21 18:34:42 strawberry smartd[5314]: Device: /dev/sda [SAT], failed to read SMART Attribute Data [x2]
1
0
Command: /usr/local/sbin/syslog-digest.py
Time : 0.0941s
Status : exited 0
Output :
Syslog digest — 2026-08-21 18:05 EDT
Processed 3,303 lines, filtered 2,226 (67%). 1,077 unknown (834 distinct) from 18 host(s).
== ar102 (774 distinct, 774 total) ==
Aug 21 16:41:34 ar102 cosmic-session[6072]: [2026-08-21T20:41:34Z ERROR cosmic_osd::components::audio] failed to connect to cosmic-settings's varlink service: Io(Os { code: 111, kind: ConnectionRefused, message: "Connection refused" })
Aug 21 16:41:37 ar102 cosmic-session[6072]: [2026-08-21T20:41:37Z ERROR cosmic_osd::components::audio] failed to connect to cosmic-settings's varlink service: Io(Os { code: 111, kind: ConnectionRefused, message: "Connection refused" })
Aug 21 16:41:40 ar102 cosmic-session[6072]: [2026-08-21T20:41:40Z ERROR cosmic_osd::components::audio] failed to connect to cosmic-settings's varlink service: Io(Os { code: 111, kind: ConnectionRefused, message: "Connection refused" })
Aug 21 16:41:43 ar102 cosmic-session[6072]: [2026-08-21T20:41:43Z ERROR cosmic_osd::components::audio] failed to connect to cosmic-settings's varlink service: Io(Os { code: 111, kind: ConnectionRefused, message: "Connection refused" })
Aug 21 16:41:46 ar102 cosmic-session[6072]: [2026-08-21T20:41:46Z ERROR cosmic_osd::components::audio] failed to connect to cosmic-settings's varlink service: Io(Os { code: 111, kind: ConnectionRefused, message: "Connection refused" })
Aug 21 16:41:49 ar102 cosmic-session[6072]: [2026-08-21T20:41:49Z ERROR cosmic_osd::components::audio] failed to connect to cosmic-settings's varlink service: Io(Os { code: 111, kind: ConnectionRefused, message: "Connection refused" })
Aug 21 16:41:52 ar102 cosmic-session[6072]: [2026-08-21T20:41:52Z ERROR cosmic_osd::components::audio] failed to connect to cosmic-settings's varlink service: Io(Os { code: 111, kind: ConnectionRefused, message: "Connection refused" })
Aug 21 16:41:55 ar102 cosmic-session[6072]: [2026-08-21T20:41:55Z ERROR cosmic_osd::components::audio] failed to connect to cosmic-settings's varlink service: Io(Os { code: 111, kind: ConnectionRefused, message: "Connection refused" })
Aug 21 16:41:58 ar102 cosmic-session[6072]: [2026-08-21T20:41:58Z ERROR cosmic_osd::components::audio] failed to connect to cosmic-settings's varlink service: Io(Os { code: 111, kind: ConnectionRefused, message: "Connection refused" })
Aug 21 16:42:01 ar102 cosmic-session[6072]: [2026-08-21T20:42:01Z ERROR cosmic_osd::components::audio] failed to connect to cosmic-settings's varlink service: Io(Os { code: 111, kind: ConnectionRefused, message: "Connection refused" })
Aug 21 16:42:04 ar102 cosmic-session[6072]: [2026-08-21T20:42:04Z ERROR cosmic_osd::components::audio] failed to connect to cosmic-settings's varlink service: Io(Os { code: 111, kind: ConnectionRefused, message: "Connection refused" })
Aug 21 16:42:07 ar102 cosmic-session[6072]: [2026-08-21T20:42:07Z ERROR cosmic_osd::components::audio] failed to connect to cosmic-settings's varlink service: Io(Os { code: 111, kind: ConnectionRefused, message: "Connection refused" })
Aug 21 16:42:10 ar102 cosmic-session[6072]: [2026-08-21T20:42:10Z ERROR cosmic_osd::components::audio] failed to connect to cosmic-settings's varlink service: Io(Os { code: 111, kind: ConnectionRefused, message: "Connection refused" })
Aug 21 16:42:13 ar102 cosmic-session[6072]: [2026-08-21T20:42:13Z ERROR cosmic_osd::components::audio] failed to connect to cosmic-settings's varlink service: Io(Os { code: 111, kind: ConnectionRefused, message: "Connection refused" })
Aug 21 16:42:16 ar102 cosmic-session[6072]: [2026-08-21T20:42:16Z ERROR cosmic_osd::components::audio] failed to connect to cosmic-settings's varlink service: Io(Os { code: 111, kind: ConnectionRefused, message: "Connection refused" })
Aug 21 16:42:19 ar102 cosmic-session[6072]: [2026-08-21T20:42:19Z ERROR cosmic_osd::components::audio] failed to connect to cosmic-settings's varlink service: Io(Os { code: 111, kind: ConnectionRefused, message: "Connection refused" })
Aug 21 16:42:22 ar102 cosmic-session[6072]: [2026-08-21T20:42:22Z ERROR cosmic_osd::components::audio] failed to connect to cosmic-settings's varlink service: Io(Os { code: 111, kind: ConnectionRefused, message: "Connection refused" })
Aug 21 16:42:25 ar102 cosmic-session[6072]: [2026-08-21T20:42:25Z ERROR cosmic_osd::components::audio] failed to connect to cosmic-settings's varlink service: Io(Os { code: 111, kind: ConnectionRefused, message: "Connection refused" })
Aug 21 16:42:28 ar102 cosmic-session[6072]: [2026-08-21T20:42:28Z ERROR cosmic_osd::components::audio] failed to connect to cosmic-settings's varlink service: Io(Os { code: 111, kind: ConnectionRefused, message: "Connection refused" })
Aug 21 16:42:31 ar102 cosmic-session[6072]: [2026-08-21T20:42:31Z ERROR cosmic_osd::components::audio] failed to connect to cosmic-settings's varlink service: Io(Os { code: 111, kind: ConnectionRefused, message: "Connection refused" })
Aug 21 16:42:34 ar102 cosmic-session[6072]: [2026-08-21T20:42:34Z ERROR cosmic_osd::components::audio] failed to connect to cosmic-settings's varlink service: Io(Os { code: 111, kind: ConnectionRefused, message: "Connection refused" })
Aug 21 16:42:37 ar102 cosmic-session[6072]: [2026-08-21T20:42:37Z ERROR cosmic_osd::components::audio] failed to connect to cosmic-settings's varlink service: Io(Os { code: 111, kind: ConnectionRefused, message: "Connection refused" })
Aug 21 16:42:40 ar102 cosmic-session[6072]: [2026-08-21T20:42:40Z ERROR cosmic_osd::components::audio] failed to connect to cosmic-settings's varlink service: Io(Os { code: 111, kind: ConnectionRefused, message: "Connection refused" })
Aug 21 16:42:43 ar102 cosmic-session[6072]: [2026-08-21T20:42:43Z ERROR cosmic_osd::components::audio] failed to connect to cosmic-settings's varlink service: Io(Os { code: 111, kind: ConnectionRefused, message: "Connection refused" })
Aug 21 16:42:46 ar102 cosmic-session[6072]: [2026-08-21T20:42:46Z ERROR cosmic_osd::components::audio] failed to connect to cosmic-settings's varlink service: Io(Os { code: 111, kind: ConnectionRefused, message: "Connection refused" })
Aug 21 16:42:49 ar102 cosmic-session[6072]: [2026-08-21T20:42:49Z ERROR cosmic_osd::components::audio] failed to connect to cosmic-settings's varlink service: Io(Os { code: 111, kind: ConnectionRefused, message: "Connection refused" })
Aug 21 16:42:52 ar102 cosmic-session[6072]: [2026-08-21T20:42:52Z ERROR cosmic_osd::components::audio] failed to connect to cosmic-settings's varlink service: Io(Os { code: 111, kind: ConnectionRefused, message: "Connection refused" })
Aug 21 16:42:55 ar102 cosmic-session[6072]: [2026-08-21T20:42:55Z ERROR cosmic_osd::components::audio] failed to connect to cosmic-settings's varlink service: Io(Os { code: 111, kind: ConnectionRefused, message: "Connection refused" })
Aug 21 16:42:58 ar102 cosmic-session[6072]: [2026-08-21T20:42:58Z ERROR cosmic_osd::components::audio] failed to connect to cosmic-settings's varlink service: Io(Os { code: 111, kind: ConnectionRefused, message: "Connection refused" })
Aug 21 16:43:01 ar102 cosmic-session[6072]: [2026-08-21T20:43:01Z ERROR cosmic_osd::components::audio] failed to connect to cosmic-settings's varlink service: Io(Os { code: 111, kind: ConnectionRefused, message: "Connection refused" })
... 744 more distinct messages not shown
== atif01.cs.umd.edu (1 distinct, 1 total) ==
Aug 21 17:17:24 atif01.cs.umd.edu kernel: net_ratelimit: 12 callbacks suppressed
== b0b02.cs.umd.edu (1 distinct, 1 total) ==
Aug 21 17:07:48 b0b02.cs.umd.edu rustdesk[724861]: cannot open display:
== csfw00a (1 distinct, 148 total) ==
Aug 21 17:04:46 csfw00a kernel: bnxt_en 0000:09:00.0 eth3: NIC Link is Down [x148]
== frozone (1 distinct, 1 total) ==
Aug 21 17:35:07 frozone systemd-tmpfiles[3418170]: Failed to remove "/var/tmp/test.log", ignoring: Operation not permitted
== hackerman (7 distinct, 12 total) ==
Aug 21 17:19:01 hackerman gnome-software[2060381]: failed to commit changes to dconf: GDBus.Error:org.gtk.GDBus.UnmappedGError.Quark._g_2dfile_2derror_2dquark.Code2: Failed to create file “/adminhomes/sajith/.config/dconf/user.I8XAU3”: Permission denied
Aug 21 17:20:04 hackerman gnome-software[2060381]: can't reliably fixup error code 4 in domain g-io-error-quark: Not a directory [x4]
Aug 21 17:20:12 hackerman gnome-software[2060381]: Only 0 apps for recent list, hiding
Aug 21 17:20:27 hackerman gnome-software[2060381]: failed to commit changes to dconf: GDBus.Error:org.gtk.GDBus.UnmappedGError.Quark._g_2dfile_2derror_2dquark.Code2: Failed to create file “/adminhomes/sajith/.config/dconf/user.ETG6T3”: Permission denied
Aug 21 17:20:28 hackerman packagekitd[1067303]: Failed to get cache filename for libreoffice [x2]
Aug 21 17:20:28 hackerman packagekitd[1067303]: Failed to get cache filename for kernel [x2]
Aug 21 17:20:38 hackerman packagekitd[1067303]: failed to parse public key for /etc/pki/rpm-gpg/RPM-GPG-KEY-PQC-redhat-release
== idm00 (1 distinct, 1 total) ==
Aug 21 17:51:38 idm00 named[3810278]: client @0x7f48d805e5a8 10.73.240.42#54815: update '73.10.in-addr.arpa/IN' denied
== idmh1 (2 distinct, 2 total) ==
Aug 21 17:34:26 idmh1 irqbalance[1033]: Cannot change IRQ 38 affinity: Operation not permitted
Aug 21 17:34:26 idmh1 irqbalance[1033]: IRQ 38 affinity is now unmanaged
== idmp0 (1 distinct, 1 total) ==
Aug 21 17:35:56 idmp0 named[1121900]: client @0x7fe3f8000cc8 10.73.240.43#54558: update '73.10.in-addr.arpa/IN' denied
== itmon02 (1 distinct, 52 total) ==
Aug 21 17:07:59 itmon02 sshd[1750555]: error: beginning MaxStartups throttling [x52]
== itmon03 (1 distinct, 1 total) ==
Aug 21 17:20:02 itmon03 systemd-timedated[1795805]: /dev/rtc is busy. Is somebody keeping it open continuously? That's not a good idea... Returning a bogus RTC timestamp.
== newhonors2 (1 distinct, 24 total) ==
Aug 21 17:13:02 newhonors2 dhcpcd[1532800]: dhcpcd is not running [x24]
== outbound00.cs.umd.edu (1 distinct, 6 total) ==
Aug 21 17:09:09 outbound00.cs.umd.edu python3[293360]: ldapdb [x6]
== outbound01.cs.umd.edu (1 distinct, 6 total) ==
Aug 21 17:13:06 outbound01.cs.umd.edu python3[2528432]: ldapdb [x6]
== sebatinsky.cs.umd.edu (1 distinct, 1 total) ==
Aug 21 17:10:14 sebatinsky.cs.umd.edu kernel: hpet1: lost 1 rtc interrupts
== sentry-docker00.cs.umd.edu (36 distinct, 36 total) ==
Aug 21 17:21:23 sentry-docker00.cs.umd.edu systemd-udevd[849028]: link_config: could not get ethtool features for veth154b447
Aug 21 17:21:23 sentry-docker00.cs.umd.edu systemd-udevd[849028]: Could not set offload features of veth154b447: No such device
Aug 21 17:21:23 sentry-docker00.cs.umd.edu systemd-udevd[849056]: Could not generate persistent MAC address for veth281c7e3: No such file or directory
Aug 21 17:21:23 sentry-docker00.cs.umd.edu systemd-udevd[849057]: Could not generate persistent MAC address for veth7a52d8c: No such file or directory
Aug 21 17:21:23 sentry-docker00.cs.umd.edu systemd-udevd[849060]: Could not generate persistent MAC address for vethef82ab6: No such file or directory
Aug 21 17:21:23 sentry-docker00.cs.umd.edu systemd-udevd[849061]: Could not generate persistent MAC address for veth068f9e7: No such file or directory
Aug 21 17:21:23 sentry-docker00.cs.umd.edu systemd-udevd[849084]: Could not generate persistent MAC address for vethc9ed3c3: No such file or directory
Aug 21 17:21:23 sentry-docker00.cs.umd.edu systemd-udevd[849085]: Could not generate persistent MAC address for veth9f4af32: No such file or directory
Aug 21 17:21:23 sentry-docker00.cs.umd.edu systemd-udevd[849105]: Could not generate persistent MAC address for vetha9be50c: No such file or directory
Aug 21 17:21:23 sentry-docker00.cs.umd.edu systemd-udevd[849104]: Could not generate persistent MAC address for veth5fdb145: No such file or directory
Aug 21 17:21:23 sentry-docker00.cs.umd.edu systemd-udevd[849095]: Could not generate persistent MAC address for veth43fbe72: No such file or directory
Aug 21 17:21:23 sentry-docker00.cs.umd.edu systemd-udevd[849105]: Could not generate persistent MAC address for veth1acdf3b: No such file or directory
Aug 21 17:41:31 sentry-docker00.cs.umd.edu systemd-udevd[858634]: link_config: could not get ethtool features for veth281c7e3
Aug 21 17:41:31 sentry-docker00.cs.umd.edu systemd-udevd[858634]: Could not set offload features of veth281c7e3: No such device
Aug 21 17:41:31 sentry-docker00.cs.umd.edu systemd-udevd[858667]: Could not generate persistent MAC address for veth8948d82: No such file or directory
Aug 21 17:41:31 sentry-docker00.cs.umd.edu systemd-udevd[858668]: Could not generate persistent MAC address for vetha1d89f5: No such file or directory
Aug 21 17:41:31 sentry-docker00.cs.umd.edu systemd-udevd[858686]: Could not generate persistent MAC address for veth4d411ed: No such file or directory
Aug 21 17:41:31 sentry-docker00.cs.umd.edu systemd-udevd[858692]: Could not generate persistent MAC address for vethfaf1e53: No such file or directory
Aug 21 17:41:31 sentry-docker00.cs.umd.edu systemd-udevd[858681]: Could not generate persistent MAC address for vethfc19169: No such file or directory
Aug 21 17:41:31 sentry-docker00.cs.umd.edu systemd-udevd[858678]: Could not generate persistent MAC address for vethc18dfbf: No such file or directory
Aug 21 17:41:31 sentry-docker00.cs.umd.edu systemd-udevd[858773]: Could not generate persistent MAC address for veth43856f7: No such file or directory
Aug 21 17:41:31 sentry-docker00.cs.umd.edu systemd-udevd[858775]: Could not generate persistent MAC address for veth69ba2f8: No such file or directory
Aug 21 17:41:31 sentry-docker00.cs.umd.edu systemd-udevd[858784]: Could not generate persistent MAC address for veth695c0d5: No such file or directory
Aug 21 17:41:31 sentry-docker00.cs.umd.edu systemd-udevd[858810]: Could not generate persistent MAC address for veth823fb8c: No such file or directory
Aug 21 18:01:39 sentry-docker00.cs.umd.edu systemd-udevd[868046]: link_config: could not get ethtool features for vethfc19169
Aug 21 18:01:39 sentry-docker00.cs.umd.edu systemd-udevd[868046]: Could not set offload features of vethfc19169: No such device
Aug 21 18:01:40 sentry-docker00.cs.umd.edu systemd-udevd[868071]: Could not generate persistent MAC address for veth4807b89: No such file or directory
Aug 21 18:01:40 sentry-docker00.cs.umd.edu systemd-udevd[868072]: Could not generate persistent MAC address for vethef9c7d3: No such file or directory
Aug 21 18:01:40 sentry-docker00.cs.umd.edu systemd-udevd[868090]: Could not generate persistent MAC address for veth22ab8d6: No such file or directory
Aug 21 18:01:40 sentry-docker00.cs.umd.edu systemd-udevd[868091]: Could not generate persistent MAC address for vetha3c0be7: No such file or directory
... 6 more distinct messages not shown
== strawberry (2 distinct, 8 total) ==
Aug 21 17:09:44 strawberry udisksd[1067]: Error performing housekeeping for drive /org/freedesktop/UDisks2/drives/ST2000DM001_1CH164_W1E8J5KJ: Error updating SMART data: Error sending ATA command CHECK POWER MODE: Unexpected sense data returned:#0120000: 00 00 00 00 00 00 00 00 00 00 00 00 00 00 00 00 ................#0120010: 00 00 00 00 00 00 00 00 00 00 00 00 00 00 00 00 ................#012 (g-io-error-quark, 0) [x6]
Aug 21 17:34:42 strawberry smartd[5314]: Device: /dev/sda [SAT], failed to read SMART Attribute Data [x2]
== talkhosts9 (1 distinct, 2 total) ==
Aug 21 17:17:19 talkhosts9 setroubleshoot[618226]: SELinux is preventing /usr/bin/lsof from getattr access on the unix_stream_socket unix_stream_socket. For complete SELinux messages run: sealert -l a6df89b3-c497-469c-8232-c4fde0508abf [x2]
1
0
Command: /usr/local/sbin/syslog-digest.py
Time : 0.1016s
Status : exited 0
Output :
Syslog digest — 2026-08-21 17:05 EDT
Processed 3,516 lines, filtered 2,303 (65%). 1,213 unknown (967 distinct) from 24 host(s).
== ar102 (730 distinct, 730 total) ==
Aug 21 16:05:02 ar102 cosmic-session[6072]: [2026-08-21T20:05:02Z ERROR cosmic_osd::components::audio] failed to connect to cosmic-settings's varlink service: Io(Os { code: 111, kind: ConnectionRefused, message: "Connection refused" })
Aug 21 16:05:05 ar102 cosmic-session[6072]: [2026-08-21T20:05:05Z ERROR cosmic_osd::components::audio] failed to connect to cosmic-settings's varlink service: Io(Os { code: 111, kind: ConnectionRefused, message: "Connection refused" })
Aug 21 16:05:08 ar102 cosmic-session[6072]: [2026-08-21T20:05:08Z ERROR cosmic_osd::components::audio] failed to connect to cosmic-settings's varlink service: Io(Os { code: 111, kind: ConnectionRefused, message: "Connection refused" })
Aug 21 16:05:11 ar102 cosmic-session[6072]: [2026-08-21T20:05:11Z ERROR cosmic_osd::components::audio] failed to connect to cosmic-settings's varlink service: Io(Os { code: 111, kind: ConnectionRefused, message: "Connection refused" })
Aug 21 16:05:14 ar102 cosmic-session[6072]: [2026-08-21T20:05:14Z ERROR cosmic_osd::components::audio] failed to connect to cosmic-settings's varlink service: Io(Os { code: 111, kind: ConnectionRefused, message: "Connection refused" })
Aug 21 16:05:17 ar102 cosmic-session[6072]: [2026-08-21T20:05:17Z ERROR cosmic_osd::components::audio] failed to connect to cosmic-settings's varlink service: Io(Os { code: 111, kind: ConnectionRefused, message: "Connection refused" })
Aug 21 16:05:20 ar102 cosmic-session[6072]: [2026-08-21T20:05:20Z ERROR cosmic_osd::components::audio] failed to connect to cosmic-settings's varlink service: Io(Os { code: 111, kind: ConnectionRefused, message: "Connection refused" })
Aug 21 16:05:23 ar102 cosmic-session[6072]: [2026-08-21T20:05:23Z ERROR cosmic_osd::components::audio] failed to connect to cosmic-settings's varlink service: Io(Os { code: 111, kind: ConnectionRefused, message: "Connection refused" })
Aug 21 16:05:26 ar102 cosmic-session[6072]: [2026-08-21T20:05:26Z ERROR cosmic_osd::components::audio] failed to connect to cosmic-settings's varlink service: Io(Os { code: 111, kind: ConnectionRefused, message: "Connection refused" })
Aug 21 16:05:29 ar102 cosmic-session[6072]: [2026-08-21T20:05:29Z ERROR cosmic_osd::components::audio] failed to connect to cosmic-settings's varlink service: Io(Os { code: 111, kind: ConnectionRefused, message: "Connection refused" })
Aug 21 16:05:32 ar102 cosmic-session[6072]: [2026-08-21T20:05:32Z ERROR cosmic_osd::components::audio] failed to connect to cosmic-settings's varlink service: Io(Os { code: 111, kind: ConnectionRefused, message: "Connection refused" })
Aug 21 16:05:35 ar102 cosmic-session[6072]: [2026-08-21T20:05:35Z ERROR cosmic_osd::components::audio] failed to connect to cosmic-settings's varlink service: Io(Os { code: 111, kind: ConnectionRefused, message: "Connection refused" })
Aug 21 16:05:38 ar102 cosmic-session[6072]: [2026-08-21T20:05:38Z ERROR cosmic_osd::components::audio] failed to connect to cosmic-settings's varlink service: Io(Os { code: 111, kind: ConnectionRefused, message: "Connection refused" })
Aug 21 16:05:41 ar102 cosmic-session[6072]: [2026-08-21T20:05:41Z ERROR cosmic_osd::components::audio] failed to connect to cosmic-settings's varlink service: Io(Os { code: 111, kind: ConnectionRefused, message: "Connection refused" })
Aug 21 16:05:44 ar102 cosmic-session[6072]: [2026-08-21T20:05:44Z ERROR cosmic_osd::components::audio] failed to connect to cosmic-settings's varlink service: Io(Os { code: 111, kind: ConnectionRefused, message: "Connection refused" })
Aug 21 16:05:47 ar102 cosmic-session[6072]: [2026-08-21T20:05:47Z ERROR cosmic_osd::components::audio] failed to connect to cosmic-settings's varlink service: Io(Os { code: 111, kind: ConnectionRefused, message: "Connection refused" })
Aug 21 16:05:50 ar102 cosmic-session[6072]: [2026-08-21T20:05:50Z ERROR cosmic_osd::components::audio] failed to connect to cosmic-settings's varlink service: Io(Os { code: 111, kind: ConnectionRefused, message: "Connection refused" })
Aug 21 16:05:53 ar102 cosmic-session[6072]: [2026-08-21T20:05:53Z ERROR cosmic_osd::components::audio] failed to connect to cosmic-settings's varlink service: Io(Os { code: 111, kind: ConnectionRefused, message: "Connection refused" })
Aug 21 16:05:56 ar102 cosmic-session[6072]: [2026-08-21T20:05:56Z ERROR cosmic_osd::components::audio] failed to connect to cosmic-settings's varlink service: Io(Os { code: 111, kind: ConnectionRefused, message: "Connection refused" })
Aug 21 16:05:59 ar102 cosmic-session[6072]: [2026-08-21T20:05:59Z ERROR cosmic_osd::components::audio] failed to connect to cosmic-settings's varlink service: Io(Os { code: 111, kind: ConnectionRefused, message: "Connection refused" })
Aug 21 16:06:02 ar102 cosmic-session[6072]: [2026-08-21T20:06:02Z ERROR cosmic_osd::components::audio] failed to connect to cosmic-settings's varlink service: Io(Os { code: 111, kind: ConnectionRefused, message: "Connection refused" })
Aug 21 16:06:05 ar102 cosmic-session[6072]: [2026-08-21T20:06:05Z ERROR cosmic_osd::components::audio] failed to connect to cosmic-settings's varlink service: Io(Os { code: 111, kind: ConnectionRefused, message: "Connection refused" })
Aug 21 16:06:08 ar102 cosmic-session[6072]: [2026-08-21T20:06:08Z ERROR cosmic_osd::components::audio] failed to connect to cosmic-settings's varlink service: Io(Os { code: 111, kind: ConnectionRefused, message: "Connection refused" })
Aug 21 16:06:11 ar102 cosmic-session[6072]: [2026-08-21T20:06:11Z ERROR cosmic_osd::components::audio] failed to connect to cosmic-settings's varlink service: Io(Os { code: 111, kind: ConnectionRefused, message: "Connection refused" })
Aug 21 16:06:14 ar102 cosmic-session[6072]: [2026-08-21T20:06:14Z ERROR cosmic_osd::components::audio] failed to connect to cosmic-settings's varlink service: Io(Os { code: 111, kind: ConnectionRefused, message: "Connection refused" })
Aug 21 16:06:17 ar102 cosmic-session[6072]: [2026-08-21T20:06:17Z ERROR cosmic_osd::components::audio] failed to connect to cosmic-settings's varlink service: Io(Os { code: 111, kind: ConnectionRefused, message: "Connection refused" })
Aug 21 16:06:20 ar102 cosmic-session[6072]: [2026-08-21T20:06:20Z ERROR cosmic_osd::components::audio] failed to connect to cosmic-settings's varlink service: Io(Os { code: 111, kind: ConnectionRefused, message: "Connection refused" })
Aug 21 16:06:23 ar102 cosmic-session[6072]: [2026-08-21T20:06:23Z ERROR cosmic_osd::components::audio] failed to connect to cosmic-settings's varlink service: Io(Os { code: 111, kind: ConnectionRefused, message: "Connection refused" })
Aug 21 16:06:26 ar102 cosmic-session[6072]: [2026-08-21T20:06:26Z ERROR cosmic_osd::components::audio] failed to connect to cosmic-settings's varlink service: Io(Os { code: 111, kind: ConnectionRefused, message: "Connection refused" })
Aug 21 16:06:29 ar102 cosmic-session[6072]: [2026-08-21T20:06:29Z ERROR cosmic_osd::components::audio] failed to connect to cosmic-settings's varlink service: Io(Os { code: 111, kind: ConnectionRefused, message: "Connection refused" })
... 700 more distinct messages not shown
== b0b02.cs.umd.edu (1 distinct, 1 total) ==
Aug 21 16:07:45 b0b02.cs.umd.edu rustdesk[709775]: cannot open display:
== bachata (10 distinct, 10 total) ==
Aug 21 16:26:04 bachata smbd[3409537]: [2026/08/21 16:26:04.280799, 0] ../../source3/smbd/smb2_service.c:117(chdir_current_service)
Aug 21 16:26:04 bachata smbd[3409537]: chdir_current_service: vfs_ChDir(/fs/junkfood/mount) failed: Permission denied. Current token: uid=11255, gid=11255, 12 groups: 11255 319000009 25038 15294 15229 755 25030 25025 30880 25029 770 15026
Aug 21 16:26:04 bachata smbd[3409537]: [2026/08/21 16:26:04.281859, 0] ../../source3/smbd/smbXsrv_tcon.c:914(smbXsrv_tcon_disconnect)
Aug 21 16:26:04 bachata smbd[3409537]: smbXsrv_tcon_disconnect: disconnect(0x6c9d21ea, 'mount'): chdir_current_service() failed: NT_STATUS_INTERNAL_ERROR
Aug 21 16:26:04 bachata smbd[3409537]: [2026/08/21 16:26:04.283396, 0] ../../source3/smbd/smbXsrv_tcon.c:1028(smbXsrv_tcon_disconnect_all)
Aug 21 16:26:04 bachata smbd[3409537]: smbXsrv_tcon_disconnect_all: count[2] errors[1] first[NT_STATUS_INTERNAL_ERROR]
Aug 21 16:26:04 bachata smbd[3409537]: [2026/08/21 16:26:04.283568, 0] ../../source3/smbd/smbXsrv_session.c:1900(smbXsrv_session_logoff)
Aug 21 16:26:04 bachata smbd[3409537]: smbXsrv_session_logoff: smbXsrv_session_logoff(0x988d6242): smb2srv_tcon_disconnect_all() failed: NT_STATUS_INTERNAL_ERROR
Aug 21 16:26:04 bachata smbd[3409537]: [2026/08/21 16:26:04.283676, 0] ../../source3/smbd/smbXsrv_session.c:1728(smbXsrv_session_remove_channel_done)
Aug 21 16:26:04 bachata smbd[3409537]: smbXsrv_session_remove_channel_done: smbXsrv_session_logoff(2559402562) failed: NT_STATUS_INTERNAL_ERROR
== bigtuna (6 distinct, 6 total) ==
Aug 21 16:23:00 bigtuna krb5_child[1337701]: Preauthentication failed
Aug 21 17:00:15 bigtuna gsd-subman[1077687]: g_atomic_ref_count_dec: assertion 'g_atomic_int_get (arc) > 0' failed
Aug 21 17:00:28 bigtuna org.gnome.Shell.desktop[1362352] The XKEYBOARD keymap compiler (xkbcomp) reports:
Aug 21 17:00:28 bigtuna org.gnome.Shell.desktop[1362352] > Warning: Unsupported maximum keycode 708, clipping.
Aug 21 17:00:28 bigtuna org.gnome.Shell.desktop[1362352] > X11 cannot support keycodes above 255.
Aug 21 17:00:28 bigtuna org.gnome.Shell.desktop[1362352] Errors from xkbcomp are not fatal to the X server
== borealis (7 distinct, 7 total) ==
Aug 21 17:00:06 borealis gsd-subman[884041]: g_atomic_ref_count_dec: assertion 'g_atomic_int_get (arc) > 0' failed
Aug 21 17:00:06 borealis xdg-desktop-por[884182]: Caught PipeWire error: connection error
Aug 21 17:00:08 borealis org.gnome.Shell.desktop[1008686] The XKEYBOARD keymap compiler (xkbcomp) reports:
Aug 21 17:00:08 borealis org.gnome.Shell.desktop[1008686] > Warning: Unsupported maximum keycode 708, clipping.
Aug 21 17:00:08 borealis org.gnome.Shell.desktop[1008686] > X11 cannot support keycodes above 255.
Aug 21 17:00:08 borealis org.gnome.Shell.desktop[1008686] Errors from xkbcomp are not fatal to the X server
Aug 21 17:00:14 borealis systemd-coredump[1008353]: Process 884538 (firefox) of user 119431696 dumped core.#012#012Stack trace of thread 884560:#012#0 0x00007fbd3848d38c __pthread_kill_implementation (libc.so.6 + 0x8d38c)#012#1 0x00007fbd3843fa86 raise (libc.so.6 + 0x3fa86)#012#2 0x00007fbd2cf76155 _ZN13nsProfileLock18FatalSignalHandlerEiP9siginfo_tPv (libxul.so + 0x5976155)#012#3 0x00007fbd3843fb30 __restore_rt (libc.so.6 + 0x3fb30)#012#4 0x00007fbd2c417446 _ZN7mozilla6widget24WlCompositorCrashHandlerEv (libxul.so + 0x4e17446)#012#5 0x00007fbd2c4191fc _ZN17ProxiedConnection14ProcessFailureEv (libxul.so + 0x4e191fc)#012#6 0x00007fbd2c41b309 _ZN12WaylandProxy18ProcessConnectionsEv (libxul.so + 0x4e1b309)#012#7 0x00007fbd2c41b404 _ZN12WaylandProxy3RunEv (libxul.so + 0x4e1b404)#012#8 0x00007fbd2c41b484 _ZN12WaylandProxy14RunProxyThreadEPS_ (libxul.so + 0x4e1b484)#012#9 0x00007fbd3848b569 start_thread (libc.so.6 + 0x8b569)#012#10 0x00007fbd38510760 __clone3 (libc.so.6 + 0x11076
0)#012#012Stack trace of thread 884557:#012#0 0x00007fbd384ff44c read (libc.so.6 + 0xff44c)#012#1 0x00007fbd2cbd5cd3 _ZN24AsyncSignalControlThread5WatchEv (libxul.so + 0x55d5cd3)#012#2 0x00007fbd2cbd5e8c _ZL29AsyncSignalControlThreadEntryPv (libxul.so + 0x55d5e8c)#012#3 0x00007fbd3848b569 start_thread (libc.so.6 + 0x8b569)#012#4 0x00007fbd38510760 __clone3 (libc.so.6 + 0x110760)#012#012Stack trace of thread 884538:#012#0 0x00007fbd3848854a __futex_abstimed_wait_common (libc.so.6 + 0x8854a)#012#1 0x00007fbd3848ab32 pthread_cond_wait@@GLIBC_2.3.2 (libc.so.6 + 0x8ab32)#012#2 0x0000559f06e44ddb _ZN7mozilla6detail21ConditionVariableImpl4waitERNS0_9MutexImplE (firefox + 0x5fddb)#012#3 0x0000559f06e44fd8 _ZN7mozilla6detail21ConditionVariableImpl8wait_forERNS0_9MutexImplERKNS_16BaseTimeDurationINS_27TimeDurationValueCalculatorEEE (firefox + 0x5ffd8)#012#4 0x00007fbd28eb43ec _ZN7mozilla3ipc14MessageChannel17WaitForSyncNotifyEv (libxul.so + 0x18b43ec)#012#5 0x00007fbd28ec99f7 _ZN7m
ozilla3ipc14MessageChannel4SendENS_9UniquePtrIN3IPC7MessageENS_13DefaultDeleteIS4_EEEEPS7_ (libxul.so + 0x18c99f7)#012#6 0x00007fbd28ec9e19 _ZN7mozilla3ipc9IProtocol11ChannelSendENS_9UniquePtrIN3IPC7MessageENS_13DefaultDeleteIS4_EEEEPS7_ (libxul.so + 0x18c9e19)#012#7 0x00007fbd293d4fa2 _ZN7mozilla6layers22PCompositorBridgeChild10SendResumeEv (libxul.so + 0x1dd4fa2)#012#8 0x00007fbd2c3a0a48 _Z19moz_container_unmapP10_GtkWidget (libxul.so + 0x4da0a48)#012#9 0x00007fbd2c3a0b23 _Z27moz_container_wayland_unmapP10_GtkWidget (libxul.so + 0x4da0b23)#012#10 0x00007fbd386b9bbc g_closure_invoke (libgobject-2.0.so.0 + 0x13bbc)#012#11 0x00007fbd386d5bf5 signal_emit_unlocked_R (libgobject-2.0.so.0 + 0x2fbf5)#012#12 0x00007fbd386d785a g_signal_emit_valist (libgobject-2.0.so.0 + 0x3185a)#012#13 0x00007fbd386d7a73 g_signal_emit (libgobject-2.0.so.0 + 0x31a73)#012#14 0x00007fbd36766f54 gtk_widget_unmap (libgtk-3.so.0 + 0x366f54)#012#15 0x00007fbd386b9c7f g_closure_invoke (libgobject-2.0.so.0 + 0x
13c7f)#012#16 0x00007fbd386d5bf5 signal_emit_unlocked_R (libgobject-2.0.so.0 + 0x2fbf5)#012#17 0x00007fbd386d785a g_signal_emit_valist (libgobject-2.0.so.0 + 0x3185a)#012#18 0x00007fbd386d7a73 g_signal_emit (libgobject-2.0.so.0 + 0x31a73)#012#19 0x00007fbd36766f54 gtk_widget_unmap (libgtk-3.so.0 + 0x366f54)#012#20 0x00007fbd36787a3b gtk_window_hide.lto_priv.0 (libgtk-3.so.0 + 0x387a3b)#012#21 0x00007fbd386b9c7f g_closure_invoke (libgobject-2.0.so.0 + 0x13c7f)#012#22 0x00007fbd386d5bf5 signal_emit_unlocked_R (libgobject-2.0.so.0 + 0x2fbf5)#012#23 0x00007fbd386d785a g_signal_emit_valist (libgobject-2.0.so.0 + 0x3185a)#012#24 0x00007fbd386d7a73 g_signal_emit (libgobject-2.0.so.0 + 0x31a73)#012#25 0x00007fbd3676e330 gtk_widget_hide (libgtk-3.so.0 + 0x36e330)#012#26 0x00007fbd2c384708 _ZN8nsWindow4ShowEb (libxul.so + 0x4d84708)#012#27 0x00007fbd2ca85bd0 _ZN7mozilla9AppWindow13SetVisibilityEb (libxul.so + 0x5485bd0)#012#28 0x00007fbd286e53f6 NS_InvokeByIndex (libxul.so + 0x10e53f6)#012#29
0x00007fbd28fb898f _ZN16XPCWrappedNative10CallMethodER14XPCCallContextNS_8CallModeE (libxul.so + 0x19b898f)#012#30 0x00007fbd28fbe1b5 _Z19XPC_WN_GetterSetterP9JSContextjPN2JS5ValueE (libxul.so + 0x19be1b5)#012#31 0x00007fbd2dba25cd _ZN2js23InternalCallOrConstructEP9JSContextRKN2JS8CallArgsENS_14MaybeConstructENS_10CallReasonE (libxul.so + 0x65a25cd)#012#32 0x00007fbd2dba44b7 _ZN2js10CallSetterEP9JSContextN2JS6HandleINS2_5ValueEEES5_S5_ (libxul.so + 0x65a44b7)#012#33 0x00007fbd2d1d8376 _ZL19SetExistingPropertyP9JSContextN2JS6HandleINS1_11PropertyKeyEEENS2_INS1_5ValueEEES6_NS2_IPN2js12NativeObjectEEERKNS7_14PropertyResultERNS1_14ObjectOpResultE (libxul.so + 0x5bd8376)#012#34 0x00007fbd2d1de8c3 _ZN2js17NativeSetPropertyILNS_13QualifiedBoolE1EEEbP9JSContextN2JS6HandleIPNS_12NativeObjectEEENS5_INS4_11PropertyKeyEEENS5_INS4_5ValueEEESC_RNS4_14ObjectOpResultE (libxul.so + 0x5bde8c3)#012#35 0x00007fbd2db9d931 _ZN2js9InterpretEP9JSContextRNS_8RunStateE (libxul.so + 0x659d931)#012#36 0x00007
fbd2dba20e3 _ZN2js9RunScriptEP9JSContextRNS_8RunStateE (libxul.so + 0x65a20e3)#012#37 0x00007fbd2dba26e2 _ZN2js23InternalCallOrConstructEP9JSContextRKN2JS8CallArgsENS_14MaybeConstructENS_10CallReasonE (libxul.so + 0x65a26e2)#012#38 0x00007fbd2dba2a5d _ZN2js4CallEP9JSContextN2JS6HandleINS2_5ValueEEES5_RKNS_13AnyInvokeArgsENS2_13MutableHandleIS4_EENS_10CallReasonE (libxul.so + 0x65a2a5d)#012#39 0x00007fbd2d0fb367 _Z20JS_CallFunctionValueP9JSContextN2JS6HandleIP8JSObjectEENS2_INS1_5ValueEEERKNS1_16HandleValueArrayENS1_13MutableHandleIS6_EE (libxul.so + 0x5afb367)#012#40 0x00007fbd28fbb483 _ZN14nsXPCWrappedJS10CallMethodEtPK15nsXPTMethodInfoP17nsXPTCMiniVariant (libxul.so + 0x19bb483)#012#41 0x00007fbd286e60ad PrepareAndDispatch (libxul.so + 0x10e60ad)#012#42 0x00007fbd286e558d SharedStub (libxul.so + 0x10e558d)#012#43 0x00007fbd2865d7a3 _ZN14nsObserverList15NotifyObserversEP11nsISupportsPKcPKDs (libxul.so + 0x105d7a3)#012#44 0x00007fbd2865d97e _ZN17nsObserverService15NotifyObserversEP1
1nsISupportsPKcPKDs (libxul.so + 0x105d97e)#012#45 0x00007fbd2cea2a16 _ZN12nsAppStartup4QuitEjiPb (libxul.so + 0x58a2a16)#012#46 0x00007fbd2cf93643 _ZN22nsNativeAppSupportUnix5DieCBEP8_SmcConnPv (libxul.so + 0x5993643)#012#47 0x00007fbd25f69396 IceProcessMessages (libICE.so.6 + 0x12396)#012#48 0x00007fbd2cf93e55 _ZL19ice_iochannel_watchP11_GIOChannel12GIOConditionPv (libxul.so + 0x5993e55)#012#49 0x00007fbd3631afbf g_main_context_dispatch (libglib-2.0.so.0 + 0x54fbf)#012#50 0x00007fbd36370428 g_main_context_iterate.constprop.0 (libglib-2.0.so.0 + 0xaa428)#012#51 0x00007fbd36318783 g_main_context_iteration (libglib-2.0.so.0 + 0x52783)#012#52 0x00007fbd2c3e016f _ZN10nsAppShell22ProcessNextNativeEventEb (libxul.so + 0x4de016f)#012#53 0x00007fbd2c32c716 _ZN14nsBaseAppShell18OnProcessNextEventEP17nsIThreadInternalb (libxul.so + 0x4d2c716)#012#54 0x00007fbd286d8eec _ZN8nsThread16ProcessNextEventEbPb (libxul.so + 0x10d8eec)#012#55 0x00007fbd286cb8df _Z19NS_ProcessNextEventP9nsIThreadb (lib
xul.so + 0x10cb8df)#012#56 0x00007fbd28eae32a _ZN7mozilla3ipc11MessagePump3RunEPN4base11MessagePump8DelegateE (libxul.so + 0x18ae32a)#012#57 0x00007fbd28e56adb _ZN11MessageLoop3RunEv (libxul.so + 0x1856adb)#012#58 0x00007fbd2c31f49c _ZN14nsBaseAppShell3RunEv (libxul.so + 0x4d1f49c)#012#59 0x00007fbd2c40c91e _ZN10nsAppShell3RunEv (libxul.so + 0x4e0c91e)#012#60 0x00007fbd2cea2eee _ZN12nsAppStartup3RunEv (libxul.so + 0x58a2eee)#012#61 0x00007fbd2cf8f98a _ZN7XREMain11XRE_mainRunEv (libxul.so + 0x598f98a)#012#62 0x00007fbd2cf904ea _ZN7XREMain8XRE_mainEiPPcRKN7mozilla15BootstrapConfigE (libxul.so + 0x59904ea)#012#63 0x00007fbd2cf90c3f _Z8XRE_mainiPPcRKN7mozilla15BootstrapConfigE (libxul.so + 0x5990c3f)#012#012Stack trace of thread 884562:#012#0 0x00007fbd3850345f __poll (libc.so.6 + 0x10345f)#012#1 0x00007fbd363703bc g_main_context_iterate.constprop.0 (libglib-2.0.so.0 + 0xaa3bc)#012#2 0x00007fbd3631a613 g_main_loop_run (libglib-2.0.so.0 + 0x54613)#012#3 0x00007fbd36200ffa gdbus_share
d_thread_func.lto_priv.0 (libgio-2.0.so.0 + 0x111ffa)#012#4 0x00007fbd36349902 g_thread_proxy (li
== borg (2 distinct, 2 total) ==
Aug 21 16:05:20 borg irqbalance[777]: Cannot change IRQ 30 affinity: Operation not permitted
Aug 21 16:05:20 borg irqbalance[777]: IRQ 30 affinity is now unmanaged
== csfw00a (2 distinct, 156 total) ==
Aug 21 16:04:40 csfw00a kernel: bnxt_en 0000:09:00.0 eth3: NIC Link is Down [x152]
Aug 21 16:56:00 csfw00a ospf6d[1477]: [EC 100663307] Could not send entire message [x4]
== hackerman (17 distinct, 22 total) ==
Aug 21 16:19:00 hackerman evolution-sourc[2060270]: Failed to reap '/adminhomes/sajith/.cache/evolution/sources/trash': Error opening directory '/adminhomes/sajith/.cache/evolution/sources/trash': Permission denied
Aug 21 16:19:00 hackerman evolution-sourc[2060270]: Failed to reap '/adminhomes/sajith/.cache/evolution/memos/trash': Error opening directory '/adminhomes/sajith/.cache/evolution/memos/trash': Permission denied
Aug 21 16:19:00 hackerman evolution-sourc[2060270]: Failed to reap '/adminhomes/sajith/.cache/evolution/addressbook/trash': Error opening directory '/adminhomes/sajith/.cache/evolution/addressbook/trash': Permission denied
Aug 21 16:19:00 hackerman evolution-sourc[2060270]: Failed to reap '/adminhomes/sajith/.local/share/evolution/tasks/trash': Error opening directory '/adminhomes/sajith/.local/share/evolution/tasks/trash': Permission denied
Aug 21 16:19:00 hackerman evolution-sourc[2060270]: Failed to reap '/adminhomes/sajith/.local/share/evolution/addressbook/trash': Error opening directory '/adminhomes/sajith/.local/share/evolution/addressbook/trash': Permission denied
Aug 21 16:19:00 hackerman evolution-sourc[2060270]: Failed to reap '/adminhomes/sajith/.cache/evolution/mail/trash': Error opening directory '/adminhomes/sajith/.cache/evolution/mail/trash': Permission denied
Aug 21 16:19:00 hackerman evolution-sourc[2060270]: Failed to reap '/adminhomes/sajith/.cache/evolution/tasks/trash': Error opening directory '/adminhomes/sajith/.cache/evolution/tasks/trash': Permission denied
Aug 21 16:19:00 hackerman evolution-sourc[2060270]: Failed to reap '/adminhomes/sajith/.local/share/evolution/memos/trash': Error opening directory '/adminhomes/sajith/.local/share/evolution/memos/trash': Permission denied
Aug 21 16:19:00 hackerman evolution-sourc[2060270]: Failed to reap '/adminhomes/sajith/.local/share/evolution/calendar/trash': Error opening directory '/adminhomes/sajith/.local/share/evolution/calendar/trash': Permission denied
Aug 21 16:19:00 hackerman evolution-sourc[2060270]: Failed to reap '/adminhomes/sajith/.cache/evolution/calendar/trash': Error opening directory '/adminhomes/sajith/.cache/evolution/calendar/trash': Permission denied
Aug 21 16:19:00 hackerman evolution-sourc[2060270]: Failed to reap '/adminhomes/sajith/.local/share/evolution/mail/trash': Error opening directory '/adminhomes/sajith/.local/share/evolution/mail/trash': Permission denied
Aug 21 16:20:04 hackerman gnome-software[2060381]: can't reliably fixup error code 4 in domain g-io-error-quark: Not a directory [x4]
Aug 21 16:20:12 hackerman gnome-software[2060381]: Only 0 apps for recent list, hiding
Aug 21 16:20:28 hackerman gnome-software[2060381]: failed to commit changes to dconf: GDBus.Error:org.gtk.GDBus.UnmappedGError.Quark._g_2dfile_2derror_2dquark.Code2: Failed to create file “/adminhomes/sajith/.config/dconf/user.EE1KU3”: Permission denied
Aug 21 16:20:28 hackerman packagekitd[1054100]: Failed to get cache filename for libreoffice [x2]
Aug 21 16:20:28 hackerman packagekitd[1054100]: Failed to get cache filename for kernel [x2]
Aug 21 16:20:39 hackerman packagekitd[1054100]: failed to parse public key for /etc/pki/rpm-gpg/RPM-GPG-KEY-PQC-redhat-release
== hazfs.cs.umd.edu (1 distinct, 1 total) ==
Aug 21 16:58:45 hazfs.cs.umd.edu rpc.mountd[1470]: refused mount request from 10.227.96.13 for /raid/newww (/): not exported
== helmsdeep (24 distinct, 24 total) ==
Aug 21 16:13:54 helmsdeep kernel: Warning: Deprecated Hardware is detected: x86_64-v2:GenuineIntel:Intel(R) Xeon(R) CPU E5-2650 v2 @ 2.60GHz will not be maintained in a future major release and may be disabled
Aug 21 16:13:54 helmsdeep kernel: shpchp 0000:05:01.0: pci_hp_register failed with error -16
Aug 21 16:13:54 helmsdeep kernel: shpchp 0000:05:01.0: Slot initialization failed
Aug 21 16:13:54 helmsdeep kernel: shpchp 0000:05:02.0: pci_hp_register failed with error -16
Aug 21 16:13:54 helmsdeep kernel: shpchp 0000:05:02.0: Slot initialization failed
Aug 21 16:13:54 helmsdeep kernel: shpchp 0000:05:03.0: pci_hp_register failed with error -16
Aug 21 16:13:54 helmsdeep kernel: shpchp 0000:05:03.0: Slot initialization failed
Aug 21 16:13:54 helmsdeep kernel: shpchp 0000:05:04.0: pci_hp_register failed with error -16
Aug 21 16:13:54 helmsdeep kernel: shpchp 0000:05:04.0: Slot initialization failed
Aug 21 16:13:56 helmsdeep kernel: sd 0:0:0:0: Power-on or device reset occurred
Aug 21 16:13:56 helmsdeep kernel: sd 1:0:0:1: Power-on or device reset occurred
Aug 21 16:14:02 helmsdeep kernel: device-mapper: core: CONFIG_IMA_DISABLE_HTABLE is disabled. Duplicate IMA measurements will not be recorded in the IMA log.
Aug 21 16:14:04 helmsdeep kernel: snd_hda_intel 0000:00:1b.0: no codecs found!
Aug 21 16:14:14 helmsdeep rpc.statd[844]: Flags: TI-RPC
Aug 21 16:14:15 helmsdeep systemd[1]: resmon.service: Supervising process 960 which is not our child. We'll most likely not notice when it exits.
Aug 21 16:14:18 helmsdeep kernel: block sda: the capability attribute has been deprecated.
Aug 21 16:14:18 helmsdeep irqbalance[695]: Cannot change IRQ 36 affinity: Operation not permitted
Aug 21 16:14:18 helmsdeep irqbalance[695]: IRQ 36 affinity is now unmanaged
Aug 21 16:14:18 helmsdeep irqbalance[695]: Cannot change IRQ 32 affinity: Operation not permitted
Aug 21 16:14:18 helmsdeep irqbalance[695]: IRQ 32 affinity is now unmanaged
Aug 21 16:15:38 helmsdeep irqbalance[695]: Cannot change IRQ 37 affinity: Operation not permitted
Aug 21 16:15:38 helmsdeep irqbalance[695]: IRQ 37 affinity is now unmanaged
Aug 21 16:30:28 helmsdeep irqbalance[695]: Cannot change IRQ 31 affinity: Operation not permitted
Aug 21 16:30:28 helmsdeep irqbalance[695]: IRQ 31 affinity is now unmanaged
== idm00 (1 distinct, 1 total) ==
Aug 21 16:51:38 idm00 named[3810278]: client @0x7f48dd400088 10.73.240.42#58279: update '73.10.in-addr.arpa/IN' denied
== idmh1 (108 distinct, 110 total) ==
Aug 21 16:07:41 idmh1 kernel: acpi PNP0A03:00: fail to add MMCONFIG information, can't access extended configuration space under this bridge
Aug 21 16:07:41 idmh1 kernel: device-mapper: core: CONFIG_IMA_DISABLE_HTABLE is disabled. Duplicate IMA measurements will not be recorded in the IMA log.
Aug 21 16:07:42 idmh1 systemd[1]: sys-module-fuse.device: Failed to enqueue SYSTEMD_WANTS= job, ignoring: Unit sys-fs-fuse-connections.mount not found.
Aug 21 16:07:42 idmh1 kernel: sd 1:0:0:1: Power-on or device reset occurred
Aug 21 16:07:42 idmh1 kernel: sd 0:0:0:0: Power-on or device reset occurred
Aug 21 16:07:42 idmh1 kernel: sd 2:0:0:2: Power-on or device reset occurred
Aug 21 16:07:45 idmh1 lvm[909]: PV /dev/sdb2 online, VG rhel_idmh1 is complete.
Aug 21 16:07:47 idmh1 kernel: Warning: Unmaintained driver is detected: ip_set
Aug 21 16:07:47 idmh1 systemd[1]: resmon.service: Supervising process 1237 which is not our child. We'll most likely not notice when it exits.
Aug 21 16:07:47 idmh1 named[1169]: LDAP error: Can't contact LDAP server: bind to LDAP server failed [x2]
Aug 21 16:07:47 idmh1 named[1169]: ldap_sync_prepare() failed, retrying in 1 second: socket is not connected
Aug 21 16:07:48 idmh1 systemd[1]: iscsi.service: Unit cannot be reloaded because it is inactive. [x2]
Aug 21 16:07:48 idmh1 rsyslogd[1570]: imjournal: filecreatemode is not set, using default 0644 [v8.2412.0-1.el9 try https://www.rsyslog.com/e/2186 ]
Aug 21 16:07:49 idmh1 kernel: block dm-0: the capability attribute has been deprecated.
Aug 21 16:07:50 idmh1 setroubleshoot[1555]: SELinux is preventing /usr/bin/lsmd from getattr access on the file /usr/bin/passt-repair. For complete SELinux messages run: sealert -l 6f5d72c0-7f51-4c16-9f0b-6ebba3496d81
Aug 21 16:07:51 idmh1 systemd[1]: check-ldap-alive.service: Watchdog timeout (limit 5s)!
Aug 21 16:07:51 idmh1 systemd-coredump[3011]: Process 1057 (systemctl) of user 0 dumped core.#012#012Stack trace of thread 1057:#012#0 0x00007fb67bd01fbf ppoll (libc.so.6 + 0x101fbf)#012#1 0x00007fb67c1c481e ppoll_usec (libsystemd-shared-252.so + 0x1c481e)#012#2 0x00007fb67c22ea79 bus_poll (libsystemd-shared-252.so + 0x22ea79)#012#3 0x00007fb67c2302dd sd_bus_wait (libsystemd-shared-252.so + 0x2302dd)#012#4 0x00007fb67c0b6881 bus_wait_for_jobs (libsystemd-shared-252.so + 0xb6881)#012#5 0x000055701cb6c825 verb_start (systemctl + 0x30825)#012#6 0x000055701cb4ccde main (systemctl + 0x10cde)#012#7 0x00007fb67bc295d0 __libc_start_call_main (libc.so.6 + 0x295d0)#012#8 0x00007fb67bc29680 __libc_start_main@@GLIBC_2.34 (libc.so.6 + 0x29680)#012#9 0x000055701cb4e565 _start (systemctl + 0x12565)#012ELF object binary architecture: AMD x86-64
Aug 21 16:07:55 idmh1 systemd-coredump[3088]: Process 1027 (check-ldap-aliv) of user 0 dumped core.#012#012Stack trace of thread 1027:#012#0 0x00007fc52843ee2b kill (libc.so.6 + 0x3ee2b)#012#1 0x0000556a7428d930 termsig_handler.part.0 (bash + 0x88930)#012#2 0x0000556a7430694b waitchld.constprop.0 (bash + 0x10194b)#012#3 0x0000556a7426aa7a wait_for (bash + 0x65a7a)#012#4 0x0000556a74252ee8 execute_command_internal (bash + 0x4dee8)#012#5 0x0000556a742523cb execute_command_internal (bash + 0x4d3cb)#012#6 0x0000556a74253748 execute_command (bash + 0x4e748)#012#7 0x0000556a74251cdf execute_command_internal (bash + 0x4ccdf)#012#8 0x0000556a742523cb execute_command_internal (bash + 0x4d3cb)#012#9 0x0000556a74253748 execute_command (bash + 0x4e748)#012#10 0x0000556a7425238e execute_command_internal (bash + 0x4d38e)#012#11 0x0000556a74253748 execute_command (bash + 0x4e748)#012#12 0x0000556a7425238e execute_command_internal (bash + 0x4d38e)#012#13 0x0000556a74253748 execute_command
(bash + 0x4e748)#012#14 0x0000556a742538f0 execute_while_or_until (bash + 0x4e8f0)#012#15 0x0000556a742511c0 execute_command_internal (bash + 0x4c1c0)#012#16 0x0000556a74253748 execute_command (bash + 0x4e748)#012#17 0x0000556a74245109 reader_loop (bash + 0x40109)#012#18 0x0000556a7423697e main (bash + 0x3197e)#012#19 0x00007fc5284295d0 __libc_start_call_main (libc.so.6 + 0x295d0)#012#20 0x00007fc528429680 __libc_start_main@@GLIBC_2.34 (libc.so.6 + 0x29680)#012#21 0x0000556a74236d75 _start (bash + 0x31d75)#012ELF object binary architecture: AMD x86-64
Aug 21 16:07:55 idmh1 systemd[1]: check-ldap-alive.service: Main process exited, code=dumped, status=6/ABRT
Aug 21 16:07:56 idmh1 irqbalance[1033]: Cannot change IRQ 35 affinity: Operation not permitted
Aug 21 16:07:56 idmh1 irqbalance[1033]: IRQ 35 affinity is now unmanaged
Aug 21 16:07:56 idmh1 irqbalance[1033]: Cannot change IRQ 43 affinity: Operation not permitted
Aug 21 16:07:56 idmh1 irqbalance[1033]: IRQ 43 affinity is now unmanaged
Aug 21 16:07:56 idmh1 irqbalance[1033]: Cannot change IRQ 33 affinity: Operation not permitted
Aug 21 16:07:56 idmh1 irqbalance[1033]: IRQ 33 affinity is now unmanaged
Aug 21 16:07:56 idmh1 irqbalance[1033]: Cannot change IRQ 31 affinity: Operation not permitted
Aug 21 16:07:56 idmh1 irqbalance[1033]: IRQ 31 affinity is now unmanaged
Aug 21 16:07:56 idmh1 irqbalance[1033]: Cannot change IRQ 46 affinity: Operation not permitted
Aug 21 16:07:56 idmh1 irqbalance[1033]: IRQ 46 affinity is now unmanaged
Aug 21 16:07:56 idmh1 irqbalance[1033]: Cannot change IRQ 36 affinity: Operation not permitted
... 78 more distinct messages not shown
== idmp0 (1 distinct, 1 total) ==
Aug 21 16:35:56 idmp0 named[1121900]: client @0x7fe3d48903f8 10.73.240.43#54620: update '73.10.in-addr.arpa/IN' denied
== irb2156 (8 distinct, 8 total) ==
Aug 21 16:43:35 irb2156 systemd-tmpfiles[356412]: Opening file "/tmp/org.chromium.Chromium.xj4HRi/SingletonSocket" failed, proceeding without lock: No such device or address
Aug 21 16:43:35 irb2156 systemd-tmpfiles[356412]: Opening file "/tmp/ssh-XXXXXXdC7uOX/agent.70518" failed, proceeding without lock: No such device or address
Aug 21 16:43:35 irb2156 systemd-tmpfiles[356412]: Opening file "/tmp/org.chromium.Chromium.f7quKm/SingletonSocket" failed, proceeding without lock: No such device or address
Aug 21 16:58:46 irb2156 setroubleshoot[358647]: SELinux is preventing /usr/sbin/rpc.gssd from unlink access on the file /var/lib/nfs/rpc_pipefs/(null). For complete SELinux messages run: sealert -l e4a9107b-1431-4ddd-818a-a2bd1cfeec70
Aug 21 16:59:04 irb2156 kernel: ICMPv6: process `2.1.238' is using deprecated sysctl (syscall) net.ipv6.neigh.umd-dns.base_reachable_time - use net.ipv6.neigh.umd-dns.base_reachable_time_ms instead
Aug 21 16:59:08 irb2156 kernel: block nvme0n1: the capability attribute has been deprecated.
Aug 21 16:59:08 irb2156 kernel: WARNING! power/level is deprecated; use power/control instead
Aug 21 16:59:08 irb2156 kernel: bdi 253:1: the stable_pages_required attribute has been removed. Use the stable_writes queue attribute instead.
== itmon02 (1 distinct, 45 total) ==
Aug 21 16:07:49 itmon02 sshd[1750555]: error: beginning MaxStartups throttling [x45]
== jaws.cs.umd.edu (3 distinct, 3 total) ==
Aug 21 17:00:22 jaws.cs.umd.edu systemd-coredump[1304219]: Process 1304204 (podman) of user 0 dumped core.#012#012Stack trace of thread 1304204:#012#0 0x000055ae7754546e internal/runtime/syscall/linux.Syscall6 (podman + 0x48c46e)#012#1 0x000055ae77625326 syscall.Syscall (podman + 0x56c326)#012#2 0x000055ae77625ed0 syscall.Syscall.abi0 (podman + 0x56ced0)#012#3 0x000055ae7779036e github.com/containers/podman/vendor/golang.org/x/sys/unix.OpenTree (podman + 0x6d736e)#012#4 0x000055ae77ded44b github.com/containers/podman/vendor/github.com/cyphar/filepath-securejoin/p… (podman + 0xd3444b)#012#5 0x000055ae77ded354 github.com/containers/podman/vendor/github.com/cyphar/filepath-securejoin/p… (podman + 0xd34354)#012#6 0x000055ae775d8f8c sync.(*Once).doSlow (podman + 0x51ff8c)#012#7 0x000055ae775d8eb9 sync.(*Once).Do (podman + 0x51feb9)#012#8 0x000055ae77ded2c5
github.com/containers/podman/vendor/github.com/cyphar/filepath-securejoin/p… (podman + 0xd342c5)#012#9 0x000055ae77dee8e2 github.com/containers/podman/vendor/github.com/cyphar/filepath-securejoin/p… (podman + 0xd358e2)#012#10 0x000055ae77deecf3 github.com/containers/podman/vendor/github.com/cyphar/filepath-securejoin/p… (podman + 0xd35cf3)#012#11 0x000055ae77dede1c github.com/containers/podman/vendor/github.com/cyphar/filepath-securejoin/p… (podman + 0xd34e1c)#012#12 0x000055ae77ded858 github.com/containers/podman/vendor/github.com/cyphar/filepath-securejoin/p… (podman + 0xd34858)#012#13 0x000055ae775d8f8c sync.(*Once).doSlow (podman + 0x51ff8c)#012#14 0x000055ae775d8eb9 sync.(*Once).Do
(podman + 0x51feb9)#012#15 0x000055ae77ded7c5 github.com/containers/podman/vendor/github.com/cyphar/filepath-securejoin/p… (podman + 0xd347c5)#012#16 0x000055ae77deec9a github.com/containers/podman/vendor/github.com/cyphar/filepath-securejoin/p… (podman + 0xd35c9a)#012#17 0x000055ae77df584e github.com/containers/podman/vendor/github.com/opencontainers/selinux/go-se… (podman + 0xd3c84e)#012#18 0x000055ae77df5d38 github.com/containers/podman/vendor/github.com/opencontainers/selinux/go-se… (podman + 0xd3cd38)#012#19 0x000055ae77df4adf github.com/containers/podman/vendor/github.com/opencontainers/selinux/go-se… (podman + 0xd3badf)#012#20 0x000055ae77df4d73 github.com/containers/podman/vendor/github.com/opencontainers/selinux/go-se… (podman + 0xd3bd73)#012#21 0x00005
5ae77fee6cb github.com/containers/podman/vendor/go.podman.io/common/pkg/config.defaultC… (podman + 0xf356cb)#012#22 0x000055ae77ff20b2 github.com/containers/podman/vendor/go.podman.io/common/pkg/config.newLocked (podman + 0xf390b2)#012#23 0x000055ae77ff1da5 github.com/containers/podman/vendor/go.podman.io/common/pkg/config.New (podman + 0xf38da5)#012#24 0x000055ae7876e7d3 github.com/containers/podman/cmd/podman/registry.newPodmanConfig (podman + 0x16b57d3)#012#25 0x000055ae775d8f8c sync.(*Once).doSlow (podman + 0x51ff8c)#012#26 0x000055ae7878f550 github.com/containers/podman/cmd/podman/common.init (podman + 0x16d6550)#012#27 0x000055ae7759eaf7 runtime.doInit1 (podman + 0x4e5af7)#012#28 0x000055ae7758f030 runtime.main (podman + 0x4d6030)#012#29 0x000055ae775cf061 runtime.goexit.abi0 (podman + 0x516061)#012ELF object binary architecture: AMD x86-64
Aug 21 17:00:23 jaws.cs.umd.edu systemd-coredump[1304241]: Process 1304225 (podman) of user 0 dumped core.#012#012Stack trace of thread 1304225:#012#0 0x0000564dfe30c46e internal/runtime/syscall/linux.Syscall6 (podman + 0x48c46e)#012#1 0x0000564dfe3ec326 syscall.Syscall (podman + 0x56c326)#012#2 0x0000564dfe3eced0 syscall.Syscall.abi0 (podman + 0x56ced0)#012#3 0x0000564dfe55736e github.com/containers/podman/vendor/golang.org/x/sys/unix.OpenTree (podman + 0x6d736e)#012#4 0x0000564dfebb444b github.com/containers/podman/vendor/github.com/cyphar/filepath-securejoin/p… (podman + 0xd3444b)#012#5 0x0000564dfebb4354 github.com/containers/podman/vendor/github.com/cyphar/filepath-securejoin/p… (podman + 0xd34354)#012#6 0x0000564dfe39ff8c sync.(*Once).doSlow (podman + 0x51ff8c)#012#7 0x0000564dfe39feb9 sync.(*Once).Do (podman + 0x51feb9)#012#8 0x0000564dfebb42c5
github.com/containers/podman/vendor/github.com/cyphar/filepath-securejoin/p… (podman + 0xd342c5)#012#9 0x0000564dfebb58e2 github.com/containers/podman/vendor/github.com/cyphar/filepath-securejoin/p… (podman + 0xd358e2)#012#10 0x0000564dfebb5cf3 github.com/containers/podman/vendor/github.com/cyphar/filepath-securejoin/p… (podman + 0xd35cf3)#012#11 0x0000564dfebb4e1c github.com/containers/podman/vendor/github.com/cyphar/filepath-securejoin/p… (podman + 0xd34e1c)#012#12 0x0000564dfebb4858 github.com/containers/podman/vendor/github.com/cyphar/filepath-securejoin/p… (podman + 0xd34858)#012#13 0x0000564dfe39ff8c sync.(*Once).doSlow (podman + 0x51ff8c)#012#14 0x0000564dfe39feb9 sync.(*Once).Do
(podman + 0x51feb9)#012#15 0x0000564dfebb47c5 github.com/containers/podman/vendor/github.com/cyphar/filepath-securejoin/p… (podman + 0xd347c5)#012#16 0x0000564dfebb5c9a github.com/containers/podman/vendor/github.com/cyphar/filepath-securejoin/p… (podman + 0xd35c9a)#012#17 0x0000564dfebbc84e github.com/containers/podman/vendor/github.com/opencontainers/selinux/go-se… (podman + 0xd3c84e)#012#18 0x0000564dfebbcd38 github.com/containers/podman/vendor/github.com/opencontainers/selinux/go-se… (podman + 0xd3cd38)#012#19 0x0000564dfebbbadf github.com/containers/podman/vendor/github.com/opencontainers/selinux/go-se… (podman + 0xd3badf)#012#20 0x0000564dfebbbd73 github.com/containers/podman/vendor/github.com/opencontainers/selinux/go-se… (podman + 0xd3bd73)#012#21 0x00005
64dfedb56cb github.com/containers/podman/vendor/go.podman.io/common/pkg/config.defaultC… (podman + 0xf356cb)#012#22 0x0000564dfedb90b2 github.com/containers/podman/vendor/go.podman.io/common/pkg/config.newLocked (podman + 0xf390b2)#012#23 0x0000564dfedb8da5 github.com/containers/podman/vendor/go.podman.io/common/pkg/config.New (podman + 0xf38da5)#012#24 0x0000564dff5357d3 github.com/containers/podman/cmd/podman/registry.newPodmanConfig (podman + 0x16b57d3)#012#25 0x0000564dfe39ff8c sync.(*Once).doSlow (podman + 0x51ff8c)#012#26 0x0000564dff556550 github.com/containers/podman/cmd/podman/common.init (podman + 0x16d6550)#012#27 0x0000564dfe365af7 runtime.doInit1 (podman + 0x4e5af7)#012#28 0x0000564dfe356030 runtime.main (podman + 0x4d6030)#012#29 0x0000564dfe396061 runtime.goexit.abi0 (podman + 0x516061)#012ELF object binary architecture: AMD x86-64
Aug 21 17:00:25 jaws.cs.umd.edu systemd-coredump[1304260]: Process 1304246 (podman) of user 0 dumped core.#012#012Stack trace of thread 1304246:#012#0 0x000055e27344346e internal/runtime/syscall/linux.Syscall6 (podman + 0x48c46e)#012#1 0x000055e273523326 syscall.Syscall (podman + 0x56c326)#012#2 0x000055e273523ed0 syscall.Syscall.abi0 (podman + 0x56ced0)#012#3 0x000055e27368e36e github.com/containers/podman/vendor/golang.org/x/sys/unix.OpenTree (podman + 0x6d736e)#012#4 0x000055e273ceb44b github.com/containers/podman/vendor/github.com/cyphar/filepath-securejoin/p… (podman + 0xd3444b)#012#5 0x000055e273ceb354 github.com/containers/podman/vendor/github.com/cyphar/filepath-securejoin/p… (podman + 0xd34354)#012#6 0x000055e2734d6f8c sync.(*Once).doSlow (podman + 0x51ff8c)#012#7 0x000055e2734d6eb9 sync.(*Once).Do (podman + 0x51feb9)#012#8 0x000055e273ceb2c5
github.com/containers/podman/vendor/github.com/cyphar/filepath-securejoin/p… (podman + 0xd342c5)#012#9 0x000055e273cec8e2 github.com/containers/podman/vendor/github.com/cyphar/filepath-securejoin/p… (podman + 0xd358e2)#012#10 0x000055e273ceccf3 github.com/containers/podman/vendor/github.com/cyphar/filepath-securejoin/p… (podman + 0xd35cf3)#012#11 0x000055e273cebe1c github.com/containers/podman/vendor/github.com/cyphar/filepath-securejoin/p… (podman + 0xd34e1c)#012#12 0x000055e273ceb858 github.com/containers/podman/vendor/github.com/cyphar/filepath-securejoin/p… (podman + 0xd34858)#012#13 0x000055e2734d6f8c sync.(*Once).doSlow (podman + 0x51ff8c)#012#14 0x000055e2734d6eb9 sync.(*Once).Do
(podman + 0x51feb9)#012#15 0x000055e273ceb7c5 github.com/containers/podman/vendor/github.com/cyphar/filepath-securejoin/p… (podman + 0xd347c5)#012#16 0x000055e273cecc9a github.com/containers/podman/vendor/github.com/cyphar/filepath-securejoin/p… (podman + 0xd35c9a)#012#17 0x000055e273cf384e github.com/containers/podman/vendor/github.com/opencontainers/selinux/go-se… (podman + 0xd3c84e)#012#18 0x000055e273cf3d38 github.com/containers/podman/vendor/github.com/opencontainers/selinux/go-se… (podman + 0xd3cd38)#012#19 0x000055e273cf2adf github.com/containers/podman/vendor/github.com/opencontainers/selinux/go-se… (podman + 0xd3badf)#012#20 0x000055e273cf2d73 github.com/containers/podman/vendor/github.com/opencontainers/selinux/go-se… (podman + 0xd3bd73)#012#21 0x00005
5e273eec6cb github.com/containers/podman/vendor/go.podman.io/common/pkg/config.defaultC… (podman + 0xf356cb)#012#22 0x000055e273ef00b2 github.com/containers/podman/vendor/go.podman.io/common/pkg/config.newLocked (podman + 0xf390b2)#012#23 0x000055e273eefda5 github.com/containers/podman/vendor/go.podman.io/common/pkg/config.New (podman + 0xf38da5)#012#24 0x000055e27466c7d3 github.com/containers/podman/cmd/podman/registry.newPodmanConfig (podman + 0x16b57d3)#012#25 0x000055e2734d6f8c sync.(*Once).doSlow (podman + 0x51ff8c)#012#26 0x000055e27468d550 github.com/containers/podman/cmd/podman/common.init (podman + 0x16d6550)#012#27 0x000055e27349caf7 runtime.doInit1 (podman + 0x4e5af7)#012#28 0x000055e27348d030 runtime.main (podman + 0x4d6030)#012#29 0x000055e2734cd061 runtime.goexit.abi0 (podman + 0x516061)#012ELF object binary architecture: AMD x86-64
== netman.cs.umd.edu (1 distinct, 1 total) ==
Aug 21 16:54:49 netman.cs.umd.edu sshd[3515994]: error: PAM: Authentication failure for nobody from 219.78.52.183
== newhonors2 (1 distinct, 24 total) ==
Aug 21 16:13:03 newhonors2 dhcpcd[1530940]: dhcpcd is not running [x24]
== outbound00.cs.umd.edu (1 distinct, 6 total) ==
Aug 21 16:09:09 outbound00.cs.umd.edu python3[279331]: ldapdb [x6]
== outbound01.cs.umd.edu (1 distinct, 6 total) ==
Aug 21 16:13:06 outbound01.cs.umd.edu python3[2514400]: ldapdb [x6]
== sentry-docker00.cs.umd.edu (36 distinct, 36 total) ==
Aug 21 16:20:58 sentry-docker00.cs.umd.edu systemd-udevd[820724]: link_config: could not get ethtool features for vethdfdc7b5
Aug 21 16:20:58 sentry-docker00.cs.umd.edu systemd-udevd[820724]: Could not set offload features of vethdfdc7b5: No such device
Aug 21 16:20:58 sentry-docker00.cs.umd.edu systemd-udevd[820759]: Could not generate persistent MAC address for veth9477b91: No such file or directory
Aug 21 16:20:58 sentry-docker00.cs.umd.edu systemd-udevd[820760]: Could not generate persistent MAC address for veth27efa12: No such file or directory
Aug 21 16:20:58 sentry-docker00.cs.umd.edu systemd-udevd[820763]: Could not generate persistent MAC address for vethd0837d6: No such file or directory
Aug 21 16:20:58 sentry-docker00.cs.umd.edu systemd-udevd[820764]: Could not generate persistent MAC address for veth9b98ec0: No such file or directory
Aug 21 16:20:58 sentry-docker00.cs.umd.edu systemd-udevd[820768]: Could not generate persistent MAC address for vethbb48871: No such file or directory
Aug 21 16:20:58 sentry-docker00.cs.umd.edu systemd-udevd[820771]: Could not generate persistent MAC address for vethff25d18: No such file or directory
Aug 21 16:20:58 sentry-docker00.cs.umd.edu systemd-udevd[820768]: Could not generate persistent MAC address for veth7a8a199: No such file or directory
Aug 21 16:20:58 sentry-docker00.cs.umd.edu systemd-udevd[820781]: Could not generate persistent MAC address for vethbc997fd: No such file or directory
Aug 21 16:20:58 sentry-docker00.cs.umd.edu systemd-udevd[820843]: Could not generate persistent MAC address for vetha6a6744: No such file or directory
Aug 21 16:20:58 sentry-docker00.cs.umd.edu systemd-udevd[820845]: Could not generate persistent MAC address for veth9471a60: No such file or directory
Aug 21 16:41:06 sentry-docker00.cs.umd.edu systemd-udevd[830181]: link_config: could not get ethtool features for veth9477b91
Aug 21 16:41:06 sentry-docker00.cs.umd.edu systemd-udevd[830181]: Could not set offload features of veth9477b91: No such device
Aug 21 16:41:06 sentry-docker00.cs.umd.edu systemd-udevd[830212]: Could not generate persistent MAC address for veth06f6878: No such file or directory
Aug 21 16:41:06 sentry-docker00.cs.umd.edu systemd-udevd[830213]: Could not generate persistent MAC address for veth59bd36a: No such file or directory
Aug 21 16:41:06 sentry-docker00.cs.umd.edu systemd-udevd[830217]: Could not generate persistent MAC address for veth217c35c: No such file or directory
Aug 21 16:41:06 sentry-docker00.cs.umd.edu systemd-udevd[830216]: Could not generate persistent MAC address for veth395dd9f: No such file or directory
Aug 21 16:41:06 sentry-docker00.cs.umd.edu systemd-udevd[830225]: Could not generate persistent MAC address for vetha2ed1cb: No such file or directory
Aug 21 16:41:06 sentry-docker00.cs.umd.edu systemd-udevd[830212]: Could not generate persistent MAC address for vethac71b5c: No such file or directory
Aug 21 16:41:06 sentry-docker00.cs.umd.edu systemd-udevd[830229]: Could not generate persistent MAC address for vethf1fa1e6: No such file or directory
Aug 21 16:41:06 sentry-docker00.cs.umd.edu systemd-udevd[830238]: Could not generate persistent MAC address for veth59c0651: No such file or directory
Aug 21 16:41:06 sentry-docker00.cs.umd.edu systemd-udevd[830229]: Could not generate persistent MAC address for vethedf8d6b: No such file or directory
Aug 21 16:41:06 sentry-docker00.cs.umd.edu systemd-udevd[830238]: Could not generate persistent MAC address for veth1d020f9: No such file or directory
Aug 21 17:01:14 sentry-docker00.cs.umd.edu systemd-udevd[839490]: link_config: could not get ethtool features for veth395dd9f
Aug 21 17:01:14 sentry-docker00.cs.umd.edu systemd-udevd[839490]: Could not set offload features of veth395dd9f: No such device
Aug 21 17:01:15 sentry-docker00.cs.umd.edu systemd-udevd[839573]: Could not generate persistent MAC address for veth1310754: No such file or directory
Aug 21 17:01:15 sentry-docker00.cs.umd.edu systemd-udevd[839574]: Could not generate persistent MAC address for veth8b62284: No such file or directory
Aug 21 17:01:15 sentry-docker00.cs.umd.edu systemd-udevd[839577]: Could not generate persistent MAC address for veth154b447: No such file or directory
Aug 21 17:01:15 sentry-docker00.cs.umd.edu systemd-udevd[839578]: Could not generate persistent MAC address for vethd932387: No such file or directory
... 6 more distinct messages not shown
== soul (1 distinct, 1 total) ==
Aug 21 16:23:22 soul krb5_child[2473786]: Preauthentication failed
== strawberry (2 distinct, 8 total) ==
Aug 21 16:09:44 strawberry udisksd[1067]: Error performing housekeeping for drive /org/freedesktop/UDisks2/drives/ST2000DM001_1CH164_W1E8J5KJ: Error updating SMART data: Error sending ATA command CHECK POWER MODE: Unexpected sense data returned:#0120000: 00 00 00 00 00 00 00 00 00 00 00 00 00 00 00 00 ................#0120010: 00 00 00 00 00 00 00 00 00 00 00 00 00 00 00 00 ................#012 (g-io-error-quark, 0) [x6]
Aug 21 16:34:42 strawberry smartd[5314]: Device: /dev/sda [SAT], failed to read SMART Attribute Data [x2]
== zwicker-computer (2 distinct, 4 total) ==
Aug 21 16:09:10 zwicker-computer sshd[3245877]: error: PAM: Authentication failure for jhanson7 from 10.206.35.97 [x3]
Aug 21 16:09:19 zwicker-computer sshd[3245877]: error: maximum authentication attempts exceeded for jhanson7 from 10.206.35.97 port 61688 ssh2 [preauth]
1
0
Command: /usr/local/sbin/syslog-digest.py
Time : 0.1180s
Status : exited 0
Output :
Syslog digest — 2026-08-21 16:05 EDT
Processed 3,545 lines, filtered 2,045 (57%). 1,500 unknown (1273 distinct) from 20 host(s).
== ar102 (1199 distinct, 1199 total) ==
Aug 21 15:05:01 ar102 cosmic-session[6072]: [2026-08-21T19:05:01Z ERROR cosmic_osd::components::audio] failed to connect to cosmic-settings's varlink service: Io(Os { code: 111, kind: ConnectionRefused, message: "Connection refused" })
Aug 21 15:05:04 ar102 cosmic-session[6072]: [2026-08-21T19:05:04Z ERROR cosmic_osd::components::audio] failed to connect to cosmic-settings's varlink service: Io(Os { code: 111, kind: ConnectionRefused, message: "Connection refused" })
Aug 21 15:05:07 ar102 cosmic-session[6072]: [2026-08-21T19:05:07Z ERROR cosmic_osd::components::audio] failed to connect to cosmic-settings's varlink service: Io(Os { code: 111, kind: ConnectionRefused, message: "Connection refused" })
Aug 21 15:05:10 ar102 cosmic-session[6072]: [2026-08-21T19:05:10Z ERROR cosmic_osd::components::audio] failed to connect to cosmic-settings's varlink service: Io(Os { code: 111, kind: ConnectionRefused, message: "Connection refused" })
Aug 21 15:05:13 ar102 cosmic-session[6072]: [2026-08-21T19:05:13Z ERROR cosmic_osd::components::audio] failed to connect to cosmic-settings's varlink service: Io(Os { code: 111, kind: ConnectionRefused, message: "Connection refused" })
Aug 21 15:05:16 ar102 cosmic-session[6072]: [2026-08-21T19:05:16Z ERROR cosmic_osd::components::audio] failed to connect to cosmic-settings's varlink service: Io(Os { code: 111, kind: ConnectionRefused, message: "Connection refused" })
Aug 21 15:05:19 ar102 cosmic-session[6072]: [2026-08-21T19:05:19Z ERROR cosmic_osd::components::audio] failed to connect to cosmic-settings's varlink service: Io(Os { code: 111, kind: ConnectionRefused, message: "Connection refused" })
Aug 21 15:05:22 ar102 cosmic-session[6072]: [2026-08-21T19:05:22Z ERROR cosmic_osd::components::audio] failed to connect to cosmic-settings's varlink service: Io(Os { code: 111, kind: ConnectionRefused, message: "Connection refused" })
Aug 21 15:05:25 ar102 cosmic-session[6072]: [2026-08-21T19:05:25Z ERROR cosmic_osd::components::audio] failed to connect to cosmic-settings's varlink service: Io(Os { code: 111, kind: ConnectionRefused, message: "Connection refused" })
Aug 21 15:05:28 ar102 cosmic-session[6072]: [2026-08-21T19:05:28Z ERROR cosmic_osd::components::audio] failed to connect to cosmic-settings's varlink service: Io(Os { code: 111, kind: ConnectionRefused, message: "Connection refused" })
Aug 21 15:05:31 ar102 cosmic-session[6072]: [2026-08-21T19:05:31Z ERROR cosmic_osd::components::audio] failed to connect to cosmic-settings's varlink service: Io(Os { code: 111, kind: ConnectionRefused, message: "Connection refused" })
Aug 21 15:05:34 ar102 cosmic-session[6072]: [2026-08-21T19:05:34Z ERROR cosmic_osd::components::audio] failed to connect to cosmic-settings's varlink service: Io(Os { code: 111, kind: ConnectionRefused, message: "Connection refused" })
Aug 21 15:05:37 ar102 cosmic-session[6072]: [2026-08-21T19:05:37Z ERROR cosmic_osd::components::audio] failed to connect to cosmic-settings's varlink service: Io(Os { code: 111, kind: ConnectionRefused, message: "Connection refused" })
Aug 21 15:05:40 ar102 cosmic-session[6072]: [2026-08-21T19:05:40Z ERROR cosmic_osd::components::audio] failed to connect to cosmic-settings's varlink service: Io(Os { code: 111, kind: ConnectionRefused, message: "Connection refused" })
Aug 21 15:05:43 ar102 cosmic-session[6072]: [2026-08-21T19:05:43Z ERROR cosmic_osd::components::audio] failed to connect to cosmic-settings's varlink service: Io(Os { code: 111, kind: ConnectionRefused, message: "Connection refused" })
Aug 21 15:05:46 ar102 cosmic-session[6072]: [2026-08-21T19:05:46Z ERROR cosmic_osd::components::audio] failed to connect to cosmic-settings's varlink service: Io(Os { code: 111, kind: ConnectionRefused, message: "Connection refused" })
Aug 21 15:05:49 ar102 cosmic-session[6072]: [2026-08-21T19:05:49Z ERROR cosmic_osd::components::audio] failed to connect to cosmic-settings's varlink service: Io(Os { code: 111, kind: ConnectionRefused, message: "Connection refused" })
Aug 21 15:05:52 ar102 cosmic-session[6072]: [2026-08-21T19:05:52Z ERROR cosmic_osd::components::audio] failed to connect to cosmic-settings's varlink service: Io(Os { code: 111, kind: ConnectionRefused, message: "Connection refused" })
Aug 21 15:05:55 ar102 cosmic-session[6072]: [2026-08-21T19:05:55Z ERROR cosmic_osd::components::audio] failed to connect to cosmic-settings's varlink service: Io(Os { code: 111, kind: ConnectionRefused, message: "Connection refused" })
Aug 21 15:05:58 ar102 cosmic-session[6072]: [2026-08-21T19:05:58Z ERROR cosmic_osd::components::audio] failed to connect to cosmic-settings's varlink service: Io(Os { code: 111, kind: ConnectionRefused, message: "Connection refused" })
Aug 21 15:06:01 ar102 cosmic-session[6072]: [2026-08-21T19:06:01Z ERROR cosmic_osd::components::audio] failed to connect to cosmic-settings's varlink service: Io(Os { code: 111, kind: ConnectionRefused, message: "Connection refused" })
Aug 21 15:06:04 ar102 cosmic-session[6072]: [2026-08-21T19:06:04Z ERROR cosmic_osd::components::audio] failed to connect to cosmic-settings's varlink service: Io(Os { code: 111, kind: ConnectionRefused, message: "Connection refused" })
Aug 21 15:06:07 ar102 cosmic-session[6072]: [2026-08-21T19:06:07Z ERROR cosmic_osd::components::audio] failed to connect to cosmic-settings's varlink service: Io(Os { code: 111, kind: ConnectionRefused, message: "Connection refused" })
Aug 21 15:06:10 ar102 cosmic-session[6072]: [2026-08-21T19:06:10Z ERROR cosmic_osd::components::audio] failed to connect to cosmic-settings's varlink service: Io(Os { code: 111, kind: ConnectionRefused, message: "Connection refused" })
Aug 21 15:06:13 ar102 cosmic-session[6072]: [2026-08-21T19:06:13Z ERROR cosmic_osd::components::audio] failed to connect to cosmic-settings's varlink service: Io(Os { code: 111, kind: ConnectionRefused, message: "Connection refused" })
Aug 21 15:06:16 ar102 cosmic-session[6072]: [2026-08-21T19:06:16Z ERROR cosmic_osd::components::audio] failed to connect to cosmic-settings's varlink service: Io(Os { code: 111, kind: ConnectionRefused, message: "Connection refused" })
Aug 21 15:06:19 ar102 cosmic-session[6072]: [2026-08-21T19:06:19Z ERROR cosmic_osd::components::audio] failed to connect to cosmic-settings's varlink service: Io(Os { code: 111, kind: ConnectionRefused, message: "Connection refused" })
Aug 21 15:06:22 ar102 cosmic-session[6072]: [2026-08-21T19:06:22Z ERROR cosmic_osd::components::audio] failed to connect to cosmic-settings's varlink service: Io(Os { code: 111, kind: ConnectionRefused, message: "Connection refused" })
Aug 21 15:06:25 ar102 cosmic-session[6072]: [2026-08-21T19:06:25Z ERROR cosmic_osd::components::audio] failed to connect to cosmic-settings's varlink service: Io(Os { code: 111, kind: ConnectionRefused, message: "Connection refused" })
Aug 21 15:06:28 ar102 cosmic-session[6072]: [2026-08-21T19:06:28Z ERROR cosmic_osd::components::audio] failed to connect to cosmic-settings's varlink service: Io(Os { code: 111, kind: ConnectionRefused, message: "Connection refused" })
... 1169 more distinct messages not shown
== b0b02.cs.umd.edu (1 distinct, 1 total) ==
Aug 21 15:07:41 b0b02.cs.umd.edu rustdesk[694689]: cannot open display:
== bigtuna (1 distinct, 1 total) ==
Aug 21 15:33:38 bigtuna krb5_child[1308657]: Preauthentication failed
== borg (12 distinct, 12 total) ==
Aug 21 16:03:45 borg kernel: acpi PNP0A03:00: fail to add MMCONFIG information, can't access extended configuration space under this bridge
Aug 21 16:03:46 borg kernel: device-mapper: core: CONFIG_IMA_DISABLE_HTABLE is disabled. Duplicate IMA measurements will not be recorded in the IMA log.
Aug 21 16:03:46 borg kernel: sd 0:0:0:0: Power-on or device reset occurred
Aug 21 16:03:49 borg lvm[697]: PV /dev/sda2 online, VG rhel_borg is complete.
Aug 21 16:03:51 borg systemd[1]: resmon.service: Supervising process 943 which is not our child. We'll most likely not notice when it exits.
Aug 21 16:03:53 borg kernel: block dm-0: the capability attribute has been deprecated.
Aug 21 16:04:00 borg irqbalance[777]: Cannot change IRQ 31 affinity: Operation not permitted
Aug 21 16:04:00 borg irqbalance[777]: IRQ 31 affinity is now unmanaged
Aug 21 16:04:00 borg irqbalance[777]: Cannot change IRQ 32 affinity: Operation not permitted
Aug 21 16:04:00 borg irqbalance[777]: IRQ 32 affinity is now unmanaged
Aug 21 16:04:00 borg irqbalance[777]: Cannot change IRQ 29 affinity: Operation not permitted
Aug 21 16:04:00 borg irqbalance[777]: IRQ 29 affinity is now unmanaged
== cheezit.cs.umd.edu (1 distinct, 1 total) ==
Aug 21 15:20:59 cheezit.cs.umd.edu sshd-session[2815090]: pam_access(sshd:auth): access denied for user `bhatele' from `172.58.245.118'
== csfw00a (1 distinct, 137 total) ==
Aug 21 15:04:52 csfw00a kernel: bnxt_en 0000:09:00.0 eth3: NIC Link is Down [x137]
== hackerman (7 distinct, 12 total) ==
Aug 21 15:19:01 hackerman gnome-software[2060381]: failed to commit changes to dconf: GDBus.Error:org.gtk.GDBus.UnmappedGError.Quark._g_2dfile_2derror_2dquark.Code2: Failed to create file “/adminhomes/sajith/.config/dconf/user.XST7T3”: Permission denied
Aug 21 15:20:04 hackerman gnome-software[2060381]: can't reliably fixup error code 4 in domain g-io-error-quark: Not a directory [x4]
Aug 21 15:20:12 hackerman gnome-software[2060381]: Only 0 apps for recent list, hiding
Aug 21 15:20:28 hackerman gnome-software[2060381]: failed to commit changes to dconf: GDBus.Error:org.gtk.GDBus.UnmappedGError.Quark._g_2dfile_2derror_2dquark.Code2: Failed to create file “/adminhomes/sajith/.config/dconf/user.6WQAU3”: Permission denied
Aug 21 15:20:28 hackerman packagekitd[1041140]: Failed to get cache filename for libreoffice [x2]
Aug 21 15:20:28 hackerman packagekitd[1041140]: Failed to get cache filename for kernel [x2]
Aug 21 15:20:38 hackerman packagekitd[1041140]: failed to parse public key for /etc/pki/rpm-gpg/RPM-GPG-KEY-PQC-redhat-release
== idm00 (1 distinct, 1 total) ==
Aug 21 15:51:39 idm00 named[3810278]: client @0x7f48dd3b0ce8 10.73.240.42#56204: update '73.10.in-addr.arpa/IN' denied
== idmp0 (1 distinct, 1 total) ==
Aug 21 15:35:56 idmp0 named[1121900]: client @0x7fe3f003a6b8 10.73.240.43#62898: update '73.10.in-addr.arpa/IN' denied
== itmon02 (1 distinct, 45 total) ==
Aug 21 15:08:03 itmon02 sshd[1750555]: error: beginning MaxStartups throttling [x45]
== itmon03 (1 distinct, 1 total) ==
Aug 21 15:20:02 itmon03 systemd-timedated[1789859]: /dev/rtc is busy. Is somebody keeping it open continuously? That's not a good idea... Returning a bogus RTC timestamp.
== krispykreme.cs.umd.edu (3 distinct, 5 total) ==
Aug 21 15:25:10 krispykreme.cs.umd.edu sshd-session[1552298]: pam_access(sshd:auth): access denied for user `larry' from `198.136.190.5' [x3]
Aug 21 15:25:25 krispykreme.cs.umd.edu sshd-session[1552298]: Error in Duo login for 'larry' from 198.136.190.5
Aug 21 15:25:25 krispykreme.cs.umd.edu sshd-session[1552296]: error: PAM: Authentication failure for larry from 198.136.190.5
== librenms-prod-staging (1 distinct, 2 total) ==
Aug 21 15:18:55 librenms-prod-staging puppet-agent[142383]: The directory '/opt/librenms/rrd' contains 16228 entries, which exceeds the default soft limit 1000 and may cause excessive resource consumption and degraded performance. To remove this warning set a value for `max_files` parameter or consider using an alternate method to manage large directory trees [x2]
== newhonors2 (1 distinct, 24 total) ==
Aug 21 15:13:03 newhonors2 dhcpcd[1529096]: dhcpcd is not running [x24]
== outbound00.cs.umd.edu (1 distinct, 6 total) ==
Aug 21 15:09:09 outbound00.cs.umd.edu python3[265393]: ldapdb [x6]
== outbound01.cs.umd.edu (1 distinct, 6 total) ==
Aug 21 15:13:06 outbound01.cs.umd.edu python3[2500403]: ldapdb [x6]
== quiss (1 distinct, 1 total) ==
Aug 21 15:58:34 quiss setroubleshoot[2757067]: SELinux is preventing /usr/libexec/openssh/sshd-session from search access on the directory josephao. For complete SELinux messages run: sealert -l bf7a29ff-cb56-4adb-bf14-f887aed82b80
== sentry-docker00.cs.umd.edu (36 distinct, 36 total) ==
Aug 21 15:20:33 sentry-docker00.cs.umd.edu systemd-udevd[792483]: link_config: could not get ethtool features for veth438be4e
Aug 21 15:20:33 sentry-docker00.cs.umd.edu systemd-udevd[792483]: Could not set offload features of veth438be4e: No such device
Aug 21 15:20:33 sentry-docker00.cs.umd.edu systemd-udevd[792488]: link_config: could not get ethtool features for vethb61f07c
Aug 21 15:20:33 sentry-docker00.cs.umd.edu systemd-udevd[792488]: Could not set offload features of vethb61f07c: No such device
Aug 21 15:20:33 sentry-docker00.cs.umd.edu systemd-udevd[792514]: Could not generate persistent MAC address for vethe84d89e: No such file or directory
Aug 21 15:20:33 sentry-docker00.cs.umd.edu systemd-udevd[792515]: Could not generate persistent MAC address for vethf4d5da0: No such file or directory
Aug 21 15:20:33 sentry-docker00.cs.umd.edu systemd-udevd[792518]: Could not generate persistent MAC address for veth0187424: No such file or directory
Aug 21 15:20:33 sentry-docker00.cs.umd.edu systemd-udevd[792519]: Could not generate persistent MAC address for veth4b83352: No such file or directory
Aug 21 15:20:33 sentry-docker00.cs.umd.edu systemd-udevd[792527]: Could not generate persistent MAC address for vethb9a05a0: No such file or directory
Aug 21 15:20:33 sentry-docker00.cs.umd.edu systemd-udevd[792529]: Could not generate persistent MAC address for veth75eb262: No such file or directory
Aug 21 15:20:33 sentry-docker00.cs.umd.edu systemd-udevd[792515]: Could not generate persistent MAC address for veth9b4f258: No such file or directory
Aug 21 15:20:33 sentry-docker00.cs.umd.edu systemd-udevd[792520]: Could not generate persistent MAC address for vethe6abeda: No such file or directory
Aug 21 15:20:33 sentry-docker00.cs.umd.edu systemd-udevd[792556]: Could not generate persistent MAC address for veth63dec48: No such file or directory
Aug 21 15:20:33 sentry-docker00.cs.umd.edu systemd-udevd[792563]: Could not generate persistent MAC address for vethb1b36f6: No such file or directory
Aug 21 15:40:41 sentry-docker00.cs.umd.edu systemd-udevd[801847]: link_config: could not get ethtool features for vethe6abeda
Aug 21 15:40:41 sentry-docker00.cs.umd.edu systemd-udevd[801847]: Could not set offload features of vethe6abeda: No such device
Aug 21 15:40:41 sentry-docker00.cs.umd.edu systemd-udevd[801883]: Could not generate persistent MAC address for veth9242c11: No such file or directory
Aug 21 15:40:41 sentry-docker00.cs.umd.edu systemd-udevd[801884]: Could not generate persistent MAC address for veth429e4a0: No such file or directory
Aug 21 15:40:41 sentry-docker00.cs.umd.edu systemd-udevd[801887]: Could not generate persistent MAC address for veth1a4e6ec: No such file or directory
Aug 21 15:40:41 sentry-docker00.cs.umd.edu systemd-udevd[801888]: Could not generate persistent MAC address for veth3cbdbdd: No such file or directory
Aug 21 15:40:41 sentry-docker00.cs.umd.edu systemd-udevd[801911]: Could not generate persistent MAC address for veth9f12bce: No such file or directory
Aug 21 15:40:41 sentry-docker00.cs.umd.edu systemd-udevd[801912]: Could not generate persistent MAC address for vethb751248: No such file or directory
Aug 21 15:40:41 sentry-docker00.cs.umd.edu systemd-udevd[801916]: Could not generate persistent MAC address for vethc8b264f: No such file or directory
Aug 21 15:40:41 sentry-docker00.cs.umd.edu systemd-udevd[801935]: Could not generate persistent MAC address for veth2f60fe7: No such file or directory
Aug 21 15:40:41 sentry-docker00.cs.umd.edu systemd-udevd[801916]: Could not generate persistent MAC address for vethca1c5bf: No such file or directory
Aug 21 15:40:41 sentry-docker00.cs.umd.edu systemd-udevd[801915]: Could not generate persistent MAC address for veth722b8c3: No such file or directory
Aug 21 16:00:50 sentry-docker00.cs.umd.edu systemd-udevd[811281]: Could not generate persistent MAC address for vethf382ce3: No such file or directory
Aug 21 16:00:50 sentry-docker00.cs.umd.edu systemd-udevd[811282]: Could not generate persistent MAC address for vethdb470d0: No such file or directory
Aug 21 16:00:50 sentry-docker00.cs.umd.edu systemd-udevd[811307]: Could not generate persistent MAC address for veth46d986f: No such file or directory
Aug 21 16:00:50 sentry-docker00.cs.umd.edu systemd-udevd[811308]: Could not generate persistent MAC address for vethb6dec8b: No such file or directory
... 6 more distinct messages not shown
== soul (1 distinct, 1 total) ==
Aug 21 15:13:24 soul krb5_child[2464935]: Preauthentication failed
== strawberry (2 distinct, 8 total) ==
Aug 21 15:09:44 strawberry udisksd[1067]: Error performing housekeeping for drive /org/freedesktop/UDisks2/drives/ST2000DM001_1CH164_W1E8J5KJ: Error updating SMART data: Error sending ATA command CHECK POWER MODE: Unexpected sense data returned:#0120000: 00 00 00 00 00 00 00 00 00 00 00 00 00 00 00 00 ................#0120010: 00 00 00 00 00 00 00 00 00 00 00 00 00 00 00 00 ................#012 (g-io-error-quark, 0) [x6]
Aug 21 15:34:42 strawberry smartd[5314]: Device: /dev/sda [SAT], failed to read SMART Attribute Data [x2]
1
0
Command: /usr/local/sbin/syslog-digest.py
Time : 0.1241s
Status : exited 0
Output :
Syslog digest — 2026-08-21 15:05 EDT
Processed 4,208 lines, filtered 2,609 (62%). 1,599 unknown (1344 distinct) from 21 host(s).
== ar102 (1273 distinct, 1273 total) ==
Aug 21 14:02:17 ar102 cosmic-session[6072]: [2026-08-21T18:02:17Z ERROR cosmic_osd::components::audio] failed to connect to cosmic-settings's varlink service: Io(Os { code: 111, kind: ConnectionRefused, message: "Connection refused" })
Aug 21 14:02:20 ar102 cosmic-session[6072]: [2026-08-21T18:02:20Z ERROR cosmic_osd::components::audio] failed to connect to cosmic-settings's varlink service: Io(Os { code: 111, kind: ConnectionRefused, message: "Connection refused" })
Aug 21 14:02:23 ar102 cosmic-session[6072]: [2026-08-21T18:02:23Z ERROR cosmic_osd::components::audio] failed to connect to cosmic-settings's varlink service: Io(Os { code: 111, kind: ConnectionRefused, message: "Connection refused" })
Aug 21 14:02:26 ar102 cosmic-session[6072]: [2026-08-21T18:02:26Z ERROR cosmic_osd::components::audio] failed to connect to cosmic-settings's varlink service: Io(Os { code: 111, kind: ConnectionRefused, message: "Connection refused" })
Aug 21 14:02:29 ar102 cosmic-session[6072]: [2026-08-21T18:02:29Z ERROR cosmic_osd::components::audio] failed to connect to cosmic-settings's varlink service: Io(Os { code: 111, kind: ConnectionRefused, message: "Connection refused" })
Aug 21 14:02:32 ar102 cosmic-session[6072]: [2026-08-21T18:02:32Z ERROR cosmic_osd::components::audio] failed to connect to cosmic-settings's varlink service: Io(Os { code: 111, kind: ConnectionRefused, message: "Connection refused" })
Aug 21 14:02:35 ar102 cosmic-session[6072]: [2026-08-21T18:02:35Z ERROR cosmic_osd::components::audio] failed to connect to cosmic-settings's varlink service: Io(Os { code: 111, kind: ConnectionRefused, message: "Connection refused" })
Aug 21 14:02:38 ar102 cosmic-session[6072]: [2026-08-21T18:02:38Z ERROR cosmic_osd::components::audio] failed to connect to cosmic-settings's varlink service: Io(Os { code: 111, kind: ConnectionRefused, message: "Connection refused" })
Aug 21 14:02:41 ar102 cosmic-session[6072]: [2026-08-21T18:02:41Z ERROR cosmic_osd::components::audio] failed to connect to cosmic-settings's varlink service: Io(Os { code: 111, kind: ConnectionRefused, message: "Connection refused" })
Aug 21 14:02:44 ar102 cosmic-session[6072]: [2026-08-21T18:02:44Z ERROR cosmic_osd::components::audio] failed to connect to cosmic-settings's varlink service: Io(Os { code: 111, kind: ConnectionRefused, message: "Connection refused" })
Aug 21 14:02:47 ar102 cosmic-session[6072]: [2026-08-21T18:02:47Z ERROR cosmic_osd::components::audio] failed to connect to cosmic-settings's varlink service: Io(Os { code: 111, kind: ConnectionRefused, message: "Connection refused" })
Aug 21 14:02:50 ar102 cosmic-session[6072]: [2026-08-21T18:02:50Z ERROR cosmic_osd::components::audio] failed to connect to cosmic-settings's varlink service: Io(Os { code: 111, kind: ConnectionRefused, message: "Connection refused" })
Aug 21 14:02:53 ar102 cosmic-session[6072]: [2026-08-21T18:02:53Z ERROR cosmic_osd::components::audio] failed to connect to cosmic-settings's varlink service: Io(Os { code: 111, kind: ConnectionRefused, message: "Connection refused" })
Aug 21 14:02:56 ar102 cosmic-session[6072]: [2026-08-21T18:02:56Z ERROR cosmic_osd::components::audio] failed to connect to cosmic-settings's varlink service: Io(Os { code: 111, kind: ConnectionRefused, message: "Connection refused" })
Aug 21 14:02:59 ar102 cosmic-session[6072]: [2026-08-21T18:02:59Z ERROR cosmic_osd::components::audio] failed to connect to cosmic-settings's varlink service: Io(Os { code: 111, kind: ConnectionRefused, message: "Connection refused" })
Aug 21 14:03:02 ar102 cosmic-session[6072]: [2026-08-21T18:03:02Z ERROR cosmic_osd::components::audio] failed to connect to cosmic-settings's varlink service: Io(Os { code: 111, kind: ConnectionRefused, message: "Connection refused" })
Aug 21 14:03:05 ar102 cosmic-session[6072]: [2026-08-21T18:03:05Z ERROR cosmic_osd::components::audio] failed to connect to cosmic-settings's varlink service: Io(Os { code: 111, kind: ConnectionRefused, message: "Connection refused" })
Aug 21 14:03:08 ar102 cosmic-session[6072]: [2026-08-21T18:03:08Z ERROR cosmic_osd::components::audio] failed to connect to cosmic-settings's varlink service: Io(Os { code: 111, kind: ConnectionRefused, message: "Connection refused" })
Aug 21 14:03:11 ar102 cosmic-session[6072]: [2026-08-21T18:03:11Z ERROR cosmic_osd::components::audio] failed to connect to cosmic-settings's varlink service: Io(Os { code: 111, kind: ConnectionRefused, message: "Connection refused" })
Aug 21 14:03:14 ar102 cosmic-session[6072]: [2026-08-21T18:03:14Z ERROR cosmic_osd::components::audio] failed to connect to cosmic-settings's varlink service: Io(Os { code: 111, kind: ConnectionRefused, message: "Connection refused" })
Aug 21 14:03:17 ar102 cosmic-session[6072]: [2026-08-21T18:03:17Z ERROR cosmic_osd::components::audio] failed to connect to cosmic-settings's varlink service: Io(Os { code: 111, kind: ConnectionRefused, message: "Connection refused" })
Aug 21 14:03:20 ar102 cosmic-session[6072]: [2026-08-21T18:03:20Z ERROR cosmic_osd::components::audio] failed to connect to cosmic-settings's varlink service: Io(Os { code: 111, kind: ConnectionRefused, message: "Connection refused" })
Aug 21 14:03:23 ar102 cosmic-session[6072]: [2026-08-21T18:03:23Z ERROR cosmic_osd::components::audio] failed to connect to cosmic-settings's varlink service: Io(Os { code: 111, kind: ConnectionRefused, message: "Connection refused" })
Aug 21 14:03:26 ar102 cosmic-session[6072]: [2026-08-21T18:03:26Z ERROR cosmic_osd::components::audio] failed to connect to cosmic-settings's varlink service: Io(Os { code: 111, kind: ConnectionRefused, message: "Connection refused" })
Aug 21 14:03:29 ar102 cosmic-session[6072]: [2026-08-21T18:03:29Z ERROR cosmic_osd::components::audio] failed to connect to cosmic-settings's varlink service: Io(Os { code: 111, kind: ConnectionRefused, message: "Connection refused" })
Aug 21 14:03:32 ar102 cosmic-session[6072]: [2026-08-21T18:03:32Z ERROR cosmic_osd::components::audio] failed to connect to cosmic-settings's varlink service: Io(Os { code: 111, kind: ConnectionRefused, message: "Connection refused" })
Aug 21 14:03:35 ar102 cosmic-session[6072]: [2026-08-21T18:03:35Z ERROR cosmic_osd::components::audio] failed to connect to cosmic-settings's varlink service: Io(Os { code: 111, kind: ConnectionRefused, message: "Connection refused" })
Aug 21 14:03:38 ar102 cosmic-session[6072]: [2026-08-21T18:03:38Z ERROR cosmic_osd::components::audio] failed to connect to cosmic-settings's varlink service: Io(Os { code: 111, kind: ConnectionRefused, message: "Connection refused" })
Aug 21 14:03:41 ar102 cosmic-session[6072]: [2026-08-21T18:03:41Z ERROR cosmic_osd::components::audio] failed to connect to cosmic-settings's varlink service: Io(Os { code: 111, kind: ConnectionRefused, message: "Connection refused" })
Aug 21 14:03:44 ar102 cosmic-session[6072]: [2026-08-21T18:03:44Z ERROR cosmic_osd::components::audio] failed to connect to cosmic-settings's varlink service: Io(Os { code: 111, kind: ConnectionRefused, message: "Connection refused" })
... 1243 more distinct messages not shown
== b0b02.cs.umd.edu (1 distinct, 1 total) ==
Aug 21 14:07:36 b0b02.cs.umd.edu rustdesk[679614]: cannot open display:
== bachata (1 distinct, 1 total) ==
Aug 21 14:12:03 bachata setroubleshoot[3418586]: SELinux is preventing /usr/sbin/smbd from name_bind access on the udp_socket port 753. For complete SELinux messages run: sealert -l 8f7247f1-69a5-4a62-a4f0-88a324bfd75c
== biggulp.cs.umd.edu (6 distinct, 6 total) ==
Aug 21 14:21:10 biggulp.cs.umd.edu sshd-session[3240940]: error: kex_protocol_error: type 20 seq 2 [preauth]
Aug 21 14:21:10 biggulp.cs.umd.edu sshd-session[3240940]: error: kex_protocol_error: type 30 seq 3 [preauth]
Aug 21 14:21:12 biggulp.cs.umd.edu sshd-session[3240940]: error: kex_protocol_error: type 20 seq 4 [preauth]
Aug 21 14:21:12 biggulp.cs.umd.edu sshd-session[3240940]: error: kex_protocol_error: type 30 seq 5 [preauth]
Aug 21 14:21:22 biggulp.cs.umd.edu sshd-session[3240940]: error: kex_protocol_error: type 20 seq 6 [preauth]
Aug 21 14:21:22 biggulp.cs.umd.edu sshd-session[3240940]: error: kex_protocol_error: type 30 seq 7 [preauth]
== borg (1 distinct, 2 total) ==
Aug 21 14:17:44 borg sshd-session[65215]: error: Certificate does not contain an authorized principal [x2]
== csfw00a (1 distinct, 158 total) ==
Aug 21 14:05:06 csfw00a kernel: bnxt_en 0000:09:00.0 eth3: NIC Link is Down [x158]
== hackerman (6 distinct, 11 total) ==
Aug 21 14:20:04 hackerman gnome-software[2060381]: can't reliably fixup error code 4 in domain g-io-error-quark: Not a directory [x4]
Aug 21 14:20:12 hackerman gnome-software[2060381]: Only 0 apps for recent list, hiding
Aug 21 14:20:28 hackerman gnome-software[2060381]: failed to commit changes to dconf: GDBus.Error:org.gtk.GDBus.UnmappedGError.Quark._g_2dfile_2derror_2dquark.Code2: Failed to create file “/adminhomes/sajith/.config/dconf/user.3WS9T3”: Permission denied
Aug 21 14:20:28 hackerman packagekitd[1028255]: Failed to get cache filename for libreoffice [x2]
Aug 21 14:20:28 hackerman packagekitd[1028255]: Failed to get cache filename for kernel [x2]
Aug 21 14:20:38 hackerman packagekitd[1028255]: failed to parse public key for /etc/pki/rpm-gpg/RPM-GPG-KEY-PQC-redhat-release
== idm00 (1 distinct, 1 total) ==
Aug 21 14:51:39 idm00 named[3810278]: client @0x7f48d80678d8 10.73.240.42#57827: update '73.10.in-addr.arpa/IN' denied
== idmp0 (1 distinct, 1 total) ==
Aug 21 14:35:56 idmp0 named[1121900]: client @0x7fe3f8005b98 10.73.240.43#63166: update '73.10.in-addr.arpa/IN' denied
== irb2156 (3 distinct, 3 total) ==
Aug 21 14:51:25 irb2156 systemd-resolved[3467]: Using degraded feature set UDP instead of UDP+EDNS0 for DNS server 128.8.74.3.
Aug 21 14:51:30 irb2156 systemd-resolved[3467]: Using degraded feature set UDP instead of UDP+EDNS0 for DNS server 128.8.76.3.
Aug 21 14:51:36 irb2156 systemd-resolved[3467]: Using degraded feature set TCP instead of UDP for DNS server 128.8.74.3.
== itmon02 (1 distinct, 35 total) ==
Aug 21 14:07:57 itmon02 sshd[1750555]: error: beginning MaxStartups throttling [x35]
== itmon03 (1 distinct, 2 total) ==
Aug 21 14:20:02 itmon03 systemd-timedated[1786875]: /dev/rtc is busy. Is somebody keeping it open continuously? That's not a good idea... Returning a bogus RTC timestamp. [x2]
== krispykreme.cs.umd.edu (1 distinct, 1 total) ==
Aug 21 14:22:59 krispykreme.cs.umd.edu sshd-session[1535864]: pam_access(sshd:auth): access denied for user `nickr' from `109.178.70.157'
== librenms-prod-staging (2 distinct, 3 total) ==
Aug 21 14:17:22 librenms-prod-staging puppet-agent[87996]: The directory '/opt/librenms/rrd' contains 17281 entries, which exceeds the default soft limit 1000 and may cause excessive resource consumption and degraded performance. To remove this warning set a value for `max_files` parameter or consider using an alternate method to manage large directory trees
Aug 21 14:17:50 librenms-prod-staging sshd-session[93468]: error: Certificate does not contain an authorized principal [x2]
== librenms-test (3 distinct, 3 total) ==
Aug 21 14:15:48 librenms-test puppet-agent[92002]: Could not retrieve catalog from remote server: Error 500 on SERVER: Server Error: Evaluation Error: Error while evaluating a Function Call, You are using the empty role, but the csd-puppet-run fact exists. This will break things! (file: /etc/puppetlabs/code/environments/production/site/profile/manifests/empty.pp, line: 6, column: 5) on node librenms-test.devpve.cs.umd.edu
Aug 21 14:15:48 librenms-test puppet-agent[92002]: Not using cache on failed catalog
Aug 21 14:15:48 librenms-test puppet-agent[92002]: Could not retrieve catalog; skipping run
== newhonors2 (1 distinct, 24 total) ==
Aug 21 14:13:03 newhonors2 dhcpcd[1527150]: dhcpcd is not running [x24]
== outbound00.cs.umd.edu (1 distinct, 6 total) ==
Aug 21 14:09:09 outbound00.cs.umd.edu python3[251289]: ldapdb [x6]
== outbound01.cs.umd.edu (1 distinct, 6 total) ==
Aug 21 14:13:06 outbound01.cs.umd.edu python3[2486400]: ldapdb [x6]
== quiss (1 distinct, 18 total) ==
Aug 21 14:40:10 quiss nautilus[2301758]: Attempted to add a non-existent file to the view. [x18]
== sentry-docker00.cs.umd.edu (36 distinct, 36 total) ==
Aug 21 14:20:08 sentry-docker00.cs.umd.edu systemd-udevd[764214]: link_config: could not get ethtool features for veth97ef942
Aug 21 14:20:08 sentry-docker00.cs.umd.edu systemd-udevd[764214]: Could not set offload features of veth97ef942: No such device
Aug 21 14:20:08 sentry-docker00.cs.umd.edu systemd-udevd[764246]: Could not generate persistent MAC address for veth0ee94b7: No such file or directory
Aug 21 14:20:08 sentry-docker00.cs.umd.edu systemd-udevd[764247]: Could not generate persistent MAC address for vethcc9e57a: No such file or directory
Aug 21 14:20:08 sentry-docker00.cs.umd.edu systemd-udevd[764250]: Could not generate persistent MAC address for veth2026bb6: No such file or directory
Aug 21 14:20:08 sentry-docker00.cs.umd.edu systemd-udevd[764251]: Could not generate persistent MAC address for veth1ea20f5: No such file or directory
Aug 21 14:20:08 sentry-docker00.cs.umd.edu systemd-udevd[764274]: Could not generate persistent MAC address for vethefb97d6: No such file or directory
Aug 21 14:20:08 sentry-docker00.cs.umd.edu systemd-udevd[764275]: Could not generate persistent MAC address for veth08754df: No such file or directory
Aug 21 14:20:08 sentry-docker00.cs.umd.edu systemd-udevd[764278]: Could not generate persistent MAC address for vethab2d945: No such file or directory
Aug 21 14:20:08 sentry-docker00.cs.umd.edu systemd-udevd[764279]: Could not generate persistent MAC address for vethdeda2ce: No such file or directory
Aug 21 14:20:08 sentry-docker00.cs.umd.edu systemd-udevd[764298]: Could not generate persistent MAC address for vethc1ff5dd: No such file or directory
Aug 21 14:20:08 sentry-docker00.cs.umd.edu systemd-udevd[764292]: Could not generate persistent MAC address for veth90c72b3: No such file or directory
Aug 21 14:40:16 sentry-docker00.cs.umd.edu systemd-udevd[773391]: link_config: could not get ethtool features for vethefb97d6
Aug 21 14:40:16 sentry-docker00.cs.umd.edu systemd-udevd[773391]: Could not set offload features of vethefb97d6: No such device
Aug 21 14:40:16 sentry-docker00.cs.umd.edu systemd-udevd[773420]: Could not generate persistent MAC address for veth409a841: No such file or directory
Aug 21 14:40:16 sentry-docker00.cs.umd.edu systemd-udevd[773421]: Could not generate persistent MAC address for veth4054cd5: No such file or directory
Aug 21 14:40:16 sentry-docker00.cs.umd.edu systemd-udevd[773439]: Could not generate persistent MAC address for vethb282ffc: No such file or directory
Aug 21 14:40:16 sentry-docker00.cs.umd.edu systemd-udevd[773437]: Could not generate persistent MAC address for vethdaaac77: No such file or directory
Aug 21 14:40:16 sentry-docker00.cs.umd.edu systemd-udevd[773444]: Could not generate persistent MAC address for veth97ac1e3: No such file or directory
Aug 21 14:40:16 sentry-docker00.cs.umd.edu systemd-udevd[773433]: Could not generate persistent MAC address for vethabacdb2: No such file or directory
Aug 21 14:40:16 sentry-docker00.cs.umd.edu systemd-udevd[773441]: Could not generate persistent MAC address for veth9b192b1: No such file or directory
Aug 21 14:40:16 sentry-docker00.cs.umd.edu systemd-udevd[773437]: Could not generate persistent MAC address for veth3e31a66: No such file or directory
Aug 21 14:40:16 sentry-docker00.cs.umd.edu systemd-udevd[773551]: Could not generate persistent MAC address for vethde4529d: No such file or directory
Aug 21 14:40:16 sentry-docker00.cs.umd.edu systemd-udevd[773545]: Could not generate persistent MAC address for veth535c235: No such file or directory
Aug 21 15:00:25 sentry-docker00.cs.umd.edu systemd-udevd[782852]: link_config: could not get ethtool features for vethb282ffc
Aug 21 15:00:25 sentry-docker00.cs.umd.edu systemd-udevd[782852]: Could not set offload features of vethb282ffc: No such device
Aug 21 15:00:25 sentry-docker00.cs.umd.edu systemd-udevd[782950]: Could not generate persistent MAC address for veth2a32f79: No such file or directory
Aug 21 15:00:25 sentry-docker00.cs.umd.edu systemd-udevd[782951]: Could not generate persistent MAC address for vethc2f82f3: No such file or directory
Aug 21 15:00:25 sentry-docker00.cs.umd.edu systemd-udevd[782954]: Could not generate persistent MAC address for veth85bc1c6: No such file or directory
Aug 21 15:00:25 sentry-docker00.cs.umd.edu systemd-udevd[782955]: Could not generate persistent MAC address for vethfdc4f0e: No such file or directory
... 6 more distinct messages not shown
== strawberry (2 distinct, 8 total) ==
Aug 21 14:09:44 strawberry udisksd[1067]: Error performing housekeeping for drive /org/freedesktop/UDisks2/drives/ST2000DM001_1CH164_W1E8J5KJ: Error updating SMART data: Error sending ATA command CHECK POWER MODE: Unexpected sense data returned:#0120000: 00 00 00 00 00 00 00 00 00 00 00 00 00 00 00 00 ................#0120010: 00 00 00 00 00 00 00 00 00 00 00 00 00 00 00 00 ................#012 (g-io-error-quark, 0) [x6]
Aug 21 14:34:42 strawberry smartd[5314]: Device: /dev/sda [SAT], failed to read SMART Attribute Data [x2]
1
0
Command: /usr/local/sbin/syslog-digest.py
Time : 0.1159s
Status : exited 0
Output :
Syslog digest — 2026-08-21 14:05 EDT
Processed 3,549 lines, filtered 2,086 (58%). 1,463 unknown (1224 distinct) from 18 host(s).
== ar102 (1164 distinct, 1168 total) ==
Aug 21 13:05:04 ar102 cosmic-session[6072]: [2026-08-21T17:05:04Z ERROR cosmic_osd::components::audio] failed to connect to cosmic-settings's varlink service: Io(Os { code: 111, kind: ConnectionRefused, message: "Connection refused" })
Aug 21 13:05:07 ar102 cosmic-session[6072]: [2026-08-21T17:05:07Z ERROR cosmic_osd::components::audio] failed to connect to cosmic-settings's varlink service: Io(Os { code: 111, kind: ConnectionRefused, message: "Connection refused" })
Aug 21 13:05:10 ar102 cosmic-session[6072]: [2026-08-21T17:05:10Z ERROR cosmic_osd::components::audio] failed to connect to cosmic-settings's varlink service: Io(Os { code: 111, kind: ConnectionRefused, message: "Connection refused" })
Aug 21 13:05:13 ar102 cosmic-session[6072]: [2026-08-21T17:05:13Z ERROR cosmic_osd::components::audio] failed to connect to cosmic-settings's varlink service: Io(Os { code: 111, kind: ConnectionRefused, message: "Connection refused" })
Aug 21 13:05:16 ar102 cosmic-session[6072]: [2026-08-21T17:05:16Z ERROR cosmic_osd::components::audio] failed to connect to cosmic-settings's varlink service: Io(Os { code: 111, kind: ConnectionRefused, message: "Connection refused" })
Aug 21 13:05:19 ar102 cosmic-session[6072]: [2026-08-21T17:05:19Z ERROR cosmic_osd::components::audio] failed to connect to cosmic-settings's varlink service: Io(Os { code: 111, kind: ConnectionRefused, message: "Connection refused" })
Aug 21 13:05:22 ar102 cosmic-session[6072]: [2026-08-21T17:05:22Z ERROR cosmic_osd::components::audio] failed to connect to cosmic-settings's varlink service: Io(Os { code: 111, kind: ConnectionRefused, message: "Connection refused" })
Aug 21 13:05:25 ar102 cosmic-session[6072]: [2026-08-21T17:05:25Z ERROR cosmic_osd::components::audio] failed to connect to cosmic-settings's varlink service: Io(Os { code: 111, kind: ConnectionRefused, message: "Connection refused" })
Aug 21 13:05:28 ar102 cosmic-session[6072]: [2026-08-21T17:05:28Z ERROR cosmic_osd::components::audio] failed to connect to cosmic-settings's varlink service: Io(Os { code: 111, kind: ConnectionRefused, message: "Connection refused" })
Aug 21 13:05:31 ar102 cosmic-session[6072]: [2026-08-21T17:05:31Z ERROR cosmic_osd::components::audio] failed to connect to cosmic-settings's varlink service: Io(Os { code: 111, kind: ConnectionRefused, message: "Connection refused" })
Aug 21 13:05:34 ar102 cosmic-session[6072]: [2026-08-21T17:05:34Z ERROR cosmic_osd::components::audio] failed to connect to cosmic-settings's varlink service: Io(Os { code: 111, kind: ConnectionRefused, message: "Connection refused" })
Aug 21 13:05:37 ar102 cosmic-session[6072]: [2026-08-21T17:05:37Z ERROR cosmic_osd::components::audio] failed to connect to cosmic-settings's varlink service: Io(Os { code: 111, kind: ConnectionRefused, message: "Connection refused" })
Aug 21 13:05:40 ar102 cosmic-session[6072]: [2026-08-21T17:05:40Z ERROR cosmic_osd::components::audio] failed to connect to cosmic-settings's varlink service: Io(Os { code: 111, kind: ConnectionRefused, message: "Connection refused" })
Aug 21 13:05:43 ar102 cosmic-session[6072]: [2026-08-21T17:05:43Z ERROR cosmic_osd::components::audio] failed to connect to cosmic-settings's varlink service: Io(Os { code: 111, kind: ConnectionRefused, message: "Connection refused" })
Aug 21 13:05:46 ar102 cosmic-session[6072]: [2026-08-21T17:05:46Z ERROR cosmic_osd::components::audio] failed to connect to cosmic-settings's varlink service: Io(Os { code: 111, kind: ConnectionRefused, message: "Connection refused" })
Aug 21 13:05:49 ar102 cosmic-session[6072]: [2026-08-21T17:05:49Z ERROR cosmic_osd::components::audio] failed to connect to cosmic-settings's varlink service: Io(Os { code: 111, kind: ConnectionRefused, message: "Connection refused" })
Aug 21 13:05:52 ar102 cosmic-session[6072]: [2026-08-21T17:05:52Z ERROR cosmic_osd::components::audio] failed to connect to cosmic-settings's varlink service: Io(Os { code: 111, kind: ConnectionRefused, message: "Connection refused" })
Aug 21 13:05:55 ar102 cosmic-session[6072]: [2026-08-21T17:05:55Z ERROR cosmic_osd::components::audio] failed to connect to cosmic-settings's varlink service: Io(Os { code: 111, kind: ConnectionRefused, message: "Connection refused" })
Aug 21 13:05:58 ar102 cosmic-session[6072]: [2026-08-21T17:05:58Z ERROR cosmic_osd::components::audio] failed to connect to cosmic-settings's varlink service: Io(Os { code: 111, kind: ConnectionRefused, message: "Connection refused" })
Aug 21 13:06:01 ar102 cosmic-session[6072]: [2026-08-21T17:06:01Z ERROR cosmic_osd::components::audio] failed to connect to cosmic-settings's varlink service: Io(Os { code: 111, kind: ConnectionRefused, message: "Connection refused" })
Aug 21 13:06:04 ar102 cosmic-session[6072]: [2026-08-21T17:06:04Z ERROR cosmic_osd::components::audio] failed to connect to cosmic-settings's varlink service: Io(Os { code: 111, kind: ConnectionRefused, message: "Connection refused" })
Aug 21 13:06:07 ar102 cosmic-session[6072]: [2026-08-21T17:06:07Z ERROR cosmic_osd::components::audio] failed to connect to cosmic-settings's varlink service: Io(Os { code: 111, kind: ConnectionRefused, message: "Connection refused" })
Aug 21 13:06:10 ar102 cosmic-session[6072]: [2026-08-21T17:06:10Z ERROR cosmic_osd::components::audio] failed to connect to cosmic-settings's varlink service: Io(Os { code: 111, kind: ConnectionRefused, message: "Connection refused" })
Aug 21 13:06:13 ar102 cosmic-session[6072]: [2026-08-21T17:06:13Z ERROR cosmic_osd::components::audio] failed to connect to cosmic-settings's varlink service: Io(Os { code: 111, kind: ConnectionRefused, message: "Connection refused" })
Aug 21 13:06:16 ar102 cosmic-session[6072]: [2026-08-21T17:06:16Z ERROR cosmic_osd::components::audio] failed to connect to cosmic-settings's varlink service: Io(Os { code: 111, kind: ConnectionRefused, message: "Connection refused" })
Aug 21 13:06:19 ar102 cosmic-session[6072]: [2026-08-21T17:06:19Z ERROR cosmic_osd::components::audio] failed to connect to cosmic-settings's varlink service: Io(Os { code: 111, kind: ConnectionRefused, message: "Connection refused" })
Aug 21 13:06:22 ar102 cosmic-session[6072]: [2026-08-21T17:06:22Z ERROR cosmic_osd::components::audio] failed to connect to cosmic-settings's varlink service: Io(Os { code: 111, kind: ConnectionRefused, message: "Connection refused" })
Aug 21 13:06:25 ar102 cosmic-session[6072]: [2026-08-21T17:06:25Z ERROR cosmic_osd::components::audio] failed to connect to cosmic-settings's varlink service: Io(Os { code: 111, kind: ConnectionRefused, message: "Connection refused" })
Aug 21 13:06:28 ar102 cosmic-session[6072]: [2026-08-21T17:06:28Z ERROR cosmic_osd::components::audio] failed to connect to cosmic-settings's varlink service: Io(Os { code: 111, kind: ConnectionRefused, message: "Connection refused" })
Aug 21 13:06:31 ar102 cosmic-session[6072]: [2026-08-21T17:06:31Z ERROR cosmic_osd::components::audio] failed to connect to cosmic-settings's varlink service: Io(Os { code: 111, kind: ConnectionRefused, message: "Connection refused" })
... 1134 more distinct messages not shown
== b0b02.cs.umd.edu (1 distinct, 1 total) ==
Aug 21 13:07:33 b0b02.cs.umd.edu rustdesk[664572]: cannot open display:
== bigtuna (1 distinct, 1 total) ==
Aug 21 13:42:19 bigtuna systemd-resolved[888]: Using degraded feature set UDP instead of UDP+EDNS0 for DNS server 10.73.244.11.
== cheezit.cs.umd.edu (1 distinct, 1 total) ==
Aug 21 13:41:59 cheezit.cs.umd.edu sshd-session[2792764]: pam_access(sshd:auth): access denied for user `nickr' from `109.178.232.11'
== csfw00a (1 distinct, 148 total) ==
Aug 21 13:04:20 csfw00a kernel: bnxt_en 0000:09:00.0 eth3: NIC Link is Down [x148]
== hackerman (7 distinct, 12 total) ==
Aug 21 13:19:01 hackerman gnome-software[2060381]: failed to commit changes to dconf: GDBus.Error:org.gtk.GDBus.UnmappedGError.Quark._g_2dfile_2derror_2dquark.Code2: Failed to create file “/adminhomes/sajith/.config/dconf/user.4IYAU3”: Permission denied
Aug 21 13:20:04 hackerman gnome-software[2060381]: can't reliably fixup error code 4 in domain g-io-error-quark: Not a directory [x4]
Aug 21 13:20:12 hackerman gnome-software[2060381]: Only 0 apps for recent list, hiding
Aug 21 13:20:28 hackerman gnome-software[2060381]: failed to commit changes to dconf: GDBus.Error:org.gtk.GDBus.UnmappedGError.Quark._g_2dfile_2derror_2dquark.Code2: Failed to create file “/adminhomes/sajith/.config/dconf/user.SV0OU3”: Permission denied
Aug 21 13:20:29 hackerman packagekitd[1015373]: Failed to get cache filename for libreoffice [x2]
Aug 21 13:20:29 hackerman packagekitd[1015373]: Failed to get cache filename for kernel [x2]
Aug 21 13:20:38 hackerman packagekitd[1015373]: failed to parse public key for /etc/pki/rpm-gpg/RPM-GPG-KEY-PQC-redhat-release
== idm00 (2 distinct, 2 total) ==
Aug 21 13:13:15 idm00 sshd-session[2502075]: error: Certificate does not contain an authorized principal
Aug 21 13:51:39 idm00 named[3810278]: client @0x7f48dcc5aeb8 10.73.240.42#63131: update '73.10.in-addr.arpa/IN' denied
== idmp0 (1 distinct, 1 total) ==
Aug 21 13:35:55 idmp0 named[1121900]: client @0x7fe4040105f8 10.73.240.43#55949: update '73.10.in-addr.arpa/IN' denied
== itmon02 (1 distinct, 45 total) ==
Aug 21 13:08:04 itmon02 sshd[1750555]: error: beginning MaxStartups throttling [x45]
== itmon03 (1 distinct, 1 total) ==
Aug 21 13:50:02 itmon03 systemd-timedated[1785345]: /dev/rtc is busy. Is somebody keeping it open continuously? That's not a good idea... Returning a bogus RTC timestamp.
== librenms-prod-staging (1 distinct, 1 total) ==
Aug 21 13:46:02 librenms-prod-staging puppet-agent[63552]: The directory '/opt/librenms/rrd' contains 17346 entries, which exceeds the default soft limit 1000 and may cause excessive resource consumption and degraded performance. To remove this warning set a value for `max_files` parameter or consider using an alternate method to manage large directory trees
== newhonors2 (1 distinct, 24 total) ==
Aug 21 13:13:02 newhonors2 dhcpcd[1525310]: dhcpcd is not running [x24]
== outbound00.cs.umd.edu (1 distinct, 6 total) ==
Aug 21 13:09:09 outbound00.cs.umd.edu python3[237086]: ldapdb [x6]
== outbound01.cs.umd.edu (1 distinct, 6 total) ==
Aug 21 13:13:06 outbound01.cs.umd.edu python3[2472032]: ldapdb [x6]
== sentry-docker00.cs.umd.edu (36 distinct, 36 total) ==
Aug 21 13:19:43 sentry-docker00.cs.umd.edu systemd-udevd[735320]: link_config: could not get ethtool features for veth9c4d637
Aug 21 13:19:43 sentry-docker00.cs.umd.edu systemd-udevd[735320]: Could not set offload features of veth9c4d637: No such device
Aug 21 13:19:43 sentry-docker00.cs.umd.edu systemd-udevd[735431]: Could not generate persistent MAC address for vethc3084f5: No such file or directory
Aug 21 13:19:43 sentry-docker00.cs.umd.edu systemd-udevd[735432]: Could not generate persistent MAC address for vethfa509d3: No such file or directory
Aug 21 13:19:43 sentry-docker00.cs.umd.edu systemd-udevd[735450]: Could not generate persistent MAC address for veth013e1cd: No such file or directory
Aug 21 13:19:43 sentry-docker00.cs.umd.edu systemd-udevd[735449]: Could not generate persistent MAC address for vethf6a9ec8: No such file or directory
Aug 21 13:19:43 sentry-docker00.cs.umd.edu systemd-udevd[735459]: Could not generate persistent MAC address for vethcd8d8f1: No such file or directory
Aug 21 13:19:43 sentry-docker00.cs.umd.edu systemd-udevd[735460]: Could not generate persistent MAC address for veth84769dc: No such file or directory
Aug 21 13:19:43 sentry-docker00.cs.umd.edu systemd-udevd[735463]: Could not generate persistent MAC address for veth9bafda8: No such file or directory
Aug 21 13:19:43 sentry-docker00.cs.umd.edu systemd-udevd[735478]: Could not generate persistent MAC address for veth2b4b81d: No such file or directory
Aug 21 13:19:43 sentry-docker00.cs.umd.edu systemd-udevd[735460]: Could not generate persistent MAC address for veth2a939f8: No such file or directory
Aug 21 13:19:43 sentry-docker00.cs.umd.edu systemd-udevd[735474]: Could not generate persistent MAC address for veth4548060: No such file or directory
Aug 21 13:39:51 sentry-docker00.cs.umd.edu systemd-udevd[745061]: link_config: could not get ethtool features for veth2b4b81d
Aug 21 13:39:51 sentry-docker00.cs.umd.edu systemd-udevd[745061]: Could not set offload features of veth2b4b81d: No such device
Aug 21 13:39:52 sentry-docker00.cs.umd.edu systemd-udevd[745099]: Could not generate persistent MAC address for veth90f3b22: No such file or directory
Aug 21 13:39:52 sentry-docker00.cs.umd.edu systemd-udevd[745100]: Could not generate persistent MAC address for veth02676ea: No such file or directory
Aug 21 13:39:52 sentry-docker00.cs.umd.edu systemd-udevd[745103]: Could not generate persistent MAC address for vethca282fc: No such file or directory
Aug 21 13:39:52 sentry-docker00.cs.umd.edu systemd-udevd[745104]: Could not generate persistent MAC address for veth0a27e9b: No such file or directory
Aug 21 13:39:52 sentry-docker00.cs.umd.edu systemd-udevd[745127]: Could not generate persistent MAC address for veth82ea26a: No such file or directory
Aug 21 13:39:52 sentry-docker00.cs.umd.edu systemd-udevd[745128]: Could not generate persistent MAC address for vethb7b2f4f: No such file or directory
Aug 21 13:39:52 sentry-docker00.cs.umd.edu systemd-udevd[745146]: Could not generate persistent MAC address for vethe84b51f: No such file or directory
Aug 21 13:39:52 sentry-docker00.cs.umd.edu systemd-udevd[745151]: Could not generate persistent MAC address for veth5dc769d: No such file or directory
Aug 21 13:39:52 sentry-docker00.cs.umd.edu systemd-udevd[745133]: Could not generate persistent MAC address for vethb8acb42: No such file or directory
Aug 21 13:39:52 sentry-docker00.cs.umd.edu systemd-udevd[745151]: Could not generate persistent MAC address for veth7e3a8d8: No such file or directory
Aug 21 14:00:00 sentry-docker00.cs.umd.edu systemd-udevd[754501]: link_config: could not get ethtool features for vethca282fc
Aug 21 14:00:00 sentry-docker00.cs.umd.edu systemd-udevd[754501]: Could not set offload features of vethca282fc: No such device
Aug 21 14:00:00 sentry-docker00.cs.umd.edu systemd-udevd[754536]: Could not generate persistent MAC address for veth697ff3f: No such file or directory
Aug 21 14:00:00 sentry-docker00.cs.umd.edu systemd-udevd[754537]: Could not generate persistent MAC address for veth0b20f68: No such file or directory
Aug 21 14:00:00 sentry-docker00.cs.umd.edu systemd-udevd[754540]: Could not generate persistent MAC address for veth7e7b642: No such file or directory
Aug 21 14:00:00 sentry-docker00.cs.umd.edu systemd-udevd[754541]: Could not generate persistent MAC address for veth2546ad1: No such file or directory
... 6 more distinct messages not shown
== soul (1 distinct, 1 total) ==
Aug 21 13:10:18 soul krb5_child[2449292]: Client 'admin(a)UMD.EDU' not found in Kerberos database
== strawberry (2 distinct, 8 total) ==
Aug 21 13:09:44 strawberry udisksd[1067]: Error performing housekeeping for drive /org/freedesktop/UDisks2/drives/ST2000DM001_1CH164_W1E8J5KJ: Error updating SMART data: Error sending ATA command CHECK POWER MODE: Unexpected sense data returned:#0120000: 00 00 00 00 00 00 00 00 00 00 00 00 00 00 00 00 ................#0120010: 00 00 00 00 00 00 00 00 00 00 00 00 00 00 00 00 ................#012 (g-io-error-quark, 0) [x6]
Aug 21 13:34:42 strawberry smartd[5314]: Device: /dev/sda [SAT], failed to read SMART Attribute Data [x2]
== syslog (1 distinct, 1 total) ==
Aug 21 13:49:16 syslog rsyslogd: imrelp[2514]: error 'error when receiving data, session broken', object 'lstn 2514: conn to clt 10.73.247.150/10.73.247.150' - input may not work as intended [v8.2510.0-5.el10 try https://www.rsyslog.com/e/2353 ]
1
0
Command: /usr/local/sbin/syslog-digest.py
Time : 0.1411s
Status : exited 0
Output :
Syslog digest — 2026-08-21 13:05 EDT
Processed 4,457 lines, filtered 2,476 (55%). 1,981 unknown (1376 distinct) from 20 host(s).
== ar102 (1298 distinct, 1649 total) ==
Aug 21 12:05:03 ar102 cosmic-session[67961]: [2026-08-21T16:05:03Z ERROR cosmic_osd::components::audio] failed to connect to cosmic-settings's varlink service: Io(Os { code: 111, kind: ConnectionRefused, message: "Connection refused" })
Aug 21 12:05:06 ar102 cosmic-session[67961]: [2026-08-21T16:05:06Z ERROR cosmic_osd::components::audio] failed to connect to cosmic-settings's varlink service: Io(Os { code: 111, kind: ConnectionRefused, message: "Connection refused" })
Aug 21 12:05:09 ar102 cosmic-session[67961]: [2026-08-21T16:05:09Z ERROR cosmic_osd::components::audio] failed to connect to cosmic-settings's varlink service: Io(Os { code: 111, kind: ConnectionRefused, message: "Connection refused" })
Aug 21 12:05:12 ar102 cosmic-session[67961]: [2026-08-21T16:05:12Z ERROR cosmic_osd::components::audio] failed to connect to cosmic-settings's varlink service: Io(Os { code: 111, kind: ConnectionRefused, message: "Connection refused" })
Aug 21 12:05:15 ar102 cosmic-session[67961]: [2026-08-21T16:05:15Z ERROR cosmic_osd::components::audio] failed to connect to cosmic-settings's varlink service: Io(Os { code: 111, kind: ConnectionRefused, message: "Connection refused" })
Aug 21 12:05:18 ar102 cosmic-session[67961]: [2026-08-21T16:05:18Z ERROR cosmic_osd::components::audio] failed to connect to cosmic-settings's varlink service: Io(Os { code: 111, kind: ConnectionRefused, message: "Connection refused" })
Aug 21 12:05:21 ar102 cosmic-session[67961]: [2026-08-21T16:05:21Z ERROR cosmic_osd::components::audio] failed to connect to cosmic-settings's varlink service: Io(Os { code: 111, kind: ConnectionRefused, message: "Connection refused" })
Aug 21 12:05:24 ar102 cosmic-session[67961]: [2026-08-21T16:05:24Z ERROR cosmic_osd::components::audio] failed to connect to cosmic-settings's varlink service: Io(Os { code: 111, kind: ConnectionRefused, message: "Connection refused" })
Aug 21 12:05:27 ar102 cosmic-session[67961]: [2026-08-21T16:05:27Z ERROR cosmic_osd::components::audio] failed to connect to cosmic-settings's varlink service: Io(Os { code: 111, kind: ConnectionRefused, message: "Connection refused" })
Aug 21 12:05:30 ar102 cosmic-session[67961]: [2026-08-21T16:05:30Z ERROR cosmic_osd::components::audio] failed to connect to cosmic-settings's varlink service: Io(Os { code: 111, kind: ConnectionRefused, message: "Connection refused" })
Aug 21 12:05:33 ar102 cosmic-session[67961]: [2026-08-21T16:05:33Z ERROR cosmic_osd::components::audio] failed to connect to cosmic-settings's varlink service: Io(Os { code: 111, kind: ConnectionRefused, message: "Connection refused" })
Aug 21 12:05:36 ar102 cosmic-session[67961]: [2026-08-21T16:05:36Z ERROR cosmic_osd::components::audio] failed to connect to cosmic-settings's varlink service: Io(Os { code: 111, kind: ConnectionRefused, message: "Connection refused" })
Aug 21 12:05:39 ar102 cosmic-session[67961]: [2026-08-21T16:05:39Z ERROR cosmic_osd::components::audio] failed to connect to cosmic-settings's varlink service: Io(Os { code: 111, kind: ConnectionRefused, message: "Connection refused" })
Aug 21 12:05:42 ar102 cosmic-session[67961]: [2026-08-21T16:05:42Z ERROR cosmic_osd::components::audio] failed to connect to cosmic-settings's varlink service: Io(Os { code: 111, kind: ConnectionRefused, message: "Connection refused" })
Aug 21 12:05:45 ar102 cosmic-session[67961]: [2026-08-21T16:05:45Z ERROR cosmic_osd::components::audio] failed to connect to cosmic-settings's varlink service: Io(Os { code: 111, kind: ConnectionRefused, message: "Connection refused" })
Aug 21 12:05:48 ar102 cosmic-session[67961]: [2026-08-21T16:05:48Z ERROR cosmic_osd::components::audio] failed to connect to cosmic-settings's varlink service: Io(Os { code: 111, kind: ConnectionRefused, message: "Connection refused" })
Aug 21 12:05:51 ar102 cosmic-session[67961]: [2026-08-21T16:05:51Z ERROR cosmic_osd::components::audio] failed to connect to cosmic-settings's varlink service: Io(Os { code: 111, kind: ConnectionRefused, message: "Connection refused" })
Aug 21 12:05:54 ar102 cosmic-session[67961]: [2026-08-21T16:05:54Z ERROR cosmic_osd::components::audio] failed to connect to cosmic-settings's varlink service: Io(Os { code: 111, kind: ConnectionRefused, message: "Connection refused" })
Aug 21 12:05:57 ar102 cosmic-session[67961]: [2026-08-21T16:05:57Z ERROR cosmic_osd::components::audio] failed to connect to cosmic-settings's varlink service: Io(Os { code: 111, kind: ConnectionRefused, message: "Connection refused" })
Aug 21 12:06:00 ar102 cosmic-session[67961]: [2026-08-21T16:06:00Z ERROR cosmic_osd::components::audio] failed to connect to cosmic-settings's varlink service: Io(Os { code: 111, kind: ConnectionRefused, message: "Connection refused" })
Aug 21 12:06:03 ar102 cosmic-session[67961]: [2026-08-21T16:06:03Z ERROR cosmic_osd::components::audio] failed to connect to cosmic-settings's varlink service: Io(Os { code: 111, kind: ConnectionRefused, message: "Connection refused" })
Aug 21 12:06:06 ar102 cosmic-session[67961]: [2026-08-21T16:06:06Z ERROR cosmic_osd::components::audio] failed to connect to cosmic-settings's varlink service: Io(Os { code: 111, kind: ConnectionRefused, message: "Connection refused" })
Aug 21 12:06:09 ar102 cosmic-session[67961]: [2026-08-21T16:06:09Z ERROR cosmic_osd::components::audio] failed to connect to cosmic-settings's varlink service: Io(Os { code: 111, kind: ConnectionRefused, message: "Connection refused" })
Aug 21 12:06:12 ar102 cosmic-session[67961]: [2026-08-21T16:06:12Z ERROR cosmic_osd::components::audio] failed to connect to cosmic-settings's varlink service: Io(Os { code: 111, kind: ConnectionRefused, message: "Connection refused" })
Aug 21 12:06:15 ar102 cosmic-session[67961]: [2026-08-21T16:06:15Z ERROR cosmic_osd::components::audio] failed to connect to cosmic-settings's varlink service: Io(Os { code: 111, kind: ConnectionRefused, message: "Connection refused" })
Aug 21 12:06:18 ar102 cosmic-session[67961]: [2026-08-21T16:06:18Z ERROR cosmic_osd::components::audio] failed to connect to cosmic-settings's varlink service: Io(Os { code: 111, kind: ConnectionRefused, message: "Connection refused" })
Aug 21 12:06:21 ar102 cosmic-session[67961]: [2026-08-21T16:06:21Z ERROR cosmic_osd::components::audio] failed to connect to cosmic-settings's varlink service: Io(Os { code: 111, kind: ConnectionRefused, message: "Connection refused" })
Aug 21 12:06:24 ar102 cosmic-session[67961]: [2026-08-21T16:06:24Z ERROR cosmic_osd::components::audio] failed to connect to cosmic-settings's varlink service: Io(Os { code: 111, kind: ConnectionRefused, message: "Connection refused" })
Aug 21 12:06:27 ar102 cosmic-session[67961]: [2026-08-21T16:06:27Z ERROR cosmic_osd::components::audio] failed to connect to cosmic-settings's varlink service: Io(Os { code: 111, kind: ConnectionRefused, message: "Connection refused" })
Aug 21 12:06:30 ar102 cosmic-session[67961]: [2026-08-21T16:06:30Z ERROR cosmic_osd::components::audio] failed to connect to cosmic-settings's varlink service: Io(Os { code: 111, kind: ConnectionRefused, message: "Connection refused" })
... 1268 more distinct messages not shown
== b0b02.cs.umd.edu (1 distinct, 1 total) ==
Aug 21 12:07:29 b0b02.cs.umd.edu rustdesk[649505]: cannot open display:
== bachata (1 distinct, 1 total) ==
Aug 21 12:11:54 bachata setroubleshoot[3414168]: SELinux is preventing /usr/sbin/smbd from name_bind access on the udp_socket port 753. For complete SELinux messages run: sealert -l 8f7247f1-69a5-4a62-a4f0-88a324bfd75c
== bigtuna (4 distinct, 4 total) ==
Aug 21 13:01:09 bigtuna sshd-session[1218067]: error: Certificate does not contain an authorized principal
Aug 21 13:01:14 bigtuna setroubleshoot[1218069]: SELinux is preventing /usr/sbin/sshd from 'read, open' accesses on the file /adminhomes/josephao/.ssh/authorized_keys. For complete SELinux messages run: sealert -l dd62e626-2e1e-4fc9-8906-5d21de0fc161
Aug 21 13:01:15 bigtuna setroubleshoot[1218069]: SELinux is preventing /usr/sbin/sshd from read access on the file authorized_keys. For complete SELinux messages run: sealert -l 0afa7bbe-8239-4f31-a825-871b162dd6cb
Aug 21 13:01:15 bigtuna setroubleshoot[1218069]: SELinux is preventing /usr/sbin/sshd from open access on the file /adminhomes/josephao/.ssh/authorized_keys. For complete SELinux messages run: sealert -l 4a711d8d-3082-49af-b88a-da8a103cf5c0
== csfw00a (1 distinct, 152 total) ==
Aug 21 12:04:15 csfw00a kernel: bnxt_en 0000:09:00.0 eth3: NIC Link is Down [x152]
== hackerman (6 distinct, 11 total) ==
Aug 21 12:20:04 hackerman gnome-software[2060381]: can't reliably fixup error code 4 in domain g-io-error-quark: Not a directory [x4]
Aug 21 12:20:12 hackerman gnome-software[2060381]: Only 0 apps for recent list, hiding
Aug 21 12:20:28 hackerman gnome-software[2060381]: failed to commit changes to dconf: GDBus.Error:org.gtk.GDBus.UnmappedGError.Quark._g_2dfile_2derror_2dquark.Code2: Failed to create file “/adminhomes/sajith/.config/dconf/user.XXDGU3”: Permission denied
Aug 21 12:20:28 hackerman packagekitd[1002399]: Failed to get cache filename for libreoffice [x2]
Aug 21 12:20:28 hackerman packagekitd[1002399]: Failed to get cache filename for kernel [x2]
Aug 21 12:20:38 hackerman packagekitd[1002399]: failed to parse public key for /etc/pki/rpm-gpg/RPM-GPG-KEY-PQC-redhat-release
== idm00 (1 distinct, 1 total) ==
Aug 21 12:51:39 idm00 named[3810278]: client @0x7f48dd3dafe8 10.73.240.42#59295: update '73.10.in-addr.arpa/IN' denied
== idmp0 (1 distinct, 1 total) ==
Aug 21 12:35:55 idmp0 named[1121900]: client @0x7fe400084be8 10.73.240.43#56670: update '73.10.in-addr.arpa/IN' denied
== itmon02 (1 distinct, 57 total) ==
Aug 21 12:08:09 itmon02 sshd[1750555]: error: beginning MaxStartups throttling [x57]
== itmon03 (1 distinct, 2 total) ==
Aug 21 12:20:02 itmon03 systemd-timedated[1780901]: /dev/rtc is busy. Is somebody keeping it open continuously? That's not a good idea... Returning a bogus RTC timestamp. [x2]
== librenms-prod-staging (8 distinct, 9 total) ==
Aug 21 12:52:08 librenms-prod-staging puppet-agent[7188]: 'php84 /opt/librenms/artisan migrate --force' returned 1 instead of one of [0]
Aug 21 12:52:08 librenms-prod-staging puppet-agent[7188]: (/Stage[main]/Profile::Librenms/Exec[librenms-db-schema-install]/returns) change from 'notrun' to ['0'] failed: 'php84 /opt/librenms/artisan migrate --force' returned 1 instead of one of [0]
Aug 21 12:52:08 librenms-prod-staging puppet-agent[7188]: (/Stage[main]/Profile::Librenms/File[/opt/librenms/.migration-complete]) Skipping because of failed dependencies
Aug 21 12:52:12 librenms-prod-staging puppet-agent[7188]: (/Stage[main]/Apache::Service/Service[httpd]) Skipping because of failed dependencies [x2]
Aug 21 12:59:24 librenms-prod-staging puppet-agent[25618]: (/Stage[main]/Profile::Librenms/Csweb::Vhost[librenms.cs.umd.edu]/Apache::Vhost[librenms.cs.umd.edu]/File[librenms.cs.umd.edu-443_etc_letsencrypt_live_librenms.cs.umd.edu_cert.pem]) Could not evaluate: Could not retrieve information from environment librenms_scheduler source(s) file:///etc/letsencrypt/live/librenms.cs.umd.edu/cert.pem
Aug 21 12:59:24 librenms-prod-staging puppet-agent[25618]: (/Stage[main]/Profile::Librenms/Csweb::Vhost[librenms.cs.umd.edu]/Apache::Vhost[librenms.cs.umd.edu]/File[librenms.cs.umd.edu-443_etc_letsencrypt_live_librenms.cs.umd.edu_privkey.pem]) Could not evaluate: Could not retrieve information from environment librenms_scheduler source(s) file:///etc/letsencrypt/live/librenms.cs.umd.edu/privkey.pem
Aug 21 12:59:24 librenms-prod-staging puppet-agent[25618]: (/Stage[main]/Profile::Librenms/Csweb::Vhost[librenms.cs.umd.edu]/Apache::Vhost[librenms.cs.umd.edu]/File[librenms.cs.umd.edu-443_etc_letsencrypt_live_librenms.cs.umd.edu_chain.pem]) Could not evaluate: Could not retrieve information from environment librenms_scheduler source(s) file:///etc/letsencrypt/live/librenms.cs.umd.edu/chain.pem
Aug 21 13:02:13 librenms-prod-staging (httpd)[28106]: httpd.service: Referenced but unset environment variable evaluates to an empty string: OPTIONS
== matrix (1 distinct, 1 total) ==
Aug 21 12:25:48 matrix sshd[3423446]: fatal: userauth_pubkey: parse publickey packet: incomplete message [preauth]
== newhonors2 (1 distinct, 24 total) ==
Aug 21 12:13:03 newhonors2 dhcpcd[1523470]: dhcpcd is not running [x24]
== nightingale (7 distinct, 7 total) ==
Aug 21 12:59:47 nightingale gsd-subman[621934]: g_atomic_ref_count_dec: assertion 'g_atomic_int_get (arc) > 0' failed
Aug 21 13:00:04 nightingale systemd-coredump[682681]: Process 621929 (PanGPUI) of user 120942471 dumped core.#012#012Stack trace of thread 621929:#012#0 0x00007f934648d38c __pthread_kill_implementation (libc.so.6 + 0x8d38c)#012#1 0x00007f934643fa86 raise (libc.so.6 + 0x3fa86)#012#2 0x00007f9346429873 abort (libc.so.6 + 0x29873)#012#3 0x00007f934642a1b2 __libc_message.cold (libc.so.6 + 0x2a1b2)#012#4 0x00007f934651d52b __fortify_fail (libc.so.6 + 0x11d52b)#012#5 0x00007f934651e7a6 __stack_chk_fail (libc.so.6 + 0x11e7a6)#012#6 0x00007f934acd15ff _ZN14QObjectPrivate14deleteChildrenEv (libQt5Core.so.5 + 0x2d15ff)#012#7 0x00007f9349bedeb6 _ZN7QWidgetD1Ev (libQt5Widgets.so.5 + 0x1edeb6)#012#8 0x00005646b2b64968 n/a (PanGPUI + 0x74968)#012#9 0x00007f934642a610 __libc_start_call_main (libc.so.6 + 0x2a610)#012#10 0x00007f934642a6c0 __libc_start_main@@GLIBC_2.34 (libc.so.6 + 0x2a6c0)#012#11 0x00005646b2b6e2fe n/a (PanGPUI + 0x7e2fe)#012#012Stack trace of thread 622491:#012#0 0x00007
f93464d5b25 clock_nanosleep(a)GLIBC_2.2.5 (libc.so.6 + 0xd5b25)#012#1 0x00007f93464da5d7 __nanosleep (libc.so.6 + 0xda5d7)#012#2 0x00007f9348d7f205 _ZN7bmalloc4Heap8scavengeERSt11unique_lockINS_11StaticMutexEENSt6chrono8durationIlSt5ratioILl1ELl1000EEEE (libQt5WebKit.so.5 + 0x217f205)#012#3 0x00007f9348d7f2d2 _ZN7bmalloc4Heap18concurrentScavengeEv (libQt5WebKit.so.5 + 0x217f2d2)#012#4 0x00007f9348d7e388 _ZN7bmalloc9AsyncTaskINS_4HeapEMS1_FvvEE13threadRunLoopEv (libQt5WebKit.so.5 + 0x217e388)#012#5 0x00007f9348d7e52f _ZN7bmalloc9AsyncTaskINS_4HeapEMS1_FvvEE16threadEntryPointEPS4_ (libQt5WebKit.so.5 + 0x217e52f)#012#6 0x00007f93468dbae4 execute_native_thread_routine (libstdc++.so.6 + 0xdbae4)#012#7 0x00007f934648b569 start_thread (libc.so.6 + 0x8b569)#012#8 0x00007f9346510760 __clone3 (libc.so.6 + 0x110760)#012#012Stack trace of thread 622602:#012#0 0x00007f934648854a __futex_abstimed_wait_common (libc.so.6 + 0x8854a)#012#1 0x00007f934648ab32 pthread_cond_wait@@GLIBC_2.3.2 (li
bc.so.6 + 0x8ab32)#012#2 0x00007f93468d56c0 _ZNSt18condition_variable4waitERSt11unique_lockISt5mutexE (libstdc++.so.6 + 0xd56c0)#012#3 0x00007f9347a662ca _ZN3WTF10ParkingLot17parkConditionallyEPKvSt8functionIFbvEES3_IFvvEENSt6chrono10time_pointINS8_3_V212steady_clockENS8_8durationIlSt5ratioILl1ELl1000000000EEEEEE (libQt5WebKit.so.5 + 0xe662ca)#012#4 0x00007f9347a64a5b _ZN3WTF18ParallelHelperPool21waitForClientWithTaskERKNS_6LockerINS_8LockBaseEEE (libQt5WebKit.so.5 + 0xe64a5b)#012#5 0x00007f9347a64b35 _ZN3WTF18ParallelHelperPool16helperThreadBodyEv (libQt5WebKit.so.5 + 0xe64b35)#012#6 0x00007f9347a68a35 _ZN3WTFL16threadEntryPointEPv (libQt5WebKit.so.5 + 0xe68a35)#012#7 0x00007f9347a887ff _ZN3WTFL19wtfThreadEntryPointEPv (libQt5WebKit.so.5 + 0xe887ff)#012#8 0x00007f934648b569 start_thread (libc.so.6 + 0x8b569)#012#9 0x00007f9346510760 __clone3 (libc.so.6 + 0x110760)#012#012Stack trace of thread 622604:#012#0 0x00007f934648854a __futex_abstimed_wait_common (libc.so.6 + 0x8854
a)#012#1 0x00007f934648ab32 pthread_cond_wait@@GLIBC_2.3.2 (libc.so.6 + 0x8ab32)#012#2 0x00007f93468d56c0 _ZNSt18condition_variable4waitERSt11unique_lockISt5mutexE (libstdc++.so.6 + 0xd56c0)#012#3 0x00007f9347a662ca _ZN3WTF10ParkingLot17parkConditionallyEPKvSt8functionIFbvEES3_IFvvEENSt6chrono10time_pointINS8_3_V212steady_clockENS8_8durationIlSt5ratioILl1ELl1000000000EEEEEE (libQt5WebKit.so.5 + 0xe662ca)#012#4 0x00007f9347a64a5b _ZN3WTF18ParallelHelperPool21waitForClientWithTaskERKNS_6LockerINS_8LockBaseEEE (libQt5WebKit.so.5 + 0xe64a5b)#012#5 0x00007f9347a64b35 _ZN3WTF18ParallelHelperPool16helperThreadBodyEv (libQt5WebKit.so.5 + 0xe64b35)#012#6 0x00007f9347a68a35 _ZN3WTFL16threadEntryPointEPv (libQt5WebKit.so.5 + 0xe68a35)#012#7 0x00007f9347a887ff _ZN3WTFL19wtfThreadEntryPointEPv (libQt5WebKit.so.5 + 0xe887ff)#012#8 0x00007f934648b569 start_thread (libc.so.6 + 0x8b569)#012#9 0x00007f9346510760 __clone3 (libc.so.6 + 0x110760)#012#012Stack trace of thread 622561:#012#0 0x00
007f934650345f __poll (libc.so.6 + 0x10345f)#012#1 0x00007f9346b703bc g_main_context_iterate.constprop.0 (libglib-2.0.so.0 + 0xaa3bc)#012#2 0x00007f9346b18783 g_main_context_iteration (libglib-2.0.so.0 + 0x52783)#012#3 0x00007f934acf9878 _ZN20QEventDispatcherGlib13processEventsE6QFlagsIN10QEventLoop17ProcessEventsFlagEE (libQt5Core.so.5 + 0x2f9878)#012#4 0x00007f934aca6402 _ZN10QEventLoop4execE6QFlagsINS_17ProcessEventsFlagEE (libQt5Core.so.5 + 0x2a6402)#012#5 0x00007f934aae8a1a _ZN7QThread4execEv (libQt5Core.so.5 + 0xe8a1a)#012#6 0x00007f934aae9cfd _ZN14QThreadPrivate5startEPv (libQt5Core.so.5 + 0xe9cfd)#012#7 0x00007f934648b569 start_thread (libc.so.6 + 0x8b569)#012#8 0x00007f9346510760 __clone3 (libc.so.6 + 0x110760)#012#012Stack trace of thread 622601:#012#0 0x00007f934648854a __futex_abstimed_wait_common (libc.so.6 + 0x8854a)#012#1 0x00007f934648ab32 pthread_cond_wait@@GLIBC_2.3.2 (libc.so.6 + 0x8ab32)#012#2 0x00007f93468d56c0 _ZNSt18condition_variable4waitERSt11uniq
ue_lockISt5mutexE (libstdc++.so.6 + 0xd56c0)#012#3 0x00007f9347a662ca _ZN3WTF10ParkingLot17parkConditionallyEPKvSt8functionIFbvEES3_IFvvEENSt6chrono10time_pointINS8_3_V212steady_clockENS8_8durationIlSt5ratioILl1ELl1000000000EEEEEE (libQt5WebKit.so.5 + 0xe662ca)#012#4 0x00007f9347a64a5b _ZN3WTF18ParallelHelperPool21waitForClientWithTaskERKNS_6LockerINS_8LockBaseEEE (libQt5WebKit.so.5 + 0xe64a5b)#012#5 0x00007f9347a64b35 _ZN3WTF18ParallelHelperPool16helperThreadBodyEv (libQt5WebKit.so.5 + 0xe64b35)#012#6 0x00007f9347a68a35 _ZN3WTFL16threadEntryPointEPv (libQt5WebKit.so.5 + 0xe68a35)#012#7 0x00007f9347a887ff _ZN3WTFL19wtfThreadEntryPointEPv (libQt5WebKit.so.5 + 0xe887ff)#012#8 0x00007f934648b569 start_thread (libc.so.6 + 0x8b569)#012#9 0x00007f9346510760 __clone3 (libc.so.6 + 0x110760)#012#012Stack trace of thread 622605:#012#0 0x00007f934648854a __futex_abstimed_wait_common (libc.so.6 + 0x8854a)#012#1 0x00007f934648ab32 pthread_cond_wait@@GLIBC_2.3.2 (libc.so.6 + 0x8ab32)#012
#2 0x00007f93468d56c0 _ZNSt18condition_variable4waitERSt11unique_lockISt5mutexE (libstdc++.so.6 + 0xd56c0)#012#3 0x00007f9347a662ca _ZN3WTF10ParkingLot17parkConditionallyEPKvSt8functionIFbvEES3_IFvvEENSt6chrono10time_pointINS8_3_V212steady_clockENS8_8durationIlSt5ratioILl1ELl1000000000EEEEEE (libQt5WebKit.so.5 + 0xe662ca)#012#4 0x00007f9347a64a5b _ZN3WTF18ParallelHelperPool21waitForClientWithTaskERKNS_6LockerINS_8LockBaseEEE (libQt5WebKit.so.5 + 0xe64a5b)#012#5 0x00007f9347a64b35 _ZN3WTF18ParallelHelperPool16helperThreadBodyEv (libQt5WebKit.so.5 + 0xe64b35)#012#6 0x00007f9347a68a35 _ZN3WTFL16threadEntryPointEPv (libQt5WebKit.so.5 + 0xe68a35)#012#7 0x00007f9347a887ff _ZN3WTFL19wtfThreadEntryPointEPv (libQt5WebKit.so.5 + 0xe887ff)#012#8 0x00007f934648b569 start_thread (libc.so.6 + 0x8b569)#012#9 0x00007f9346510760 __clone3 (libc.so.6 + 0x110760)#012#012Stack trace of thread 622606:#012#0 0x00007f934648854a __futex_abstimed_wait_common (libc.so.6 + 0x8854a)#012#1 0x00007f9346
48ab32 pthread_cond_wait@@GLIBC_2.3.2 (libc.so.6 + 0x8ab32)#012#2 0x00007f93468d56c0 _ZNSt18condition_variable4waitERSt11unique_lockISt5mutexE (libstdc++.so.6 + 0xd56c0)#012#3 0x00007f9347a662ca _ZN3WTF10ParkingLot17parkConditionallyEPKvSt8functionIFbvEES3_IFvvEENSt6chrono10time_pointINS8_3_V212steady_clockENS8_8durationIlSt5ratioILl1ELl1000000000EEEEEE (libQt5WebKit.so.5 + 0xe662ca)#012#4 0x00007f9347a64a5b _ZN3WTF18ParallelHelperPool21waitForClientWithTaskERKNS_6LockerINS_8LockBaseEEE (libQt5WebKit.so.5 + 0xe64a5b)#012#5 0x00007f9347a64b35 _ZN3WTF18ParallelHelperPool16helperThreadBodyEv (libQt5WebKit.so.5 + 0xe64b35)#012#6 0x00007f9347a68a35 _ZN3WTFL16threadEntryPointEPv (libQt5WebKit.so.5 + 0xe68a35)#012#7 0x00007f9347a887ff _ZN3WTFL19wtfThreadEntryPointEPv (libQt5WebKit.so.5 + 0xe887ff)#012#8 0x00007f934648b569 start_thread (libc.so.6 + 0x8b569)#012#9 0x00007f9346510760 __clone3 (libc.so.6 + 0x110760)#012#012Stack trace of thread 622724:#012#0 0x00007f934648854a __futex
_abstimed_wait_common (libc.so.6 + 0x8854a)#012#1 0x00007f934648ab32 pthread_cond_wait@@GLIBC_2.3
Aug 21 13:00:06 nightingale systemd-coredump[682661]: Process 622366 (firefox) of user 120942471 dumped core.#012#012Stack trace of thread 622402:#012#0 0x00007fb2bb08d38c __pthread_kill_implementation (libc.so.6 + 0x8d38c)#012#1 0x00007fb2bb03fa86 raise (libc.so.6 + 0x3fa86)#012#2 0x00007fb2af976155 _ZN13nsProfileLock18FatalSignalHandlerEiP9siginfo_tPv (libxul.so + 0x5976155)#012#3 0x00007fb2bb03fb30 __restore_rt (libc.so.6 + 0x3fb30)#012#4 0x00007fb2aee17446 _ZN7mozilla6widget24WlCompositorCrashHandlerEv (libxul.so + 0x4e17446)#012#5 0x00007fb2aee191fc _ZN17ProxiedConnection14ProcessFailureEv (libxul.so + 0x4e191fc)#012#6 0x00007fb2aee1b309 _ZN12WaylandProxy18ProcessConnectionsEv (libxul.so + 0x4e1b309)#012#7 0x00007fb2aee1b404 _ZN12WaylandProxy3RunEv (libxul.so + 0x4e1b404)#012#8 0x00007fb2aee1b484 _ZN12WaylandProxy14RunProxyThreadEPS_ (libxul.so + 0x4e1b484)#012#9 0x00007fb2bb08b569 start_thread (libc.so.6 + 0x8b569)#012#10 0x00007fb2bb110760 __clone3 (libc.so.6 + 0x110
760)#012#012Stack trace of thread 622399:#012#0 0x00007fb2bb0ff44c read (libc.so.6 + 0xff44c)#012#1 0x00007fb2af5d5cd3 _ZN24AsyncSignalControlThread5WatchEv (libxul.so + 0x55d5cd3)#012#2 0x00007fb2af5d5e8c _ZL29AsyncSignalControlThreadEntryPv (libxul.so + 0x55d5e8c)#012#3 0x00007fb2bb08b569 start_thread (libc.so.6 + 0x8b569)#012#4 0x00007fb2bb110760 __clone3 (libc.so.6 + 0x110760)#012#012Stack trace of thread 622415:#012#0 0x00007fb2bb10345f __poll (libc.so.6 + 0x10345f)#012#1 0x00007fb2ab74873a _ZN7mozilla3net14NetlinkService3RunEv (libxul.so + 0x174873a)#012#2 0x00007fb2ab0d9169 _ZN8nsThread16ProcessNextEventEbPb (libxul.so + 0x10d9169)#012#3 0x00007fb2ab0cb8df _Z19NS_ProcessNextEventP9nsIThreadb (libxul.so + 0x10cb8df)#012#4 0x00007fb2ab8ae67a _ZN7mozilla3ipc28MessagePumpForNonMainThreads3RunEPN4base11MessagePump8DelegateE (libxul.so + 0x18ae67a)#012#5 0x00007fb2ab856adb _ZN11MessageLoop3RunEv (libxul.so + 0x1856adb)#012#6 0x00007fb2ab0debca _ZN8nsThread10ThreadFuncEP
v (libxul.so + 0x10debca)#012#7 0x00007fb2bb671bd4 _pt_root (libnspr4.so + 0x2cbd4)#012#8 0x00007fb2bb08b569 start_thread (libc.so.6 + 0x8b569)#012#9 0x00007fb2bb110760 __clone3 (libc.so.6 + 0x110760)#012#012Stack trace of thread 622414:#012#0 0x00007fb2bb08854a __futex_abstimed_wait_common (libc.so.6 + 0x8854a)#012#1 0x00007fb2bb08ad1f pthread_cond_timedwait@@GLIBC_2.3.2 (libc.so.6 + 0x8ad1f)#012#2 0x000055ec626c8f25 _ZN7mozilla6detail21ConditionVariableImpl8wait_forERNS0_9MutexImplERKNS_16BaseTimeDurationINS_27TimeDurationValueCalculatorEEE (firefox + 0x5ff25)#012#3 0x00007fb2ab0d00f9 _ZN11TimerThread3RunEv (libxul.so + 0x10d00f9)#012#4 0x00007fb2ab0d9169 _ZN8nsThread16ProcessNextEventEbPb (libxul.so + 0x10d9169)#012#5 0x00007fb2ab0cb8df _Z19NS_ProcessNextEventP9nsIThreadb (libxul.so + 0x10cb8df)#012#6 0x00007fb2ab8ae67a _ZN7mozilla3ipc28MessagePumpForNonMainThreads3RunEPN4base11MessagePump8DelegateE (libxul.so + 0x18ae67a)#012#7 0x00007fb2ab856adb _ZN11MessageLoop3RunE
v (libxul.so + 0x1856adb)#012#8 0x00007fb2ab0debca _ZN8nsThread10ThreadFuncEPv (libxul.so + 0x10debca)#012#9 0x00007fb2bb671bd4 _pt_root (libnspr4.so + 0x2cbd4)#012#10 0x00007fb2bb08b569 start_thread (libc.so.6 + 0x8b569)#012#11 0x00007fb2bb110760 __clone3 (libc.so.6 + 0x110760)#012#012Stack trace of thread 622400:#012#0 0x00007fb2bb10345f __poll (libc.so.6 + 0x10345f)#012#1 0x00007fb2b8f703bc g_main_context_iterate.constprop.0 (libglib-2.0.so.0 + 0xaa3bc)#012#2 0x00007fb2b8f18783 g_main_context_iteration (libglib-2.0.so.0 + 0x52783)#012#3 0x00007fb2b8f187d1 glib_worker_main (libglib-2.0.so.0 + 0x527d1)#012#4 0x00007fb2b8f49902 g_thread_proxy (libglib-2.0.so.0 + 0x83902)#012#5 0x00007fb2bb08b569 start_thread (libc.so.6 + 0x8b569)#012#6 0x00007fb2bb110760 __clone3 (libc.so.6 + 0x110760)#012#012Stack trace of thread 622366:#012#0 0x00007fb2bb08854a __futex_abstimed_wait_common (libc.so.6 + 0x8854a)#012#1 0x00007fb2bb08ab32 pthread_cond_wait@@GLIBC_2.3.2 (libc.so.6 + 0x8ab32
)#012#2 0x000055ec626c8ddb _ZN7mozilla6detail21ConditionVariableImpl4waitERNS0_9MutexImplE (firefox + 0x5fddb)#012#3 0x000055ec626c8fd8 _ZN7mozilla6detail21ConditionVariableImpl8wait_forERNS0_9MutexImplERKNS_16BaseTimeDurationINS_27TimeDurationValueCalculatorEEE (firefox + 0x5ffd8)#012#4 0x00007fb2ab8b43ec _ZN7mozilla3ipc14MessageChannel17WaitForSyncNotifyEv (libxul.so + 0x18b43ec)#012#5 0x00007fb2ab8c99f7 _ZN7mozilla3ipc14MessageChannel4SendENS_9UniquePtrIN3IPC7MessageENS_13DefaultDeleteIS4_EEEEPS7_ (libxul.so + 0x18c99f7)#012#6 0x00007fb2ab8c9e19 _ZN7mozilla3ipc9IProtocol11ChannelSendENS_9UniquePtrIN3IPC7MessageENS_13DefaultDeleteIS4_EEEEPS7_ (libxul.so + 0x18c9e19)#012#7 0x00007fb2abdd4fa2 _ZN7mozilla6layers22PCompositorBridgeChild10SendResumeEv (libxul.so + 0x1dd4fa2)#012#8 0x00007fb2aeda0a48 _Z19moz_container_unmapP10_GtkWidget (libxul.so + 0x4da0a48)#012#9 0x00007fb2aeda0b23 _Z27moz_container_wayland_unmapP10_GtkWidget (libxul.so + 0x4da0b23)#012#10 0x00007fb2bb2b0bbc
g_closure_invoke (libgobject-2.0.so.0 + 0x13bbc)#012#11 0x00007fb2bb2ccbf5 signal_emit_unlocked_R (libgobject-2.0.so.0 + 0x2fbf5)#012#12 0x00007fb2bb2ce85a g_signal_emit_valist (libgobject-2.0.so.0 + 0x3185a)#012#13 0x00007fb2bb2cea73 g_signal_emit (libgobject-2.0.so.0 + 0x31a73)#012#14 0x00007fb2b9366f54 gtk_widget_unmap (libgtk-3.so.0 + 0x366f54)#012#15 0x00007fb2bb2b0c7f g_closure_invoke (libgobject-2.0.so.0 + 0x13c7f)#012#16 0x00007fb2bb2ccbf5 signal_emit_unlocked_R (libgobject-2.0.so.0 + 0x2fbf5)#012#17 0x00007fb2bb2ce85a g_signal_emit_valist (libgobject-2.0.so.0 + 0x3185a)#012#18 0x00007fb2bb2cea73 g_signal_emit (libgobject-2.0.so.0 + 0x31a73)#012#19 0x00007fb2b9366f54 gtk_widget_unmap (libgtk-3.so.0 + 0x366f54)#012#20 0x00007fb2b9387a3b gtk_window_hide.lto_priv.0 (libgtk-3.so.0 + 0x387a3b)#012#21 0x00007fb2bb2b0c7f g_closure_invoke (libgobject-2.0.so.0 + 0x13c7f)#012#22 0x00007fb2bb2ccbf5 signal_emit_unlocked_R (libgobject-2.0.so.0 + 0x2fbf5)#012#23 0x00007fb2bb2ce85a g_signa
l_emit_valist (libgobject-2.0.so.0 + 0x3185a)#012#24 0x00007fb2bb2cea73 g_signal_emit (libgobject-2.0.so.0 + 0x31a73)#012#25 0x00007fb2b936e330 gtk_widget_hide (libgtk-3.so.0 + 0x36e330)#012#26 0x00007fb2aed84708 _ZN8nsWindow4ShowEb (libxul.so + 0x4d84708)#012#27 0x00007fb2af485bd0 _ZN7mozilla9AppWindow13SetVisibilityEb (libxul.so + 0x5485bd0)#012#28 0x00007fb2ab0e53f6 NS_InvokeByIndex (libxul.so + 0x10e53f6)#012#29 0x00007fb2ab9b898f _ZN16XPCWrappedNative10CallMethodER14XPCCallContextNS_8CallModeE (libxul.so + 0x19b898f)#012#30 0x00007fb2ab9be1b5 _Z19XPC_WN_GetterSetterP9JSContextjPN2JS5ValueE (libxul.so + 0x19be1b5)#012#31 0x00007fb2b05a25cd _ZN2js23InternalCallOrConstructEP9JSContextRKN2JS8CallArgsENS_14MaybeConstructENS_10CallReasonE (libxul.so + 0x65a25cd)#012#32 0x00007fb2b05a44b7 _ZN2js10CallSetterEP9JSContextN2JS6HandleINS2_5ValueEEES5_S5_ (libxul.so + 0x65a44b7)#012#33 0x00007fb2afbd8376 _ZL19SetExistingPropertyP9JSContextN2JS6HandleINS1_11PropertyKeyEEENS2_INS1_5ValueEEES6
_NS2_IPN2js12NativeObjectEEERKNS7_14PropertyResultERNS1_14ObjectOpResultE (libxul.so + 0x5bd8376)#012#34 0x00007fb2afbde8c3 _ZN2js17NativeSetPropertyILNS_13QualifiedBoolE1EEEbP9JSContextN2JS6HandleIPNS_12NativeObjectEEENS5_INS4_11PropertyKeyEEENS5_INS4_5ValueEEESC_RNS4_14ObjectOpResultE (libxul.so + 0x5bde8c3)#012#35 0x00007fb2b059d931 _ZN2js9InterpretEP9JSContextRNS_8RunStateE (libxul.so + 0x659d931)#012#36 0x00007fb2b05a20e3 _ZN2js9RunScriptEP9JSContextRNS_8RunStateE (libxul.so + 0x65a20e3)#012#37 0x00007fb2b05a26e2 _ZN2js23InternalCallOrConstructEP9JSContextRKN2JS8CallArgsENS_14MaybeConstructENS_10CallReasonE (libxul.so + 0x65a26e2)#012#38 0x00007fb2b05a2a5d _ZN2js4CallEP9JSContextN2JS6HandleINS2_5ValueEEES5_RKNS_13AnyInvokeArgsENS2_13MutableHandleIS4_EENS_10CallReasonE (libxul.so + 0x65a2a5d)#012#39 0x00007fb2afafb367 _Z20JS_CallFunctionValueP9JSContextN2JS6HandleIP8JSObjectEENS2_INS1_5ValueEEERKNS1_16HandleValueArrayENS1_13MutableHandleIS6_EE (libxul.so + 0x5afb367)#012#40 0x00
007fb2ab9bb483 _ZN14nsXPCWrappedJS10CallMethodEtPK15nsXPTMethodInfoP17nsXPTCMiniVariant (libxul.so
Aug 21 13:00:09 nightingale org.gnome.Shell.desktop[683572]: The XKEYBOARD keymap compiler (xkbcomp) reports:
Aug 21 13:00:09 nightingale org.gnome.Shell.desktop[683572]: > Warning: Unsupported maximum keycode 708, clipping.
Aug 21 13:00:09 nightingale org.gnome.Shell.desktop[683572]: > X11 cannot support keycodes above 255.
Aug 21 13:00:09 nightingale org.gnome.Shell.desktop[683572]: Errors from xkbcomp are not fatal to the X server
== outbound00.cs.umd.edu (1 distinct, 6 total) ==
Aug 21 12:09:09 outbound00.cs.umd.edu python3[223094]: ldapdb [x6]
== outbound01.cs.umd.edu (1 distinct, 6 total) ==
Aug 21 12:13:06 outbound01.cs.umd.edu python3[2458039]: ldapdb [x6]
== quiss (1 distinct, 2 total) ==
Aug 21 12:21:55 quiss nautilus[2301758]: Attempted to add a non-existent file to the view. [x2]
== sentry-docker00.cs.umd.edu (38 distinct, 38 total) ==
Aug 21 12:19:18 sentry-docker00.cs.umd.edu systemd-udevd[707025]: link_config: could not get ethtool features for vetha5e8cae
Aug 21 12:19:18 sentry-docker00.cs.umd.edu systemd-udevd[707025]: Could not set offload features of vetha5e8cae: No such device
Aug 21 12:19:18 sentry-docker00.cs.umd.edu systemd-udevd[707094]: link_config: could not get ethtool features for veth1d605d1
Aug 21 12:19:18 sentry-docker00.cs.umd.edu systemd-udevd[707094]: Could not set offload features of veth1d605d1: No such device
Aug 21 12:19:18 sentry-docker00.cs.umd.edu systemd-udevd[707116]: Could not generate persistent MAC address for vethef28e48: No such file or directory
Aug 21 12:19:18 sentry-docker00.cs.umd.edu systemd-udevd[707117]: Could not generate persistent MAC address for veth3d267fa: No such file or directory
Aug 21 12:19:18 sentry-docker00.cs.umd.edu systemd-udevd[707140]: Could not generate persistent MAC address for veth1d5c3fa: No such file or directory
Aug 21 12:19:18 sentry-docker00.cs.umd.edu systemd-udevd[707136]: Could not generate persistent MAC address for vethe70db7b: No such file or directory
Aug 21 12:19:18 sentry-docker00.cs.umd.edu systemd-udevd[707127]: Could not generate persistent MAC address for veth14b2f44: No such file or directory
Aug 21 12:19:18 sentry-docker00.cs.umd.edu systemd-udevd[707140]: Could not generate persistent MAC address for veth46713a5: No such file or directory
Aug 21 12:19:18 sentry-docker00.cs.umd.edu systemd-udevd[707202]: Could not generate persistent MAC address for vetha154d3f: No such file or directory
Aug 21 12:19:18 sentry-docker00.cs.umd.edu systemd-udevd[707205]: Could not generate persistent MAC address for veth04a9559: No such file or directory
Aug 21 12:19:18 sentry-docker00.cs.umd.edu systemd-udevd[707217]: Could not generate persistent MAC address for vethc0d9238: No such file or directory
Aug 21 12:19:18 sentry-docker00.cs.umd.edu systemd-udevd[707228]: Could not generate persistent MAC address for vethbe29e3d: No such file or directory
Aug 21 12:39:26 sentry-docker00.cs.umd.edu systemd-udevd[716558]: link_config: could not get ethtool features for vethe70db7b
Aug 21 12:39:26 sentry-docker00.cs.umd.edu systemd-udevd[716558]: Could not set offload features of vethe70db7b: No such device
Aug 21 12:39:27 sentry-docker00.cs.umd.edu systemd-udevd[716591]: Could not generate persistent MAC address for vethc761e0f: No such file or directory
Aug 21 12:39:27 sentry-docker00.cs.umd.edu systemd-udevd[716592]: Could not generate persistent MAC address for veth1712d80: No such file or directory
Aug 21 12:39:27 sentry-docker00.cs.umd.edu systemd-udevd[716595]: Could not generate persistent MAC address for veth54fe4c1: No such file or directory
Aug 21 12:39:27 sentry-docker00.cs.umd.edu systemd-udevd[716596]: Could not generate persistent MAC address for veth107b11c: No such file or directory
Aug 21 12:39:27 sentry-docker00.cs.umd.edu systemd-udevd[716602]: Could not generate persistent MAC address for veth6cb363f: No such file or directory
Aug 21 12:39:27 sentry-docker00.cs.umd.edu systemd-udevd[716606]: Could not generate persistent MAC address for veth9b900af: No such file or directory
Aug 21 12:39:27 sentry-docker00.cs.umd.edu systemd-udevd[716602]: Could not generate persistent MAC address for veth9294595: No such file or directory
Aug 21 12:39:27 sentry-docker00.cs.umd.edu systemd-udevd[716606]: Could not generate persistent MAC address for vethe2b022d: No such file or directory
Aug 21 12:39:27 sentry-docker00.cs.umd.edu systemd-udevd[716615]: Could not generate persistent MAC address for veth4e37dde: No such file or directory
Aug 21 12:39:27 sentry-docker00.cs.umd.edu systemd-udevd[716596]: Could not generate persistent MAC address for veth5230b7b: No such file or directory
Aug 21 12:59:35 sentry-docker00.cs.umd.edu systemd-udevd[725969]: link_config: could not get ethtool features for veth9294595
Aug 21 12:59:35 sentry-docker00.cs.umd.edu systemd-udevd[725969]: Could not set offload features of veth9294595: No such device
Aug 21 12:59:35 sentry-docker00.cs.umd.edu systemd-udevd[726006]: Could not generate persistent MAC address for vetha4ec096: No such file or directory
Aug 21 12:59:35 sentry-docker00.cs.umd.edu systemd-udevd[726007]: Could not generate persistent MAC address for veth4f9b17f: No such file or directory
... 8 more distinct messages not shown
== soul (1 distinct, 1 total) ==
Aug 21 12:40:54 soul krb5_child[2445976]: Client 'admin(a)UMD.EDU' not found in Kerberos database
== strawberry (2 distinct, 8 total) ==
Aug 21 12:09:44 strawberry udisksd[1067]: Error performing housekeeping for drive /org/freedesktop/UDisks2/drives/ST2000DM001_1CH164_W1E8J5KJ: Error updating SMART data: Error sending ATA command CHECK POWER MODE: Unexpected sense data returned:#0120000: 00 00 00 00 00 00 00 00 00 00 00 00 00 00 00 00 ................#0120010: 00 00 00 00 00 00 00 00 00 00 00 00 00 00 00 00 ................#012 (g-io-error-quark, 0) [x6]
Aug 21 12:34:42 strawberry smartd[5314]: Device: /dev/sda [SAT], failed to read SMART Attribute Data [x2]
1
0
Command: /usr/local/sbin/syslog-digest.py
Time : 0.1237s
Status : exited 0
Output :
Syslog digest — 2026-08-21 12:05 EDT
Processed 4,117 lines, filtered 2,534 (61%). 1,583 unknown (1310 distinct) from 19 host(s).
== ar102 (1239 distinct, 1256 total) ==
Aug 21 11:05:03 ar102 cosmic-session[67961]: [2026-08-21T15:05:03Z ERROR cosmic_osd::components::audio] failed to connect to cosmic-settings's varlink service: Io(Os { code: 111, kind: ConnectionRefused, message: "Connection refused" })
Aug 21 11:05:06 ar102 cosmic-session[67961]: [2026-08-21T15:05:06Z ERROR cosmic_osd::components::audio] failed to connect to cosmic-settings's varlink service: Io(Os { code: 111, kind: ConnectionRefused, message: "Connection refused" })
Aug 21 11:05:09 ar102 cosmic-session[67961]: [2026-08-21T15:05:09Z ERROR cosmic_osd::components::audio] failed to connect to cosmic-settings's varlink service: Io(Os { code: 111, kind: ConnectionRefused, message: "Connection refused" })
Aug 21 11:05:12 ar102 cosmic-session[67961]: [2026-08-21T15:05:12Z ERROR cosmic_osd::components::audio] failed to connect to cosmic-settings's varlink service: Io(Os { code: 111, kind: ConnectionRefused, message: "Connection refused" })
Aug 21 11:05:15 ar102 cosmic-session[67961]: [2026-08-21T15:05:15Z ERROR cosmic_osd::components::audio] failed to connect to cosmic-settings's varlink service: Io(Os { code: 111, kind: ConnectionRefused, message: "Connection refused" })
Aug 21 11:05:18 ar102 cosmic-session[67961]: [2026-08-21T15:05:18Z ERROR cosmic_osd::components::audio] failed to connect to cosmic-settings's varlink service: Io(Os { code: 111, kind: ConnectionRefused, message: "Connection refused" })
Aug 21 11:05:21 ar102 cosmic-session[67961]: [2026-08-21T15:05:21Z ERROR cosmic_osd::components::audio] failed to connect to cosmic-settings's varlink service: Io(Os { code: 111, kind: ConnectionRefused, message: "Connection refused" })
Aug 21 11:05:24 ar102 cosmic-session[67961]: [2026-08-21T15:05:24Z ERROR cosmic_osd::components::audio] failed to connect to cosmic-settings's varlink service: Io(Os { code: 111, kind: ConnectionRefused, message: "Connection refused" })
Aug 21 11:05:27 ar102 cosmic-session[67961]: [2026-08-21T15:05:27Z ERROR cosmic_osd::components::audio] failed to connect to cosmic-settings's varlink service: Io(Os { code: 111, kind: ConnectionRefused, message: "Connection refused" })
Aug 21 11:05:30 ar102 cosmic-session[67961]: [2026-08-21T15:05:30Z ERROR cosmic_osd::components::audio] failed to connect to cosmic-settings's varlink service: Io(Os { code: 111, kind: ConnectionRefused, message: "Connection refused" })
Aug 21 11:05:33 ar102 cosmic-session[67961]: [2026-08-21T15:05:33Z ERROR cosmic_osd::components::audio] failed to connect to cosmic-settings's varlink service: Io(Os { code: 111, kind: ConnectionRefused, message: "Connection refused" })
Aug 21 11:05:36 ar102 cosmic-session[67961]: [2026-08-21T15:05:36Z ERROR cosmic_osd::components::audio] failed to connect to cosmic-settings's varlink service: Io(Os { code: 111, kind: ConnectionRefused, message: "Connection refused" })
Aug 21 11:05:39 ar102 cosmic-session[67961]: [2026-08-21T15:05:39Z ERROR cosmic_osd::components::audio] failed to connect to cosmic-settings's varlink service: Io(Os { code: 111, kind: ConnectionRefused, message: "Connection refused" })
Aug 21 11:05:42 ar102 cosmic-session[67961]: [2026-08-21T15:05:42Z ERROR cosmic_osd::components::audio] failed to connect to cosmic-settings's varlink service: Io(Os { code: 111, kind: ConnectionRefused, message: "Connection refused" })
Aug 21 11:05:45 ar102 cosmic-session[67961]: [2026-08-21T15:05:45Z ERROR cosmic_osd::components::audio] failed to connect to cosmic-settings's varlink service: Io(Os { code: 111, kind: ConnectionRefused, message: "Connection refused" })
Aug 21 11:05:48 ar102 cosmic-session[67961]: [2026-08-21T15:05:48Z ERROR cosmic_osd::components::audio] failed to connect to cosmic-settings's varlink service: Io(Os { code: 111, kind: ConnectionRefused, message: "Connection refused" })
Aug 21 11:05:51 ar102 cosmic-session[67961]: [2026-08-21T15:05:51Z ERROR cosmic_osd::components::audio] failed to connect to cosmic-settings's varlink service: Io(Os { code: 111, kind: ConnectionRefused, message: "Connection refused" })
Aug 21 11:05:54 ar102 cosmic-session[67961]: [2026-08-21T15:05:54Z ERROR cosmic_osd::components::audio] failed to connect to cosmic-settings's varlink service: Io(Os { code: 111, kind: ConnectionRefused, message: "Connection refused" })
Aug 21 11:05:57 ar102 cosmic-session[67961]: [2026-08-21T15:05:57Z ERROR cosmic_osd::components::audio] failed to connect to cosmic-settings's varlink service: Io(Os { code: 111, kind: ConnectionRefused, message: "Connection refused" })
Aug 21 11:06:00 ar102 cosmic-session[67961]: [2026-08-21T15:06:00Z ERROR cosmic_osd::components::audio] failed to connect to cosmic-settings's varlink service: Io(Os { code: 111, kind: ConnectionRefused, message: "Connection refused" })
Aug 21 11:06:03 ar102 cosmic-session[67961]: [2026-08-21T15:06:03Z ERROR cosmic_osd::components::audio] failed to connect to cosmic-settings's varlink service: Io(Os { code: 111, kind: ConnectionRefused, message: "Connection refused" })
Aug 21 11:06:06 ar102 cosmic-session[67961]: [2026-08-21T15:06:06Z ERROR cosmic_osd::components::audio] failed to connect to cosmic-settings's varlink service: Io(Os { code: 111, kind: ConnectionRefused, message: "Connection refused" })
Aug 21 11:06:09 ar102 cosmic-session[67961]: [2026-08-21T15:06:09Z ERROR cosmic_osd::components::audio] failed to connect to cosmic-settings's varlink service: Io(Os { code: 111, kind: ConnectionRefused, message: "Connection refused" })
Aug 21 11:06:12 ar102 cosmic-session[67961]: [2026-08-21T15:06:12Z ERROR cosmic_osd::components::audio] failed to connect to cosmic-settings's varlink service: Io(Os { code: 111, kind: ConnectionRefused, message: "Connection refused" })
Aug 21 11:06:15 ar102 cosmic-session[67961]: [2026-08-21T15:06:15Z ERROR cosmic_osd::components::audio] failed to connect to cosmic-settings's varlink service: Io(Os { code: 111, kind: ConnectionRefused, message: "Connection refused" })
Aug 21 11:06:18 ar102 cosmic-session[67961]: [2026-08-21T15:06:18Z ERROR cosmic_osd::components::audio] failed to connect to cosmic-settings's varlink service: Io(Os { code: 111, kind: ConnectionRefused, message: "Connection refused" })
Aug 21 11:06:21 ar102 cosmic-session[67961]: [2026-08-21T15:06:21Z ERROR cosmic_osd::components::audio] failed to connect to cosmic-settings's varlink service: Io(Os { code: 111, kind: ConnectionRefused, message: "Connection refused" })
Aug 21 11:06:24 ar102 cosmic-session[67961]: [2026-08-21T15:06:24Z ERROR cosmic_osd::components::audio] failed to connect to cosmic-settings's varlink service: Io(Os { code: 111, kind: ConnectionRefused, message: "Connection refused" })
Aug 21 11:06:27 ar102 cosmic-session[67961]: [2026-08-21T15:06:27Z ERROR cosmic_osd::components::audio] failed to connect to cosmic-settings's varlink service: Io(Os { code: 111, kind: ConnectionRefused, message: "Connection refused" })
Aug 21 11:06:30 ar102 cosmic-session[67961]: [2026-08-21T15:06:30Z ERROR cosmic_osd::components::audio] failed to connect to cosmic-settings's varlink service: Io(Os { code: 111, kind: ConnectionRefused, message: "Connection refused" })
... 1209 more distinct messages not shown
== b0b02.cs.umd.edu (1 distinct, 1 total) ==
Aug 21 11:07:24 b0b02.cs.umd.edu rustdesk[634384]: cannot open display:
== csfw00a (2 distinct, 165 total) ==
Aug 21 11:04:38 csfw00a kernel: bnxt_en 0000:09:00.0 eth3: NIC Link is Down [x161]
Aug 21 11:44:48 csfw00a ospf6d[1477]: [EC 100663307] Could not send entire message [x4]
== hackerman (7 distinct, 12 total) ==
Aug 21 11:19:01 hackerman gnome-software[2060381]: failed to commit changes to dconf: GDBus.Error:org.gtk.GDBus.UnmappedGError.Quark._g_2dfile_2derror_2dquark.Code2: Failed to create file “/adminhomes/sajith/.config/dconf/user.4HTEU3”: Permission denied
Aug 21 11:20:04 hackerman gnome-software[2060381]: can't reliably fixup error code 4 in domain g-io-error-quark: Not a directory [x4]
Aug 21 11:20:12 hackerman gnome-software[2060381]: Only 0 apps for recent list, hiding
Aug 21 11:20:27 hackerman gnome-software[2060381]: failed to commit changes to dconf: GDBus.Error:org.gtk.GDBus.UnmappedGError.Quark._g_2dfile_2derror_2dquark.Code2: Failed to create file “/adminhomes/sajith/.config/dconf/user.PH87T3”: Permission denied
Aug 21 11:20:28 hackerman packagekitd[989540]: Failed to get cache filename for libreoffice [x2]
Aug 21 11:20:28 hackerman packagekitd[989540]: Failed to get cache filename for kernel [x2]
Aug 21 11:20:38 hackerman packagekitd[989540]: failed to parse public key for /etc/pki/rpm-gpg/RPM-GPG-KEY-PQC-redhat-release
== idm00 (1 distinct, 1 total) ==
Aug 21 11:51:39 idm00 named[3810278]: client @0x7f48d4088de8 10.73.240.42#59931: update '73.10.in-addr.arpa/IN' denied
== idmp0 (1 distinct, 1 total) ==
Aug 21 11:35:55 idmp0 named[1121900]: client @0x7fe3fc03e868 10.73.240.43#52127: update '73.10.in-addr.arpa/IN' denied
== itmon02 (1 distinct, 42 total) ==
Aug 21 11:07:49 itmon02 sshd[1750555]: error: beginning MaxStartups throttling [x42]
== itmon03 (1 distinct, 1 total) ==
Aug 21 11:50:02 itmon03 systemd-timedated[1779409]: /dev/rtc is busy. Is somebody keeping it open continuously? That's not a good idea... Returning a bogus RTC timestamp.
== librenms-test (3 distinct, 3 total) ==
Aug 21 11:23:31 librenms-test puppet-agent[67364]: Could not retrieve catalog from remote server: Error 500 on SERVER: Server Error: Evaluation Error: Error while evaluating a Function Call, You are using the empty role, but the csd-puppet-run fact exists. This will break things! (file: /etc/puppetlabs/code/environments/librenms_scheduler/site/profile/manifests/empty.pp, line: 6, column: 5) on node librenms-test.devpve.cs.umd.edu
Aug 21 11:23:31 librenms-test puppet-agent[67364]: Not using cache on failed catalog
Aug 21 11:23:31 librenms-test puppet-agent[67364]: Could not retrieve catalog; skipping run
== munin (2 distinct, 8 total) ==
Aug 21 11:33:05 munin sudo[2002645]: pam_systemd(sudo:session): Failed to stat() runtime directory '/run/user/0': No such file or directory [x4]
Aug 21 11:33:05 munin sudo[2002645]: pam_systemd(sudo:session): Not setting $XDG_RUNTIME_DIR, as the directory is not in order. [x4]
== newhonors.cs.umd.edu (1 distinct, 1 total) ==
Aug 21 11:26:13 newhonors.cs.umd.edu systemd-tmpfiles: [/usr/lib/tmpfiles.d/var.conf:14] Duplicate line for path "/var/log", ignoring.
== newhonors2 (1 distinct, 24 total) ==
Aug 21 11:13:03 newhonors2 dhcpcd[1521627]: dhcpcd is not running [x24]
== outbound00.cs.umd.edu (1 distinct, 6 total) ==
Aug 21 11:09:09 outbound00.cs.umd.edu python3[209126]: ldapdb [x6]
== outbound01.cs.umd.edu (1 distinct, 6 total) ==
Aug 21 11:13:06 outbound01.cs.umd.edu python3[2444044]: ldapdb [x6]
== quiss (3 distinct, 3 total) ==
Aug 21 11:36:02 quiss systemd-tmpfiles[2706952]: Opening file "/tmp/.X11-unix/X1024" failed, proceeding without lock: No such device or address
Aug 21 11:36:02 quiss systemd-tmpfiles[2706952]: Opening file "/tmp/.X11-unix/X1025" failed, proceeding without lock: No such device or address
Aug 21 11:36:02 quiss systemd-tmpfiles[2706952]: Opening file "/tmp/.ICE-unix/1621178" failed, proceeding without lock: No such device or address
== sebatinsky.cs.umd.edu (2 distinct, 3 total) ==
Aug 21 11:54:14 sebatinsky.cs.umd.edu kernel: hpet1: lost 2 rtc interrupts
Aug 21 11:54:14 sebatinsky.cs.umd.edu kernel: hpet1: lost 1 rtc interrupts [x2]
== sentry-docker00.cs.umd.edu (40 distinct, 40 total) ==
Aug 21 11:18:53 sentry-docker00.cs.umd.edu systemd-udevd[678757]: link_config: could not get ethtool features for vethdb2c59e
Aug 21 11:18:53 sentry-docker00.cs.umd.edu systemd-udevd[678757]: Could not set offload features of vethdb2c59e: No such device
Aug 21 11:18:53 sentry-docker00.cs.umd.edu systemd-udevd[678793]: Could not generate persistent MAC address for veth48a2605: No such file or directory
Aug 21 11:18:53 sentry-docker00.cs.umd.edu systemd-udevd[678794]: Could not generate persistent MAC address for vethd3aa8a6: No such file or directory
Aug 21 11:18:53 sentry-docker00.cs.umd.edu systemd-udevd[678797]: Could not generate persistent MAC address for vetha1d8e0d: No such file or directory
Aug 21 11:18:53 sentry-docker00.cs.umd.edu systemd-udevd[678798]: Could not generate persistent MAC address for veth126a885: No such file or directory
Aug 21 11:18:53 sentry-docker00.cs.umd.edu systemd-udevd[678821]: Could not generate persistent MAC address for veth73e0b6e: No such file or directory
Aug 21 11:18:53 sentry-docker00.cs.umd.edu systemd-udevd[678822]: Could not generate persistent MAC address for veth2db6b0e: No such file or directory
Aug 21 11:18:53 sentry-docker00.cs.umd.edu systemd-udevd[678840]: Could not generate persistent MAC address for vethc35e713: No such file or directory
Aug 21 11:18:53 sentry-docker00.cs.umd.edu systemd-udevd[678846]: Could not generate persistent MAC address for veth3ee6391: No such file or directory
Aug 21 11:18:53 sentry-docker00.cs.umd.edu systemd-udevd[678857]: Could not generate persistent MAC address for veth9b2bb0a: No such file or directory
Aug 21 11:18:53 sentry-docker00.cs.umd.edu systemd-udevd[678862]: Could not generate persistent MAC address for vetheca00a5: No such file or directory
Aug 21 11:39:01 sentry-docker00.cs.umd.edu systemd-udevd[688214]: link_config: could not get ethtool features for veth73e0b6e
Aug 21 11:39:01 sentry-docker00.cs.umd.edu systemd-udevd[688214]: Could not set offload features of veth73e0b6e: No such device
Aug 21 11:39:01 sentry-docker00.cs.umd.edu systemd-udevd[688218]: link_config: could not get ethtool features for veth48a2605
Aug 21 11:39:01 sentry-docker00.cs.umd.edu systemd-udevd[688218]: Could not set offload features of veth48a2605: No such device
Aug 21 11:39:02 sentry-docker00.cs.umd.edu systemd-udevd[688253]: Could not generate persistent MAC address for vethe8858c0: No such file or directory
Aug 21 11:39:02 sentry-docker00.cs.umd.edu systemd-udevd[688254]: Could not generate persistent MAC address for veth61f7677: No such file or directory
Aug 21 11:39:02 sentry-docker00.cs.umd.edu systemd-udevd[688258]: Could not generate persistent MAC address for vethaea068b: No such file or directory
Aug 21 11:39:02 sentry-docker00.cs.umd.edu systemd-udevd[688257]: Could not generate persistent MAC address for vethd070bfa: No such file or directory
Aug 21 11:39:02 sentry-docker00.cs.umd.edu systemd-udevd[688271]: Could not generate persistent MAC address for vethce59826: No such file or directory
Aug 21 11:39:02 sentry-docker00.cs.umd.edu systemd-udevd[688258]: Could not generate persistent MAC address for vethfa86ecf: No such file or directory
Aug 21 11:39:02 sentry-docker00.cs.umd.edu systemd-udevd[688283]: Could not generate persistent MAC address for veth9a094ce: No such file or directory
Aug 21 11:39:02 sentry-docker00.cs.umd.edu systemd-udevd[688284]: Could not generate persistent MAC address for vethed3058b: No such file or directory
Aug 21 11:39:02 sentry-docker00.cs.umd.edu systemd-udevd[688327]: Could not generate persistent MAC address for vethc5662c0: No such file or directory
Aug 21 11:39:02 sentry-docker00.cs.umd.edu systemd-udevd[688323]: Could not generate persistent MAC address for vethf75c2e1: No such file or directory
Aug 21 11:59:10 sentry-docker00.cs.umd.edu systemd-udevd[697628]: link_config: could not get ethtool features for veth9a094ce
Aug 21 11:59:10 sentry-docker00.cs.umd.edu systemd-udevd[697628]: Could not set offload features of veth9a094ce: No such device
Aug 21 11:59:10 sentry-docker00.cs.umd.edu systemd-udevd[697638]: link_config: could not get ethtool features for vethd070bfa
Aug 21 11:59:10 sentry-docker00.cs.umd.edu systemd-udevd[697638]: Could not set offload features of vethd070bfa: No such device
... 10 more distinct messages not shown
== strawberry (2 distinct, 8 total) ==
Aug 21 11:09:44 strawberry udisksd[1067]: Error performing housekeeping for drive /org/freedesktop/UDisks2/drives/ST2000DM001_1CH164_W1E8J5KJ: Error updating SMART data: Error sending ATA command CHECK POWER MODE: Unexpected sense data returned:#0120000: 00 00 00 00 00 00 00 00 00 00 00 00 00 00 00 00 ................#0120010: 00 00 00 00 00 00 00 00 00 00 00 00 00 00 00 00 ................#012 (g-io-error-quark, 0) [x6]
Aug 21 11:34:42 strawberry smartd[5314]: Device: /dev/sda [SAT], failed to read SMART Attribute Data [x2]
== talkhosts9 (1 distinct, 2 total) ==
Aug 21 11:17:17 talkhosts9 setroubleshoot[571427]: SELinux is preventing /usr/bin/lsof from getattr access on the unix_stream_socket unix_stream_socket. For complete SELinux messages run: sealert -l a6df89b3-c497-469c-8232-c4fde0508abf [x2]
1
0
Command: /usr/local/sbin/syslog-digest.py
Time : 0.1281s
Status : exited 0
Output :
Syslog digest — 2026-08-21 11:05 EDT
Processed 3,534 lines, filtered 1,876 (53%). 1,658 unknown (1409 distinct) from 21 host(s).
== ar102 (1300 distinct, 1300 total) ==
Jul 21 16:33:54 ar102 cosmic-session[67961]: [2026-07-21T20:33:54Z ERROR cosmic_osd::components::audio] failed to connect to cosmic-settings's varlink service: Io(Os { code: 111, kind: ConnectionRefused, message: "Connection refused" })
Jul 21 16:33:57 ar102 cosmic-session[67961]: [2026-07-21T20:33:57Z ERROR cosmic_osd::components::audio] failed to connect to cosmic-settings's varlink service: Io(Os { code: 111, kind: ConnectionRefused, message: "Connection refused" })
Jul 21 16:34:00 ar102 cosmic-session[67961]: [2026-07-21T20:34:00Z ERROR cosmic_osd::components::audio] failed to connect to cosmic-settings's varlink service: Io(Os { code: 111, kind: ConnectionRefused, message: "Connection refused" })
Jul 21 16:34:04 ar102 cosmic-session[67961]: [2026-07-21T20:34:04Z ERROR cosmic_osd::components::audio] failed to connect to cosmic-settings's varlink service: Io(Os { code: 111, kind: ConnectionRefused, message: "Connection refused" })
Jul 21 16:34:07 ar102 cosmic-session[67961]: [2026-07-21T20:34:07Z ERROR cosmic_osd::components::audio] failed to connect to cosmic-settings's varlink service: Io(Os { code: 111, kind: ConnectionRefused, message: "Connection refused" })
Jul 21 16:34:10 ar102 cosmic-session[67961]: [2026-07-21T20:34:10Z ERROR cosmic_osd::components::audio] failed to connect to cosmic-settings's varlink service: Io(Os { code: 111, kind: ConnectionRefused, message: "Connection refused" })
Jul 21 16:34:13 ar102 cosmic-session[67961]: [2026-07-21T20:34:13Z ERROR cosmic_osd::components::audio] failed to connect to cosmic-settings's varlink service: Io(Os { code: 111, kind: ConnectionRefused, message: "Connection refused" })
Jul 21 16:34:16 ar102 cosmic-session[67961]: [2026-07-21T20:34:16Z ERROR cosmic_osd::components::audio] failed to connect to cosmic-settings's varlink service: Io(Os { code: 111, kind: ConnectionRefused, message: "Connection refused" })
Jul 21 16:34:19 ar102 cosmic-session[67961]: [2026-07-21T20:34:19Z ERROR cosmic_osd::components::audio] failed to connect to cosmic-settings's varlink service: Io(Os { code: 111, kind: ConnectionRefused, message: "Connection refused" })
Jul 21 16:34:22 ar102 cosmic-session[67961]: [2026-07-21T20:34:22Z ERROR cosmic_osd::components::audio] failed to connect to cosmic-settings's varlink service: Io(Os { code: 111, kind: ConnectionRefused, message: "Connection refused" })
Jul 21 16:34:25 ar102 cosmic-session[67961]: [2026-07-21T20:34:25Z ERROR cosmic_osd::components::audio] failed to connect to cosmic-settings's varlink service: Io(Os { code: 111, kind: ConnectionRefused, message: "Connection refused" })
Jul 21 16:34:28 ar102 cosmic-session[67961]: [2026-07-21T20:34:28Z ERROR cosmic_osd::components::audio] failed to connect to cosmic-settings's varlink service: Io(Os { code: 111, kind: ConnectionRefused, message: "Connection refused" })
Jul 21 16:34:31 ar102 cosmic-session[67961]: [2026-07-21T20:34:31Z ERROR cosmic_osd::components::audio] failed to connect to cosmic-settings's varlink service: Io(Os { code: 111, kind: ConnectionRefused, message: "Connection refused" })
Jul 21 16:34:34 ar102 cosmic-session[67961]: [2026-07-21T20:34:34Z ERROR cosmic_osd::components::audio] failed to connect to cosmic-settings's varlink service: Io(Os { code: 111, kind: ConnectionRefused, message: "Connection refused" })
Jul 21 16:34:37 ar102 cosmic-session[67961]: [2026-07-21T20:34:37Z ERROR cosmic_osd::components::audio] failed to connect to cosmic-settings's varlink service: Io(Os { code: 111, kind: ConnectionRefused, message: "Connection refused" })
Jul 21 16:34:40 ar102 cosmic-session[67961]: [2026-07-21T20:34:40Z ERROR cosmic_osd::components::audio] failed to connect to cosmic-settings's varlink service: Io(Os { code: 111, kind: ConnectionRefused, message: "Connection refused" })
Jul 21 16:34:43 ar102 cosmic-session[67961]: [2026-07-21T20:34:43Z ERROR cosmic_osd::components::audio] failed to connect to cosmic-settings's varlink service: Io(Os { code: 111, kind: ConnectionRefused, message: "Connection refused" })
Jul 21 16:34:46 ar102 cosmic-session[67961]: [2026-07-21T20:34:46Z ERROR cosmic_osd::components::audio] failed to connect to cosmic-settings's varlink service: Io(Os { code: 111, kind: ConnectionRefused, message: "Connection refused" })
Jul 21 16:34:49 ar102 cosmic-session[67961]: [2026-07-21T20:34:49Z ERROR cosmic_osd::components::audio] failed to connect to cosmic-settings's varlink service: Io(Os { code: 111, kind: ConnectionRefused, message: "Connection refused" })
Jul 21 16:34:52 ar102 cosmic-session[67961]: [2026-07-21T20:34:52Z ERROR cosmic_osd::components::audio] failed to connect to cosmic-settings's varlink service: Io(Os { code: 111, kind: ConnectionRefused, message: "Connection refused" })
Jul 21 16:34:55 ar102 cosmic-session[67961]: [2026-07-21T20:34:55Z ERROR cosmic_osd::components::audio] failed to connect to cosmic-settings's varlink service: Io(Os { code: 111, kind: ConnectionRefused, message: "Connection refused" })
Jul 21 16:34:58 ar102 cosmic-session[67961]: [2026-07-21T20:34:58Z ERROR cosmic_osd::components::audio] failed to connect to cosmic-settings's varlink service: Io(Os { code: 111, kind: ConnectionRefused, message: "Connection refused" })
Jul 21 16:35:01 ar102 cosmic-session[67961]: [2026-07-21T20:35:01Z ERROR cosmic_osd::components::audio] failed to connect to cosmic-settings's varlink service: Io(Os { code: 111, kind: ConnectionRefused, message: "Connection refused" })
Jul 21 16:35:04 ar102 cosmic-session[67961]: [2026-07-21T20:35:04Z ERROR cosmic_osd::components::audio] failed to connect to cosmic-settings's varlink service: Io(Os { code: 111, kind: ConnectionRefused, message: "Connection refused" })
Jul 21 16:35:07 ar102 cosmic-session[67961]: [2026-07-21T20:35:07Z ERROR cosmic_osd::components::audio] failed to connect to cosmic-settings's varlink service: Io(Os { code: 111, kind: ConnectionRefused, message: "Connection refused" })
Jul 21 16:35:10 ar102 cosmic-session[67961]: [2026-07-21T20:35:10Z ERROR cosmic_osd::components::audio] failed to connect to cosmic-settings's varlink service: Io(Os { code: 111, kind: ConnectionRefused, message: "Connection refused" })
Jul 21 16:35:13 ar102 cosmic-session[67961]: [2026-07-21T20:35:13Z ERROR cosmic_osd::components::audio] failed to connect to cosmic-settings's varlink service: Io(Os { code: 111, kind: ConnectionRefused, message: "Connection refused" })
Jul 21 16:35:16 ar102 cosmic-session[67961]: [2026-07-21T20:35:16Z ERROR cosmic_osd::components::audio] failed to connect to cosmic-settings's varlink service: Io(Os { code: 111, kind: ConnectionRefused, message: "Connection refused" })
Jul 21 16:35:19 ar102 cosmic-session[67961]: [2026-07-21T20:35:19Z ERROR cosmic_osd::components::audio] failed to connect to cosmic-settings's varlink service: Io(Os { code: 111, kind: ConnectionRefused, message: "Connection refused" })
Jul 21 16:35:22 ar102 cosmic-session[67961]: [2026-07-21T20:35:22Z ERROR cosmic_osd::components::audio] failed to connect to cosmic-settings's varlink service: Io(Os { code: 111, kind: ConnectionRefused, message: "Connection refused" })
... 1270 more distinct messages not shown
== b0b02.cs.umd.edu (1 distinct, 1 total) ==
Aug 21 10:07:20 b0b02.cs.umd.edu rustdesk[619302]: cannot open display:
== bachata (1 distinct, 2 total) ==
Aug 21 10:11:25 bachata setroubleshoot[3409562]: SELinux is preventing /usr/sbin/smbd from name_bind access on the udp_socket port 753. For complete SELinux messages run: sealert -l 8f7247f1-69a5-4a62-a4f0-88a324bfd75c [x2]
== csfw00a (1 distinct, 145 total) ==
Aug 21 10:04:20 csfw00a kernel: bnxt_en 0000:09:00.0 eth3: NIC Link is Down [x145]
== gle-dind04 (14 distinct, 28 total) ==
Aug 21 10:05:11 gle-dind04 (dockerd)[571004]: docker.service: Referenced but unset environment variable evaluates to an empty string: BLOCK_REGISTRY, DOCKER_NETWORK_OPTIONS, INSECURE_REGISTRY [x2]
Aug 21 10:05:12 gle-dind04 firewalld[1069]: ERROR: NAME_CONFLICT: new_policy_object(): 'docker-forwarding' [x2]
Aug 21 10:05:12 gle-dind04 firewalld[1069]: WARNING: COMMAND_FAILED: '/usr/sbin/ip6tables -w10 -t nat -D OUTPUT -m addrtype --dst-type LOCAL -j DOCKER' failed: ip6tables: Bad rule (does a matching rule exist in that chain?). [x2]
Aug 21 10:05:12 gle-dind04 firewalld[1069]: WARNING: COMMAND_FAILED: '/usr/sbin/ip6tables -w10 -t nat -D PREROUTING' failed: ip6tables: Bad rule (does a matching rule exist in that chain?). [x2]
Aug 21 10:05:12 gle-dind04 firewalld[1069]: WARNING: COMMAND_FAILED: '/usr/sbin/ip6tables -w10 -t nat -D OUTPUT' failed: ip6tables: Bad rule (does a matching rule exist in that chain?). [x2]
Aug 21 10:05:12 gle-dind04 firewalld[1069]: WARNING: COMMAND_FAILED: '/usr/sbin/ip6tables -w10 -t filter -X DOCKER-FORWARD' failed: ip6tables v1.8.11 (nf_tables): CHAIN_DEL failed (Device or resource busy): chain DOCKER-FORWARD [x2]
Aug 21 10:05:12 gle-dind04 firewalld[1069]: WARNING: COMMAND_FAILED: '/usr/sbin/ip6tables -w10 -t filter -F DOCKER-ISOLATION-STAGE-1' failed: ip6tables: No chain/target/match by that name. [x2]
Aug 21 10:05:12 gle-dind04 firewalld[1069]: WARNING: COMMAND_FAILED: '/usr/sbin/ip6tables -w10 -t filter -X DOCKER-ISOLATION-STAGE-1' failed: ip6tables: No chain/target/match by that name. [x2]
Aug 21 10:05:12 gle-dind04 firewalld[1069]: WARNING: COMMAND_FAILED: '/usr/sbin/ip6tables -w10 -t filter -F DOCKER-ISOLATION-STAGE-2' failed: ip6tables: No chain/target/match by that name. [x2]
Aug 21 10:05:12 gle-dind04 firewalld[1069]: WARNING: COMMAND_FAILED: '/usr/sbin/ip6tables -w10 -t filter -X DOCKER-ISOLATION-STAGE-2' failed: ip6tables: No chain/target/match by that name. [x2]
Aug 21 10:05:12 gle-dind04 firewalld[1069]: WARNING: COMMAND_FAILED: '/usr/sbin/ip6tables -w10 -t filter -F DOCKER-ISOLATION' failed: ip6tables: No chain/target/match by that name. [x2]
Aug 21 10:05:12 gle-dind04 firewalld[1069]: WARNING: COMMAND_FAILED: '/usr/sbin/ip6tables -w10 -t filter -X DOCKER-ISOLATION' failed: ip6tables: No chain/target/match by that name. [x2]
Aug 21 10:09:45 gle-dind04 firewalld[1069]: ERROR: INVALID_POLICY: docker-egress [x3]
Aug 21 10:09:46 gle-dind04 firewalld[1069]: WARNING: ALREADY_ENABLED: masquerade already enabled in 'public'
== hackerman (6 distinct, 11 total) ==
Aug 21 10:20:04 hackerman gnome-software[2060381]: can't reliably fixup error code 4 in domain g-io-error-quark: Not a directory [x4]
Aug 21 10:20:12 hackerman gnome-software[2060381]: Only 0 apps for recent list, hiding
Aug 21 10:20:28 hackerman gnome-software[2060381]: failed to commit changes to dconf: GDBus.Error:org.gtk.GDBus.UnmappedGError.Quark._g_2dfile_2derror_2dquark.Code2: Failed to create file “/adminhomes/sajith/.config/dconf/user.UTWHU3”: Permission denied
Aug 21 10:20:28 hackerman packagekitd[976510]: Failed to get cache filename for libreoffice [x2]
Aug 21 10:20:28 hackerman packagekitd[976510]: Failed to get cache filename for kernel [x2]
Aug 21 10:20:38 hackerman packagekitd[976510]: failed to parse public key for /etc/pki/rpm-gpg/RPM-GPG-KEY-PQC-redhat-release
== idm00 (3 distinct, 3 total) ==
Aug 21 10:38:21 idm00 named[3810278]: client @0x7f48cc0aa6f8 10.73.245.14#56667: update '73.10.in-addr.arpa/IN' denied
Aug 21 10:40:20 idm00 named[3810278]: client @0x7f48cc0c6c88 10.73.245.14#56667: update '73.10.in-addr.arpa/IN' denied
Aug 21 10:51:39 idm00 named[3810278]: client @0x7f48cc0cb7a8 10.73.240.42#49816: update '73.10.in-addr.arpa/IN' denied
== idmp0 (1 distinct, 1 total) ==
Aug 21 10:35:55 idmp0 named[1121900]: client @0x7fe410001d58 10.73.240.43#50028: update '73.10.in-addr.arpa/IN' denied
== irb2156 (29 distinct, 31 total) ==
Aug 21 10:59:22 irb2156 packagekitd[303219]: Failed to get cache filename for cosmic-epoch [x2]
Aug 21 10:59:22 irb2156 packagekitd[303219]: Failed to get cache filename for bitbison-agent
Aug 21 10:59:22 irb2156 packagekitd[303219]: Failed to get cache filename for bitbison-forwarder
Aug 21 10:59:22 irb2156 packagekitd[303219]: Failed to get cache filename for libcupsfilters
Aug 21 10:59:22 irb2156 packagekitd[303219]: Failed to get cache filename for glib2-devel
Aug 21 10:59:22 irb2156 packagekitd[303219]: Failed to get cache filename for yggdrasil
Aug 21 10:59:22 irb2156 packagekitd[303219]: Failed to get cache filename for ansible-core
Aug 21 10:59:22 irb2156 packagekitd[303219]: Failed to get cache filename for nspr
Aug 21 10:59:22 irb2156 packagekitd[303219]: Failed to get cache filename for nss
Aug 21 10:59:22 irb2156 packagekitd[303219]: Failed to get cache filename for nss-softokn
Aug 21 10:59:22 irb2156 packagekitd[303219]: Failed to get cache filename for nss-softokn-freebl
Aug 21 10:59:22 irb2156 packagekitd[303219]: Failed to get cache filename for nss-sysinit
Aug 21 10:59:22 irb2156 packagekitd[303219]: Failed to get cache filename for nss-tools
Aug 21 10:59:22 irb2156 packagekitd[303219]: Failed to get cache filename for nss-util
Aug 21 10:59:22 irb2156 packagekitd[303219]: Failed to get cache filename for kernel-headers
Aug 21 10:59:22 irb2156 packagekitd[303219]: Failed to get cache filename for python3-perf
Aug 21 10:59:22 irb2156 packagekitd[303219]: Failed to get cache filename for glib2
Aug 21 10:59:22 irb2156 packagekitd[303219]: Failed to get cache filename for kernel-tools
Aug 21 10:59:22 irb2156 packagekitd[303219]: Failed to get cache filename for kernel-tools-libs
Aug 21 10:59:22 irb2156 packagekitd[303219]: Failed to get cache filename for kbd
Aug 21 10:59:22 irb2156 packagekitd[303219]: Failed to get cache filename for kbd-legacy
Aug 21 10:59:22 irb2156 packagekitd[303219]: Failed to get cache filename for kbd-misc
Aug 21 10:59:22 irb2156 packagekitd[303219]: Failed to get cache filename for kernel-devel
Aug 21 10:59:22 irb2156 packagekitd[303219]: Failed to get cache filename for kernel [x2]
Aug 21 10:59:22 irb2156 packagekitd[303219]: Failed to get cache filename for kernel-core
Aug 21 10:59:22 irb2156 packagekitd[303219]: Failed to get cache filename for kernel-modules
Aug 21 10:59:22 irb2156 packagekitd[303219]: Failed to get cache filename for kernel-modules-core
Aug 21 10:59:22 irb2156 packagekitd[303219]: Failed to get cache filename for kernel-modules-extra
Aug 21 11:00:25 irb2156 (da-udp.*)[303604]: amanda-udp-restart.service: Failed at step EXEC spawning /usr/bin/systemctl restart amanda-udp.*: No such file or directory
== itmon02 (1 distinct, 40 total) ==
Aug 21 10:08:14 itmon02 sshd[1750555]: error: beginning MaxStartups throttling [x40]
== itmon03 (1 distinct, 1 total) ==
Aug 21 10:50:02 itmon03 systemd-timedated[1776380]: /dev/rtc is busy. Is somebody keeping it open continuously? That's not a good idea... Returning a bogus RTC timestamp.
== librenms-test (1 distinct, 1 total) ==
Aug 21 10:43:49 librenms-test (httpd)[60853]: httpd.service: Referenced but unset environment variable evaluates to an empty string: OPTIONS
== munin (2 distinct, 4 total) ==
Aug 21 10:18:09 munin sudo[1975130]: pam_systemd(sudo:session): Failed to stat() runtime directory '/run/user/0': No such file or directory [x2]
Aug 21 10:18:09 munin sudo[1975130]: pam_systemd(sudo:session): Not setting $XDG_RUNTIME_DIR, as the directory is not in order. [x2]
== netman.cs.umd.edu (2 distinct, 5 total) ==
Aug 21 10:58:25 netman.cs.umd.edu krb5_child[3419271]: Client 'admin(a)UMD.EDU' not found in Kerberos database [x4]
Aug 21 10:58:31 netman.cs.umd.edu sshd[3419229]: error: PAM: Authentication failure for admin from 218.102.209.81
== newhonors2 (1 distinct, 24 total) ==
Aug 21 10:13:02 newhonors2 dhcpcd[1519779]: dhcpcd is not running [x24]
== outbound00.cs.umd.edu (1 distinct, 6 total) ==
Aug 21 10:09:09 outbound00.cs.umd.edu python3[194988]: ldapdb [x6]
== outbound01.cs.umd.edu (1 distinct, 6 total) ==
Aug 21 10:13:07 outbound01.cs.umd.edu python3[2429999]: ldapdb [x6]
== quiss (2 distinct, 2 total) ==
Aug 21 10:09:14 quiss nautilus[2301758]: Attempted to add a non-existent file to the view.
Aug 21 11:00:18 quiss (da-udp.*)[2701273]: amanda-udp-restart.service: Failed at step EXEC spawning /usr/bin/systemctl restart amanda-udp.*: No such file or directory
== sentry-docker00.cs.umd.edu (38 distinct, 38 total) ==
Aug 21 10:18:28 sentry-docker00.cs.umd.edu systemd-udevd[650423]: link_config: could not get ethtool features for veth4c3be4a
Aug 21 10:18:28 sentry-docker00.cs.umd.edu systemd-udevd[650423]: Could not set offload features of veth4c3be4a: No such device
Aug 21 10:18:28 sentry-docker00.cs.umd.edu systemd-udevd[650498]: Could not generate persistent MAC address for veth862e4d9: No such file or directory
Aug 21 10:18:28 sentry-docker00.cs.umd.edu systemd-udevd[650499]: Could not generate persistent MAC address for vethc91e70a: No such file or directory
Aug 21 10:18:28 sentry-docker00.cs.umd.edu systemd-udevd[650517]: Could not generate persistent MAC address for vethe4a03b5: No such file or directory
Aug 21 10:18:28 sentry-docker00.cs.umd.edu systemd-udevd[650512]: Could not generate persistent MAC address for vethd6d49ef: No such file or directory
Aug 21 10:18:28 sentry-docker00.cs.umd.edu systemd-udevd[650506]: Could not generate persistent MAC address for vetha2f73a9: No such file or directory
Aug 21 10:18:28 sentry-docker00.cs.umd.edu systemd-udevd[650509]: Could not generate persistent MAC address for veth7788f84: No such file or directory
Aug 21 10:18:28 sentry-docker00.cs.umd.edu systemd-udevd[650529]: Could not generate persistent MAC address for vethb581b6a: No such file or directory
Aug 21 10:18:28 sentry-docker00.cs.umd.edu systemd-udevd[650530]: Could not generate persistent MAC address for vethb26195b: No such file or directory
Aug 21 10:18:28 sentry-docker00.cs.umd.edu systemd-udevd[650567]: Could not generate persistent MAC address for veth544b0e8: No such file or directory
Aug 21 10:18:28 sentry-docker00.cs.umd.edu systemd-udevd[650568]: Could not generate persistent MAC address for veth816e99c: No such file or directory
Aug 21 10:38:36 sentry-docker00.cs.umd.edu systemd-udevd[659803]: link_config: could not get ethtool features for veth862e4d9
Aug 21 10:38:36 sentry-docker00.cs.umd.edu systemd-udevd[659803]: Could not set offload features of veth862e4d9: No such device
Aug 21 10:38:36 sentry-docker00.cs.umd.edu systemd-udevd[659901]: link_config: could not get ethtool features for vethb581b6a
Aug 21 10:38:36 sentry-docker00.cs.umd.edu systemd-udevd[659901]: Could not set offload features of vethb581b6a: No such device
Aug 21 10:38:37 sentry-docker00.cs.umd.edu systemd-udevd[659929]: Could not generate persistent MAC address for veth9661c76: No such file or directory
Aug 21 10:38:37 sentry-docker00.cs.umd.edu systemd-udevd[659930]: Could not generate persistent MAC address for veth7615fe4: No such file or directory
Aug 21 10:38:37 sentry-docker00.cs.umd.edu systemd-udevd[659934]: Could not generate persistent MAC address for veth5538ecd: No such file or directory
Aug 21 10:38:37 sentry-docker00.cs.umd.edu systemd-udevd[659937]: Could not generate persistent MAC address for veth7f4676e: No such file or directory
Aug 21 10:38:37 sentry-docker00.cs.umd.edu systemd-udevd[659934]: Could not generate persistent MAC address for vethb1979bd: No such file or directory
Aug 21 10:38:37 sentry-docker00.cs.umd.edu systemd-udevd[659937]: Could not generate persistent MAC address for veth195e8bd: No such file or directory
Aug 21 10:38:37 sentry-docker00.cs.umd.edu systemd-udevd[659942]: Could not generate persistent MAC address for veth03cef34: No such file or directory
Aug 21 10:38:37 sentry-docker00.cs.umd.edu systemd-udevd[659954]: Could not generate persistent MAC address for vethb51d986: No such file or directory
Aug 21 10:38:37 sentry-docker00.cs.umd.edu systemd-udevd[659937]: Could not generate persistent MAC address for veth010f14a: No such file or directory
Aug 21 10:38:37 sentry-docker00.cs.umd.edu systemd-udevd[659938]: Could not generate persistent MAC address for veth92126b2: No such file or directory
Aug 21 10:58:45 sentry-docker00.cs.umd.edu systemd-udevd[669266]: link_config: could not get ethtool features for veth010f14a
Aug 21 10:58:45 sentry-docker00.cs.umd.edu systemd-udevd[669266]: Could not set offload features of veth010f14a: No such device
Aug 21 10:58:45 sentry-docker00.cs.umd.edu systemd-udevd[669314]: Could not generate persistent MAC address for vethdb2c59e: No such file or directory
Aug 21 10:58:45 sentry-docker00.cs.umd.edu systemd-udevd[669315]: Could not generate persistent MAC address for veth24782f3: No such file or directory
... 8 more distinct messages not shown
== strawberry (2 distinct, 8 total) ==
Aug 21 10:09:44 strawberry udisksd[1067]: Error performing housekeeping for drive /org/freedesktop/UDisks2/drives/ST2000DM001_1CH164_W1E8J5KJ: Error updating SMART data: Error sending ATA command CHECK POWER MODE: Unexpected sense data returned:#0120000: 00 00 00 00 00 00 00 00 00 00 00 00 00 00 00 00 ................#0120010: 00 00 00 00 00 00 00 00 00 00 00 00 00 00 00 00 ................#012 (g-io-error-quark, 0) [x6]
Aug 21 10:34:42 strawberry smartd[5314]: Device: /dev/sda [SAT], failed to read SMART Attribute Data [x2]
== zebatinsky.cs.umd.edu (1 distinct, 1 total) ==
Aug 21 10:50:14 zebatinsky.cs.umd.edu setroubleshoot[697123]: SELinux is preventing pdns/comm-main from name_bind access on the udp_socket port 16514. For complete SELinux messages run: sealert -l d9886900-6794-4791-81d0-2ebdb3459096
1
0