Command: /usr/local/sbin/syslog-digest.py
Time : 0.0518s
Status : exited 0
Output :
Syslog digest — 2026-09-14 13:05 EDT
Processed 2,532 lines, filtered 1,993 (78%). 539 unknown (283 distinct) from 19 host(s).
== b0b02.cs.umd.edu (1 distinct, 1 total) ==
Sep 14 12:43:25 b0b02.cs.umd.edu rustdesk[1052905]: cannot open display:
== csfw00a (2 distinct, 113 total) ==
Sep 14 12:04:53 csfw00a ospf6d[1477]: [EC 100663307] Could not send entire message [x4]
Sep 14 12:04:53 csfw00a kernel: bnxt_en 0000:09:00.0 eth3: NIC Link is Down [x109]
== galax (3 distinct, 3 total) ==
Sep 14 12:10:28 galax kernel: workqueue: dm_irq_work_func [amdgpu] hogged CPU for >10000us 67 times, consider switching to WQ_UNBOUND
Sep 14 12:22:00 galax kernel: workqueue: dm_irq_work_func [amdgpu] hogged CPU for >10000us 131 times, consider switching to WQ_UNBOUND
Sep 14 12:45:05 galax kernel: workqueue: dm_irq_work_func [amdgpu] hogged CPU for >10000us 259 times, consider switching to WQ_UNBOUND
== gle-dind04 (1 distinct, 1 total) ==
Sep 14 12:47:41 gle-dind04 lldpd[22022]: unable to send packet on real device for veth6e51c68: No such device or address
== hackerman (220 distinct, 227 total) ==
Sep 14 13:01:19 hackerman goa-identity-se[3173509]: GoaKerberosIdentityManager: Using polling for change notification for credential cache type 'KCM'
Sep 14 13:01:19 hackerman vmware-user.desktop[3173644]: vmware-user: could not open /proc/fs/vmblock/dev
Sep 14 13:01:20 hackerman gsd-usb-protect[3173611]: Failed to fetch USBGuard parameters: GDBus.Error:org.freedesktop.DBus.Error.ServiceUnknown: The name is not activatable
Sep 14 13:01:26 hackerman gsd-color[1121204]: failed to create profile from EDID data: failed to save ICC file: Error opening file “/adminhomes/jzhou131/.local/share/icc/edid-91865d454fc91ab61a1a10410ce6fc90.icc”: Permission denied [x3]
Sep 14 13:01:27 hackerman gsd-color[1121204]: failed to connect to device: Failed to connect to missing device /org/freedesktop/ColorManager/devices/xrandr_Dell_Inc__DELL_U2312HM_2GFKN2CAC4NL_gdm_42
Sep 14 13:01:42 hackerman gnome-software[3173565]: Kind change on net.launchpad.Gnuclad from console-application to desktop-application is not OK
Sep 14 13:01:44 hackerman gnome-software[3173565]: Kind change on io.github.sil_car.SqueezeVid from console-application to desktop-application is not OK
Sep 14 13:01:45 hackerman gnome-software[3173565]: Kind change on net.mkiol.SpeechNote.Addon.amd from addon to runtime is not OK
Sep 14 13:01:45 hackerman gnome-software[3173565]: Kind change on net.mkiol.SpeechNote.Addon.nvidia from addon to runtime is not OK
Sep 14 13:01:45 hackerman gnome-software[3173565]: Kind change on org.videolan.VLC.Plugin.pause_click from addon to runtime is not OK
Sep 14 13:01:47 hackerman gnome-software[3173565]: Kind change on org.nuspell.Nuspell from console-application to desktop-application is not OK
Sep 14 13:01:48 hackerman gnome-software[3173565]: Kind change on com.github.ilai_deutel.kibi from console-application to desktop-application is not OK
Sep 14 13:01:49 hackerman gnome-software[3173565]: Kind change on dev.paullee.scraterpreter.Scrape from console-application to desktop-application is not OK
Sep 14 13:01:49 hackerman gnome-software[3173565]: Kind change on dev.paullee.scraterpreter.Scrapec from console-application to desktop-application is not OK
Sep 14 13:01:49 hackerman gnome-software[3173565]: Kind change on fr.inria.corese.CoreseCommand from console-application to desktop-application is not OK
Sep 14 13:01:49 hackerman gnome-software[3173565]: Kind change on io.github.erkin.ponysay from console-application to desktop-application is not OK
Sep 14 13:01:51 hackerman gnome-software[3173565]: Kind change on net.imaginaryinfinity.Squiid from console-application to desktop-application is not OK
Sep 14 13:01:51 hackerman gnome-software[3173565]: Kind change on org.asamk.SignalCli from console-application to desktop-application is not OK
Sep 14 13:01:51 hackerman gnome-software[3173565]: Kind change on org.eu.wabarc.wayback from console-application to desktop-application is not OK
Sep 14 13:01:53 hackerman gnome-software[3173565]: Kind change on com.jeffser.Alpaca.Plugins.AMD from addon to runtime is not OK
Sep 14 13:01:53 hackerman gnome-software[3173565]: Kind change on com.jeffser.Alpaca.Plugins.Ollama from addon to runtime is not OK
Sep 14 13:01:53 hackerman gnome-software[3173565]: Kind change on com.sublimetext.three.DevUtils from addon to runtime is not OK [x4]
Sep 14 13:01:53 hackerman gnome-software[3173565]: Kind change on com.valvesoftware.Steam.Utility.slonfig from addon to runtime is not OK
Sep 14 13:01:58 hackerman gnome-software[3173565]: Kind change on com.valvesoftware.Steam.Utility.InhibitScreensaver from addon to runtime is not OK
Sep 14 13:01:58 hackerman gnome-software[3173565]: Kind change on com.valvesoftware.Steam.Utility.steamtinkerlaunch from addon to runtime is not OK
Sep 14 13:01:58 hackerman gnome-software[3173565]: Kind change on io.github.theforceengine.tfe.Debug from addon to generic is not OK
Sep 14 13:01:58 hackerman gnome-software[3173565]: Kind change on io.github.theforceengine.tfe.Mod.AdjustableHud from addon to runtime is not OK
Sep 14 13:01:58 hackerman gnome-software[3173565]: Kind change on chat.iamb.iamb from console-application to desktop-application is not OK
Sep 14 13:01:59 hackerman falcon-sensor-bpf[896]: CrowdStrike(4): Could not retrieve DisableProxy value: c0000225
Sep 14 13:01:59 hackerman falcon-sensor-bpf[896]: CrowdStrike(4): ConnectWithProxy: Unable to get application proxy host from CsConfig: c0000225
... 190 more distinct messages not shown
== hazfs.cs.umd.edu (1 distinct, 2 total) ==
Sep 14 12:25:02 hazfs.cs.umd.edu pcp[1763386]: pmlogger_daily failed - see /var/log/pcp/pmlogger/pmlogger_daily-K.log [x2]
== idm00 (1 distinct, 1 total) ==
Sep 14 12:53:54 idm00 named[4166701]: client @0x7f11a406bb48 10.73.240.42#51444: update '73.10.in-addr.arpa/IN' denied
== idmp0 (1 distinct, 1 total) ==
Sep 14 12:37:38 idmp0 named[1598691]: client @0x7f2d2c0368e8 10.73.240.43#60886: update '73.10.in-addr.arpa/IN' denied
== itmon02 (1 distinct, 50 total) ==
Sep 14 12:08:04 itmon02 sshd[1750555]: error: beginning MaxStartups throttling [x50]
== krispykreme.cs.umd.edu (1 distinct, 1 total) ==
Sep 14 12:48:41 krispykreme.cs.umd.edu sshd-session[2074456]: error: send_error: write: Connection reset by peer
== newhonors2 (1 distinct, 24 total) ==
Sep 14 12:13:02 newhonors2 dhcpcd[2631090]: dhcpcd is not running [x24]
== outbound00.cs.umd.edu (2 distinct, 7 total) ==
Sep 14 12:09:09 outbound00.cs.umd.edu python3[4185590]: ldapdb [x6]
Sep 14 12:29:24 outbound00.cs.umd.edu krb5_child[4190736]: Preauthentication failed
== outbound01.cs.umd.edu (1 distinct, 6 total) ==
Sep 14 12:13:06 outbound01.cs.umd.edu python3[2250508]: ldapdb [x6]
== sentry-docker00.cs.umd.edu (36 distinct, 36 total) ==
Sep 14 12:17:48 sentry-docker00.cs.umd.edu systemd-udevd[233948]: link_config: could not get ethtool features for veth3771cdd
Sep 14 12:17:48 sentry-docker00.cs.umd.edu systemd-udevd[233948]: Could not set offload features of veth3771cdd: No such device
Sep 14 12:17:48 sentry-docker00.cs.umd.edu systemd-udevd[233980]: Could not generate persistent MAC address for vethef4421c: No such file or directory
Sep 14 12:17:48 sentry-docker00.cs.umd.edu systemd-udevd[233981]: Could not generate persistent MAC address for veth65a5370: No such file or directory
Sep 14 12:17:48 sentry-docker00.cs.umd.edu systemd-udevd[233984]: Could not generate persistent MAC address for veth634e637: No such file or directory
Sep 14 12:17:48 sentry-docker00.cs.umd.edu systemd-udevd[233988]: Could not generate persistent MAC address for vethf7cadc6: No such file or directory
Sep 14 12:17:48 sentry-docker00.cs.umd.edu systemd-udevd[234008]: Could not generate persistent MAC address for veth12467d1: No such file or directory
Sep 14 12:17:48 sentry-docker00.cs.umd.edu systemd-udevd[234009]: Could not generate persistent MAC address for veth4f1337e: No such file or directory
Sep 14 12:17:48 sentry-docker00.cs.umd.edu systemd-udevd[234027]: Could not generate persistent MAC address for veth717876f: No such file or directory
Sep 14 12:17:48 sentry-docker00.cs.umd.edu systemd-udevd[234033]: Could not generate persistent MAC address for veth5540b58: No such file or directory
Sep 14 12:17:48 sentry-docker00.cs.umd.edu systemd-udevd[234036]: Could not generate persistent MAC address for veth4d2ff41: No such file or directory
Sep 14 12:17:48 sentry-docker00.cs.umd.edu systemd-udevd[234037]: Could not generate persistent MAC address for veth22495bd: No such file or directory
Sep 14 12:37:56 sentry-docker00.cs.umd.edu systemd-udevd[243330]: link_config: could not get ethtool features for veth4d2ff41
Sep 14 12:37:56 sentry-docker00.cs.umd.edu systemd-udevd[243330]: Could not set offload features of veth4d2ff41: No such device
Sep 14 12:37:56 sentry-docker00.cs.umd.edu systemd-udevd[243395]: Could not generate persistent MAC address for veth638de6f: No such file or directory
Sep 14 12:37:56 sentry-docker00.cs.umd.edu systemd-udevd[243396]: Could not generate persistent MAC address for veth22955c6: No such file or directory
Sep 14 12:37:56 sentry-docker00.cs.umd.edu systemd-udevd[243399]: Could not generate persistent MAC address for vethf09e7b3: No such file or directory
Sep 14 12:37:56 sentry-docker00.cs.umd.edu systemd-udevd[243396]: Could not generate persistent MAC address for veth1f2ea5b: No such file or directory
Sep 14 12:37:56 sentry-docker00.cs.umd.edu systemd-udevd[243403]: Could not generate persistent MAC address for veth1f11729: No such file or directory
Sep 14 12:37:56 sentry-docker00.cs.umd.edu systemd-udevd[243408]: Could not generate persistent MAC address for veth39394c0: No such file or directory
Sep 14 12:37:56 sentry-docker00.cs.umd.edu systemd-udevd[243426]: Could not generate persistent MAC address for veth8bca0d8: No such file or directory
Sep 14 12:37:56 sentry-docker00.cs.umd.edu systemd-udevd[243427]: Could not generate persistent MAC address for veth64cefde: No such file or directory
Sep 14 12:37:56 sentry-docker00.cs.umd.edu systemd-udevd[243481]: Could not generate persistent MAC address for veth1f57853: No such file or directory
Sep 14 12:37:56 sentry-docker00.cs.umd.edu systemd-udevd[243485]: Could not generate persistent MAC address for vethe93653d: No such file or directory
Sep 14 12:58:04 sentry-docker00.cs.umd.edu systemd-udevd[252768]: link_config: could not get ethtool features for veth1f11729
Sep 14 12:58:04 sentry-docker00.cs.umd.edu systemd-udevd[252768]: Could not set offload features of veth1f11729: No such device
Sep 14 12:58:05 sentry-docker00.cs.umd.edu systemd-udevd[252882]: Could not generate persistent MAC address for veth4db17d7: No such file or directory
Sep 14 12:58:05 sentry-docker00.cs.umd.edu systemd-udevd[252883]: Could not generate persistent MAC address for veth6a9c67b: No such file or directory
Sep 14 12:58:05 sentry-docker00.cs.umd.edu systemd-udevd[252886]: Could not generate persistent MAC address for veth825b22e: No such file or directory
Sep 14 12:58:05 sentry-docker00.cs.umd.edu systemd-udevd[252887]: Could not generate persistent MAC address for veth005fa77: No such file or directory
... 6 more distinct messages not shown
== strawberry (7 distinct, 38 total) ==
Sep 14 12:07:03 strawberry kernel: I/O error, dev sda, sector 206848 op 0x0:(READ) flags 0x80700 phys_seg 1 prio class 2 [x6]
Sep 14 12:07:03 strawberry kernel: I/O error, dev sda, sector 206848 op 0x0:(READ) flags 0x0 phys_seg 1 prio class 2 [x6]
Sep 14 12:07:03 strawberry kernel: Buffer I/O error on dev sda2, logical block 0, async page read [x6]
Sep 14 12:07:03 strawberry kernel: I/O error, dev sda, sector 2048 op 0x0:(READ) flags 0x80700 phys_seg 1 prio class 2 [x6]
Sep 14 12:07:03 strawberry kernel: I/O error, dev sda, sector 2048 op 0x0:(READ) flags 0x0 phys_seg 1 prio class 2 [x6]
Sep 14 12:07:03 strawberry kernel: Buffer I/O error on dev sda1, logical block 0, async page read [x6]
Sep 14 12:34:42 strawberry smartd[5314]: Device: /dev/sda [SAT], failed to read SMART Attribute Data [x2]
== submit26-b9-f1 (1 distinct, 5 total) ==
Sep 14 12:23:36 submit26-b9-f1 systemd[1]: user(a)1001.service: Main process exited, code=killed, status=9/KILL [x5]
== submit26-b9-f2 (1 distinct, 7 total) ==
Sep 14 12:19:55 submit26-b9-f2 systemd[1]: user(a)1001.service: Main process exited, code=killed, status=9/KILL [x7]
== submit26-b9-f3 (1 distinct, 10 total) ==
Sep 14 12:05:05 submit26-b9-f3 systemd[1]: user(a)1001.service: Main process exited, code=killed, status=9/KILL [x10]
== submit26-b9-f4 (1 distinct, 6 total) ==
Sep 14 12:05:47 submit26-b9-f4 systemd[1]: user(a)1001.service: Main process exited, code=killed, status=9/KILL [x6]
1
0
Command: /usr/local/sbin/syslog-digest.py
Time : 2.6901s
Status : exited 0
Output :
Syslog digest — 2026-09-14 12:05 EDT
Processed 32,254 lines, filtered 2,260 (7%). 29,994 unknown (29378 distinct) from 19 host(s).
== b0b02.cs.umd.edu (1 distinct, 1 total) ==
Sep 14 11:43:21 b0b02.cs.umd.edu rustdesk[1037591]: cannot open display:
== biggulp.cs.umd.edu (1 distinct, 1 total) ==
Sep 14 11:41:46 biggulp.cs.umd.edu sshd-session[1248942]: pam_access(sshd:auth): access denied for user `profk' from `71.191.192.56'
== borealis (127 distinct, 268 total) ==
Sep 14 11:47:19 borealis goa-identity-se[1873941]: GoaKerberosIdentityManager: Using polling for change notification for credential cache type 'KCM'
Sep 14 11:47:19 borealis vmware-user.desktop[1874078]: vmware-user: could not open /proc/fs/vmblock/dev
Sep 14 11:47:19 borealis gsd-usb-protect[1874046]: Failed to fetch USBGuard parameters: GDBus.Error:org.freedesktop.DBus.Error.ServiceUnknown: The name is not activatable
Sep 14 11:47:21 borealis gsd-color[1873981]: failed to connect to device: Failed to connect to missing device /org/freedesktop/ColorManager/devices/xrandr_Dell_Inc__DELL_U2412M_7WFG152E149L_gdm_42
Sep 14 11:47:21 borealis gsd-color[1873981]: failed to connect to device: Failed to connect to missing device /org/freedesktop/ColorManager/devices/xrandr_Dell_Inc__DELL_U2412M_4V35D7133HNU_gdm_42
Sep 14 11:47:21 borealis gnome-software[1874084]: Only 0 apps for recent list, hiding [x3]
Sep 14 11:47:30 borealis packagekitd[1873962]: Failed to get cache filename for chromium [x3]
Sep 14 11:47:30 borealis packagekitd[1873962]: Failed to get cache filename for chromium-common [x2]
Sep 14 11:47:30 borealis packagekitd[1873962]: Failed to get cache filename for dkms [x2]
Sep 14 11:47:30 borealis packagekitd[1873962]: Failed to get cache filename for openbao [x2]
Sep 14 11:47:30 borealis packagekitd[1873962]: Failed to get cache filename for gum [x2]
Sep 14 11:47:30 borealis packagekitd[1873962]: Failed to get cache filename for vault [x2]
Sep 14 11:47:30 borealis packagekitd[1873962]: Failed to get cache filename for egl-gbm [x2]
Sep 14 11:47:30 borealis packagekitd[1873962]: Failed to get cache filename for egl-wayland [x2]
Sep 14 11:47:30 borealis packagekitd[1873962]: Failed to get cache filename for egl-x11 [x2]
Sep 14 11:47:30 borealis packagekitd[1873962]: Failed to get cache filename for pcp [x2]
Sep 14 11:47:30 borealis packagekitd[1873962]: Failed to get cache filename for pcp-conf [x2]
Sep 14 11:47:30 borealis packagekitd[1873962]: Failed to get cache filename for pcp-doc [x2]
Sep 14 11:47:30 borealis packagekitd[1873962]: Failed to get cache filename for pcp-libs [x2]
Sep 14 11:47:30 borealis packagekitd[1873962]: Failed to get cache filename for pcp-pmda-dm [x2]
Sep 14 11:47:30 borealis packagekitd[1873962]: Failed to get cache filename for pcp-pmda-nfsclient [x2]
Sep 14 11:47:30 borealis packagekitd[1873962]: Failed to get cache filename for pcp-pmda-openmetrics [x2]
Sep 14 11:47:30 borealis packagekitd[1873962]: Failed to get cache filename for pcp-selinux [x2]
Sep 14 11:47:30 borealis packagekitd[1873962]: Failed to get cache filename for pcp-system-tools [x2]
Sep 14 11:47:30 borealis packagekitd[1873962]: Failed to get cache filename for pcp-zeroconf [x2]
Sep 14 11:47:30 borealis packagekitd[1873962]: Failed to get cache filename for python3-pcp [x2]
Sep 14 11:47:30 borealis packagekitd[1873962]: Failed to get cache filename for gstreamer1-plugins-bad-free [x3]
Sep 14 11:47:30 borealis packagekitd[1873962]: Failed to get cache filename for gstreamer1-plugins-bad-free-libs [x2]
Sep 14 11:47:30 borealis packagekitd[1873962]: Failed to get cache filename for gstreamer1-plugins-ugly-free [x3]
Sep 14 11:47:30 borealis packagekitd[1873962]: Failed to get cache filename for java-17-openjdk [x2]
... 97 more distinct messages not shown
== csfw00a (1 distinct, 113 total) ==
Sep 14 11:04:01 csfw00a kernel: bnxt_en 0000:09:00.0 eth3: NIC Link is Down [x113]
== galax (29191 distinct, 29432 total) ==
Sep 14 11:11:41 galax update-notifier[91974]: failed to commit changes to dconf: GDBus.Error:org.gtk.GDBus.UnmappedGError.Quark._g_2dfile_2derror_2dquark.Code4: Failed to create file “/fs/junkfood/rztao/.config/dconf/user.20RXV3”: No such file or directory
Sep 14 11:21:41 galax update-notifier[91974]: failed to commit changes to dconf: GDBus.Error:org.gtk.GDBus.UnmappedGError.Quark._g_2dfile_2derror_2dquark.Code4: Failed to create file “/fs/junkfood/rztao/.config/dconf/user.C7CXV3”: No such file or directory
Sep 14 11:25:16 galax org.gnome.Nautilus[103882]: Unable to initialize tag manager: Could not create database directory [x2]
Sep 14 11:25:17 galax org.freedesktop.FileManager1[103 Failed to create /fs/junkfood for shader cache (Permission denied)---disabling. [x2]
Sep 14 11:25:17 galax org.gnome.Nautilus[103882]: failed to commit changes to dconf: GDBus.Error:org.gtk.GDBus.UnmappedGError.Quark._g_2dfile_2derror_2dquark.Code4: Failed to create file “/fs/junkfood/rztao/.config/dconf/user.M0JQV3”: No such file or directory
Sep 14 11:25:17 galax org.gnome.Nautilus[103882]: failed to commit changes to dconf: GDBus.Error:org.gtk.GDBus.UnmappedGError.Quark._g_2dfile_2derror_2dquark.Code4: Failed to create file “/fs/junkfood/rztao/.config/dconf/user.F7DQV3”: No such file or directory
Sep 14 11:25:22 galax ptyxis[103971]: failed to commit changes to dconf: GDBus.Error:org.gtk.GDBus.UnmappedGError.Quark._g_2dfile_2derror_2dquark.Code4: Failed to create file “/fs/junkfood/rztao/.config/dconf/user.4PLFV3”: No such file or directory
Sep 14 11:25:22 galax ptyxis[103971]: failed to commit changes to dconf: GDBus.Error:org.gtk.GDBus.UnmappedGError.Quark._g_2dfile_2derror_2dquark.Code4: Failed to create file “/fs/junkfood/rztao/.config/dconf/user.7FLFV3”: No such file or directory
Sep 14 11:25:22 galax ptyxis[103971]: void vte_terminal_set_size(VteTerminal*, long int, long int): assertion 'columns >= 1' failed [x2]
Sep 14 11:25:33 galax ptyxis[103971]: Failed to create pipeline cache directory [x2]
Sep 14 11:25:55 galax ptyxis[103971]: Failed to save session state: Error opening file “/fs/junkfood/rztao/.config/org.gnome.Ptyxis/session.gvariant”: No such file or directory [x2]
Sep 14 11:25:55 galax ptyxis[103971]: failed to commit changes to dconf: GDBus.Error:org.gtk.GDBus.UnmappedGError.Quark._g_2dfile_2derror_2dquark.Code4: Failed to create file “/fs/junkfood/rztao/.config/dconf/user.1POHV3”: No such file or directory
Sep 14 11:25:55 galax ptyxis[103971]: failed to commit changes to dconf: GDBus.Error:org.gtk.GDBus.UnmappedGError.Quark._g_2dfile_2derror_2dquark.Code4: Failed to create file “/fs/junkfood/rztao/.config/dconf/user.U6VHV3”: No such file or directory
Sep 14 11:26:10 galax gnome-control-center[104448]: The resource style-dark.css is deprecated and shouldn't be used anymore. Use style.css with media queries instead.
Sep 14 11:26:10 galax gnome-control-center[104448]: The resource style-hc.css is deprecated and shouldn't be used anymore. Use style.css with media queries instead.
Sep 14 11:26:10 galax org.gnome.Settings[104448]: Failed to create /fs/junkfood for shader cache (Permission denied)---disabling. [x8]
Sep 14 11:26:10 galax gnome-control-center[104448]: failed to commit changes to dconf: GDBus.Error:org.gtk.GDBus.UnmappedGError.Quark._g_2dfile_2derror_2dquark.Code4: Failed to create file “/fs/junkfood/rztao/.config/dconf/user.C4FUV3”: No such file or directory
Sep 14 11:26:15 galax gnome-control-center[104448]: failed to commit changes to dconf: GDBus.Error:org.gtk.GDBus.UnmappedGError.Quark._g_2dfile_2derror_2dquark.Code4: Failed to create file “/fs/junkfood/rztao/.config/dconf/user.WSOLV3”: No such file or directory
Sep 14 11:26:27 galax gnome-control-center[104448]: failed to commit changes to dconf: GDBus.Error:org.gtk.GDBus.UnmappedGError.Quark._g_2dfile_2derror_2dquark.Code4: Failed to create file “/fs/junkfood/rztao/.config/dconf/user.UD7QV3”: No such file or directory
Sep 14 11:26:27 galax gnome-control-center[104448]: failed to commit changes to dconf: GDBus.Error:org.gtk.GDBus.UnmappedGError.Quark._g_2dfile_2derror_2dquark.Code4: Failed to create file “/fs/junkfood/rztao/.config/dconf/user.N7CEV3”: No such file or directory
Sep 14 11:26:28 galax gnome-control-center[104448]: failed to commit changes to dconf: GDBus.Error:org.gtk.GDBus.UnmappedGError.Quark._g_2dfile_2derror_2dquark.Code4: Failed to create file “/fs/junkfood/rztao/.config/dconf/user.G40PV3”: No such file or directory
Sep 14 11:26:28 galax gnome-control-center[104448]: failed to commit changes to dconf: GDBus.Error:org.gtk.GDBus.UnmappedGError.Quark._g_2dfile_2derror_2dquark.Code4: Failed to create file “/fs/junkfood/rztao/.config/dconf/user.TN0PV3”: No such file or directory
Sep 14 11:26:28 galax gnome-control-center[104448]: failed to commit changes to dconf: GDBus.Error:org.gtk.GDBus.UnmappedGError.Quark._g_2dfile_2derror_2dquark.Code4: Failed to create file “/fs/junkfood/rztao/.config/dconf/user.UDWPV3”: No such file or directory
Sep 14 11:26:28 galax gnome-control-center[104448]: failed to commit changes to dconf: GDBus.Error:org.gtk.GDBus.UnmappedGError.Quark._g_2dfile_2derror_2dquark.Code4: Failed to create file “/fs/junkfood/rztao/.config/dconf/user.W84PV3”: No such file or directory
Sep 14 11:26:29 galax gnome-control-center[104448]: failed to commit changes to dconf: GDBus.Error:org.gtk.GDBus.UnmappedGError.Quark._g_2dfile_2derror_2dquark.Code4: Failed to create file “/fs/junkfood/rztao/.config/dconf/user.4RQIV3”: No such file or directory
Sep 14 11:26:29 galax gnome-control-center[104448]: failed to commit changes to dconf: GDBus.Error:org.gtk.GDBus.UnmappedGError.Quark._g_2dfile_2derror_2dquark.Code4: Failed to create file “/fs/junkfood/rztao/.config/dconf/user.L5VIV3”: No such file or directory
Sep 14 11:26:30 galax gnome-control-center[104448]: failed to commit changes to dconf: GDBus.Error:org.gtk.GDBus.UnmappedGError.Quark._g_2dfile_2derror_2dquark.Code4: Failed to create file “/fs/junkfood/rztao/.config/dconf/user.VMDFV3”: No such file or directory
Sep 14 11:26:30 galax gnome-control-center[104448]: failed to commit changes to dconf: GDBus.Error:org.gtk.GDBus.UnmappedGError.Quark._g_2dfile_2derror_2dquark.Code4: Failed to create file “/fs/junkfood/rztao/.config/dconf/user.VNEFV3”: No such file or directory
Sep 14 11:26:30 galax gnome-control-center[104448]: failed to commit changes to dconf: GDBus.Error:org.gtk.GDBus.UnmappedGError.Quark._g_2dfile_2derror_2dquark.Code4: Failed to create file “/fs/junkfood/rztao/.config/dconf/user.NLJFV3”: No such file or directory
Sep 14 11:26:31 galax gnome-control-center[104448]: failed to commit changes to dconf: GDBus.Error:org.gtk.GDBus.UnmappedGError.Quark._g_2dfile_2derror_2dquark.Code4: Failed to create file “/fs/junkfood/rztao/.config/dconf/user.7CWVV3”: No such file or directory
... 29161 more distinct messages not shown
== hazfs.cs.umd.edu (1 distinct, 2 total) ==
Sep 14 11:25:01 hazfs.cs.umd.edu pcp[1448262]: pmlogger_daily failed - see /var/log/pcp/pmlogger/pmlogger_daily-K.log [x2]
== idm00 (1 distinct, 1 total) ==
Sep 14 11:53:54 idm00 named[4166701]: client @0x7f11a8045438 10.73.240.42#53367: update '73.10.in-addr.arpa/IN' denied
== idmp0 (1 distinct, 1 total) ==
Sep 14 11:37:38 idmp0 named[1598691]: client @0x7f2d34043a38 10.73.240.43#55827: update '73.10.in-addr.arpa/IN' denied
== itmon02 (1 distinct, 41 total) ==
Sep 14 11:07:54 itmon02 sshd[1750555]: error: beginning MaxStartups throttling [x41]
== newhonors2 (1 distinct, 24 total) ==
Sep 14 11:13:03 newhonors2 dhcpcd[2629249]: dhcpcd is not running [x24]
== orchids (1 distinct, 1 total) ==
Sep 14 11:58:08 orchids krb5_child[1232891]: Preauthentication failed
== outbound00.cs.umd.edu (1 distinct, 6 total) ==
Sep 14 11:09:09 outbound00.cs.umd.edu python3[4171520]: ldapdb [x6]
== outbound01.cs.umd.edu (1 distinct, 6 total) ==
Sep 14 11:13:06 outbound01.cs.umd.edu python3[2236421]: ldapdb [x6]
== sentry-docker00.cs.umd.edu (38 distinct, 38 total) ==
Sep 14 11:17:23 sentry-docker00.cs.umd.edu systemd-udevd[205600]: link_config: could not get ethtool features for veth086a608
Sep 14 11:17:23 sentry-docker00.cs.umd.edu systemd-udevd[205600]: Could not set offload features of veth086a608: No such device
Sep 14 11:17:23 sentry-docker00.cs.umd.edu systemd-udevd[205671]: Could not generate persistent MAC address for veth49463e0: No such file or directory
Sep 14 11:17:23 sentry-docker00.cs.umd.edu systemd-udevd[205670]: Could not generate persistent MAC address for veth2b91fe4: No such file or directory
Sep 14 11:17:23 sentry-docker00.cs.umd.edu systemd-udevd[205674]: Could not generate persistent MAC address for veth73613b9: No such file or directory
Sep 14 11:17:23 sentry-docker00.cs.umd.edu systemd-udevd[205688]: Could not generate persistent MAC address for veth830a90d: No such file or directory
Sep 14 11:17:23 sentry-docker00.cs.umd.edu systemd-udevd[205690]: Could not generate persistent MAC address for veth2837606: No such file or directory
Sep 14 11:17:23 sentry-docker00.cs.umd.edu systemd-udevd[205685]: Could not generate persistent MAC address for veth5358cdc: No such file or directory
Sep 14 11:17:23 sentry-docker00.cs.umd.edu systemd-udevd[205696]: Could not generate persistent MAC address for veth2845701: No such file or directory
Sep 14 11:17:23 sentry-docker00.cs.umd.edu systemd-udevd[205679]: Could not generate persistent MAC address for veth260e867: No such file or directory
Sep 14 11:17:23 sentry-docker00.cs.umd.edu systemd-udevd[205746]: Could not generate persistent MAC address for veth5b26ac5: No such file or directory
Sep 14 11:17:23 sentry-docker00.cs.umd.edu systemd-udevd[205747]: Could not generate persistent MAC address for veth93d2cd4: No such file or directory
Sep 14 11:37:31 sentry-docker00.cs.umd.edu systemd-udevd[215079]: link_config: could not get ethtool features for veth73613b9
Sep 14 11:37:31 sentry-docker00.cs.umd.edu systemd-udevd[215079]: Could not set offload features of veth73613b9: No such device
Sep 14 11:37:31 sentry-docker00.cs.umd.edu systemd-udevd[215132]: Could not generate persistent MAC address for veth0228e8a: No such file or directory
Sep 14 11:37:31 sentry-docker00.cs.umd.edu systemd-udevd[215133]: Could not generate persistent MAC address for vethc8e266e: No such file or directory
Sep 14 11:37:31 sentry-docker00.cs.umd.edu systemd-udevd[215136]: Could not generate persistent MAC address for veth3fb3c63: No such file or directory
Sep 14 11:37:31 sentry-docker00.cs.umd.edu systemd-udevd[215137]: Could not generate persistent MAC address for vethe458af3: No such file or directory
Sep 14 11:37:32 sentry-docker00.cs.umd.edu systemd-udevd[215156]: Could not generate persistent MAC address for veth889ccb3: No such file or directory
Sep 14 11:37:32 sentry-docker00.cs.umd.edu systemd-udevd[215141]: Could not generate persistent MAC address for veth5959156: No such file or directory
Sep 14 11:37:32 sentry-docker00.cs.umd.edu systemd-udevd[215156]: Could not generate persistent MAC address for veth797e6e3: No such file or directory
Sep 14 11:37:32 sentry-docker00.cs.umd.edu systemd-udevd[215141]: Could not generate persistent MAC address for vethf16b633: No such file or directory
Sep 14 11:37:32 sentry-docker00.cs.umd.edu systemd-udevd[215143]: Could not generate persistent MAC address for vethc7a5458: No such file or directory
Sep 14 11:37:32 sentry-docker00.cs.umd.edu systemd-udevd[215157]: Could not generate persistent MAC address for veth5b83565: No such file or directory
Sep 14 11:57:39 sentry-docker00.cs.umd.edu systemd-udevd[224421]: link_config: could not get ethtool features for veth0228e8a
Sep 14 11:57:39 sentry-docker00.cs.umd.edu systemd-udevd[224421]: Could not set offload features of veth0228e8a: No such device
Sep 14 11:57:40 sentry-docker00.cs.umd.edu systemd-udevd[224519]: link_config: could not get ethtool features for veth3fb3c63
Sep 14 11:57:40 sentry-docker00.cs.umd.edu systemd-udevd[224519]: Could not set offload features of veth3fb3c63: No such device
Sep 14 11:57:40 sentry-docker00.cs.umd.edu systemd-udevd[224543]: Could not generate persistent MAC address for veth14e0f83: No such file or directory
Sep 14 11:57:40 sentry-docker00.cs.umd.edu systemd-udevd[224544]: Could not generate persistent MAC address for veth16d4422: No such file or directory
... 8 more distinct messages not shown
== strawberry (7 distinct, 38 total) ==
Sep 14 11:07:03 strawberry kernel: I/O error, dev sda, sector 206848 op 0x0:(READ) flags 0x80700 phys_seg 1 prio class 2 [x6]
Sep 14 11:07:03 strawberry kernel: I/O error, dev sda, sector 206848 op 0x0:(READ) flags 0x0 phys_seg 1 prio class 2 [x6]
Sep 14 11:07:03 strawberry kernel: Buffer I/O error on dev sda2, logical block 0, async page read [x6]
Sep 14 11:07:03 strawberry kernel: I/O error, dev sda, sector 2048 op 0x0:(READ) flags 0x80700 phys_seg 1 prio class 2 [x6]
Sep 14 11:07:03 strawberry kernel: I/O error, dev sda, sector 2048 op 0x0:(READ) flags 0x0 phys_seg 1 prio class 2 [x6]
Sep 14 11:07:03 strawberry kernel: Buffer I/O error on dev sda1, logical block 0, async page read [x6]
Sep 14 11:34:42 strawberry smartd[5314]: Device: /dev/sda [SAT], failed to read SMART Attribute Data [x2]
== submit26-b9-f1 (1 distinct, 8 total) ==
Sep 14 11:18:01 submit26-b9-f1 systemd[1]: user(a)1001.service: Main process exited, code=killed, status=9/KILL [x8]
== submit26-b9-f2 (1 distinct, 4 total) ==
Sep 14 11:18:20 submit26-b9-f2 systemd[1]: user(a)1001.service: Main process exited, code=killed, status=9/KILL [x4]
== submit26-b9-f3 (1 distinct, 4 total) ==
Sep 14 11:11:20 submit26-b9-f3 systemd[1]: user(a)1001.service: Main process exited, code=killed, status=9/KILL [x4]
== submit26-b9-f4 (1 distinct, 5 total) ==
Sep 14 11:06:05 submit26-b9-f4 systemd[1]: user(a)1001.service: Main process exited, code=killed, status=9/KILL [x5]
1
0
Command: /usr/local/sbin/syslog-digest.py
Time : 0.0565s
Status : exited 0
Output :
Syslog digest — 2026-09-14 11:05 EDT
Processed 2,659 lines, filtered 2,037 (76%). 622 unknown (331 distinct) from 22 host(s).
== b0b02.cs.umd.edu (1 distinct, 1 total) ==
Sep 14 10:43:17 b0b02.cs.umd.edu rustdesk[1022424]: cannot open display:
== bigtuna (5 distinct, 5 total) ==
Sep 14 11:00:00 bigtuna gsd-subman[2708136]: g_atomic_ref_count_dec: assertion 'g_atomic_int_get (arc) > 0' failed
Sep 14 11:00:10 bigtuna org.gnome.Shell.desktop[2747579] The XKEYBOARD keymap compiler (xkbcomp) reports:
Sep 14 11:00:10 bigtuna org.gnome.Shell.desktop[2747579] > Warning: Unsupported maximum keycode 708, clipping.
Sep 14 11:00:10 bigtuna org.gnome.Shell.desktop[2747579] > X11 cannot support keycodes above 255.
Sep 14 11:00:10 bigtuna org.gnome.Shell.desktop[2747579] Errors from xkbcomp are not fatal to the X server
== csfw00a (1 distinct, 131 total) ==
Sep 14 10:04:13 csfw00a kernel: bnxt_en 0000:09:00.0 eth3: NIC Link is Down [x131]
== galax (55 distinct, 70 total) ==
Sep 14 10:08:38 galax kernel: workqueue: dm_irq_work_func [amdgpu] hogged CPU for >10000us 2051 times, consider switching to WQ_UNBOUND
Sep 14 10:41:40 galax gsd-keyboard[91886]: Error migrating gtk-im-module: Failed to create file “/fs/junkfood/rztao/.config/.gsd-keyboard.settings-ported.W5AKV3”: No such file or directory
Sep 14 10:41:40 galax evolution-source-registry[91849] failed to commit changes to dconf: GDBus.Error:org.gtk.GDBus.UnmappedGError.Quark._g_2dfile_2derror_2dquark.Code4: Failed to create file “/fs/junkfood/rztao/.config/dconf/user.C6AKV3”: No such file or directory
Sep 14 10:41:40 galax ibus-daemon[91870]: mkdir is failed in: /fs/junkfood/rztao/.cache/ibus: Permission denied [x5]
Sep 14 10:41:40 galax evolution-source-registry[91849] e_cache_reaper_init: Failed to make directory '/fs/junkfood/rztao/.local/share/evolution/addressbook/trash': Error creating directory /fs/junkfood: Permission denied
Sep 14 10:41:40 galax evolution-source-registry[91849] e_cache_reaper_init: Failed to make directory '/fs/junkfood/rztao/.local/share/evolution/calendar/trash': Error creating directory /fs/junkfood: Permission denied
Sep 14 10:41:40 galax evolution-source-registry[91849] e_cache_reaper_init: Failed to make directory '/fs/junkfood/rztao/.local/share/evolution/mail/trash': Error creating directory /fs/junkfood: Permission denied
Sep 14 10:41:40 galax evolution-source-registry[91849] e_cache_reaper_init: Failed to make directory '/fs/junkfood/rztao/.local/share/evolution/memos/trash': Error creating directory /fs/junkfood: Permission denied
Sep 14 10:41:40 galax evolution-source-registry[91849] e_cache_reaper_init: Failed to make directory '/fs/junkfood/rztao/.local/share/evolution/tasks/trash': Error creating directory /fs/junkfood: Permission denied
Sep 14 10:41:40 galax evolution-source-registry[91849] e_cache_reaper_init: Failed to make directory '/fs/junkfood/rztao/.cache/evolution/addressbook/trash': Error creating directory /fs/junkfood: Permission denied
Sep 14 10:41:40 galax evolution-source-registry[91849] e_cache_reaper_init: Failed to make directory '/fs/junkfood/rztao/.cache/evolution/calendar/trash': Error creating directory /fs/junkfood: Permission denied
Sep 14 10:41:40 galax evolution-source-registry[91849] e_cache_reaper_init: Failed to make directory '/fs/junkfood/rztao/.cache/evolution/mail/trash': Error creating directory /fs/junkfood: Permission denied
Sep 14 10:41:40 galax evolution-source-registry[91849] e_cache_reaper_init: Failed to make directory '/fs/junkfood/rztao/.cache/evolution/memos/trash': Error creating directory /fs/junkfood: Permission denied
Sep 14 10:41:40 galax evolution-source-registry[91849] e_cache_reaper_init: Failed to make directory '/fs/junkfood/rztao/.cache/evolution/sources/trash': Error creating directory /fs/junkfood: Permission denied
Sep 14 10:41:40 galax evolution-source-registry[91849] e_cache_reaper_init: Failed to make directory '/fs/junkfood/rztao/.cache/evolution/tasks/trash': Error creating directory /fs/junkfood: Permission denied
Sep 14 10:41:40 galax gsd-keyboard[91886]: Failed to create directory /fs/junkfood/rztao/.local/share/gnome-settings-daemon: Permission denied
Sep 14 10:41:40 galax gsd-keyboard[91886]: g_variant_unref: assertion 'value != NULL' failed
Sep 14 10:41:40 galax gsd-keyboard[91886]: failed to commit changes to dconf: GDBus.Error:org.gtk.GDBus.UnmappedGError.Quark._g_2dfile_2derror_2dquark.Code4: Failed to create file “/fs/junkfood/rztao/.config/dconf/user.UG6KV3”: No such file or directory
Sep 14 10:41:40 galax org.gnome.Shell.Screencast[91853 Failed to create /fs/junkfood for shader cache (Permission denied)---disabling. [x9]
Sep 14 10:41:40 galax evolution-source-registry[91849] Failed to scan '/fs/junkfood/rztao/.local/share/evolution/addressbook': Error opening directory '/fs/junkfood/rztao/.local/share/evolution/addressbook': No such file or directory
Sep 14 10:41:40 galax evolution-source-registry[91849] Failed to scan '/fs/junkfood/rztao/.local/share/evolution/calendar': Error opening directory '/fs/junkfood/rztao/.local/share/evolution/calendar': No such file or directory
Sep 14 10:41:40 galax evolution-source-registry[91849] Failed to scan '/fs/junkfood/rztao/.local/share/evolution/mail': Error opening directory '/fs/junkfood/rztao/.local/share/evolution/mail': No such file or directory
Sep 14 10:41:40 galax evolution-source-registry[91849] Failed to scan '/fs/junkfood/rztao/.local/share/evolution/memos': Error opening directory '/fs/junkfood/rztao/.local/share/evolution/memos': No such file or directory
Sep 14 10:41:40 galax evolution-source-registry[91849] Failed to scan '/fs/junkfood/rztao/.local/share/evolution/tasks': Error opening directory '/fs/junkfood/rztao/.local/share/evolution/tasks': No such file or directory
Sep 14 10:41:40 galax evolution-source-registry[91849] Failed to scan '/fs/junkfood/rztao/.cache/evolution/addressbook': Error opening directory '/fs/junkfood/rztao/.cache/evolution/addressbook': No such file or directory
Sep 14 10:41:40 galax evolution-source-registry[91849] Failed to scan '/fs/junkfood/rztao/.cache/evolution/calendar': Error opening directory '/fs/junkfood/rztao/.cache/evolution/calendar': No such file or directory
Sep 14 10:41:40 galax evolution-source-registry[91849] Failed to scan '/fs/junkfood/rztao/.cache/evolution/mail': Error opening directory '/fs/junkfood/rztao/.cache/evolution/mail': No such file or directory
Sep 14 10:41:40 galax evolution-source-registry[91849] Failed to scan '/fs/junkfood/rztao/.cache/evolution/memos': Error opening directory '/fs/junkfood/rztao/.cache/evolution/memos': No such file or directory
Sep 14 10:41:40 galax evolution-source-registry[91849] Failed to scan '/fs/junkfood/rztao/.cache/evolution/sources': Error opening directory '/fs/junkfood/rztao/.cache/evolution/sources': No such file or directory
Sep 14 10:41:40 galax evolution-source-registry[91849] Failed to scan '/fs/junkfood/rztao/.cache/evolution/tasks': Error opening directory '/fs/junkfood/rztao/.cache/evolution/tasks': No such file or directory
... 25 more distinct messages not shown
== grosh (1 distinct, 1 total) ==
Sep 14 11:00:04 grosh (da-udp.*)[2226805]: amanda-udp-restart.service: Failed at step EXEC spawning /usr/bin/systemctl restart amanda-udp.*: No such file or directory
== hazfs.cs.umd.edu (1 distinct, 2 total) ==
Sep 14 10:25:02 hazfs.cs.umd.edu pcp[1132074]: pmlogger_daily failed - see /var/log/pcp/pmlogger/pmlogger_daily-K.log [x2]
== idm00 (1 distinct, 1 total) ==
Sep 14 10:53:54 idm00 named[4166701]: client @0x7f11980762a8 10.73.240.42#56239: update '73.10.in-addr.arpa/IN' denied
== idmp0 (3 distinct, 3 total) ==
Sep 14 10:37:38 idmp0 named[1598691]: client @0x7f2d2c035088 10.73.240.43#56594: update '73.10.in-addr.arpa/IN' denied
Sep 14 10:39:58 idmp0 named[1598691]: client @0x7f2d48005288 10.73.245.14#58463: update '73.10.in-addr.arpa/IN' denied
Sep 14 10:40:47 idmp0 named[1598691]: client @0x7f2d48026348 10.73.245.14#58463: update '73.10.in-addr.arpa/IN' denied
== inbound00.cs.umd.edu (1 distinct, 1 total) ==
Sep 14 10:33:02 inbound00.cs.umd.edu krb5_child[85941]: Client 'admin(a)UMD.EDU' not found in Kerberos database
== irb2156 (107 distinct, 107 total) ==
Sep 14 11:00:11 irb2156 (da-udp.*)[1130872]: amanda-udp-restart.service: Failed at step EXEC spawning /usr/bin/systemctl restart amanda-udp.*: No such file or directory
Sep 14 11:01:44 irb2156 packagekitd[1131026]: Failed to get cache filename for firefox-nightly
Sep 14 11:01:44 irb2156 packagekitd[1131026]: Failed to get cache filename for cosmic-epoch
Sep 14 11:01:44 irb2156 packagekitd[1131026]: Failed to get cache filename for openssl-devel
Sep 14 11:01:44 irb2156 packagekitd[1131026]: Failed to get cache filename for perl
Sep 14 11:01:44 irb2156 packagekitd[1131026]: Failed to get cache filename for perl-Attribute-Handlers
Sep 14 11:01:44 irb2156 packagekitd[1131026]: Failed to get cache filename for perl-AutoLoader
Sep 14 11:01:44 irb2156 packagekitd[1131026]: Failed to get cache filename for perl-AutoSplit
Sep 14 11:01:44 irb2156 packagekitd[1131026]: Failed to get cache filename for perl-B
Sep 14 11:01:44 irb2156 packagekitd[1131026]: Failed to get cache filename for perl-Benchmark
Sep 14 11:01:44 irb2156 packagekitd[1131026]: Failed to get cache filename for perl-Class-Struct
Sep 14 11:01:44 irb2156 packagekitd[1131026]: Failed to get cache filename for perl-Config-Extensions
Sep 14 11:01:44 irb2156 packagekitd[1131026]: Failed to get cache filename for perl-DBM_Filter
Sep 14 11:01:44 irb2156 packagekitd[1131026]: Failed to get cache filename for perl-Devel-Peek
Sep 14 11:01:44 irb2156 packagekitd[1131026]: Failed to get cache filename for perl-Devel-SelfStubber
Sep 14 11:01:44 irb2156 packagekitd[1131026]: Failed to get cache filename for perl-DirHandle
Sep 14 11:01:44 irb2156 packagekitd[1131026]: Failed to get cache filename for perl-Dumpvalue
Sep 14 11:01:44 irb2156 packagekitd[1131026]: Failed to get cache filename for perl-DynaLoader
Sep 14 11:01:44 irb2156 packagekitd[1131026]: Failed to get cache filename for perl-English
Sep 14 11:01:44 irb2156 packagekitd[1131026]: Failed to get cache filename for perl-Errno
Sep 14 11:01:44 irb2156 packagekitd[1131026]: Failed to get cache filename for perl-ExtUtils-Constant
Sep 14 11:01:44 irb2156 packagekitd[1131026]: Failed to get cache filename for perl-ExtUtils-Embed
Sep 14 11:01:44 irb2156 packagekitd[1131026]: Failed to get cache filename for perl-ExtUtils-Miniperl
Sep 14 11:01:44 irb2156 packagekitd[1131026]: Failed to get cache filename for perl-Fcntl
Sep 14 11:01:44 irb2156 packagekitd[1131026]: Failed to get cache filename for perl-File-Basename
Sep 14 11:01:44 irb2156 packagekitd[1131026]: Failed to get cache filename for perl-File-Compare
Sep 14 11:01:44 irb2156 packagekitd[1131026]: Failed to get cache filename for perl-File-Copy
Sep 14 11:01:44 irb2156 packagekitd[1131026]: Failed to get cache filename for perl-File-DosGlob
Sep 14 11:01:44 irb2156 packagekitd[1131026]: Failed to get cache filename for perl-File-Find
Sep 14 11:01:44 irb2156 packagekitd[1131026]: Failed to get cache filename for perl-File-stat
... 77 more distinct messages not shown
== itmon02 (1 distinct, 37 total) ==
Sep 14 10:07:50 itmon02 sshd[1750555]: error: beginning MaxStartups throttling [x37]
== newhonors2 (1 distinct, 24 total) ==
Sep 14 10:13:03 newhonors2 dhcpcd[2627376]: dhcpcd is not running [x24]
== nightingale (85 distinct, 104 total) ==
Sep 14 10:43:18 nightingale org.gnome.Shell.desktop[765098]: libinput error: client bug: timer event6 debounce: scheduled expiry is in the past (-163ms), your system is too slow
Sep 14 10:43:18 nightingale org.gnome.Shell.desktop[765098]: libinput error: client bug: timer event6 debounce: scheduled expiry is in the past (-275ms), your system is too slow
Sep 14 10:43:18 nightingale org.gnome.Shell.desktop[765098]: libinput error: client bug: timer event6 debounce short: scheduled expiry is in the past (-288ms), your system is too slow
Sep 14 10:43:18 nightingale org.gnome.Shell.desktop[765098]: libinput error: client bug: timer event6 debounce: scheduled expiry is in the past (-225ms), your system is too slow
Sep 14 10:43:18 nightingale org.gnome.Shell.desktop[765098]: libinput error: client bug: timer event6 debounce: scheduled expiry is in the past (-131ms), your system is too slow
Sep 14 10:43:18 nightingale org.gnome.Shell.desktop[765098]: libinput error: client bug: timer event6 debounce short: scheduled expiry is in the past (-144ms), your system is too slow
Sep 14 10:44:45 nightingale gsd-housekeepin[765259]: Error releasing name org.gnome.SettingsDaemon.Housekeeping: The connection is closed
Sep 14 10:44:45 nightingale gsd-rfkill[765230]: Error releasing name org.gnome.SettingsDaemon.Rfkill: The connection is closed
Sep 14 10:44:46 nightingale gsd-color[731446]: failed to connect to device: Failed to connect to missing device /org/freedesktop/ColorManager/devices/xrandr_Acer_Technologies_B246WL_T1ZAA0012420_gdm_42
Sep 14 10:44:56 nightingale goa-identity-se[1610075]: GoaKerberosIdentityManager: Using polling for change notification for credential cache type 'KCM'
Sep 14 10:44:58 nightingale vmware-user.desktop[1610222]: vmware-user: could not open /proc/fs/vmblock/dev
Sep 14 10:44:59 nightingale gsd-usb-protect[1610124]: Failed to fetch USBGuard parameters: GDBus.Error:org.freedesktop.DBus.Error.ServiceUnknown: The name is not activatable
Sep 14 10:45:13 nightingale PanGPUI[1610168]: QObject::connect: No such slot PanGPUIWebDialog::onReload()
Sep 14 10:45:13 nightingale PanGPUI[1610168]: Setting a QCompleter on non-editable QComboBox is not allowed.
Sep 14 10:45:13 nightingale PanGPUI[1610168]: QLayout: Attempting to add QLayout "" to ConnectionsTab "", which already has a layout [x5]
Sep 14 10:45:13 nightingale PanGPUI[1610168]: QLayout: Attempting to add QLayout "" to TroubleShootingTab "", which already has a layout
Sep 14 10:45:13 nightingale PanGPUI[1610168]: QLayout: Attempting to add QLayout "" to PanGPUIFedMandateDialog "", which already has a layout
Sep 14 10:45:13 nightingale PanGPUI[1610168]: QLayout: Attempting to add QLayout "" to PanGPUIPreferredGwDialog "", which already has a layout
Sep 14 10:45:13 nightingale PanGPUI[1610168]: QLayout: Attempting to add QLayout "" to PanGPUICertSelectDialog "", which already has a layout
Sep 14 10:46:09 nightingale gnome-software[1610156]: Kind change on net.launchpad.Gnuclad from console-application to desktop-application is not OK
Sep 14 10:46:11 nightingale gnome-software[1610156]: Kind change on io.github.sil_car.SqueezeVid from console-application to desktop-application is not OK
Sep 14 10:46:12 nightingale gnome-software[1610156]: Kind change on net.mkiol.SpeechNote.Addon.amd from addon to runtime is not OK
Sep 14 10:46:12 nightingale gnome-software[1610156]: Kind change on net.mkiol.SpeechNote.Addon.nvidia from addon to runtime is not OK
Sep 14 10:46:12 nightingale gnome-software[1610156]: Kind change on org.videolan.VLC.Plugin.pause_click from addon to runtime is not OK
Sep 14 10:47:41 nightingale packagekitd[1610088]: failed to parse public key for /etc/pki/rpm-gpg/RPM-GPG-KEY-PQC-redhat-release
Sep 14 10:48:29 nightingale gnome-software[1610156]: Kind change on org.nuspell.Nuspell from console-application to desktop-application is not OK
Sep 14 10:48:30 nightingale gnome-software[1610156]: Kind change on com.github.ilai_deutel.kibi from console-application to desktop-application is not OK
Sep 14 10:48:31 nightingale gnome-software[1610156]: Kind change on dev.paullee.scraterpreter.Scrape from console-application to desktop-application is not OK
Sep 14 10:48:31 nightingale gnome-software[1610156]: Kind change on dev.paullee.scraterpreter.Scrapec from console-application to desktop-application is not OK
Sep 14 10:48:31 nightingale gnome-software[1610156]: Kind change on fr.inria.corese.CoreseCommand from console-application to desktop-application is not OK
... 55 more distinct messages not shown
== outbound00.cs.umd.edu (1 distinct, 6 total) ==
Sep 14 10:09:09 outbound00.cs.umd.edu python3[4157396]: ldapdb [x6]
== outbound01.cs.umd.edu (1 distinct, 6 total) ==
Sep 14 10:13:06 outbound01.cs.umd.edu python3[2222403]: ldapdb [x6]
== quiss (1 distinct, 1 total) ==
Sep 14 11:00:13 quiss (da-udp.*)[3962843]: amanda-udp-restart.service: Failed at step EXEC spawning /usr/bin/systemctl restart amanda-udp.*: No such file or directory
== sentry-docker00.cs.umd.edu (36 distinct, 36 total) ==
Sep 14 10:16:58 sentry-docker00.cs.umd.edu systemd-udevd[177294]: link_config: could not get ethtool features for veth943a222
Sep 14 10:16:58 sentry-docker00.cs.umd.edu systemd-udevd[177294]: Could not set offload features of veth943a222: No such device
Sep 14 10:16:58 sentry-docker00.cs.umd.edu systemd-udevd[177319]: Could not generate persistent MAC address for vetha46b661: No such file or directory
Sep 14 10:16:58 sentry-docker00.cs.umd.edu systemd-udevd[177320]: Could not generate persistent MAC address for vethf9ce429: No such file or directory
Sep 14 10:16:58 sentry-docker00.cs.umd.edu systemd-udevd[177345]: Could not generate persistent MAC address for vethf4edac6: No such file or directory
Sep 14 10:16:58 sentry-docker00.cs.umd.edu systemd-udevd[177346]: Could not generate persistent MAC address for veth0c2e5df: No such file or directory
Sep 14 10:16:58 sentry-docker00.cs.umd.edu systemd-udevd[177371]: Could not generate persistent MAC address for vethd84d409: No such file or directory
Sep 14 10:16:58 sentry-docker00.cs.umd.edu systemd-udevd[177370]: Could not generate persistent MAC address for veth82236bf: No such file or directory
Sep 14 10:16:58 sentry-docker00.cs.umd.edu systemd-udevd[177399]: Could not generate persistent MAC address for veth8cd5157: No such file or directory
Sep 14 10:16:58 sentry-docker00.cs.umd.edu systemd-udevd[177400]: Could not generate persistent MAC address for veth8e670c4: No such file or directory
Sep 14 10:16:58 sentry-docker00.cs.umd.edu systemd-udevd[177429]: Could not generate persistent MAC address for veth85e5878: No such file or directory
Sep 14 10:16:58 sentry-docker00.cs.umd.edu systemd-udevd[177418]: Could not generate persistent MAC address for veth0a6b0de: No such file or directory
Sep 14 10:37:06 sentry-docker00.cs.umd.edu systemd-udevd[186762]: link_config: could not get ethtool features for vetha46b661
Sep 14 10:37:06 sentry-docker00.cs.umd.edu systemd-udevd[186762]: Could not set offload features of vetha46b661: No such device
Sep 14 10:37:07 sentry-docker00.cs.umd.edu systemd-udevd[186793]: Could not generate persistent MAC address for vethe48d718: No such file or directory
Sep 14 10:37:07 sentry-docker00.cs.umd.edu systemd-udevd[186794]: Could not generate persistent MAC address for veth780e375: No such file or directory
Sep 14 10:37:07 sentry-docker00.cs.umd.edu systemd-udevd[186797]: Could not generate persistent MAC address for vetha500a0f: No such file or directory
Sep 14 10:37:07 sentry-docker00.cs.umd.edu systemd-udevd[186798]: Could not generate persistent MAC address for vetha00237d: No such file or directory
Sep 14 10:37:07 sentry-docker00.cs.umd.edu systemd-udevd[186822]: Could not generate persistent MAC address for veth80741f0: No such file or directory
Sep 14 10:37:07 sentry-docker00.cs.umd.edu systemd-udevd[186821]: Could not generate persistent MAC address for veth6920b2c: No such file or directory
Sep 14 10:37:07 sentry-docker00.cs.umd.edu systemd-udevd[186854]: Could not generate persistent MAC address for veth3fe157a: No such file or directory
Sep 14 10:37:07 sentry-docker00.cs.umd.edu systemd-udevd[186856]: Could not generate persistent MAC address for veth42be73d: No such file or directory
Sep 14 10:37:07 sentry-docker00.cs.umd.edu systemd-udevd[186924]: Could not generate persistent MAC address for veth7f927e7: No such file or directory
Sep 14 10:37:07 sentry-docker00.cs.umd.edu systemd-udevd[186925]: Could not generate persistent MAC address for veth152e43f: No such file or directory
Sep 14 10:57:15 sentry-docker00.cs.umd.edu systemd-udevd[196167]: link_config: could not get ethtool features for vetha500a0f
Sep 14 10:57:15 sentry-docker00.cs.umd.edu systemd-udevd[196167]: Could not set offload features of vetha500a0f: No such device
Sep 14 10:57:15 sentry-docker00.cs.umd.edu systemd-udevd[196203]: Could not generate persistent MAC address for veth6a11447: No such file or directory
Sep 14 10:57:15 sentry-docker00.cs.umd.edu systemd-udevd[196204]: Could not generate persistent MAC address for vethf151335: No such file or directory
Sep 14 10:57:15 sentry-docker00.cs.umd.edu systemd-udevd[196207]: Could not generate persistent MAC address for veth554adc5: No such file or directory
Sep 14 10:57:15 sentry-docker00.cs.umd.edu systemd-udevd[196208]: Could not generate persistent MAC address for vethd638e10: No such file or directory
... 6 more distinct messages not shown
== strawberry (7 distinct, 38 total) ==
Sep 14 10:07:03 strawberry kernel: I/O error, dev sda, sector 206848 op 0x0:(READ) flags 0x80700 phys_seg 1 prio class 2 [x6]
Sep 14 10:07:03 strawberry kernel: I/O error, dev sda, sector 206848 op 0x0:(READ) flags 0x0 phys_seg 1 prio class 2 [x6]
Sep 14 10:07:03 strawberry kernel: Buffer I/O error on dev sda2, logical block 0, async page read [x6]
Sep 14 10:07:03 strawberry kernel: I/O error, dev sda, sector 2048 op 0x0:(READ) flags 0x80700 phys_seg 1 prio class 2 [x6]
Sep 14 10:07:03 strawberry kernel: I/O error, dev sda, sector 2048 op 0x0:(READ) flags 0x0 phys_seg 1 prio class 2 [x6]
Sep 14 10:07:03 strawberry kernel: Buffer I/O error on dev sda1, logical block 0, async page read [x6]
Sep 14 10:34:42 strawberry smartd[5314]: Device: /dev/sda [SAT], failed to read SMART Attribute Data [x2]
== submit26-b9-f1 (10 distinct, 17 total) ==
Sep 14 10:05:06 submit26-b9-f1 systemd[1]: user(a)1001.service: Main process exited, code=killed, status=9/KILL [x8]
Sep 14 10:25:51 submit26-b9-f1 setroubleshoot[1549744]: SELinux is preventing /usr/bin/python3.9 from create access on the directory /(null). For complete SELinux messages run: sealert -l 3ef7d677-731f-46bf-9c34-c2c55fea665c
Sep 14 10:25:51 submit26-b9-f1 setroubleshoot[1549744]: SELinux is preventing /usr/bin/python3.9 from add_name access on the directory /(null). For complete SELinux messages run: sealert -l aa60e26f-72e1-45f1-bc12-aa8b3b669e36
Sep 14 10:25:51 submit26-b9-f1 setroubleshoot[1549744]: SELinux is preventing /usr/bin/python3.9 from create access on the file /(null). For complete SELinux messages run: sealert -l d088fb43-23ee-4ae8-ae6a-5d1c041ee2d6
Sep 14 10:25:51 submit26-b9-f1 setroubleshoot[1549744]: SELinux is preventing /usr/bin/python3.9 from open access on the file /tmp/libdnf.UfzcIM/repodata/repomd.xml. For complete SELinux messages run: sealert -l 3b0d8c9a-6637-4d6e-a864-f1dd7c00377d
Sep 14 10:25:51 submit26-b9-f1 setroubleshoot[1549744]: SELinux is preventing /usr/bin/python3.9 from setattr access on the file repomd.xml. For complete SELinux messages run: sealert -l 0fd3339f-3ef2-45f3-9e58-65a58b42f3ee
Sep 14 10:25:51 submit26-b9-f1 setroubleshoot[1549744]: SELinux is preventing /usr/bin/python3.9 from read access on the directory libdnf.UfzcIM. For complete SELinux messages run: sealert -l 0d661d88-dc9e-469d-986b-52e29b353aa8
Sep 14 10:25:51 submit26-b9-f1 setroubleshoot[1549744]: SELinux is preventing /usr/bin/python3.9 from remove_name access on the directory repomd.xml. For complete SELinux messages run: sealert -l 405a8556-cf9f-4ef4-8525-0dca18d4259d
Sep 14 10:25:51 submit26-b9-f1 setroubleshoot[1549744]: SELinux is preventing /usr/bin/python3.9 from unlink access on the file repomd.xml. For complete SELinux messages run: sealert -l 3c38e23e-3631-4cb5-81c7-992675c836d9
Sep 14 10:25:51 submit26-b9-f1 setroubleshoot[1549744]: SELinux is preventing /usr/bin/python3.9 from rmdir access on the directory repodata. For complete SELinux messages run: sealert -l a070e9b5-2867-47d6-b2e3-3b7d99725848
== submit26-b9-f2 (10 distinct, 18 total) ==
Sep 14 10:06:24 submit26-b9-f2 systemd[1]: user(a)1001.service: Main process exited, code=killed, status=9/KILL [x9]
Sep 14 10:06:46 submit26-b9-f2 setroubleshoot[685600]: SELinux is preventing /usr/bin/python3.9 from create access on the directory /(null). For complete SELinux messages run: sealert -l 0659d546-3107-4f75-b00f-008c85f41dc6
Sep 14 10:06:46 submit26-b9-f2 setroubleshoot[685600]: SELinux is preventing /usr/bin/python3.9 from add_name access on the directory /(null). For complete SELinux messages run: sealert -l 156d9270-3466-4356-b86f-1a128825961a
Sep 14 10:06:46 submit26-b9-f2 setroubleshoot[685600]: SELinux is preventing /usr/bin/python3.9 from create access on the file /(null). For complete SELinux messages run: sealert -l c8a40bf5-2fc4-46b3-b813-8592b3523339
Sep 14 10:06:46 submit26-b9-f2 setroubleshoot[685600]: SELinux is preventing /usr/bin/python3.9 from open access on the file /tmp/libdnf.lDDMgw/repodata/repomd.xml. For complete SELinux messages run: sealert -l 7f4c3a8e-0f99-47c4-9baf-e1336fe24876
Sep 14 10:06:47 submit26-b9-f2 setroubleshoot[685600]: SELinux is preventing /usr/bin/python3.9 from setattr access on the file repomd.xml. For complete SELinux messages run: sealert -l 988123da-b724-4e6a-900c-33a2723fdaf1
Sep 14 10:06:47 submit26-b9-f2 setroubleshoot[685600]: SELinux is preventing /usr/bin/python3.9 from read access on the directory libdnf.lDDMgw. For complete SELinux messages run: sealert -l ca585e2b-d50f-4264-8127-6b3fa04070c8
Sep 14 10:06:47 submit26-b9-f2 setroubleshoot[685600]: SELinux is preventing /usr/bin/python3.9 from remove_name access on the directory repomd.xml. For complete SELinux messages run: sealert -l 3a749560-1cec-40ca-a4dc-596841be3885
Sep 14 10:06:47 submit26-b9-f2 setroubleshoot[685600]: SELinux is preventing /usr/bin/python3.9 from unlink access on the file repomd.xml. For complete SELinux messages run: sealert -l 0aa52f08-94f8-474e-96d8-e818846941af
Sep 14 10:06:47 submit26-b9-f2 setroubleshoot[685600]: SELinux is preventing /usr/bin/python3.9 from rmdir access on the directory repodata. For complete SELinux messages run: sealert -l de019dc4-408f-439c-902a-676d18dfe8e7
== submit26-b9-f3 (1 distinct, 5 total) ==
Sep 14 10:15:05 submit26-b9-f3 systemd[1]: user(a)1001.service: Main process exited, code=killed, status=9/KILL [x5]
== submit26-b9-f4 (1 distinct, 8 total) ==
Sep 14 10:09:23 submit26-b9-f4 systemd[1]: user(a)1001.service: Main process exited, code=killed, status=9/KILL [x8]
1
0
Command: /usr/local/sbin/syslog-digest.py
Time : 0.0447s
Status : exited 0
Output :
Syslog digest — 2026-09-14 10:05 EDT
Processed 1,916 lines, filtered 1,544 (80%). 372 unknown (115 distinct) from 20 host(s).
== atif01.cs.umd.edu (1 distinct, 1 total) ==
Sep 14 09:45:30 atif01.cs.umd.edu kernel: net_ratelimit: 11 callbacks suppressed
== b0b02.cs.umd.edu (2 distinct, 2 total) ==
Sep 14 09:16:12 b0b02.cs.umd.edu systemd[1]: insights-client.service: Start request repeated too quickly.
Sep 14 09:43:14 b0b02.cs.umd.edu rustdesk[1007220]: cannot open display:
== bigtuna (27 distinct, 33 total) ==
Sep 14 09:11:48 bigtuna goa-identity-se[2708003]: GoaKerberosIdentityManager: Using polling for change notification for credential cache type 'KCM'
Sep 14 09:11:49 bigtuna vmware-user.desktop[2708104]: vmware-user: could not open /proc/fs/vmblock/dev
Sep 14 09:11:49 bigtuna gsd-usb-protect[2708138]: Failed to fetch USBGuard parameters: GDBus.Error:org.freedesktop.DBus.Error.ServiceUnknown: The name is not activatable
Sep 14 09:11:51 bigtuna gsd-screensaver[2392418]: Error releasing name org.freedesktop.ScreenSaver: The connection is closed
Sep 14 09:11:51 bigtuna gsd-smartcard[2392405]: Error releasing name org.gnome.SettingsDaemon.Smartcard: The connection is closed
Sep 14 09:11:51 bigtuna gsd-rfkill[2392403]: Error releasing name org.gnome.SettingsDaemon.Rfkill: The connection is closed
Sep 14 09:11:51 bigtuna gsd-color[2708069]: failed to connect to device: Failed to connect to missing device /org/freedesktop/ColorManager/devices/xrandr_Dell_Inc__DELL_P2213_FJ44J3CTBTNM_gdm_42
Sep 14 09:11:51 bigtuna gsd-color[2708069]: failed to connect to device: Failed to connect to missing device /org/freedesktop/ColorManager/devices/xrandr_Dell_Inc__DELL_P2314H_7R1K347HA1US_gdm_42
Sep 14 09:11:51 bigtuna gsd-color[2708069]: failed to connect to device: Failed to connect to missing device /org/freedesktop/ColorManager/devices/xrandr_BenQ_Corporation_BenQ_XL2730Z_26G04807SL0_gdm_42
Sep 14 09:11:54 bigtuna gnome-software[2708103]: Only 0 apps for recent list, hiding [x3]
Sep 14 09:12:05 bigtuna packagekitd[2708042]: Failed to get cache filename for gum
Sep 14 09:12:05 bigtuna packagekitd[2708042]: Failed to get cache filename for vault
Sep 14 09:12:05 bigtuna packagekitd[2708042]: Failed to get cache filename for chromium [x2]
Sep 14 09:12:05 bigtuna packagekitd[2708042]: Failed to get cache filename for chromium-common
Sep 14 09:12:05 bigtuna packagekitd[2708042]: Failed to get cache filename for openbao
Sep 14 09:12:05 bigtuna packagekitd[2708042]: Failed to get cache filename for openvox-agent
Sep 14 09:12:28 bigtuna packagekitd[2708042]: failed to parse public key for /etc/pki/rpm-gpg/RPM-GPG-KEY-PQC-redhat-release [x4]
Sep 14 09:13:03 bigtuna packagekitd[2708042]: Failed to get cache filename for firefox
Sep 14 09:13:03 bigtuna packagekitd[2708042]: Failed to get cache filename for gstreamer1-plugins-bad-free
Sep 14 09:13:03 bigtuna packagekitd[2708042]: Failed to get cache filename for libreoffice-impress
Sep 14 09:13:03 bigtuna packagekitd[2708042]: Failed to get cache filename for gstreamer1-plugins-good
Sep 14 09:13:03 bigtuna packagekitd[2708042]: Failed to get cache filename for yelp
Sep 14 09:13:03 bigtuna packagekitd[2708042]: Failed to get cache filename for libreoffice-calc
Sep 14 09:13:03 bigtuna packagekitd[2708042]: Failed to get cache filename for libreoffice-writer
Sep 14 09:13:03 bigtuna packagekitd[2708042]: Failed to get cache filename for libreoffice-draw
Sep 14 09:13:03 bigtuna packagekitd[2708042]: Failed to get cache filename for libreoffice-base
Sep 14 09:13:03 bigtuna packagekitd[2708042]: Failed to get cache filename for gstreamer1-plugins-ugly-free
== csfw00a (1 distinct, 132 total) ==
Sep 14 09:04:10 csfw00a kernel: bnxt_en 0000:09:00.0 eth3: NIC Link is Down [x132]
== hackerman (11 distinct, 11 total) ==
Sep 14 09:42:39 hackerman evolution-sourc[1121141]: Failed to reap '/adminhomes/jzhou131/.cache/evolution/calendar/trash': Error opening directory '/adminhomes/jzhou131/.cache/evolution/calendar/trash': Permission denied
Sep 14 09:42:39 hackerman evolution-sourc[1121141]: Failed to reap '/adminhomes/jzhou131/.cache/evolution/addressbook/trash': Error opening directory '/adminhomes/jzhou131/.cache/evolution/addressbook/trash': Permission denied
Sep 14 09:42:39 hackerman evolution-sourc[1121141]: Failed to reap '/adminhomes/jzhou131/.cache/evolution/memos/trash': Error opening directory '/adminhomes/jzhou131/.cache/evolution/memos/trash': Permission denied
Sep 14 09:42:39 hackerman evolution-sourc[1121141]: Failed to reap '/adminhomes/jzhou131/.cache/evolution/mail/trash': Error opening directory '/adminhomes/jzhou131/.cache/evolution/mail/trash': Permission denied
Sep 14 09:42:39 hackerman evolution-sourc[1121141]: Failed to reap '/adminhomes/jzhou131/.local/share/evolution/mail/trash': Error opening directory '/adminhomes/jzhou131/.local/share/evolution/mail/trash': Permission denied
Sep 14 09:42:39 hackerman evolution-sourc[1121141]: Failed to reap '/adminhomes/jzhou131/.local/share/evolution/calendar/trash': Error opening directory '/adminhomes/jzhou131/.local/share/evolution/calendar/trash': Permission denied
Sep 14 09:42:39 hackerman evolution-sourc[1121141]: Failed to reap '/adminhomes/jzhou131/.local/share/evolution/tasks/trash': Error opening directory '/adminhomes/jzhou131/.local/share/evolution/tasks/trash': Permission denied
Sep 14 09:42:39 hackerman evolution-sourc[1121141]: Failed to reap '/adminhomes/jzhou131/.local/share/evolution/addressbook/trash': Error opening directory '/adminhomes/jzhou131/.local/share/evolution/addressbook/trash': Permission denied
Sep 14 09:42:39 hackerman evolution-sourc[1121141]: Failed to reap '/adminhomes/jzhou131/.local/share/evolution/memos/trash': Error opening directory '/adminhomes/jzhou131/.local/share/evolution/memos/trash': Permission denied
Sep 14 09:42:39 hackerman evolution-sourc[1121141]: Failed to reap '/adminhomes/jzhou131/.cache/evolution/sources/trash': Error opening directory '/adminhomes/jzhou131/.cache/evolution/sources/trash': Permission denied
Sep 14 09:42:39 hackerman evolution-sourc[1121141]: Failed to reap '/adminhomes/jzhou131/.cache/evolution/tasks/trash': Error opening directory '/adminhomes/jzhou131/.cache/evolution/tasks/trash': Permission denied
== hazfs.cs.umd.edu (1 distinct, 2 total) ==
Sep 14 09:25:02 hazfs.cs.umd.edu pcp[814671]: pmlogger_daily failed - see /var/log/pcp/pmlogger/pmlogger_daily-K.log [x2]
== idm00 (1 distinct, 1 total) ==
Sep 14 09:53:54 idm00 named[4166701]: client @0x7f1198066c58 10.73.240.42#55653: update '73.10.in-addr.arpa/IN' denied
== idmp0 (1 distinct, 1 total) ==
Sep 14 09:37:39 idmp0 named[1598691]: client @0x7f2d1c046568 10.73.240.43#52401: update '73.10.in-addr.arpa/IN' denied
== itmon02 (1 distinct, 45 total) ==
Sep 14 09:08:11 itmon02 sshd[1750555]: error: beginning MaxStartups throttling [x45]
== neograd (1 distinct, 1 total) ==
Sep 14 09:46:46 neograd kernel: clocksource: timekeeping watchdog on CPU0: kvm-clock retried 1 times before success
== newhonors2 (1 distinct, 24 total) ==
Sep 14 09:13:03 newhonors2 dhcpcd[2625535]: dhcpcd is not running [x24]
== orchids (1 distinct, 2 total) ==
Sep 14 09:36:20 orchids setroubleshoot[1163105]: SELinux is preventing /opt/zoom/zoom from execmod access on the file /memfd:JITCode:QtQml (deleted). For complete SELinux messages run: sealert -l d2a5013b-cf74-44be-8505-892db15d8aa4 [x2]
== outbound00.cs.umd.edu (1 distinct, 6 total) ==
Sep 14 09:09:08 outbound00.cs.umd.edu python3[4143455]: ldapdb [x6]
== outbound01.cs.umd.edu (1 distinct, 6 total) ==
Sep 14 09:13:07 outbound01.cs.umd.edu python3[2208246]: ldapdb [x6]
== sentry-docker00.cs.umd.edu (34 distinct, 34 total) ==
Sep 14 09:16:33 sentry-docker00.cs.umd.edu systemd-udevd[148742]: link_config: could not get ethtool features for vethaf3e623
Sep 14 09:16:33 sentry-docker00.cs.umd.edu systemd-udevd[148742]: Could not set offload features of vethaf3e623: No such device
Sep 14 09:16:33 sentry-docker00.cs.umd.edu systemd-udevd[148770]: Could not generate persistent MAC address for veth239501c: No such file or directory
Sep 14 09:16:33 sentry-docker00.cs.umd.edu systemd-udevd[148771]: Could not generate persistent MAC address for vethd8e8b7b: No such file or directory
Sep 14 09:16:33 sentry-docker00.cs.umd.edu systemd-udevd[148789]: Could not generate persistent MAC address for veth2a1030f: No such file or directory
Sep 14 09:16:33 sentry-docker00.cs.umd.edu systemd-udevd[148788]: Could not generate persistent MAC address for vethc90ffb8: No such file or directory
Sep 14 09:16:33 sentry-docker00.cs.umd.edu systemd-udevd[148798]: Could not generate persistent MAC address for veth90402f8: No such file or directory
Sep 14 09:16:33 sentry-docker00.cs.umd.edu systemd-udevd[148799]: Could not generate persistent MAC address for veth717080e: No such file or directory
Sep 14 09:16:33 sentry-docker00.cs.umd.edu systemd-udevd[148812]: Could not generate persistent MAC address for veth6ca8851: No such file or directory
Sep 14 09:16:33 sentry-docker00.cs.umd.edu systemd-udevd[148809]: Could not generate persistent MAC address for veth3541d01: No such file or directory
Sep 14 09:16:33 sentry-docker00.cs.umd.edu systemd-udevd[148871]: Could not generate persistent MAC address for veth878e759: No such file or directory
Sep 14 09:16:33 sentry-docker00.cs.umd.edu systemd-udevd[148878]: Could not generate persistent MAC address for veth2497668: No such file or directory
Sep 14 09:36:41 sentry-docker00.cs.umd.edu systemd-udevd[158431]: link_config: could not get ethtool features for veth878e759
Sep 14 09:36:41 sentry-docker00.cs.umd.edu systemd-udevd[158431]: Could not set offload features of veth878e759: No such device
Sep 14 09:36:42 sentry-docker00.cs.umd.edu systemd-udevd[158466]: Could not generate persistent MAC address for vethdb37ef1: No such file or directory
Sep 14 09:36:42 sentry-docker00.cs.umd.edu systemd-udevd[158467]: Could not generate persistent MAC address for veth2a80964: No such file or directory
Sep 14 09:36:42 sentry-docker00.cs.umd.edu systemd-udevd[158470]: Could not generate persistent MAC address for veth5004829: No such file or directory
Sep 14 09:36:42 sentry-docker00.cs.umd.edu systemd-udevd[158471]: Could not generate persistent MAC address for veth522f97c: No such file or directory
Sep 14 09:36:42 sentry-docker00.cs.umd.edu systemd-udevd[158486]: Could not generate persistent MAC address for vethb20b16f: No such file or directory
Sep 14 09:36:42 sentry-docker00.cs.umd.edu systemd-udevd[158489]: Could not generate persistent MAC address for vethdcf8ce8: No such file or directory
Sep 14 09:36:42 sentry-docker00.cs.umd.edu systemd-udevd[158552]: Could not generate persistent MAC address for veth96869cc: No such file or directory
Sep 14 09:36:42 sentry-docker00.cs.umd.edu systemd-udevd[158553]: Could not generate persistent MAC address for veth277178c: No such file or directory
Sep 14 09:36:42 sentry-docker00.cs.umd.edu systemd-udevd[158576]: Could not generate persistent MAC address for veth4fbf906: No such file or directory
Sep 14 09:36:42 sentry-docker00.cs.umd.edu systemd-udevd[158580]: Could not generate persistent MAC address for vethbdee7d7: No such file or directory
Sep 14 09:56:50 sentry-docker00.cs.umd.edu systemd-udevd[167883]: Could not generate persistent MAC address for veth943a222: No such file or directory
Sep 14 09:56:50 sentry-docker00.cs.umd.edu systemd-udevd[167884]: Could not generate persistent MAC address for vethbf4799d: No such file or directory
Sep 14 09:56:50 sentry-docker00.cs.umd.edu systemd-udevd[167902]: Could not generate persistent MAC address for vethc30f54f: No such file or directory
Sep 14 09:56:50 sentry-docker00.cs.umd.edu systemd-udevd[167887]: Could not generate persistent MAC address for veth82ef9c9: No such file or directory
Sep 14 09:56:50 sentry-docker00.cs.umd.edu systemd-udevd[167911]: Could not generate persistent MAC address for veth9decce2: No such file or directory
Sep 14 09:56:50 sentry-docker00.cs.umd.edu systemd-udevd[167912]: Could not generate persistent MAC address for veth1e0ade0: No such file or directory
... 4 more distinct messages not shown
== strawberry (8 distinct, 39 total) ==
Sep 14 09:07:04 strawberry kernel: I/O error, dev sda, sector 206848 op 0x0:(READ) flags 0x80700 phys_seg 1 prio class 2 [x6]
Sep 14 09:07:04 strawberry kernel: I/O error, dev sda, sector 206848 op 0x0:(READ) flags 0x0 phys_seg 1 prio class 2 [x6]
Sep 14 09:07:04 strawberry kernel: Buffer I/O error on dev sda2, logical block 0, async page read [x6]
Sep 14 09:07:04 strawberry kernel: I/O error, dev sda, sector 2048 op 0x0:(READ) flags 0x80700 phys_seg 1 prio class 2 [x6]
Sep 14 09:07:04 strawberry kernel: I/O error, dev sda, sector 2048 op 0x0:(READ) flags 0x0 phys_seg 1 prio class 2 [x6]
Sep 14 09:07:04 strawberry kernel: Buffer I/O error on dev sda1, logical block 0, async page read [x6]
Sep 14 09:34:42 strawberry smartd[5314]: Device: /dev/sda [SAT], failed to read SMART Attribute Data [x2]
Sep 14 10:04:42 strawberry smartd[5314]: Device: /dev/sda [SAT], not capable of Offline or Self-Testing.
== submit26-b9-f1 (1 distinct, 5 total) ==
Sep 14 09:23:07 submit26-b9-f1 systemd[1]: user(a)1001.service: Main process exited, code=killed, status=9/KILL [x5]
== submit26-b9-f2 (1 distinct, 1 total) ==
Sep 14 09:58:07 submit26-b9-f2 systemd[1]: user(a)1001.service: Main process exited, code=killed, status=9/KILL
== submit26-b9-f3 (10 distinct, 11 total) ==
Sep 14 09:06:41 submit26-b9-f3 setroubleshoot[821339]: SELinux is preventing /usr/bin/python3.9 from create access on the directory /(null). For complete SELinux messages run: sealert -l a653b772-cbcd-438b-bae5-23c3dc69b31b
Sep 14 09:06:41 submit26-b9-f3 setroubleshoot[821339]: SELinux is preventing /usr/bin/python3.9 from add_name access on the directory /(null). For complete SELinux messages run: sealert -l 3e904634-6caa-4202-8c92-f139db798859
Sep 14 09:06:41 submit26-b9-f3 setroubleshoot[821339]: SELinux is preventing /usr/bin/python3.9 from create access on the file /(null). For complete SELinux messages run: sealert -l 580b20e4-ec2c-433d-905c-5bd417fba033
Sep 14 09:06:41 submit26-b9-f3 setroubleshoot[821339]: SELinux is preventing /usr/bin/python3.9 from open access on the file /tmp/libdnf.H8vuRA/repodata/repomd.xml. For complete SELinux messages run: sealert -l 27f29d48-5e7c-4db7-b051-8ac055737d6f
Sep 14 09:06:41 submit26-b9-f3 setroubleshoot[821339]: SELinux is preventing /usr/bin/python3.9 from setattr access on the file repomd.xml. For complete SELinux messages run: sealert -l bff72452-d40a-430b-9060-dd0a48f5b6ba
Sep 14 09:06:41 submit26-b9-f3 setroubleshoot[821339]: SELinux is preventing /usr/bin/python3.9 from read access on the directory libdnf.H8vuRA. For complete SELinux messages run: sealert -l 9638d396-8ce5-4e6a-ae47-45cd3985e1cd
Sep 14 09:06:41 submit26-b9-f3 setroubleshoot[821339]: SELinux is preventing /usr/bin/python3.9 from remove_name access on the directory repomd.xml. For complete SELinux messages run: sealert -l 6da64b94-7024-45a9-b8c2-3b9812517407
Sep 14 09:06:41 submit26-b9-f3 setroubleshoot[821339]: SELinux is preventing /usr/bin/python3.9 from unlink access on the file repomd.xml. For complete SELinux messages run: sealert -l 64cbe179-abf1-4d5a-bade-bb164897ee65
Sep 14 09:06:41 submit26-b9-f3 setroubleshoot[821339]: SELinux is preventing /usr/bin/python3.9 from rmdir access on the directory repodata. For complete SELinux messages run: sealert -l d2e35b1a-e27c-4f91-9217-2bb1204e1e68
Sep 14 09:36:31 submit26-b9-f3 systemd[1]: user(a)1001.service: Main process exited, code=killed, status=9/KILL [x2]
== submit26-b9-f4 (10 distinct, 15 total) ==
Sep 14 09:16:31 submit26-b9-f4 systemd[1]: user(a)1001.service: Main process exited, code=killed, status=9/KILL [x3]
Sep 14 09:24:44 submit26-b9-f4 setroubleshoot[613421]: SELinux is preventing /usr/bin/python3.9 from create access on the directory /(null). For complete SELinux messages run: sealert -l ee160f23-b161-4f4a-9985-c4edfd3a5beb
Sep 14 09:24:44 submit26-b9-f4 setroubleshoot[613421]: SELinux is preventing /usr/bin/python3.9 from add_name access on the directory /(null). For complete SELinux messages run: sealert -l 89a83821-4b24-4081-9973-0a79ca6ed5b4
Sep 14 09:24:44 submit26-b9-f4 setroubleshoot[613421]: SELinux is preventing /usr/bin/python3.9 from create access on the file /(null). For complete SELinux messages run: sealert -l f73955d6-1416-45f9-bab6-ff1f3ea07e9d [x2]
Sep 14 09:24:44 submit26-b9-f4 setroubleshoot[613421]: SELinux is preventing /usr/bin/python3.9 from open access on the file /tmp/libdnf.6lahqb/repodata/repomd.xml. For complete SELinux messages run: sealert -l 9f8f24a0-8fb6-454d-a103-31a8f7a6efa0 [x2]
Sep 14 09:24:44 submit26-b9-f4 setroubleshoot[613421]: SELinux is preventing /usr/bin/python3.9 from setattr access on the file repomd.xml. For complete SELinux messages run: sealert -l 20293136-86a3-40ba-a651-cff48d36059e [x2]
Sep 14 09:24:44 submit26-b9-f4 setroubleshoot[613421]: SELinux is preventing /usr/bin/python3.9 from read access on the directory libdnf.6lahqb. For complete SELinux messages run: sealert -l 25f86b49-4ee7-4f60-ad1c-73a70032560c
Sep 14 09:24:44 submit26-b9-f4 setroubleshoot[613421]: SELinux is preventing /usr/bin/python3.9 from remove_name access on the directory repomd.xml. For complete SELinux messages run: sealert -l eec250fb-073f-456d-93bc-f98776fd476d
Sep 14 09:24:44 submit26-b9-f4 setroubleshoot[613421]: SELinux is preventing /usr/bin/python3.9 from unlink access on the file repomd.xml. For complete SELinux messages run: sealert -l c9209e04-a349-43d5-8cb2-3e303e48df74
Sep 14 09:24:44 submit26-b9-f4 setroubleshoot[613421]: SELinux is preventing /usr/bin/python3.9 from rmdir access on the directory repodata. For complete SELinux messages run: sealert -l 3178d5f5-80e9-404b-92b7-9bef397a8915
1
0
Command: /usr/local/sbin/syslog-digest.py
Time : 0.0452s
Status : exited 0
Output :
Syslog digest — 2026-09-14 09:05 EDT
Processed 1,905 lines, filtered 1,499 (78%). 406 unknown (172 distinct) from 20 host(s).
== b0b02.cs.umd.edu (1 distinct, 1 total) ==
Sep 14 08:43:10 b0b02.cs.umd.edu rustdesk[992077]: cannot open display:
== biggulp.cs.umd.edu (6 distinct, 6 total) ==
Sep 14 08:47:38 biggulp.cs.umd.edu sshd-session[1217900]: error: kex_protocol_error: type 20 seq 2 [preauth]
Sep 14 08:47:38 biggulp.cs.umd.edu sshd-session[1217900]: error: kex_protocol_error: type 30 seq 3 [preauth]
Sep 14 08:47:39 biggulp.cs.umd.edu sshd-session[1217900]: error: kex_protocol_error: type 20 seq 4 [preauth]
Sep 14 08:47:39 biggulp.cs.umd.edu sshd-session[1217900]: error: kex_protocol_error: type 30 seq 5 [preauth]
Sep 14 08:47:41 biggulp.cs.umd.edu sshd-session[1217900]: error: kex_protocol_error: type 20 seq 6 [preauth]
Sep 14 08:47:41 biggulp.cs.umd.edu sshd-session[1217900]: error: kex_protocol_error: type 30 seq 7 [preauth]
== csfw00a (1 distinct, 119 total) ==
Sep 14 08:03:53 csfw00a kernel: bnxt_en 0000:09:00.0 eth3: NIC Link is Down [x119]
== defer (1 distinct, 1 total) ==
Sep 14 08:58:05 defer krb5_child[371459]: Preauthentication failed
== emaar (1 distinct, 1 total) ==
Sep 14 08:43:21 emaar puppet-agent[1249381]: (Facter) invalid or malformed lldp data: MalformedDataError: no lldp interface data found
== hazfs.cs.umd.edu (1 distinct, 2 total) ==
Sep 14 08:25:00 hazfs.cs.umd.edu pcp[499585]: pmlogger_daily failed - see /var/log/pcp/pmlogger/pmlogger_daily-K.log [x2]
== idm00 (1 distinct, 1 total) ==
Sep 14 08:53:54 idm00 named[4166701]: client @0x7f119806f9c8 10.73.240.42#59463: update '73.10.in-addr.arpa/IN' denied
== idmp0 (1 distinct, 1 total) ==
Sep 14 08:37:39 idmp0 named[1598691]: client @0x7f2d2801dea8 10.73.240.43#57877: update '73.10.in-addr.arpa/IN' denied
== itmon02 (1 distinct, 40 total) ==
Sep 14 08:08:02 itmon02 sshd[1750555]: error: beginning MaxStartups throttling [x40]
== mirrors.cs.umd.edu (1 distinct, 1 total) ==
Sep 14 08:37:00 mirrors.cs.umd.edu puppet-agent[11417]: (Facter) Error while resolving custom fact fact='ipa', resolution='<anonymous>': Failed while executing '/usr/bin/kinit -k 2>&1': Timeout encounter after 10s, killing process with pid: 11625
== newhonors2 (1 distinct, 24 total) ==
Sep 14 08:13:02 newhonors2 dhcpcd[2623085]: dhcpcd is not running [x24]
== orchids (2 distinct, 9 total) ==
Sep 14 08:20:29 orchids setroubleshoot[1117497]: SELinux is preventing /opt/zoom/zoom from execmod access on the file /memfd:JITCode:QtQml (deleted). For complete SELinux messages run: sealert -l d2a5013b-cf74-44be-8505-892db15d8aa4 [x8]
Sep 14 08:37:05 orchids systemd-coredump[1133292]: Process 1133282 (ZoomWebviewHost) of user 12641 dumped core.#012#012Stack trace of thread 1133282:#012#0 0x00007f060c48d4bc __pthread_kill_implementation (libc.so.6 + 0x8d4bc)#012#1 0x00007f060c43fbb6 raise (libc.so.6 + 0x3fbb6)#012#2 0x00007f060c429873 abort (libc.so.6 + 0x29873)#012#3 0x00007f060c42a1b2 __libc_message.cold (libc.so.6 + 0x2a1b2)#012#4 0x00007f060c51d66b __fortify_fail (libc.so.6 + 0x11d66b)#012#5 0x00007f060c51e8e6 __stack_chk_fail (libc.so.6 + 0x11e8e6)#012#6 0x0000555593114af7 n/a (ZoomWebviewHost + 0x173af7)#012#7 0x00005555930d54ac n/a (ZoomWebviewHost + 0x1344ac)#012#8 0x00007f060c42a610 __libc_start_call_main (libc.so.6 + 0x2a610)#012#9 0x00007f060c42a6c0 __libc_start_main@@GLIBC_2.34 (libc.so.6 + 0x2a6c0)#012#10 0x00005555930cfdee n/a (ZoomWebviewHost + 0x12edee)#012#012Stack trace of thread 1133288:#012#0 0x00007f060c48867a __futex_abstimed_wait_common (libc.so.6 + 0x8867a)#012#1 0x00007f060c48ac
62 pthread_cond_wait@@GLIBC_2.3.2 (libc.so.6 + 0x8ac62)#012#2 0x00007f06149a0478 n/a (libcef.so + 0x6fa0478)#012#3 0x00007f06149cbdb8 n/a (libcef.so + 0x6fcbdb8)#012#4 0x00007f06149502b6 n/a (libcef.so + 0x6f502b6)#012#5 0x00007f0614982f44 n/a (libcef.so + 0x6f82f44)#012#6 0x00007f0614983818 n/a (libcef.so + 0x6f83818)#012#7 0x00007f061498361d n/a (libcef.so + 0x6f8361d)#012#8 0x00007f061498351e n/a (libcef.so + 0x6f8351e)#012#9 0x00007f06149a0c4b n/a (libcef.so + 0x6fa0c4b)#012#10 0x00007f060c48b699 start_thread (libc.so.6 + 0x8b699)#012#11 0x00007f060c5108a0 __clone3 (libc.so.6 + 0x1108a0)#012#012Stack trace of thread 1133285:#012#0 0x00007f060c50fede epoll_wait (libc.so.6 + 0x10fede)#012#1 0x00007f06149c859b n/a (libcef.so + 0x6fc859b)#012#2 0x00007f06149c82f8 n/a (libcef.so + 0x6fc82f8)#012#3 0x00007f061496df6d n/a (libcef.so + 0x6f6df6d)#012#4 0x00007f06149324e6 n/a (libcef.so + 0x6f324e6)#012#5 0x00007f061498c808 n/a (libcef.so + 0x6f8c808)#012#6 0x00007f061498c
9d0 n/a (libcef.so + 0x6f8c9d0)#012#7 0x00007f06149a0c4b n/a (libcef.so + 0x6fa0c4b)#012#8 0x00007f060c48b699 start_thread (libc.so.6 + 0x8b699)#012#9 0x00007f060c5108a0 __clone3 (libc.so.6 + 0x1108a0)#012#012Stack trace of thread 1133283:#012#0 0x00007f060c48867a __futex_abstimed_wait_common (libc.so.6 + 0x8867a)#012#1 0x00007f060c48ac62 pthread_cond_wait@@GLIBC_2.3.2 (libc.so.6 + 0x8ac62)#012#2 0x00007f05f63e07ed cnd_wait (libvulkan_intel.so + 0x3e07ed)#012#3 0x00007f05f63c8f3b util_queue_thread_func (libvulkan_intel.so + 0x3c8f3b)#012#4 0x00007f05f63e074b impl_thrd_routine (libvulkan_intel.so + 0x3e074b)#012#5 0x00007f060c48b699 start_thread (libc.so.6 + 0x8b699)#012#6 0x00007f060c5108a0 __clone3 (libc.so.6 + 0x1108a0)#012#012Stack trace of thread 1133290:#012#0 0x00007f060c48867a __futex_abstimed_wait_common (libc.so.6 + 0x8867a)#012#1 0x00007f060c48ac62 pthread_cond_wait@@GLIBC_2.3.2 (libc.so.6 + 0x8ac62)#012#2 0x00007f06149a0478 n/a (libcef.so + 0x6fa0478)#012#3
0x00007f06149cbdb8 n/a (libcef.so + 0x6fcbdb8)#012#4 0x00007f06149502b6 n/a (libcef.so + 0x6f502b6)#012#5 0x00007f0614982f44 n/a (libcef.so + 0x6f82f44)#012#6 0x00007f0614983818 n/a (libcef.so + 0x6f83818)#012#7 0x00007f061498361d n/a (libcef.so + 0x6f8361d)#012#8 0x00007f061498351e n/a (libcef.so + 0x6f8351e)#012#9 0x00007f06149a0c4b n/a (libcef.so + 0x6fa0c4b)#012#10 0x00007f060c48b699 start_thread (libc.so.6 + 0x8b699)#012#11 0x00007f060c5108a0 __clone3 (libc.so.6 + 0x1108a0)#012#012Stack trace of thread 1133286:#012#0 0x00007f060c48867a __futex_abstimed_wait_common (libc.so.6 + 0x8867a)#012#1 0x00007f060c48ae4f pthread_cond_timedwait@@GLIBC_2.3.2 (libc.so.6 + 0x8ae4f)#012#2 0x00007f06149a0571 n/a (libcef.so + 0x6fa0571)#012#3 0x00007f06149cbdda n/a (libcef.so + 0x6fcbdda)#012#4 0x00007f06149502b6 n/a (libcef.so + 0x6f502b6)#012#5 0x00007f0614986b8a n/a (libcef.so + 0x6f86b8a)#012#6 0x00007f0614986cd7 n/a (libcef.so + 0x6f86cd7)#012#7 0x00007f06149a0c4b n/a (libcef.
so + 0x6fa0c4b)#012#8 0x00007f060c48b699 start_thread (libc.so.6 + 0x8b699)#012#9 0x00007f060c5108a0 __clone3 (libc.so.6 + 0x1108a0)#012ELF object binary architecture: AMD x86-64
== outbound00.cs.umd.edu (1 distinct, 6 total) ==
Sep 14 08:09:09 outbound00.cs.umd.edu python3[4129513]: ldapdb [x6]
== outbound01.cs.umd.edu (1 distinct, 6 total) ==
Sep 14 08:13:06 outbound01.cs.umd.edu python3[2194250]: ldapdb [x6]
== quiss (106 distinct, 110 total) ==
Sep 14 08:08:40 quiss gnome-software[191719]: failed to get featured apps: no apps to show
Sep 14 08:08:40 quiss gnome-software[191719]: Only 0 apps for curated list, hiding
Sep 14 08:08:40 quiss gnome-software[191719]: Only 0 apps for recent list, hiding
Sep 14 08:08:46 quiss packagekitd[3933120]: Failed to get cache filename for perl [x3]
Sep 14 08:08:46 quiss packagekitd[3933120]: Failed to get cache filename for perl-Attribute-Handlers
Sep 14 08:08:46 quiss packagekitd[3933120]: Failed to get cache filename for perl-AutoLoader
Sep 14 08:08:46 quiss packagekitd[3933120]: Failed to get cache filename for perl-AutoSplit
Sep 14 08:08:46 quiss packagekitd[3933120]: Failed to get cache filename for perl-B
Sep 14 08:08:46 quiss packagekitd[3933120]: Failed to get cache filename for perl-Benchmark
Sep 14 08:08:46 quiss packagekitd[3933120]: Failed to get cache filename for perl-Class-Struct
Sep 14 08:08:46 quiss packagekitd[3933120]: Failed to get cache filename for perl-Config-Extensions
Sep 14 08:08:46 quiss packagekitd[3933120]: Failed to get cache filename for perl-DBM_Filter
Sep 14 08:08:46 quiss packagekitd[3933120]: Failed to get cache filename for perl-Devel-Peek
Sep 14 08:08:46 quiss packagekitd[3933120]: Failed to get cache filename for perl-Devel-SelfStubber
Sep 14 08:08:46 quiss packagekitd[3933120]: Failed to get cache filename for perl-DirHandle
Sep 14 08:08:46 quiss packagekitd[3933120]: Failed to get cache filename for perl-Dumpvalue
Sep 14 08:08:46 quiss packagekitd[3933120]: Failed to get cache filename for perl-DynaLoader
Sep 14 08:08:46 quiss packagekitd[3933120]: Failed to get cache filename for perl-English
Sep 14 08:08:46 quiss packagekitd[3933120]: Failed to get cache filename for perl-Errno
Sep 14 08:08:46 quiss packagekitd[3933120]: Failed to get cache filename for perl-ExtUtils-Constant
Sep 14 08:08:46 quiss packagekitd[3933120]: Failed to get cache filename for perl-ExtUtils-Embed
Sep 14 08:08:46 quiss packagekitd[3933120]: Failed to get cache filename for perl-ExtUtils-Miniperl
Sep 14 08:08:46 quiss packagekitd[3933120]: Failed to get cache filename for perl-Fcntl
Sep 14 08:08:46 quiss packagekitd[3933120]: Failed to get cache filename for perl-File-Basename
Sep 14 08:08:46 quiss packagekitd[3933120]: Failed to get cache filename for perl-File-Compare
Sep 14 08:08:46 quiss packagekitd[3933120]: Failed to get cache filename for perl-File-Copy
Sep 14 08:08:46 quiss packagekitd[3933120]: Failed to get cache filename for perl-File-DosGlob
Sep 14 08:08:46 quiss packagekitd[3933120]: Failed to get cache filename for perl-File-Find
Sep 14 08:08:46 quiss packagekitd[3933120]: Failed to get cache filename for perl-File-stat
Sep 14 08:08:46 quiss packagekitd[3933120]: Failed to get cache filename for perl-FileCache
... 76 more distinct messages not shown
== sentry-docker00.cs.umd.edu (36 distinct, 36 total) ==
Sep 14 08:16:08 sentry-docker00.cs.umd.edu systemd-udevd[118901]: link_config: could not get ethtool features for veth67ce9ed
Sep 14 08:16:08 sentry-docker00.cs.umd.edu systemd-udevd[118901]: Could not set offload features of veth67ce9ed: No such device
Sep 14 08:16:08 sentry-docker00.cs.umd.edu systemd-udevd[118925]: Could not generate persistent MAC address for veth6e2d14b: No such file or directory
Sep 14 08:16:08 sentry-docker00.cs.umd.edu systemd-udevd[118926]: Could not generate persistent MAC address for veth8806eec: No such file or directory
Sep 14 08:16:08 sentry-docker00.cs.umd.edu systemd-udevd[118979]: Could not generate persistent MAC address for veth9f9e0da: No such file or directory
Sep 14 08:16:08 sentry-docker00.cs.umd.edu systemd-udevd[118980]: Could not generate persistent MAC address for veth3272288: No such file or directory
Sep 14 08:16:08 sentry-docker00.cs.umd.edu systemd-udevd[119000]: Could not generate persistent MAC address for vethfeb270e: No such file or directory
Sep 14 08:16:08 sentry-docker00.cs.umd.edu systemd-udevd[119003]: Could not generate persistent MAC address for vetha12fde4: No such file or directory
Sep 14 08:16:08 sentry-docker00.cs.umd.edu systemd-udevd[118998]: Could not generate persistent MAC address for veth829041a: No such file or directory
Sep 14 08:16:08 sentry-docker00.cs.umd.edu systemd-udevd[119004]: Could not generate persistent MAC address for veth411ead1: No such file or directory
Sep 14 08:16:08 sentry-docker00.cs.umd.edu systemd-udevd[119077]: Could not generate persistent MAC address for vethc7195f8: No such file or directory
Sep 14 08:16:08 sentry-docker00.cs.umd.edu systemd-udevd[119081]: Could not generate persistent MAC address for vethbc2cdf3: No such file or directory
Sep 14 08:36:16 sentry-docker00.cs.umd.edu systemd-udevd[128247]: link_config: could not get ethtool features for veth9f9e0da
Sep 14 08:36:16 sentry-docker00.cs.umd.edu systemd-udevd[128247]: Could not set offload features of veth9f9e0da: No such device
Sep 14 08:36:17 sentry-docker00.cs.umd.edu systemd-udevd[128368]: Could not generate persistent MAC address for vethe8bd0a0: No such file or directory
Sep 14 08:36:17 sentry-docker00.cs.umd.edu systemd-udevd[128369]: Could not generate persistent MAC address for veth9ba3d18: No such file or directory
Sep 14 08:36:17 sentry-docker00.cs.umd.edu systemd-udevd[128372]: Could not generate persistent MAC address for veth8557ec6: No such file or directory
Sep 14 08:36:17 sentry-docker00.cs.umd.edu systemd-udevd[128379]: Could not generate persistent MAC address for veth9ffe96a: No such file or directory
Sep 14 08:36:17 sentry-docker00.cs.umd.edu systemd-udevd[128398]: Could not generate persistent MAC address for vethfd56b5d: No such file or directory
Sep 14 08:36:17 sentry-docker00.cs.umd.edu systemd-udevd[128396]: Could not generate persistent MAC address for veth0dc54c2: No such file or directory
Sep 14 08:36:17 sentry-docker00.cs.umd.edu systemd-udevd[128414]: Could not generate persistent MAC address for veth252d2db: No such file or directory
Sep 14 08:36:17 sentry-docker00.cs.umd.edu systemd-udevd[128420]: Could not generate persistent MAC address for vethaecaad5: No such file or directory
Sep 14 08:36:17 sentry-docker00.cs.umd.edu systemd-udevd[128451]: Could not generate persistent MAC address for vethd8c0777: No such file or directory
Sep 14 08:36:17 sentry-docker00.cs.umd.edu systemd-udevd[128445]: Could not generate persistent MAC address for vethf62f3ed: No such file or directory
Sep 14 08:56:25 sentry-docker00.cs.umd.edu systemd-udevd[139312]: link_config: could not get ethtool features for vethe8bd0a0
Sep 14 08:56:25 sentry-docker00.cs.umd.edu systemd-udevd[139312]: Could not set offload features of vethe8bd0a0: No such device
Sep 14 08:56:25 sentry-docker00.cs.umd.edu systemd-udevd[139331]: Could not generate persistent MAC address for vethd161d00: No such file or directory
Sep 14 08:56:25 sentry-docker00.cs.umd.edu systemd-udevd[139332]: Could not generate persistent MAC address for veth31255ae: No such file or directory
Sep 14 08:56:25 sentry-docker00.cs.umd.edu systemd-udevd[139357]: Could not generate persistent MAC address for vethaf3e623: No such file or directory
Sep 14 08:56:25 sentry-docker00.cs.umd.edu systemd-udevd[139358]: Could not generate persistent MAC address for veth02d9021: No such file or directory
... 6 more distinct messages not shown
== smokeping-slave (1 distinct, 1 total) ==
Sep 14 08:58:18 smokeping-slave nologin[1293568]: Attempted login by UNKNOWN (UID: 65534) on UNKNOWN
== strawberry (7 distinct, 38 total) ==
Sep 14 08:07:03 strawberry kernel: I/O error, dev sda, sector 206848 op 0x0:(READ) flags 0x80700 phys_seg 1 prio class 2 [x6]
Sep 14 08:07:03 strawberry kernel: I/O error, dev sda, sector 206848 op 0x0:(READ) flags 0x0 phys_seg 1 prio class 2 [x6]
Sep 14 08:07:03 strawberry kernel: Buffer I/O error on dev sda2, logical block 0, async page read [x6]
Sep 14 08:07:03 strawberry kernel: I/O error, dev sda, sector 2048 op 0x0:(READ) flags 0x80700 phys_seg 1 prio class 2 [x6]
Sep 14 08:07:03 strawberry kernel: I/O error, dev sda, sector 2048 op 0x0:(READ) flags 0x0 phys_seg 1 prio class 2 [x6]
Sep 14 08:07:03 strawberry kernel: Buffer I/O error on dev sda1, logical block 0, async page read [x6]
Sep 14 08:34:42 strawberry smartd[5314]: Device: /dev/sda [SAT], failed to read SMART Attribute Data [x2]
== submit26-b9-f3 (1 distinct, 2 total) ==
Sep 14 08:23:05 submit26-b9-f3 systemd[1]: user(a)1001.service: Main process exited, code=killed, status=9/KILL [x2]
== submit26-b9-f4 (1 distinct, 1 total) ==
Sep 14 09:03:06 submit26-b9-f4 systemd[1]: user(a)1001.service: Main process exited, code=killed, status=9/KILL
1
0
Command: /usr/local/sbin/syslog-digest.py
Time : 0.0422s
Status : exited 0
Output :
Syslog digest — 2026-09-14 08:05 EDT
Processed 1,563 lines, filtered 1,181 (75%). 382 unknown (75 distinct) from 18 host(s).
== b0b02.cs.umd.edu (1 distinct, 1 total) ==
Sep 14 07:43:07 b0b02.cs.umd.edu rustdesk[976745]: cannot open display:
== cheezit.cs.umd.edu (7 distinct, 7 total) ==
Sep 14 07:10:00 cheezit.cs.umd.edu systemd[1]: insights-client.service: Start request repeated too quickly.
Sep 14 07:47:16 cheezit.cs.umd.edu sshd-session[3312928]: error: kex_protocol_error: type 20 seq 2 [preauth]
Sep 14 07:47:16 cheezit.cs.umd.edu sshd-session[3312928]: error: kex_protocol_error: type 30 seq 3 [preauth]
Sep 14 07:47:17 cheezit.cs.umd.edu sshd-session[3312928]: error: kex_protocol_error: type 20 seq 4 [preauth]
Sep 14 07:47:17 cheezit.cs.umd.edu sshd-session[3312928]: error: kex_protocol_error: type 30 seq 5 [preauth]
Sep 14 07:47:19 cheezit.cs.umd.edu sshd-session[3312928]: error: kex_protocol_error: type 20 seq 6 [preauth]
Sep 14 07:47:19 cheezit.cs.umd.edu sshd-session[3312928]: error: kex_protocol_error: type 30 seq 7 [preauth]
== csfw00a (1 distinct, 140 total) ==
Sep 14 07:05:33 csfw00a kernel: bnxt_en 0000:09:00.0 eth3: NIC Link is Down [x140]
== emaar (1 distinct, 1 total) ==
Sep 14 07:41:09 emaar systemd[1]: insights-client.service: Start request repeated too quickly.
== hackerman (1 distinct, 1 total) ==
Sep 14 07:29:07 hackerman systemd[1]: insights-client.service: Start request repeated too quickly.
== hazfs.cs.umd.edu (12 distinct, 68 total) ==
Sep 14 07:25:00 hazfs.cs.umd.edu pcp[184087]: pmlogger_daily failed - see /var/log/pcp/pmlogger/pmlogger_daily-K.log [x2]
Sep 14 07:35:24 hazfs.cs.umd.edu snmpd[1431]: send response: Failure in sendto [x6]
Sep 14 07:35:24 hazfs.cs.umd.edu snmpd[1431]: -- NET-SNMP-EXTEND-MIB::nsExtendStatus."userweb" [x6]
Sep 14 07:35:24 hazfs.cs.umd.edu snmpd[1431]: -- NET-SNMP-EXTEND-MIB::nsExtendStatus."zfslist" [x6]
Sep 14 07:35:24 hazfs.cs.umd.edu snmpd[1431]: -- NET-SNMP-EXTEND-MIB::nsExtendStatus."userhome" [x6]
Sep 14 07:35:24 hazfs.cs.umd.edu snmpd[1431]: -- NET-SNMP-EXTEND-MIB::nsExtendOutput1Line."userweb" [x6]
Sep 14 07:35:24 hazfs.cs.umd.edu snmpd[1431]: -- NET-SNMP-EXTEND-MIB::nsExtendOutput1Line."zfslist" [x6]
Sep 14 07:35:24 hazfs.cs.umd.edu snmpd[1431]: -- NET-SNMP-EXTEND-MIB::nsExtendOutput1Line."userhome" [x6]
Sep 14 07:35:24 hazfs.cs.umd.edu snmpd[1431]: -- NET-SNMP-EXTEND-MIB::nsExtendOutputFull."userweb" [x6]
Sep 14 07:35:24 hazfs.cs.umd.edu snmpd[1431]: -- NET-SNMP-EXTEND-MIB::nsExtendOutputFull."zfslist" [x6]
Sep 14 07:35:24 hazfs.cs.umd.edu snmpd[1431]: -- NET-SNMP-EXTEND-MIB::nsExtendOutputFull."userhome" [x6]
Sep 14 07:35:24 hazfs.cs.umd.edu snmpd[1431]: -- NET-SNMP-EXTEND-MIB::nsExtendOutNumLines."userweb" [x6]
== idm00 (1 distinct, 1 total) ==
Sep 14 07:53:54 idm00 named[4166701]: client @0x7f11a0053278 10.73.240.42#55276: update '73.10.in-addr.arpa/IN' denied
== idmp0 (1 distinct, 1 total) ==
Sep 14 07:37:39 idmp0 named[1598691]: client @0x7f2d140302e8 10.73.240.43#51537: update '73.10.in-addr.arpa/IN' denied
== irb2156 (1 distinct, 1 total) ==
Sep 14 07:52:43 irb2156 systemd[1]: insights-client.service: Start request repeated too quickly.
== itmon02 (1 distinct, 43 total) ==
Sep 14 07:08:03 itmon02 sshd[1750555]: error: beginning MaxStartups throttling [x43]
== munin (2 distinct, 8 total) ==
Sep 14 07:13:13 munin sudo[1745442]: pam_systemd(sudo:session): Failed to stat() runtime directory '/run/user/0': No such file or directory [x4]
Sep 14 07:13:13 munin sudo[1745442]: pam_systemd(sudo:session): Not setting $XDG_RUNTIME_DIR, as the directory is not in order. [x4]
== newhonors2 (1 distinct, 24 total) ==
Sep 14 07:13:03 newhonors2 dhcpcd[2621263]: dhcpcd is not running [x24]
== outbound00.cs.umd.edu (1 distinct, 6 total) ==
Sep 14 07:09:09 outbound00.cs.umd.edu python3[4115579]: ldapdb [x6]
== outbound01.cs.umd.edu (1 distinct, 6 total) ==
Sep 14 07:13:06 outbound01.cs.umd.edu python3[2180290]: ldapdb [x6]
== sentry-docker00.cs.umd.edu (34 distinct, 34 total) ==
Sep 14 07:15:43 sentry-docker00.cs.umd.edu systemd-udevd[90740]: link_config: could not get ethtool features for veth2dea3cb
Sep 14 07:15:43 sentry-docker00.cs.umd.edu systemd-udevd[90740]: Could not set offload features of veth2dea3cb: No such device
Sep 14 07:15:43 sentry-docker00.cs.umd.edu systemd-udevd[90830]: Could not generate persistent MAC address for veth703c352: No such file or directory
Sep 14 07:15:43 sentry-docker00.cs.umd.edu systemd-udevd[90831]: Could not generate persistent MAC address for veth0619f7b: No such file or directory
Sep 14 07:15:43 sentry-docker00.cs.umd.edu systemd-udevd[90863]: Could not generate persistent MAC address for veth7d49322: No such file or directory
Sep 14 07:15:43 sentry-docker00.cs.umd.edu systemd-udevd[90861]: Could not generate persistent MAC address for veth70d747c: No such file or directory
Sep 14 07:15:43 sentry-docker00.cs.umd.edu systemd-udevd[90850]: Could not generate persistent MAC address for veth5d40417: No such file or directory
Sep 14 07:15:43 sentry-docker00.cs.umd.edu systemd-udevd[90861]: Could not generate persistent MAC address for vethc7a25cf: No such file or directory
Sep 14 07:15:43 sentry-docker00.cs.umd.edu systemd-udevd[90850]: Could not generate persistent MAC address for veth3097ae7: No such file or directory
Sep 14 07:15:43 sentry-docker00.cs.umd.edu systemd-udevd[90861]: Could not generate persistent MAC address for veth4e74fb2: No such file or directory
Sep 14 07:15:43 sentry-docker00.cs.umd.edu systemd-udevd[90851]: Could not generate persistent MAC address for veth4325546: No such file or directory
Sep 14 07:15:43 sentry-docker00.cs.umd.edu systemd-udevd[90848]: Could not generate persistent MAC address for veth8cfe8cb: No such file or directory
Sep 14 07:35:52 sentry-docker00.cs.umd.edu systemd-udevd[100203]: Could not generate persistent MAC address for vethf4323d8: No such file or directory
Sep 14 07:35:52 sentry-docker00.cs.umd.edu systemd-udevd[100204]: Could not generate persistent MAC address for vethfc3c771: No such file or directory
Sep 14 07:35:52 sentry-docker00.cs.umd.edu systemd-udevd[100207]: Could not generate persistent MAC address for veth7e71138: No such file or directory
Sep 14 07:35:52 sentry-docker00.cs.umd.edu systemd-udevd[100208]: Could not generate persistent MAC address for vethc6491f0: No such file or directory
Sep 14 07:35:52 sentry-docker00.cs.umd.edu systemd-udevd[100225]: Could not generate persistent MAC address for veth06f7d22: No such file or directory
Sep 14 07:35:52 sentry-docker00.cs.umd.edu systemd-udevd[100228]: Could not generate persistent MAC address for veth7efdfd4: No such file or directory
Sep 14 07:35:52 sentry-docker00.cs.umd.edu systemd-udevd[100233]: Could not generate persistent MAC address for veth761d980: No such file or directory
Sep 14 07:35:52 sentry-docker00.cs.umd.edu systemd-udevd[100269]: Could not generate persistent MAC address for vethed55fe7: No such file or directory
Sep 14 07:35:52 sentry-docker00.cs.umd.edu systemd-udevd[100243]: Could not generate persistent MAC address for veth6ecbfd3: No such file or directory
Sep 14 07:35:52 sentry-docker00.cs.umd.edu systemd-udevd[100235]: Could not generate persistent MAC address for vetheff4e83: No such file or directory
Sep 14 07:56:00 sentry-docker00.cs.umd.edu systemd-udevd[109508]: link_config: could not get ethtool features for vethf4323d8
Sep 14 07:56:00 sentry-docker00.cs.umd.edu systemd-udevd[109508]: Could not set offload features of vethf4323d8: No such device
Sep 14 07:56:00 sentry-docker00.cs.umd.edu systemd-udevd[109562]: Could not generate persistent MAC address for veth67ce9ed: No such file or directory
Sep 14 07:56:00 sentry-docker00.cs.umd.edu systemd-udevd[109564]: Could not generate persistent MAC address for veth97a2d69: No such file or directory
Sep 14 07:56:00 sentry-docker00.cs.umd.edu systemd-udevd[109566]: Could not generate persistent MAC address for veth1003918: No such file or directory
Sep 14 07:56:00 sentry-docker00.cs.umd.edu systemd-udevd[109573]: Could not generate persistent MAC address for veth5322b0e: No such file or directory
Sep 14 07:56:00 sentry-docker00.cs.umd.edu systemd-udevd[109570]: Could not generate persistent MAC address for veth7423249: No such file or directory
Sep 14 07:56:00 sentry-docker00.cs.umd.edu systemd-udevd[109577]: Could not generate persistent MAC address for vethac95048: No such file or directory
... 4 more distinct messages not shown
== strawberry (7 distinct, 38 total) ==
Sep 14 07:07:03 strawberry kernel: I/O error, dev sda, sector 206848 op 0x0:(READ) flags 0x80700 phys_seg 1 prio class 2 [x6]
Sep 14 07:07:03 strawberry kernel: I/O error, dev sda, sector 206848 op 0x0:(READ) flags 0x0 phys_seg 1 prio class 2 [x6]
Sep 14 07:07:03 strawberry kernel: Buffer I/O error on dev sda2, logical block 0, async page read [x6]
Sep 14 07:07:03 strawberry kernel: I/O error, dev sda, sector 2048 op 0x0:(READ) flags 0x80700 phys_seg 1 prio class 2 [x6]
Sep 14 07:07:03 strawberry kernel: I/O error, dev sda, sector 2048 op 0x0:(READ) flags 0x0 phys_seg 1 prio class 2 [x6]
Sep 14 07:07:03 strawberry kernel: Buffer I/O error on dev sda1, logical block 0, async page read [x6]
Sep 14 07:34:42 strawberry smartd[5314]: Device: /dev/sda [SAT], failed to read SMART Attribute Data [x2]
== submit10-cln25 (1 distinct, 1 total) ==
Sep 14 07:37:00 submit10-cln25 systemd: Failed at step EXEC spawning /usr/local/bin/cronjob: No such file or directory
== submit26-b9-f3 (1 distinct, 1 total) ==
Sep 14 08:01:32 submit26-b9-f3 systemd[1]: user(a)1001.service: Main process exited, code=killed, status=9/KILL
1
0
Command: /usr/local/sbin/syslog-digest.py
Time : 0.0442s
Status : exited 0
Output :
Syslog digest — 2026-09-14 07:05 EDT
Processed 2,186 lines, filtered 1,842 (84%). 344 unknown (94 distinct) from 23 host(s).
== abadi-computer (2 distinct, 2 total) ==
Sep 14 06:15:01 abadi-computer nologin[124955]: Attempted login by UNKNOWN (UID: 65534) on UNKNOWN
Sep 14 06:15:01 abadi-computer pipewire[124954]: mod.jackdbus-detect: Failed to receive jackdbus reply: org.freedesktop.DBus.Error.ServiceUnknown: The name org.jackaudio.service was not provided by any .service files
== b0b02.cs.umd.edu (1 distinct, 1 total) ==
Sep 14 06:43:03 b0b02.cs.umd.edu rustdesk[960621]: cannot open display:
== csfw00a (2 distinct, 135 total) ==
Sep 14 06:03:51 csfw00a kernel: bnxt_en 0000:09:00.0 eth3: NIC Link is Down [x133]
Sep 14 06:27:01 csfw00a ospf6d[1477]: [EC 100663307] Could not send entire message [x2]
== galahad.cs.umd.edu (1 distinct, 1 total) ==
Sep 14 06:19:12 galahad.cs.umd.edu gnome-software[2904800]: Only 0 apps for recent list, hiding
== galax (1 distinct, 1 total) ==
Sep 14 07:03:59 galax kernel: workqueue: dm_irq_work_func [amdgpu] hogged CPU for >10000us 1027 times, consider switching to WQ_UNBOUND
== hazfs.cs.umd.edu (1 distinct, 2 total) ==
Sep 14 06:25:01 hazfs.cs.umd.edu pcp[4062561]: pmlogger_daily failed - see /var/log/pcp/pmlogger/pmlogger_daily-K.log [x2]
== idm00 (1 distinct, 1 total) ==
Sep 14 06:53:54 idm00 named[4166701]: client @0x7f11a93e2ef8 10.73.240.42#56213: update '73.10.in-addr.arpa/IN' denied
== idmp0 (1 distinct, 1 total) ==
Sep 14 06:37:39 idmp0 named[1598691]: client @0x7f2d34043a38 10.73.240.43#56470: update '73.10.in-addr.arpa/IN' denied
== inbound00.cs.umd.edu (1 distinct, 1 total) ==
Sep 14 06:07:01 inbound00.cs.umd.edu systemd[1]: Configuration file /usr/lib/systemd/system/authentication_milter.service is marked executable. Please remove executable permission bits. Proceeding anyway.
== inbound01.cs.umd.edu (1 distinct, 1 total) ==
Sep 14 06:18:13 inbound01.cs.umd.edu systemd[1]: Configuration file /usr/lib/systemd/system/authentication_milter.service is marked executable. Please remove executable permission bits. Proceeding anyway.
== itmon02 (1 distinct, 42 total) ==
Sep 14 06:07:49 itmon02 sshd[1750555]: error: beginning MaxStartups throttling [x42]
== librenms (1 distinct, 1 total) ==
Sep 14 06:48:21 librenms puppet-agent[1190179]: The directory '/opt/librenms/rrd' contains 16515 entries, which exceeds the default soft limit 1000 and may cause excessive resource consumption and degraded performance. To remove this warning set a value for `max_files` parameter or consider using an alternate method to manage large directory trees
== neoavion (1 distinct, 1 total) ==
Sep 14 06:32:35 neoavion krb5_child[2615243]: No credentials cache found
== neodontcare.cs.umd.edu (7 distinct, 11 total) ==
Sep 14 06:13:30 neodontcare.cs.umd.edu gnome-software[7556]: Only 0 apps for recent list, hiding
Sep 14 06:13:39 neodontcare.cs.umd.edu packagekitd[2506354]: Failed to get cache filename for gnu-free-mono-fonts
Sep 14 06:13:39 neodontcare.cs.umd.edu packagekitd[2506354]: Failed to get cache filename for gnu-free-serif-fonts
Sep 14 06:13:40 neodontcare.cs.umd.edu packagekitd[2506354]: Failed to get cache filename for libreoffice [x2]
Sep 14 06:13:40 neodontcare.cs.umd.edu packagekitd[2506354]: Failed to get cache filename for cups-filesystem [x2]
Sep 14 06:13:40 neodontcare.cs.umd.edu packagekitd[2506354]: Failed to get cache filename for kernel [x2]
Sep 14 06:13:44 neodontcare.cs.umd.edu packagekitd[2506354]: failed to parse public key for /etc/pki/rpm-gpg/RPM-GPG-KEY-PQC-redhat-release [x2]
== newhonors2 (1 distinct, 24 total) ==
Sep 14 06:13:03 newhonors2 dhcpcd[2619391]: dhcpcd is not running [x24]
== orchids (5 distinct, 6 total) ==
Sep 14 06:11:31 orchids gnome-software[1516991]: Only 0 apps for recent list, hiding
Sep 14 06:11:38 orchids packagekitd[1069545]: Failed to get cache filename for libreoffice
Sep 14 06:11:38 orchids packagekitd[1069545]: Failed to get cache filename for cups-filesystem
Sep 14 06:11:38 orchids packagekitd[1069545]: Failed to get cache filename for kernel
Sep 14 06:11:40 orchids packagekitd[1069545]: failed to parse public key for /etc/pki/rpm-gpg/RPM-GPG-KEY-PQC-redhat-release [x2]
== outbound00.cs.umd.edu (1 distinct, 6 total) ==
Sep 14 06:09:09 outbound00.cs.umd.edu python3[4101528]: ldapdb [x6]
== outbound01.cs.umd.edu (1 distinct, 6 total) ==
Sep 14 06:13:06 outbound01.cs.umd.edu python3[2166347]: ldapdb [x6]
== sentry-docker00.cs.umd.edu (36 distinct, 36 total) ==
Sep 14 06:15:18 sentry-docker00.cs.umd.edu systemd-udevd[62196]: link_config: could not get ethtool features for veth34bcc63
Sep 14 06:15:18 sentry-docker00.cs.umd.edu systemd-udevd[62196]: Could not set offload features of veth34bcc63: No such device
Sep 14 06:15:18 sentry-docker00.cs.umd.edu systemd-udevd[62265]: Could not generate persistent MAC address for veth67348db: No such file or directory
Sep 14 06:15:18 sentry-docker00.cs.umd.edu systemd-udevd[62266]: Could not generate persistent MAC address for vethdb08593: No such file or directory
Sep 14 06:15:18 sentry-docker00.cs.umd.edu systemd-udevd[62269]: Could not generate persistent MAC address for vethb483463: No such file or directory
Sep 14 06:15:18 sentry-docker00.cs.umd.edu systemd-udevd[62270]: Could not generate persistent MAC address for veth36e7710: No such file or directory
Sep 14 06:15:18 sentry-docker00.cs.umd.edu systemd-udevd[62269]: Could not generate persistent MAC address for veth82362f9: No such file or directory
Sep 14 06:15:18 sentry-docker00.cs.umd.edu systemd-udevd[62289]: Could not generate persistent MAC address for veth6565741: No such file or directory
Sep 14 06:15:18 sentry-docker00.cs.umd.edu systemd-udevd[62280]: Could not generate persistent MAC address for veth9b82d7d: No such file or directory
Sep 14 06:15:18 sentry-docker00.cs.umd.edu systemd-udevd[62269]: Could not generate persistent MAC address for veth0fc952a: No such file or directory
Sep 14 06:15:18 sentry-docker00.cs.umd.edu systemd-udevd[62310]: Could not generate persistent MAC address for veth1a687f1: No such file or directory
Sep 14 06:15:18 sentry-docker00.cs.umd.edu systemd-udevd[62311]: Could not generate persistent MAC address for veth1d4fd75: No such file or directory
Sep 14 06:35:27 sentry-docker00.cs.umd.edu systemd-udevd[72017]: link_config: could not get ethtool features for veth67348db
Sep 14 06:35:27 sentry-docker00.cs.umd.edu systemd-udevd[72017]: Could not set offload features of veth67348db: No such device
Sep 14 06:35:27 sentry-docker00.cs.umd.edu systemd-udevd[72047]: Could not generate persistent MAC address for vetheddbbb0: No such file or directory
Sep 14 06:35:27 sentry-docker00.cs.umd.edu systemd-udevd[72046]: Could not generate persistent MAC address for veth8a358e8: No such file or directory
Sep 14 06:35:27 sentry-docker00.cs.umd.edu systemd-udevd[72050]: Could not generate persistent MAC address for vethf4dcdc0: No such file or directory
Sep 14 06:35:27 sentry-docker00.cs.umd.edu systemd-udevd[72051]: Could not generate persistent MAC address for veth5110454: No such file or directory
Sep 14 06:35:27 sentry-docker00.cs.umd.edu systemd-udevd[72066]: Could not generate persistent MAC address for veth39910a8: No such file or directory
Sep 14 06:35:27 sentry-docker00.cs.umd.edu systemd-udevd[72055]: Could not generate persistent MAC address for veth763af9d: No such file or directory
Sep 14 06:35:27 sentry-docker00.cs.umd.edu systemd-udevd[72093]: Could not generate persistent MAC address for vethcb4a035: No such file or directory
Sep 14 06:35:27 sentry-docker00.cs.umd.edu systemd-udevd[72099]: Could not generate persistent MAC address for vethfd50877: No such file or directory
Sep 14 06:35:27 sentry-docker00.cs.umd.edu systemd-udevd[72145]: Could not generate persistent MAC address for vethe5d1bc7: No such file or directory
Sep 14 06:35:27 sentry-docker00.cs.umd.edu systemd-udevd[72139]: Could not generate persistent MAC address for vethc7c9d9b: No such file or directory
Sep 14 06:55:35 sentry-docker00.cs.umd.edu systemd-udevd[81352]: link_config: could not get ethtool features for vethcb4a035
Sep 14 06:55:35 sentry-docker00.cs.umd.edu systemd-udevd[81352]: Could not set offload features of vethcb4a035: No such device
Sep 14 06:55:35 sentry-docker00.cs.umd.edu systemd-udevd[81422]: Could not generate persistent MAC address for veth3e0d3ee: No such file or directory
Sep 14 06:55:35 sentry-docker00.cs.umd.edu systemd-udevd[81421]: Could not generate persistent MAC address for veth799d53a: No such file or directory
Sep 14 06:55:35 sentry-docker00.cs.umd.edu systemd-udevd[81440]: Could not generate persistent MAC address for veth956db97: No such file or directory
Sep 14 06:55:35 sentry-docker00.cs.umd.edu systemd-udevd[81428]: Could not generate persistent MAC address for vethc87d21c: No such file or directory
... 6 more distinct messages not shown
== strawberry (9 distinct, 46 total) ==
Sep 14 06:07:03 strawberry kernel: I/O error, dev sda, sector 206848 op 0x0:(READ) flags 0x80700 phys_seg 1 prio class 2 [x7]
Sep 14 06:07:03 strawberry kernel: I/O error, dev sda, sector 206848 op 0x0:(READ) flags 0x0 phys_seg 1 prio class 2 [x7]
Sep 14 06:07:03 strawberry kernel: Buffer I/O error on dev sda2, logical block 0, async page read [x7]
Sep 14 06:07:03 strawberry kernel: I/O error, dev sda, sector 2048 op 0x0:(READ) flags 0x80700 phys_seg 1 prio class 2 [x7]
Sep 14 06:07:03 strawberry kernel: I/O error, dev sda, sector 2048 op 0x0:(READ) flags 0x0 phys_seg 1 prio class 2 [x7]
Sep 14 06:07:03 strawberry kernel: Buffer I/O error on dev sda1, logical block 0, async page read [x7]
Sep 14 06:31:04 strawberry nologin[2672574]: Attempted login by UNKNOWN (UID: 65534) on UNKNOWN
Sep 14 06:31:04 strawberry pipewire[2672572]: mod.jackdbus-detect: Failed to receive jackdbus reply: org.freedesktop.DBus.Error.ServiceUnknown: The name org.jackaudio.service was not provided by any .service files
Sep 14 06:34:42 strawberry smartd[5314]: Device: /dev/sda [SAT], failed to read SMART Attribute Data [x2]
== submit26-b9-f1 (9 distinct, 9 total) ==
Sep 14 06:25:51 submit26-b9-f1 setroubleshoot[1537653]: SELinux is preventing /usr/bin/python3.9 from create access on the directory /(null). For complete SELinux messages run: sealert -l 3ef7d677-731f-46bf-9c34-c2c55fea665c
Sep 14 06:25:51 submit26-b9-f1 setroubleshoot[1537653]: SELinux is preventing /usr/bin/python3.9 from add_name access on the directory /(null). For complete SELinux messages run: sealert -l aa60e26f-72e1-45f1-bc12-aa8b3b669e36
Sep 14 06:25:51 submit26-b9-f1 setroubleshoot[1537653]: SELinux is preventing /usr/bin/python3.9 from create access on the file /(null). For complete SELinux messages run: sealert -l d088fb43-23ee-4ae8-ae6a-5d1c041ee2d6
Sep 14 06:25:51 submit26-b9-f1 setroubleshoot[1537653]: SELinux is preventing /usr/bin/python3.9 from open access on the file /tmp/libdnf.ejZ14n/repodata/repomd.xml. For complete SELinux messages run: sealert -l 3b0d8c9a-6637-4d6e-a864-f1dd7c00377d
Sep 14 06:25:51 submit26-b9-f1 setroubleshoot[1537653]: SELinux is preventing /usr/bin/python3.9 from setattr access on the file repomd.xml. For complete SELinux messages run: sealert -l 0fd3339f-3ef2-45f3-9e58-65a58b42f3ee
Sep 14 06:25:51 submit26-b9-f1 setroubleshoot[1537653]: SELinux is preventing /usr/bin/python3.9 from read access on the directory libdnf.ejZ14n. For complete SELinux messages run: sealert -l 0d661d88-dc9e-469d-986b-52e29b353aa8
Sep 14 06:25:51 submit26-b9-f1 setroubleshoot[1537653]: SELinux is preventing /usr/bin/python3.9 from remove_name access on the directory repomd.xml. For complete SELinux messages run: sealert -l 405a8556-cf9f-4ef4-8525-0dca18d4259d
Sep 14 06:25:51 submit26-b9-f1 setroubleshoot[1537653]: SELinux is preventing /usr/bin/python3.9 from unlink access on the file repomd.xml. For complete SELinux messages run: sealert -l 3c38e23e-3631-4cb5-81c7-992675c836d9
Sep 14 06:25:51 submit26-b9-f1 setroubleshoot[1537653]: SELinux is preventing /usr/bin/python3.9 from rmdir access on the directory repodata. For complete SELinux messages run: sealert -l a070e9b5-2867-47d6-b2e3-3b7d99725848
== submit26-b9-f2 (9 distinct, 9 total) ==
Sep 14 06:06:46 submit26-b9-f2 setroubleshoot[673130]: SELinux is preventing /usr/bin/python3.9 from create access on the directory /(null). For complete SELinux messages run: sealert -l 0659d546-3107-4f75-b00f-008c85f41dc6
Sep 14 06:06:46 submit26-b9-f2 setroubleshoot[673130]: SELinux is preventing /usr/bin/python3.9 from add_name access on the directory /(null). For complete SELinux messages run: sealert -l 156d9270-3466-4356-b86f-1a128825961a
Sep 14 06:06:46 submit26-b9-f2 setroubleshoot[673130]: SELinux is preventing /usr/bin/python3.9 from create access on the file /(null). For complete SELinux messages run: sealert -l c8a40bf5-2fc4-46b3-b813-8592b3523339
Sep 14 06:06:46 submit26-b9-f2 setroubleshoot[673130]: SELinux is preventing /usr/bin/python3.9 from open access on the file /tmp/libdnf.VATyTK/repodata/repomd.xml. For complete SELinux messages run: sealert -l 7f4c3a8e-0f99-47c4-9baf-e1336fe24876
Sep 14 06:06:46 submit26-b9-f2 setroubleshoot[673130]: SELinux is preventing /usr/bin/python3.9 from setattr access on the file repomd.xml. For complete SELinux messages run: sealert -l 988123da-b724-4e6a-900c-33a2723fdaf1
Sep 14 06:06:46 submit26-b9-f2 setroubleshoot[673130]: SELinux is preventing /usr/bin/python3.9 from read access on the directory libdnf.VATyTK. For complete SELinux messages run: sealert -l ca585e2b-d50f-4264-8127-6b3fa04070c8
Sep 14 06:06:46 submit26-b9-f2 setroubleshoot[673130]: SELinux is preventing /usr/bin/python3.9 from remove_name access on the directory repomd.xml. For complete SELinux messages run: sealert -l 3a749560-1cec-40ca-a4dc-596841be3885
Sep 14 06:06:46 submit26-b9-f2 setroubleshoot[673130]: SELinux is preventing /usr/bin/python3.9 from unlink access on the file repomd.xml. For complete SELinux messages run: sealert -l 0aa52f08-94f8-474e-96d8-e818846941af
Sep 14 06:06:46 submit26-b9-f2 setroubleshoot[673130]: SELinux is preventing /usr/bin/python3.9 from rmdir access on the directory repodata. For complete SELinux messages run: sealert -l de019dc4-408f-439c-902a-676d18dfe8e7
== tlsrpt (1 distinct, 1 total) ==
Sep 14 06:38:02 tlsrpt (httpd)[2636741]: httpd.service: Referenced but unset environment variable evaluates to an empty string: OPTIONS
1
0
Command: /usr/local/sbin/syslog-digest.py
Time : 0.0426s
Status : exited 0
Output :
Syslog digest — 2026-09-14 06:05 EDT
Processed 1,940 lines, filtered 1,603 (82%). 337 unknown (88 distinct) from 18 host(s).
== b0b02.cs.umd.edu (1 distinct, 1 total) ==
Sep 14 05:42:59 b0b02.cs.umd.edu rustdesk[945417]: cannot open display:
== cheezit.cs.umd.edu (1 distinct, 2 total) ==
Sep 14 05:19:52 cheezit.cs.umd.edu sshd-session[3278067]: error: send_error: write: Connection reset by peer [x2]
== csfw00a (1 distinct, 135 total) ==
Sep 14 05:03:50 csfw00a kernel: bnxt_en 0000:09:00.0 eth3: NIC Link is Down [x135]
== galax (1 distinct, 1 total) ==
Sep 14 05:31:39 galax kernel: workqueue: dm_irq_work_func [amdgpu] hogged CPU for >10000us 515 times, consider switching to WQ_UNBOUND
== grades01.cs.umd.edu (1 distinct, 1 total) ==
Sep 14 05:48:26 grades01.cs.umd.edu puppet-agent[14105]: The directory '/srv/grades' contains 2471 entries, which exceeds the default soft limit 1000 and may cause excessive resource consumption and degraded performance. To remove this warning set a value for `max_files` parameter or consider using an alternate method to manage large directory trees
== hazfs.cs.umd.edu (1 distinct, 2 total) ==
Sep 14 05:25:03 hazfs.cs.umd.edu pcp[3746163]: pmlogger_daily failed - see /var/log/pcp/pmlogger/pmlogger_daily-K.log [x2]
== idm00 (1 distinct, 1 total) ==
Sep 14 05:53:54 idm00 named[4166701]: client @0x7f11a40214a8 10.73.240.42#52886: update '73.10.in-addr.arpa/IN' denied
== idmp0 (1 distinct, 1 total) ==
Sep 14 05:37:39 idmp0 named[1598691]: client @0x7f2d140302e8 10.73.240.43#63634: update '73.10.in-addr.arpa/IN' denied
== inbound01.cs.umd.edu (2 distinct, 2 total) ==
Sep 14 05:27:05 inbound01.cs.umd.edu krb5_child[2233678]: Client 'admin(a)UMD.EDU' not found in Kerberos database
Sep 14 05:27:15 inbound01.cs.umd.edu sshd-session[2233691]: error: Protocol major versions differ: 2 vs. 1
== itmon02 (1 distinct, 47 total) ==
Sep 14 05:08:09 itmon02 sshd[1750555]: error: beginning MaxStartups throttling [x47]
== matrix (12 distinct, 14 total) ==
Sep 14 05:29:59 matrix systemd[1]: networkd-dispatcher.service: Got notification message from PID 2153512, but reception only permitted for main PID 720
Sep 14 05:29:59 matrix systemd[1]: networkd-dispatcher.service: Got notification message from PID 2153524, but reception only permitted for main PID 720
Sep 14 05:30:07 matrix systemd[1]: networkd-dispatcher.service: Got notification message from PID 2153638, but reception only permitted for main PID 720
Sep 14 05:30:07 matrix systemd[1]: networkd-dispatcher.service: Got notification message from PID 2153644, but reception only permitted for main PID 720
Sep 14 05:30:07 matrix networkctl[2153658]: Interface "vethba21135" not found.
Sep 14 05:30:07 matrix systemd[1]: networkd-dispatcher.service: Got notification message from PID 2153658, but reception only permitted for main PID 720 [x2]
Sep 14 05:30:07 matrix systemd[1]: networkd-dispatcher.service: Got notification message from PID 2153716, but reception only permitted for main PID 720
Sep 14 05:30:07 matrix systemd[1]: networkd-dispatcher.service: Got notification message from PID 2153728, but reception only permitted for main PID 720
Sep 14 05:33:29 matrix systemd[1]: networkd-dispatcher.service: Got notification message from PID 2156444, but reception only permitted for main PID 720
Sep 14 05:33:29 matrix systemd[1]: networkd-dispatcher.service: Got notification message from PID 2156450, but reception only permitted for main PID 720
Sep 14 05:33:29 matrix networkctl[2156461]: Interface "vethf2578c3" not found.
Sep 14 05:33:29 matrix systemd[1]: networkd-dispatcher.service: Got notification message from PID 2156461, but reception only permitted for main PID 720 [x2]
== newhonors2 (1 distinct, 24 total) ==
Sep 14 05:13:02 newhonors2 dhcpcd[2617427]: dhcpcd is not running [x24]
== outbound00.cs.umd.edu (1 distinct, 6 total) ==
Sep 14 05:09:09 outbound00.cs.umd.edu python3[4087615]: ldapdb [x6]
== outbound01.cs.umd.edu (2 distinct, 8 total) ==
Sep 14 05:08:28 outbound01.cs.umd.edu python3[2150624]: ldapdb [x7]
Sep 14 05:09:33 outbound01.cs.umd.edu systemd[1]: Configuration file /usr/lib/systemd/system/authentication_milter.service is marked executable. Please remove executable permission bits. Proceeding anyway.
== sentry-docker00.cs.umd.edu (36 distinct, 36 total) ==
Sep 14 05:14:53 sentry-docker00.cs.umd.edu systemd-udevd[33684]: link_config: could not get ethtool features for vethabb817b
Sep 14 05:14:53 sentry-docker00.cs.umd.edu systemd-udevd[33684]: Could not set offload features of vethabb817b: No such device
Sep 14 05:14:54 sentry-docker00.cs.umd.edu systemd-udevd[33753]: Could not generate persistent MAC address for veth1fbbff8: No such file or directory
Sep 14 05:14:54 sentry-docker00.cs.umd.edu systemd-udevd[33754]: Could not generate persistent MAC address for vethc472a0c: No such file or directory
Sep 14 05:14:54 sentry-docker00.cs.umd.edu systemd-udevd[33757]: Could not generate persistent MAC address for veth85b44a6: No such file or directory
Sep 14 05:14:54 sentry-docker00.cs.umd.edu systemd-udevd[33779]: Could not generate persistent MAC address for vethaba0b23: No such file or directory
Sep 14 05:14:54 sentry-docker00.cs.umd.edu systemd-udevd[33769]: Could not generate persistent MAC address for vethd8eebb7: No such file or directory
Sep 14 05:14:54 sentry-docker00.cs.umd.edu systemd-udevd[33777]: Could not generate persistent MAC address for veth367005b: No such file or directory
Sep 14 05:14:54 sentry-docker00.cs.umd.edu systemd-udevd[33783]: Could not generate persistent MAC address for veth65396ac: No such file or directory
Sep 14 05:14:54 sentry-docker00.cs.umd.edu systemd-udevd[33784]: Could not generate persistent MAC address for veth7cc4d53: No such file or directory
Sep 14 05:14:54 sentry-docker00.cs.umd.edu systemd-udevd[33843]: Could not generate persistent MAC address for veth52de9e1: No such file or directory
Sep 14 05:14:54 sentry-docker00.cs.umd.edu systemd-udevd[33844]: Could not generate persistent MAC address for veth4a828e5: No such file or directory
Sep 14 05:35:02 sentry-docker00.cs.umd.edu systemd-udevd[43376]: link_config: could not get ethtool features for veth52de9e1
Sep 14 05:35:02 sentry-docker00.cs.umd.edu systemd-udevd[43376]: Could not set offload features of veth52de9e1: No such device
Sep 14 05:35:02 sentry-docker00.cs.umd.edu systemd-udevd[43409]: Could not generate persistent MAC address for veth66f33a7: No such file or directory
Sep 14 05:35:02 sentry-docker00.cs.umd.edu systemd-udevd[43410]: Could not generate persistent MAC address for vethf86cd3d: No such file or directory
Sep 14 05:35:02 sentry-docker00.cs.umd.edu systemd-udevd[43413]: Could not generate persistent MAC address for vethf8fdc56: No such file or directory
Sep 14 05:35:02 sentry-docker00.cs.umd.edu systemd-udevd[43414]: Could not generate persistent MAC address for veth48fd6de: No such file or directory
Sep 14 05:35:02 sentry-docker00.cs.umd.edu systemd-udevd[43437]: Could not generate persistent MAC address for veth5fb3cfe: No such file or directory
Sep 14 05:35:02 sentry-docker00.cs.umd.edu systemd-udevd[43438]: Could not generate persistent MAC address for vetha54af06: No such file or directory
Sep 14 05:35:02 sentry-docker00.cs.umd.edu systemd-udevd[43448]: Could not generate persistent MAC address for vethb26d7cd: No such file or directory
Sep 14 05:35:02 sentry-docker00.cs.umd.edu systemd-udevd[43446]: Could not generate persistent MAC address for vetha4c015b: No such file or directory
Sep 14 05:35:02 sentry-docker00.cs.umd.edu systemd-udevd[43483]: Could not generate persistent MAC address for vethad71f78: No such file or directory
Sep 14 05:35:02 sentry-docker00.cs.umd.edu systemd-udevd[43485]: Could not generate persistent MAC address for vethfc78923: No such file or directory
Sep 14 05:55:10 sentry-docker00.cs.umd.edu systemd-udevd[52788]: link_config: could not get ethtool features for vetha4c015b
Sep 14 05:55:10 sentry-docker00.cs.umd.edu systemd-udevd[52788]: Could not set offload features of vetha4c015b: No such device
Sep 14 05:55:10 sentry-docker00.cs.umd.edu systemd-udevd[52812]: Could not generate persistent MAC address for veth34bcc63: No such file or directory
Sep 14 05:55:10 sentry-docker00.cs.umd.edu systemd-udevd[52813]: Could not generate persistent MAC address for veth9c93d54: No such file or directory
Sep 14 05:55:10 sentry-docker00.cs.umd.edu systemd-udevd[52831]: Could not generate persistent MAC address for vethc7261b7: No such file or directory
Sep 14 05:55:10 sentry-docker00.cs.umd.edu systemd-udevd[52827]: Could not generate persistent MAC address for veth9e719b1: No such file or directory
... 6 more distinct messages not shown
== strawberry (7 distinct, 38 total) ==
Sep 14 05:07:03 strawberry kernel: I/O error, dev sda, sector 206848 op 0x0:(READ) flags 0x80700 phys_seg 1 prio class 2 [x6]
Sep 14 05:07:03 strawberry kernel: I/O error, dev sda, sector 206848 op 0x0:(READ) flags 0x0 phys_seg 1 prio class 2 [x6]
Sep 14 05:07:03 strawberry kernel: Buffer I/O error on dev sda2, logical block 0, async page read [x6]
Sep 14 05:07:03 strawberry kernel: I/O error, dev sda, sector 2048 op 0x0:(READ) flags 0x80700 phys_seg 1 prio class 2 [x6]
Sep 14 05:07:03 strawberry kernel: I/O error, dev sda, sector 2048 op 0x0:(READ) flags 0x0 phys_seg 1 prio class 2 [x6]
Sep 14 05:07:03 strawberry kernel: Buffer I/O error on dev sda1, logical block 0, async page read [x6]
Sep 14 05:34:42 strawberry smartd[5314]: Device: /dev/sda [SAT], failed to read SMART Attribute Data [x2]
== submit26-b9-f3 (9 distinct, 9 total) ==
Sep 14 05:06:40 submit26-b9-f3 setroubleshoot[810213]: SELinux is preventing /usr/bin/python3.9 from create access on the directory /(null). For complete SELinux messages run: sealert -l a653b772-cbcd-438b-bae5-23c3dc69b31b
Sep 14 05:06:40 submit26-b9-f3 setroubleshoot[810213]: SELinux is preventing /usr/bin/python3.9 from add_name access on the directory /(null). For complete SELinux messages run: sealert -l 3e904634-6caa-4202-8c92-f139db798859
Sep 14 05:06:40 submit26-b9-f3 setroubleshoot[810213]: SELinux is preventing /usr/bin/python3.9 from create access on the file /(null). For complete SELinux messages run: sealert -l 580b20e4-ec2c-433d-905c-5bd417fba033
Sep 14 05:06:41 submit26-b9-f3 setroubleshoot[810213]: SELinux is preventing /usr/bin/python3.9 from open access on the file /tmp/libdnf.RD0epX/repodata/repomd.xml. For complete SELinux messages run: sealert -l 27f29d48-5e7c-4db7-b051-8ac055737d6f
Sep 14 05:06:41 submit26-b9-f3 setroubleshoot[810213]: SELinux is preventing /usr/bin/python3.9 from setattr access on the file repomd.xml. For complete SELinux messages run: sealert -l bff72452-d40a-430b-9060-dd0a48f5b6ba
Sep 14 05:06:41 submit26-b9-f3 setroubleshoot[810213]: SELinux is preventing /usr/bin/python3.9 from read access on the directory libdnf.RD0epX. For complete SELinux messages run: sealert -l 9638d396-8ce5-4e6a-ae47-45cd3985e1cd
Sep 14 05:06:41 submit26-b9-f3 setroubleshoot[810213]: SELinux is preventing /usr/bin/python3.9 from remove_name access on the directory repomd.xml. For complete SELinux messages run: sealert -l 6da64b94-7024-45a9-b8c2-3b9812517407
Sep 14 05:06:41 submit26-b9-f3 setroubleshoot[810213]: SELinux is preventing /usr/bin/python3.9 from unlink access on the file repomd.xml. For complete SELinux messages run: sealert -l 64cbe179-abf1-4d5a-bade-bb164897ee65
Sep 14 05:06:41 submit26-b9-f3 setroubleshoot[810213]: SELinux is preventing /usr/bin/python3.9 from rmdir access on the directory repodata. For complete SELinux messages run: sealert -l d2e35b1a-e27c-4f91-9217-2bb1204e1e68
== submit26-b9-f4 (9 distinct, 9 total) ==
Sep 14 05:24:43 submit26-b9-f4 setroubleshoot[602533]: SELinux is preventing /usr/bin/python3.9 from create access on the directory /(null). For complete SELinux messages run: sealert -l ee160f23-b161-4f4a-9985-c4edfd3a5beb
Sep 14 05:24:43 submit26-b9-f4 setroubleshoot[602533]: SELinux is preventing /usr/bin/python3.9 from add_name access on the directory /(null). For complete SELinux messages run: sealert -l 89a83821-4b24-4081-9973-0a79ca6ed5b4
Sep 14 05:24:43 submit26-b9-f4 setroubleshoot[602533]: SELinux is preventing /usr/bin/python3.9 from create access on the file /(null). For complete SELinux messages run: sealert -l f73955d6-1416-45f9-bab6-ff1f3ea07e9d
Sep 14 05:24:43 submit26-b9-f4 setroubleshoot[602533]: SELinux is preventing /usr/bin/python3.9 from open access on the file /tmp/libdnf.IOE0R9/repodata/repomd.xml. For complete SELinux messages run: sealert -l 9f8f24a0-8fb6-454d-a103-31a8f7a6efa0
Sep 14 05:24:43 submit26-b9-f4 setroubleshoot[602533]: SELinux is preventing /usr/bin/python3.9 from setattr access on the file repomd.xml. For complete SELinux messages run: sealert -l 20293136-86a3-40ba-a651-cff48d36059e
Sep 14 05:24:43 submit26-b9-f4 setroubleshoot[602533]: SELinux is preventing /usr/bin/python3.9 from read access on the directory libdnf.IOE0R9. For complete SELinux messages run: sealert -l 25f86b49-4ee7-4f60-ad1c-73a70032560c
Sep 14 05:24:43 submit26-b9-f4 setroubleshoot[602533]: SELinux is preventing /usr/bin/python3.9 from remove_name access on the directory repomd.xml. For complete SELinux messages run: sealert -l eec250fb-073f-456d-93bc-f98776fd476d
Sep 14 05:24:43 submit26-b9-f4 setroubleshoot[602533]: SELinux is preventing /usr/bin/python3.9 from unlink access on the file repomd.xml. For complete SELinux messages run: sealert -l c9209e04-a349-43d5-8cb2-3e303e48df74
Sep 14 05:24:43 submit26-b9-f4 setroubleshoot[602533]: SELinux is preventing /usr/bin/python3.9 from rmdir access on the directory repodata. For complete SELinux messages run: sealert -l 3178d5f5-80e9-404b-92b7-9bef397a8915
1
0
Command: /usr/local/sbin/syslog-digest.py
Time : 0.0442s
Status : exited 0
Output :
Syslog digest — 2026-09-14 05:05 EDT
Processed 2,475 lines, filtered 2,172 (87%). 303 unknown (62 distinct) from 15 host(s).
== abadi-computer (2 distinct, 2 total) ==
Sep 14 04:15:00 abadi-computer nologin[114101]: Attempted login by UNKNOWN (UID: 65534) on UNKNOWN
Sep 14 04:15:00 abadi-computer pipewire[114099]: mod.jackdbus-detect: Failed to receive jackdbus reply: org.freedesktop.DBus.Error.ServiceUnknown: The name org.jackaudio.service was not provided by any .service files
== b0b02.cs.umd.edu (1 distinct, 1 total) ==
Sep 14 04:42:55 b0b02.cs.umd.edu rustdesk[930239]: cannot open display:
== csfw00a (2 distinct, 138 total) ==
Sep 14 04:04:06 csfw00a kernel: bnxt_en 0000:09:00.0 eth3: NIC Link is Down [x134]
Sep 14 04:08:51 csfw00a ospf6d[1477]: [EC 100663307] Could not send entire message [x4]
== forge00 (1 distinct, 1 total) ==
Sep 14 04:09:03 forge00 (httpd)[3685577]: httpd.service: Referenced but unset environment variable evaluates to an empty string: OPTIONS
== galax (5 distinct, 5 total) ==
Sep 14 04:05:06 galax kernel: workqueue: dm_irq_work_func [amdgpu] hogged CPU for >10000us 35 times, consider switching to WQ_UNBOUND
Sep 14 04:10:52 galax kernel: workqueue: dm_irq_work_func [amdgpu] hogged CPU for >10000us 67 times, consider switching to WQ_UNBOUND
Sep 14 04:22:24 galax kernel: workqueue: dm_irq_work_func [amdgpu] hogged CPU for >10000us 131 times, consider switching to WQ_UNBOUND
Sep 14 04:33:00 galax kernel: hrtimer: interrupt took 10460 ns
Sep 14 04:45:29 galax kernel: workqueue: dm_irq_work_func [amdgpu] hogged CPU for >10000us 259 times, consider switching to WQ_UNBOUND
== hazfs.cs.umd.edu (1 distinct, 2 total) ==
Sep 14 04:25:03 hazfs.cs.umd.edu pcp[3430818]: pmlogger_daily failed - see /var/log/pcp/pmlogger/pmlogger_daily-K.log [x2]
== idm00 (1 distinct, 1 total) ==
Sep 14 04:53:54 idm00 named[4166701]: client @0x7f11a4068068 10.73.240.42#54820: update '73.10.in-addr.arpa/IN' denied
== idmp0 (1 distinct, 1 total) ==
Sep 14 04:37:39 idmp0 named[1598691]: client @0x7f2d08972e18 10.73.240.43#61862: update '73.10.in-addr.arpa/IN' denied
== itmon02 (1 distinct, 41 total) ==
Sep 14 04:07:53 itmon02 sshd[1750555]: error: beginning MaxStartups throttling [x41]
== newhonors2 (1 distinct, 24 total) ==
Sep 14 04:13:03 newhonors2 dhcpcd[2615563]: dhcpcd is not running [x24]
== outbound00.cs.umd.edu (1 distinct, 6 total) ==
Sep 14 04:09:09 outbound00.cs.umd.edu python3[4073583]: ldapdb [x6]
== outbound01.cs.umd.edu (1 distinct, 6 total) ==
Sep 14 04:13:06 outbound01.cs.umd.edu python3[2137418]: ldapdb [x6]
== sentry-docker00.cs.umd.edu (34 distinct, 34 total) ==
Sep 14 04:14:28 sentry-docker00.cs.umd.edu systemd-udevd[5102]: link_config: could not get ethtool features for vethf53ccd0
Sep 14 04:14:28 sentry-docker00.cs.umd.edu systemd-udevd[5102]: Could not set offload features of vethf53ccd0: No such device
Sep 14 04:14:29 sentry-docker00.cs.umd.edu systemd-udevd[5139]: Could not generate persistent MAC address for veth49d25eb: No such file or directory
Sep 14 04:14:29 sentry-docker00.cs.umd.edu systemd-udevd[5140]: Could not generate persistent MAC address for veth58acd44: No such file or directory
Sep 14 04:14:29 sentry-docker00.cs.umd.edu systemd-udevd[5143]: Could not generate persistent MAC address for vethdfedd11: No such file or directory
Sep 14 04:14:29 sentry-docker00.cs.umd.edu systemd-udevd[5144]: Could not generate persistent MAC address for veth11f69f0: No such file or directory
Sep 14 04:14:29 sentry-docker00.cs.umd.edu systemd-udevd[5167]: Could not generate persistent MAC address for veth249aeb6: No such file or directory
Sep 14 04:14:29 sentry-docker00.cs.umd.edu systemd-udevd[5168]: Could not generate persistent MAC address for veth537b6c7: No such file or directory
Sep 14 04:14:29 sentry-docker00.cs.umd.edu systemd-udevd[5193]: Could not generate persistent MAC address for veth8e676b6: No such file or directory
Sep 14 04:14:29 sentry-docker00.cs.umd.edu systemd-udevd[5194]: Could not generate persistent MAC address for veth26e6527: No such file or directory
Sep 14 04:14:29 sentry-docker00.cs.umd.edu systemd-udevd[5197]: Could not generate persistent MAC address for vethdf075ed: No such file or directory
Sep 14 04:14:29 sentry-docker00.cs.umd.edu systemd-udevd[5230]: Could not generate persistent MAC address for vetheac80d8: No such file or directory
Sep 14 04:34:37 sentry-docker00.cs.umd.edu systemd-udevd[14967]: Could not generate persistent MAC address for veth4e0e211: No such file or directory
Sep 14 04:34:37 sentry-docker00.cs.umd.edu systemd-udevd[14968]: Could not generate persistent MAC address for vethee6c444: No such file or directory
Sep 14 04:34:37 sentry-docker00.cs.umd.edu systemd-udevd[14971]: Could not generate persistent MAC address for vethbdb6f75: No such file or directory
Sep 14 04:34:37 sentry-docker00.cs.umd.edu systemd-udevd[14972]: Could not generate persistent MAC address for vethd53713a: No such file or directory
Sep 14 04:34:37 sentry-docker00.cs.umd.edu systemd-udevd[14979]: Could not generate persistent MAC address for vethd66fce2: No such file or directory
Sep 14 04:34:37 sentry-docker00.cs.umd.edu systemd-udevd[14989]: Could not generate persistent MAC address for vethbafc93e: No such file or directory
Sep 14 04:34:37 sentry-docker00.cs.umd.edu systemd-udevd[14997]: Could not generate persistent MAC address for veth406aa19: No such file or directory
Sep 14 04:34:37 sentry-docker00.cs.umd.edu systemd-udevd[14998]: Could not generate persistent MAC address for veth1594cf2: No such file or directory
Sep 14 04:34:37 sentry-docker00.cs.umd.edu systemd-udevd[15005]: Could not generate persistent MAC address for vethf3c2bb7: No such file or directory
Sep 14 04:34:37 sentry-docker00.cs.umd.edu systemd-udevd[15001]: Could not generate persistent MAC address for vethb0c8dc1: No such file or directory
Sep 14 04:54:45 sentry-docker00.cs.umd.edu systemd-udevd[24298]: link_config: could not get ethtool features for veth406aa19
Sep 14 04:54:45 sentry-docker00.cs.umd.edu systemd-udevd[24298]: Could not set offload features of veth406aa19: No such device
Sep 14 04:54:45 sentry-docker00.cs.umd.edu systemd-udevd[24333]: Could not generate persistent MAC address for vethd1cea19: No such file or directory
Sep 14 04:54:45 sentry-docker00.cs.umd.edu systemd-udevd[24334]: Could not generate persistent MAC address for veth7ae4c96: No such file or directory
Sep 14 04:54:45 sentry-docker00.cs.umd.edu systemd-udevd[24337]: Could not generate persistent MAC address for vethabb817b: No such file or directory
Sep 14 04:54:45 sentry-docker00.cs.umd.edu systemd-udevd[24338]: Could not generate persistent MAC address for veth86d44d9: No such file or directory
Sep 14 04:54:46 sentry-docker00.cs.umd.edu systemd-udevd[24354]: Could not generate persistent MAC address for veth51af0b2: No such file or directory
Sep 14 04:54:46 sentry-docker00.cs.umd.edu systemd-udevd[24346]: Could not generate persistent MAC address for veth6b316f1: No such file or directory
... 4 more distinct messages not shown
== smokeping-slave (1 distinct, 1 total) ==
Sep 14 04:15:31 smokeping-slave nologin[1271015]: Attempted login by UNKNOWN (UID: 65534) on UNKNOWN
== strawberry (9 distinct, 40 total) ==
Sep 14 04:07:03 strawberry kernel: I/O error, dev sda, sector 206848 op 0x0:(READ) flags 0x80700 phys_seg 1 prio class 2 [x6]
Sep 14 04:07:03 strawberry kernel: I/O error, dev sda, sector 206848 op 0x0:(READ) flags 0x0 phys_seg 1 prio class 2 [x6]
Sep 14 04:07:03 strawberry kernel: Buffer I/O error on dev sda2, logical block 0, async page read [x6]
Sep 14 04:07:03 strawberry kernel: I/O error, dev sda, sector 2048 op 0x0:(READ) flags 0x80700 phys_seg 1 prio class 2 [x6]
Sep 14 04:07:03 strawberry kernel: I/O error, dev sda, sector 2048 op 0x0:(READ) flags 0x0 phys_seg 1 prio class 2 [x6]
Sep 14 04:07:03 strawberry kernel: Buffer I/O error on dev sda1, logical block 0, async page read [x6]
Sep 14 04:15:04 strawberry nologin[2663799]: Attempted login by UNKNOWN (UID: 65534) on UNKNOWN
Sep 14 04:15:04 strawberry pipewire[2663798]: mod.jackdbus-detect: Failed to receive jackdbus reply: org.freedesktop.DBus.Error.ServiceUnknown: The name org.jackaudio.service was not provided by any .service files
Sep 14 04:34:42 strawberry smartd[5314]: Device: /dev/sda [SAT], failed to read SMART Attribute Data [x2]
1
0
Command: /usr/local/sbin/syslog-digest.py
Time : 0.0428s
Status : exited 0
Output :
Syslog digest — 2026-09-14 04:05 EDT
Processed 1,721 lines, filtered 1,338 (77%). 383 unknown (79 distinct) from 22 host(s).
== b0b02.cs.umd.edu (1 distinct, 1 total) ==
Sep 14 03:42:51 b0b02.cs.umd.edu rustdesk[914796]: cannot open display:
== csfw00a (1 distinct, 126 total) ==
Sep 14 03:04:01 csfw00a kernel: bnxt_en 0000:09:00.0 eth3: NIC Link is Down [x126]
== galax (9 distinct, 71 total) ==
Sep 14 03:05:42 galax boltd[2250]: watchdog: failed to send ping: failed to send msg: Connection refused [x32]
Sep 14 03:05:42 galax systemd-journald[670]: Failed to send WATCHDOG=1 notification message: Transport endpoint is not connected [x32]
Sep 14 03:54:09 galax falcon-sensor[1462]: CrowdStrike(4): Could not retrieve DisableProxy value: c0000225
Sep 14 03:54:09 galax falcon-sensor[1462]: CrowdStrike(4): ConnectWithProxy: Unable to get application proxy host from CsConfig: c0000225
Sep 14 03:59:30 galax kernel: workqueue: dm_irq_work_func [amdgpu] hogged CPU for >10000us 4 times, consider switching to WQ_UNBOUND
Sep 14 03:59:41 galax kernel: workqueue: dm_irq_work_func [amdgpu] hogged CPU for >10000us 5 times, consider switching to WQ_UNBOUND
Sep 14 04:00:03 galax kernel: workqueue: dm_irq_work_func [amdgpu] hogged CPU for >10000us 7 times, consider switching to WQ_UNBOUND
Sep 14 04:00:46 galax kernel: workqueue: dm_irq_work_func [amdgpu] hogged CPU for >10000us 11 times, consider switching to WQ_UNBOUND
Sep 14 04:02:13 galax kernel: workqueue: dm_irq_work_func [amdgpu] hogged CPU for >10000us 19 times, consider switching to WQ_UNBOUND
== hazfs.cs.umd.edu (1 distinct, 2 total) ==
Sep 14 03:25:10 hazfs.cs.umd.edu pcp[3115121]: pmlogger_daily failed - see /var/log/pcp/pmlogger/pmlogger_daily-K.log [x2]
== idm00 (1 distinct, 1 total) ==
Sep 14 03:53:54 idm00 named[4166701]: client @0x7f11a00432a8 10.73.240.42#52263: update '73.10.in-addr.arpa/IN' denied
== idmp0 (1 distinct, 1 total) ==
Sep 14 03:37:39 idmp0 named[1598691]: client @0x7f2d480190a8 10.73.240.43#49941: update '73.10.in-addr.arpa/IN' denied
== inbound00.cs.umd.edu (2 distinct, 4 total) ==
Sep 14 03:16:35 inbound00.cs.umd.edu krb5_child[4175851]: Preauthentication failed [x3]
Sep 14 03:34:04 inbound00.cs.umd.edu krb5_child[4180206]: Client 'admin(a)UMD.EDU' not found in Kerberos database
== itmon02 (2 distinct, 48 total) ==
Sep 14 03:08:10 itmon02 sshd[1750555]: error: beginning MaxStartups throttling [x47]
Sep 14 03:15:06 itmon02 (httpd)[3802557]: httpd.service: Referenced but unset environment variable evaluates to an empty string: OPTIONS
== kadath.cs.umd.edu (1 distinct, 1 total) ==
Sep 14 03:47:30 kadath.cs.umd.edu puppet-agent[3763851]: (Facter) invalid or malformed lldp data: MalformedDataError: no lldp interface data found
== krispykreme.cs.umd.edu (1 distinct, 1 total) ==
Sep 14 03:15:01 krispykreme.cs.umd.edu sshd-session[1917632]: error: send_error: write: Connection reset by peer
== librenms (1 distinct, 1 total) ==
Sep 14 03:47:03 librenms (httpd)[1033345]: httpd.service: Referenced but unset environment variable evaluates to an empty string: OPTIONS
== mcstic (6 distinct, 6 total) ==
Sep 14 03:55:02 mcstic sshd[559148]: error: kex_protocol_error: type 20 seq 2 [preauth]
Sep 14 03:55:02 mcstic sshd[559148]: error: kex_protocol_error: type 30 seq 3 [preauth]
Sep 14 03:55:02 mcstic sshd[559148]: error: kex_protocol_error: type 20 seq 4 [preauth]
Sep 14 03:55:02 mcstic sshd[559148]: error: kex_protocol_error: type 30 seq 5 [preauth]
Sep 14 03:55:04 mcstic sshd[559148]: error: kex_protocol_error: type 20 seq 6 [preauth]
Sep 14 03:55:04 mcstic sshd[559148]: error: kex_protocol_error: type 30 seq 7 [preauth]
== netbox (1 distinct, 1 total) ==
Sep 14 03:08:02 netbox (httpd)[3188187]: httpd.service: Referenced but unset environment variable evaluates to an empty string: OPTIONS
== newhonors2 (1 distinct, 24 total) ==
Sep 14 03:13:03 newhonors2 dhcpcd[2613721]: dhcpcd is not running [x24]
== outbound00.cs.umd.edu (2 distinct, 8 total) ==
Sep 14 03:09:09 outbound00.cs.umd.edu python3[4058906]: ldapdb [x7]
Sep 14 03:24:54 outbound00.cs.umd.edu systemd[1]: Configuration file /usr/lib/systemd/system/authentication_milter.service is marked executable. Please remove executable permission bits. Proceeding anyway.
== outbound01.cs.umd.edu (1 distinct, 6 total) ==
Sep 14 03:13:06 outbound01.cs.umd.edu python3[2123467]: ldapdb [x6]
== sentry-docker00.cs.umd.edu (36 distinct, 36 total) ==
Sep 14 03:14:03 sentry-docker00.cs.umd.edu systemd-udevd[4170156]: link_config: could not get ethtool features for veth38cb52d
Sep 14 03:14:03 sentry-docker00.cs.umd.edu systemd-udevd[4170156]: Could not set offload features of veth38cb52d: No such device
Sep 14 03:14:04 sentry-docker00.cs.umd.edu systemd-udevd[4170185]: Could not generate persistent MAC address for veth3509935: No such file or directory
Sep 14 03:14:04 sentry-docker00.cs.umd.edu systemd-udevd[4170184]: Could not generate persistent MAC address for veth82270b2: No such file or directory
Sep 14 03:14:04 sentry-docker00.cs.umd.edu systemd-udevd[4170188]: Could not generate persistent MAC address for veth3aaf07f: No such file or directory
Sep 14 03:14:04 sentry-docker00.cs.umd.edu systemd-udevd[4170189]: Could not generate persistent MAC address for veth7562b35: No such file or directory
Sep 14 03:14:04 sentry-docker00.cs.umd.edu systemd-udevd[4170212]: Could not generate persistent MAC address for vetha464493: No such file or directory
Sep 14 03:14:04 sentry-docker00.cs.umd.edu systemd-udevd[4170213]: Could not generate persistent MAC address for vethd0693aa: No such file or directory
Sep 14 03:14:04 sentry-docker00.cs.umd.edu systemd-udevd[4170231]: Could not generate persistent MAC address for veth5add7ea: No such file or directory
Sep 14 03:14:04 sentry-docker00.cs.umd.edu systemd-udevd[4170229]: Could not generate persistent MAC address for veth2f9a1a9: No such file or directory
Sep 14 03:14:04 sentry-docker00.cs.umd.edu systemd-udevd[4170248]: Could not generate persistent MAC address for veth1d46614: No such file or directory
Sep 14 03:14:04 sentry-docker00.cs.umd.edu systemd-udevd[4170253]: Could not generate persistent MAC address for vethb2899b3: No such file or directory
Sep 14 03:34:12 sentry-docker00.cs.umd.edu systemd-udevd[4179595]: link_config: could not get ethtool features for veth3aaf07f
Sep 14 03:34:12 sentry-docker00.cs.umd.edu systemd-udevd[4179595]: Could not set offload features of veth3aaf07f: No such device
Sep 14 03:34:12 sentry-docker00.cs.umd.edu systemd-udevd[4179629]: Could not generate persistent MAC address for veth55b0909: No such file or directory
Sep 14 03:34:12 sentry-docker00.cs.umd.edu systemd-udevd[4179630]: Could not generate persistent MAC address for veth9c9f433: No such file or directory
Sep 14 03:34:12 sentry-docker00.cs.umd.edu systemd-udevd[4179633]: Could not generate persistent MAC address for veth1cad7a5: No such file or directory
Sep 14 03:34:12 sentry-docker00.cs.umd.edu systemd-udevd[4179634]: Could not generate persistent MAC address for veth4afaa4f: No such file or directory
Sep 14 03:34:12 sentry-docker00.cs.umd.edu systemd-udevd[4179657]: Could not generate persistent MAC address for veth7378d49: No such file or directory
Sep 14 03:34:12 sentry-docker00.cs.umd.edu systemd-udevd[4179658]: Could not generate persistent MAC address for veth11f66a6: No such file or directory
Sep 14 03:34:12 sentry-docker00.cs.umd.edu systemd-udevd[4179676]: Could not generate persistent MAC address for veth642b6fb: No such file or directory
Sep 14 03:34:12 sentry-docker00.cs.umd.edu systemd-udevd[4179672]: Could not generate persistent MAC address for vethe0aacf9: No such file or directory
Sep 14 03:34:12 sentry-docker00.cs.umd.edu systemd-udevd[4179685]: Could not generate persistent MAC address for vethb88157b: No such file or directory
Sep 14 03:34:12 sentry-docker00.cs.umd.edu systemd-udevd[4179686]: Could not generate persistent MAC address for veth7e649bf: No such file or directory
Sep 14 03:54:20 sentry-docker00.cs.umd.edu systemd-udevd[4188986]: link_config: could not get ethtool features for veth55b0909
Sep 14 03:54:20 sentry-docker00.cs.umd.edu systemd-udevd[4188986]: Could not set offload features of veth55b0909: No such device
Sep 14 03:54:20 sentry-docker00.cs.umd.edu systemd-udevd[4189019]: Could not generate persistent MAC address for veth6b59cc9: No such file or directory
Sep 14 03:54:20 sentry-docker00.cs.umd.edu systemd-udevd[4189020]: Could not generate persistent MAC address for vethdb514df: No such file or directory
Sep 14 03:54:20 sentry-docker00.cs.umd.edu systemd-udevd[4189023]: Could not generate persistent MAC address for vethf53ccd0: No such file or directory
Sep 14 03:54:20 sentry-docker00.cs.umd.edu systemd-udevd[4189024]: Could not generate persistent MAC address for veth0905bd2: No such file or directory
... 6 more distinct messages not shown
== strawberry (7 distinct, 38 total) ==
Sep 14 03:07:04 strawberry kernel: I/O error, dev sda, sector 206848 op 0x0:(READ) flags 0x80700 phys_seg 1 prio class 2 [x6]
Sep 14 03:07:04 strawberry kernel: I/O error, dev sda, sector 206848 op 0x0:(READ) flags 0x0 phys_seg 1 prio class 2 [x6]
Sep 14 03:07:04 strawberry kernel: Buffer I/O error on dev sda2, logical block 0, async page read [x6]
Sep 14 03:07:04 strawberry kernel: I/O error, dev sda, sector 2048 op 0x0:(READ) flags 0x80700 phys_seg 1 prio class 2 [x6]
Sep 14 03:07:04 strawberry kernel: I/O error, dev sda, sector 2048 op 0x0:(READ) flags 0x0 phys_seg 1 prio class 2 [x6]
Sep 14 03:07:04 strawberry kernel: Buffer I/O error on dev sda1, logical block 0, async page read [x6]
Sep 14 03:34:42 strawberry smartd[5314]: Device: /dev/sda [SAT], failed to read SMART Attribute Data [x2]
== submit26-b9-f1 (1 distinct, 1 total) ==
Sep 14 03:28:05 submit26-b9-f1 systemd[1]: user(a)1001.service: Main process exited, code=killed, status=9/KILL
== submit26-b9-f2 (1 distinct, 3 total) ==
Sep 14 03:08:05 submit26-b9-f2 systemd[1]: user(a)1001.service: Main process exited, code=killed, status=9/KILL [x3]
== submit26-b9-f3 (1 distinct, 2 total) ==
Sep 14 03:08:05 submit26-b9-f3 systemd[1]: user(a)1001.service: Main process exited, code=killed, status=9/KILL [x2]
== submit26-b9-f4 (1 distinct, 1 total) ==
Sep 14 03:13:08 submit26-b9-f4 systemd[1]: user(a)1001.service: Main process exited, code=killed, status=9/KILL
1
0