Command: /usr/local/sbin/syslog-digest.py
Time : 0.0558s
Status : exited 0
Output :
Syslog digest — 2026-09-21 02:05 EDT
Processed 3,142 lines, filtered 2,554 (81%). 588 unknown (203 distinct) from 23 host(s).
== b0b02.cs.umd.edu (1 distinct, 1 total) ==
Sep 21 01:53:12 b0b02.cs.umd.edu rustdesk[3459018]: cannot open display:
== bale (5 distinct, 86 total) ==
Sep 21 01:05:15 bale setroubleshoot[1332102]: failed to retrieve rpm info for /dev/nvme0 [x37]
Sep 21 01:05:16 bale setroubleshoot[1332102]: SELinux is preventing /usr/libexec/platform-python3.6 from getattr access on the chr_file /dev/nvme0. For complete SELinux messages run: sealert -l e098d0bd-ac29-4737-9018-de9a71e328ee [x12]
Sep 21 01:05:18 bale setroubleshoot[1332102]: SELinux is preventing smartctl from read access on the chr_file nvme0. For complete SELinux messages run: sealert -l fc305ce6-663c-4aa2-8640-0ee0f8dce1a9 [x12]
Sep 21 01:05:21 bale setroubleshoot[1332102]: SELinux is preventing smartctl from open access on the chr_file /dev/nvme0. For complete SELinux messages run: sealert -l 2c1d6b29-3343-488c-84c7-92d46f8010b6 [x12]
Sep 21 01:05:33 bale setroubleshoot[1332719]: SELinux is preventing /usr/sbin/smartctl from ioctl access on the chr_file /dev/nvme0. For complete SELinux messages run: sealert -l 8ea740c2-97d8-42fb-b550-a236b114507d [x13]
== biggulp.cs.umd.edu (3 distinct, 3 total) ==
Sep 21 01:57:57 biggulp.cs.umd.edu sshd-session[2949804]: pam_access(sshd:auth): access denied for user `admin' from `193.187.110.214'
Sep 21 01:57:58 biggulp.cs.umd.edu krb5_child[2949822]: Client 'admin(a)UMD.EDU' not found in Kerberos database
Sep 21 01:57:58 biggulp.cs.umd.edu sshd-session[2949802]: error: PAM: System error for admin from 193.187.110.214
== cmsc436-0101-redis (1 distinct, 1 total) ==
Sep 21 01:15:55 cmsc436-0101-redis sshd-session[3364158]: error: PAM: Authentication failure for operator from 193.187.110.214
== csfw00a (1 distinct, 127 total) ==
Sep 21 01:03:48 csfw00a kernel: bnxt_en 0000:09:00.0 eth3: NIC Link is Down [x127]
== hazfs.cs.umd.edu (11 distinct, 66 total) ==
Sep 21 01:16:51 hazfs.cs.umd.edu snmpd[1431]: send response: Failure in sendto [x6]
Sep 21 01:16:51 hazfs.cs.umd.edu snmpd[1431]: -- NET-SNMP-EXTEND-MIB::nsExtendStatus."userweb" [x6]
Sep 21 01:16:51 hazfs.cs.umd.edu snmpd[1431]: -- NET-SNMP-EXTEND-MIB::nsExtendStatus."zfslist" [x6]
Sep 21 01:16:51 hazfs.cs.umd.edu snmpd[1431]: -- NET-SNMP-EXTEND-MIB::nsExtendStatus."userhome" [x6]
Sep 21 01:16:51 hazfs.cs.umd.edu snmpd[1431]: -- NET-SNMP-EXTEND-MIB::nsExtendOutput1Line."userweb" [x6]
Sep 21 01:16:51 hazfs.cs.umd.edu snmpd[1431]: -- NET-SNMP-EXTEND-MIB::nsExtendOutput1Line."zfslist" [x6]
Sep 21 01:16:51 hazfs.cs.umd.edu snmpd[1431]: -- NET-SNMP-EXTEND-MIB::nsExtendOutput1Line."userhome" [x6]
Sep 21 01:16:51 hazfs.cs.umd.edu snmpd[1431]: -- NET-SNMP-EXTEND-MIB::nsExtendOutputFull."userweb" [x6]
Sep 21 01:16:51 hazfs.cs.umd.edu snmpd[1431]: -- NET-SNMP-EXTEND-MIB::nsExtendOutputFull."zfslist" [x6]
Sep 21 01:16:51 hazfs.cs.umd.edu snmpd[1431]: -- NET-SNMP-EXTEND-MIB::nsExtendOutputFull."userhome" [x6]
Sep 21 01:16:51 hazfs.cs.umd.edu snmpd[1431]: -- NET-SNMP-EXTEND-MIB::nsExtendOutNumLines."userweb" [x6]
== idm00 (1 distinct, 1 total) ==
Sep 21 01:54:01 idm00 named[4166701]: client @0x7f1198079d88 10.73.240.42#52035: update '73.10.in-addr.arpa/IN' denied
== idmp0 (1 distinct, 1 total) ==
Sep 21 01:37:56 idmp0 named[1598691]: client @0x7f2d2c0368e8 10.73.240.43#60956: update '73.10.in-addr.arpa/IN' denied
== inbound00.cs.umd.edu (2 distinct, 2 total) ==
Sep 21 01:11:10 inbound00.cs.umd.edu krb5_child[2350790]: Client 'admin(a)UMD.EDU' not found in Kerberos database
Sep 21 01:11:39 inbound00.cs.umd.edu sshd-session[2350826]: error: Protocol major versions differ: 2 vs. 1
== inbound01.cs.umd.edu (2 distinct, 2 total) ==
Sep 21 01:22:46 inbound01.cs.umd.edu krb5_child[377095]: Client 'admin(a)UMD.EDU' not found in Kerberos database
Sep 21 01:23:06 inbound01.cs.umd.edu sshd-session[377104]: error: Protocol major versions differ: 2 vs. 1
== itmon02 (1 distinct, 7 total) ==
Sep 21 01:14:00 itmon02 sshd[1750555]: error: beginning MaxStartups throttling [x7]
== munin (2 distinct, 8 total) ==
Sep 21 01:18:09 munin sudo[1075241]: pam_systemd(sudo:session): Failed to stat() runtime directory '/run/user/0': No such file or directory [x4]
Sep 21 01:18:09 munin sudo[1075241]: pam_systemd(sudo:session): Not setting $XDG_RUNTIME_DIR, as the directory is not in order. [x4]
== newhonors2 (1 distinct, 24 total) ==
Sep 21 01:13:03 newhonors2 dhcpcd[2928706]: dhcpcd is not running [x24]
== ntop00 (99 distinct, 143 total) ==
Sep 21 01:05:01 ntop00 nfacctd[791663]: INFO ( m1/mysql ): *** Purging cache - START (PID: 418) ***
Sep 21 01:05:32 ntop00 sfacctd[791587]: INFO ( m1/mysql ): *** Purging cache - END (PID: 418, QN: 7248/7248, ET: 31) ***
Sep 21 01:05:32 ntop00 nfacctd[791663]: INFO ( m1/mysql ): *** Purging cache - END (PID: 418, QN: 42/42, ET: 31) ***
Sep 21 01:08:01 ntop00 sfacctd[791587]: INFO ( p1/print ): *** Purging cache - START (PID: 419) ***
Sep 21 01:08:01 ntop00 sfacctd[791587]: INFO ( p1/print ): *** Purging cache - END (PID: 419, QN: 7315/7315, ET: 0) ***
Sep 21 01:08:01 ntop00 nfacctd[791663]: INFO ( p1/print ): *** Purging cache - START (PID: 419) ***
Sep 21 01:08:01 ntop00 nfacctd[791663]: INFO ( p1/print ): *** Purging cache - END (PID: 419, QN: 40/40, ET: 0) ***
Sep 21 01:08:02 ntop00 setroubleshoot[928991]: SELinux is preventing /usr/local/sbin/sfacctd from append access on the file sflow.json. For complete SELinux messages run: sealert -l aec09a24-8fd6-4c2f-ba24-2e4b38b93f4c [x12]
Sep 21 01:08:02 ntop00 setroubleshoot[928991]: SELinux is preventing /usr/local/sbin/sfacctd from write access on the file sflow.json. For complete SELinux messages run: sealert -l b2869c09-acbd-427c-b7c9-edae08c37a0e [x12]
Sep 21 01:08:02 ntop00 setroubleshoot[928991]: failed to retrieve rpm info for path '/srv/pmacct/sflow.json': [x12]
Sep 21 01:08:02 ntop00 setroubleshoot[928991]: SELinux is preventing /usr/local/sbin/sfacctd from lock access on the file /srv/pmacct/sflow.json. For complete SELinux messages run: sealert -l dbd70a69-3ee5-4fce-87ea-309297754109 [x12]
Sep 21 01:10:01 ntop00 sfacctd[791587]: INFO ( m1/mysql ): *** Purging cache - START (PID: 420) ***
Sep 21 01:10:01 ntop00 nfacctd[791663]: INFO ( m1/mysql ): *** Purging cache - START (PID: 420) ***
Sep 21 01:10:35 ntop00 sfacctd[791587]: INFO ( m1/mysql ): *** Purging cache - END (PID: 420, QN: 7580/7580, ET: 34) ***
Sep 21 01:10:35 ntop00 nfacctd[791663]: INFO ( m1/mysql ): *** Purging cache - END (PID: 420, QN: 52/52, ET: 34) ***
Sep 21 01:13:01 ntop00 sfacctd[791587]: INFO ( p1/print ): *** Purging cache - START (PID: 421) ***
Sep 21 01:13:01 ntop00 sfacctd[791587]: INFO ( p1/print ): *** Purging cache - END (PID: 421, QN: 7635/7635, ET: 0) ***
Sep 21 01:13:01 ntop00 nfacctd[791663]: INFO ( p1/print ): *** Purging cache - START (PID: 421) ***
Sep 21 01:13:01 ntop00 nfacctd[791663]: INFO ( p1/print ): *** Purging cache - END (PID: 421, QN: 44/44, ET: 0) ***
Sep 21 01:15:01 ntop00 sfacctd[791587]: INFO ( m1/mysql ): *** Purging cache - START (PID: 422) ***
Sep 21 01:15:01 ntop00 nfacctd[791663]: INFO ( m1/mysql ): *** Purging cache - START (PID: 422) ***
Sep 21 01:15:35 ntop00 sfacctd[791587]: INFO ( m1/mysql ): *** Purging cache - END (PID: 422, QN: 7296/7296, ET: 34) ***
Sep 21 01:15:35 ntop00 nfacctd[791663]: INFO ( m1/mysql ): *** Purging cache - END (PID: 422, QN: 36/36, ET: 34) ***
Sep 21 01:18:01 ntop00 nfacctd[791663]: INFO ( p1/print ): *** Purging cache - START (PID: 423) ***
Sep 21 01:18:01 ntop00 nfacctd[791663]: INFO ( p1/print ): *** Purging cache - END (PID: 423, QN: 35/35, ET: 0) ***
Sep 21 01:18:01 ntop00 sfacctd[791587]: INFO ( p1/print ): *** Purging cache - START (PID: 423) ***
Sep 21 01:18:01 ntop00 sfacctd[791587]: INFO ( p1/print ): *** Purging cache - END (PID: 423, QN: 7553/7553, ET: 0) ***
Sep 21 01:20:01 ntop00 sfacctd[791587]: INFO ( m1/mysql ): *** Purging cache - START (PID: 424) ***
Sep 21 01:20:01 ntop00 nfacctd[791663]: INFO ( m1/mysql ): *** Purging cache - START (PID: 424) ***
Sep 21 01:20:37 ntop00 sfacctd[791587]: INFO ( m1/mysql ): *** Purging cache - END (PID: 424, QN: 7850/7850, ET: 36) ***
... 69 more distinct messages not shown
== outbound00.cs.umd.edu (1 distinct, 6 total) ==
Sep 21 01:09:09 outbound00.cs.umd.edu python3[2216669]: ldapdb [x6]
== outbound01.cs.umd.edu (1 distinct, 6 total) ==
Sep 21 01:13:06 outbound01.cs.umd.edu python3[283029]: ldapdb [x6]
== sentry-docker00.cs.umd.edu (40 distinct, 40 total) ==
Sep 21 01:22:42 sentry-docker00.cs.umd.edu systemd-udevd[485315]: link_config: could not get ethtool features for vetheadb795
Sep 21 01:22:42 sentry-docker00.cs.umd.edu systemd-udevd[485315]: Could not set offload features of vetheadb795: No such device
Sep 21 01:22:42 sentry-docker00.cs.umd.edu systemd-udevd[485379]: Could not generate persistent MAC address for veth7561f77: No such file or directory
Sep 21 01:22:42 sentry-docker00.cs.umd.edu systemd-udevd[485380]: Could not generate persistent MAC address for veth779dadb: No such file or directory
Sep 21 01:22:42 sentry-docker00.cs.umd.edu systemd-udevd[485383]: Could not generate persistent MAC address for veth8641e88: No such file or directory
Sep 21 01:22:42 sentry-docker00.cs.umd.edu systemd-udevd[485384]: Could not generate persistent MAC address for veth4f86a53: No such file or directory
Sep 21 01:22:42 sentry-docker00.cs.umd.edu systemd-udevd[485407]: Could not generate persistent MAC address for vethdbdeaf6: No such file or directory
Sep 21 01:22:42 sentry-docker00.cs.umd.edu systemd-udevd[485408]: Could not generate persistent MAC address for veth47a2a63: No such file or directory
Sep 21 01:22:42 sentry-docker00.cs.umd.edu systemd-udevd[485426]: Could not generate persistent MAC address for veth88c53d0: No such file or directory
Sep 21 01:22:42 sentry-docker00.cs.umd.edu systemd-udevd[485433]: Could not generate persistent MAC address for vethf3b2e4e: No such file or directory
Sep 21 01:22:42 sentry-docker00.cs.umd.edu systemd-udevd[485440]: Could not generate persistent MAC address for vethb671a97: No such file or directory
Sep 21 01:22:42 sentry-docker00.cs.umd.edu systemd-udevd[485446]: Could not generate persistent MAC address for veth4ed4f22: No such file or directory
Sep 21 01:42:50 sentry-docker00.cs.umd.edu systemd-udevd[494790]: link_config: could not get ethtool features for veth7561f77
Sep 21 01:42:50 sentry-docker00.cs.umd.edu systemd-udevd[494790]: Could not set offload features of veth7561f77: No such device
Sep 21 01:42:50 sentry-docker00.cs.umd.edu systemd-udevd[494792]: link_config: could not get ethtool features for veth8641e88
Sep 21 01:42:50 sentry-docker00.cs.umd.edu systemd-udevd[494792]: Could not set offload features of veth8641e88: No such device
Sep 21 01:42:50 sentry-docker00.cs.umd.edu systemd-udevd[494833]: Could not generate persistent MAC address for vethc8a6ab4: No such file or directory
Sep 21 01:42:50 sentry-docker00.cs.umd.edu systemd-udevd[494834]: Could not generate persistent MAC address for veth44af3e2: No such file or directory
Sep 21 01:42:50 sentry-docker00.cs.umd.edu systemd-udevd[494837]: Could not generate persistent MAC address for vethad21fb4: No such file or directory
Sep 21 01:42:50 sentry-docker00.cs.umd.edu systemd-udevd[494838]: Could not generate persistent MAC address for vethb5f3226: No such file or directory
Sep 21 01:42:50 sentry-docker00.cs.umd.edu systemd-udevd[494861]: Could not generate persistent MAC address for veth32f2656: No such file or directory
Sep 21 01:42:50 sentry-docker00.cs.umd.edu systemd-udevd[494862]: Could not generate persistent MAC address for veth4862a45: No such file or directory
Sep 21 01:42:50 sentry-docker00.cs.umd.edu systemd-udevd[494885]: Could not generate persistent MAC address for vethab0f164: No such file or directory
Sep 21 01:42:50 sentry-docker00.cs.umd.edu systemd-udevd[494871]: Could not generate persistent MAC address for veth3689c81: No such file or directory
Sep 21 01:42:50 sentry-docker00.cs.umd.edu systemd-udevd[494869]: Could not generate persistent MAC address for veth0fbc5af: No such file or directory
Sep 21 01:42:50 sentry-docker00.cs.umd.edu systemd-udevd[494861]: Could not generate persistent MAC address for veth6b91818: No such file or directory
Sep 21 02:02:58 sentry-docker00.cs.umd.edu systemd-udevd[504140]: link_config: could not get ethtool features for veth3689c81
Sep 21 02:02:58 sentry-docker00.cs.umd.edu systemd-udevd[504140]: Could not set offload features of veth3689c81: No such device
Sep 21 02:02:58 sentry-docker00.cs.umd.edu systemd-udevd[504171]: link_config: could not set ethtool features for vethc8a6ab4
Sep 21 02:02:58 sentry-docker00.cs.umd.edu systemd-udevd[504171]: Could not set offload features of vethc8a6ab4: Operation not permitted
... 10 more distinct messages not shown
== strawberry (7 distinct, 38 total) ==
Sep 21 01:07:03 strawberry kernel: I/O error, dev sda, sector 206848 op 0x0:(READ) flags 0x80700 phys_seg 1 prio class 2 [x6]
Sep 21 01:07:03 strawberry kernel: I/O error, dev sda, sector 206848 op 0x0:(READ) flags 0x0 phys_seg 1 prio class 2 [x6]
Sep 21 01:07:03 strawberry kernel: Buffer I/O error on dev sda2, logical block 0, async page read [x6]
Sep 21 01:07:03 strawberry kernel: I/O error, dev sda, sector 2048 op 0x0:(READ) flags 0x80700 phys_seg 1 prio class 2 [x6]
Sep 21 01:07:03 strawberry kernel: I/O error, dev sda, sector 2048 op 0x0:(READ) flags 0x0 phys_seg 1 prio class 2 [x6]
Sep 21 01:07:03 strawberry kernel: Buffer I/O error on dev sda1, logical block 0, async page read [x6]
Sep 21 01:34:42 strawberry smartd[5314]: Device: /dev/sda [SAT], failed to read SMART Attribute Data [x2]
== submit26-b9-f1 (1 distinct, 2 total) ==
Sep 21 01:08:07 submit26-b9-f1 systemd[1]: user(a)1001.service: Main process exited, code=killed, status=9/KILL [x2]
== submit26-b9-f2 (1 distinct, 2 total) ==
Sep 21 01:23:06 submit26-b9-f2 systemd[1]: user(a)1001.service: Main process exited, code=killed, status=9/KILL [x2]
== submit26-b9-f3 (10 distinct, 11 total) ==
Sep 21 01:05:06 submit26-b9-f3 systemd[1]: user(a)1001.service: Main process exited, code=killed, status=9/KILL [x2]
Sep 21 01:06:43 submit26-b9-f3 setroubleshoot[2213617]: SELinux is preventing /usr/bin/python3.9 from create access on the directory /(null). For complete SELinux messages run: sealert -l a653b772-cbcd-438b-bae5-23c3dc69b31b
Sep 21 01:06:43 submit26-b9-f3 setroubleshoot[2213617]: SELinux is preventing /usr/bin/python3.9 from add_name access on the directory /(null). For complete SELinux messages run: sealert -l 3e904634-6caa-4202-8c92-f139db798859
Sep 21 01:06:43 submit26-b9-f3 setroubleshoot[2213617]: SELinux is preventing /usr/bin/python3.9 from create access on the file /(null). For complete SELinux messages run: sealert -l 580b20e4-ec2c-433d-905c-5bd417fba033
Sep 21 01:06:43 submit26-b9-f3 setroubleshoot[2213617]: SELinux is preventing /usr/bin/python3.9 from open access on the file /tmp/libdnf.OIYCwp/repodata/repomd.xml. For complete SELinux messages run: sealert -l 27f29d48-5e7c-4db7-b051-8ac055737d6f
Sep 21 01:06:43 submit26-b9-f3 setroubleshoot[2213617]: SELinux is preventing /usr/bin/python3.9 from setattr access on the file repomd.xml. For complete SELinux messages run: sealert -l bff72452-d40a-430b-9060-dd0a48f5b6ba
Sep 21 01:06:43 submit26-b9-f3 setroubleshoot[2213617]: SELinux is preventing /usr/bin/python3.9 from read access on the directory libdnf.OIYCwp. For complete SELinux messages run: sealert -l 9638d396-8ce5-4e6a-ae47-45cd3985e1cd
Sep 21 01:06:43 submit26-b9-f3 setroubleshoot[2213617]: SELinux is preventing /usr/bin/python3.9 from remove_name access on the directory repomd.xml. For complete SELinux messages run: sealert -l 6da64b94-7024-45a9-b8c2-3b9812517407
Sep 21 01:06:43 submit26-b9-f3 setroubleshoot[2213617]: SELinux is preventing /usr/bin/python3.9 from unlink access on the file repomd.xml. For complete SELinux messages run: sealert -l 64cbe179-abf1-4d5a-bade-bb164897ee65
Sep 21 01:06:43 submit26-b9-f3 setroubleshoot[2213617]: SELinux is preventing /usr/bin/python3.9 from rmdir access on the directory repodata. For complete SELinux messages run: sealert -l d2e35b1a-e27c-4f91-9217-2bb1204e1e68
== submit26-b9-f4 (10 distinct, 10 total) ==
Sep 21 01:24:47 submit26-b9-f4 setroubleshoot[1592053]: SELinux is preventing /usr/bin/python3.9 from create access on the directory /(null). For complete SELinux messages run: sealert -l ee160f23-b161-4f4a-9985-c4edfd3a5beb
Sep 21 01:24:47 submit26-b9-f4 setroubleshoot[1592053]: SELinux is preventing /usr/bin/python3.9 from add_name access on the directory /(null). For complete SELinux messages run: sealert -l 89a83821-4b24-4081-9973-0a79ca6ed5b4
Sep 21 01:24:47 submit26-b9-f4 setroubleshoot[1592053]: SELinux is preventing /usr/bin/python3.9 from create access on the file /(null). For complete SELinux messages run: sealert -l f73955d6-1416-45f9-bab6-ff1f3ea07e9d
Sep 21 01:24:47 submit26-b9-f4 setroubleshoot[1592053]: SELinux is preventing /usr/bin/python3.9 from open access on the file /tmp/libdnf.DBMvD3/repodata/repomd.xml. For complete SELinux messages run: sealert -l 9f8f24a0-8fb6-454d-a103-31a8f7a6efa0
Sep 21 01:24:47 submit26-b9-f4 setroubleshoot[1592053]: SELinux is preventing /usr/bin/python3.9 from setattr access on the file repomd.xml. For complete SELinux messages run: sealert -l 20293136-86a3-40ba-a651-cff48d36059e
Sep 21 01:24:47 submit26-b9-f4 setroubleshoot[1592053]: SELinux is preventing /usr/bin/python3.9 from read access on the directory libdnf.DBMvD3. For complete SELinux messages run: sealert -l 25f86b49-4ee7-4f60-ad1c-73a70032560c
Sep 21 01:24:47 submit26-b9-f4 setroubleshoot[1592053]: SELinux is preventing /usr/bin/python3.9 from remove_name access on the directory repomd.xml. For complete SELinux messages run: sealert -l eec250fb-073f-456d-93bc-f98776fd476d
Sep 21 01:24:47 submit26-b9-f4 setroubleshoot[1592053]: SELinux is preventing /usr/bin/python3.9 from unlink access on the file repomd.xml. For complete SELinux messages run: sealert -l c9209e04-a349-43d5-8cb2-3e303e48df74
Sep 21 01:24:48 submit26-b9-f4 setroubleshoot[1592053]: SELinux is preventing /usr/bin/python3.9 from rmdir access on the directory repodata. For complete SELinux messages run: sealert -l 3178d5f5-80e9-404b-92b7-9bef397a8915
Sep 21 01:43:08 submit26-b9-f4 systemd[1]: user(a)1001.service: Main process exited, code=killed, status=9/KILL
== tma-0 (1 distinct, 1 total) ==
Sep 21 01:12:53 tma-0 sshd[13127]: error: PAM: Authentication failure for admin from 79.62.62.34.bc.googleusercontent.com
1
0
Command: /usr/local/sbin/syslog-digest.py
Time : 0.0526s
Status : exited 0
Output :
Syslog digest — 2026-09-21 01:05 EDT
Processed 1,985 lines, filtered 1,386 (69%). 599 unknown (220 distinct) from 34 host(s).
== abuse (3 distinct, 4 total) ==
Sep 21 00:10:14 abuse systemd[1]: New main PID 26280 does not belong to service, and PID file is not owned by root. Refusing. [x2]
Sep 21 00:10:33 abuse systemd[1]: Daemon never wrote its PID file. Failing.
Sep 21 00:10:43 abuse systemd[1]: pmlogger.service: Supervising process 1046 which is not our child. We'll most likely not notice when it exits.
== b0b02.cs.umd.edu (1 distinct, 1 total) ==
Sep 21 00:53:08 b0b02.cs.umd.edu rustdesk[3443845]: cannot open display:
== bale (5 distinct, 84 total) ==
Sep 21 00:06:05 bale setroubleshoot[1318904]: failed to retrieve rpm info for /dev/nvme0 [x36]
Sep 21 00:06:06 bale setroubleshoot[1318904]: SELinux is preventing /usr/libexec/platform-python3.6 from getattr access on the chr_file /dev/nvme0. For complete SELinux messages run: sealert -l e098d0bd-ac29-4737-9018-de9a71e328ee [x12]
Sep 21 00:06:08 bale setroubleshoot[1318904]: SELinux is preventing smartctl from read access on the chr_file nvme0. For complete SELinux messages run: sealert -l fc305ce6-663c-4aa2-8640-0ee0f8dce1a9 [x12]
Sep 21 00:06:11 bale setroubleshoot[1318904]: SELinux is preventing smartctl from open access on the chr_file /dev/nvme0. For complete SELinux messages run: sealert -l 2c1d6b29-3343-488c-84c7-92d46f8010b6 [x12]
Sep 21 00:06:23 bale setroubleshoot[1319518]: SELinux is preventing /usr/sbin/smartctl from ioctl access on the chr_file /dev/nvme0. For complete SELinux messages run: sealert -l 8ea740c2-97d8-42fb-b550-a236b114507d [x12]
== biggulp.cs.umd.edu (4 distinct, 4 total) ==
Sep 21 00:37:54 biggulp.cs.umd.edu sshd-session[2936346]: pam_access(sshd:auth): access denied for user `admin' from `130.211.97.92'
Sep 21 00:37:54 biggulp.cs.umd.edu krb5_child[2936348]: Client 'admin(a)UMD.EDU' not found in Kerberos database
Sep 21 00:37:54 biggulp.cs.umd.edu sshd-session[2936344]: error: PAM: System error for admin from 130.211.97.92
Sep 21 00:38:19 biggulp.cs.umd.edu sshd-session[2936415]: error: Protocol major versions differ: 2 vs. 1
== cheezit.cs.umd.edu (3 distinct, 3 total) ==
Sep 21 00:39:50 cheezit.cs.umd.edu sshd-session[1408301]: pam_access(sshd:auth): access denied for user `admin' from `130.211.97.92'
Sep 21 00:39:50 cheezit.cs.umd.edu krb5_child[1408303]: Client 'admin(a)UMD.EDU' not found in Kerberos database
Sep 21 00:39:50 cheezit.cs.umd.edu sshd-session[1408299]: error: PAM: System error for admin from 130.211.97.92
== csfw00a (1 distinct, 130 total) ==
Sep 21 00:04:56 csfw00a kernel: bnxt_en 0000:09:00.0 eth3: NIC Link is Down [x130]
== grades01.cs.umd.edu (3 distinct, 4 total) ==
Sep 21 00:10:13 grades01.cs.umd.edu systemd[1]: New main PID 29529 does not belong to service, and PID file is not owned by root. Refusing. [x2]
Sep 21 00:10:34 grades01.cs.umd.edu systemd[1]: Daemon never wrote its PID file. Failing.
Sep 21 00:10:49 grades01.cs.umd.edu systemd[1]: pmlogger.service: Supervising process 4527 which is not our child. We'll most likely not notice when it exits.
== idm00 (1 distinct, 1 total) ==
Sep 21 00:54:01 idm00 named[4166701]: client @0x7f11a4036798 10.73.240.42#62867: update '73.10.in-addr.arpa/IN' denied
== idmp0 (1 distinct, 1 total) ==
Sep 21 00:37:56 idmp0 named[1598691]: client @0x7f2d1c0104c8 10.73.240.43#63077: update '73.10.in-addr.arpa/IN' denied
== itmon02 (1 distinct, 2 total) ==
Sep 21 00:43:52 itmon02 sshd[1750555]: error: beginning MaxStartups throttling [x2]
== jubjub.cs.umd.edu (3 distinct, 4 total) ==
Sep 21 00:10:12 jubjub.cs.umd.edu systemd[1]: New main PID 3928319 does not belong to service, and PID file is not owned by root. Refusing. [x2]
Sep 21 00:10:32 jubjub.cs.umd.edu systemd[1]: Daemon never wrote its PID file. Failing.
Sep 21 00:10:40 jubjub.cs.umd.edu systemd[1]: pmlogger.service: Supervising process 3935403 which is not our child. We'll most likely not notice when it exits.
== krispykreme.cs.umd.edu (3 distinct, 3 total) ==
Sep 21 00:44:27 krispykreme.cs.umd.edu sshd-session[512891]: pam_access(sshd:auth): access denied for user `admin' from `104.199.98.110'
Sep 21 00:44:27 krispykreme.cs.umd.edu krb5_child[512893]: Client 'admin(a)UMD.EDU' not found in Kerberos database
Sep 21 00:44:27 krispykreme.cs.umd.edu sshd-session[512889]: error: PAM: System error for admin from 104.199.98.110
== mirrors.cs.umd.edu (4 distinct, 6 total) ==
Sep 21 00:10:33 mirrors.cs.umd.edu root[13216]: pmlogger_daily failed - see /var/log/pcp/pmlogger/pmlogger_daily-K.log
Sep 21 00:10:33 mirrors.cs.umd.edu systemd[1]: Daemon never wrote its PID file. Failing. [x2]
Sep 21 00:10:37 mirrors.cs.umd.edu systemd[1]: New main PID 12147 does not belong to service, and PID file is not owned by root. Refusing. [x2]
Sep 21 00:11:51 mirrors.cs.umd.edu systemd[1]: pmlogger.service: Supervising process 28955 which is not our child. We'll most likely not notice when it exits.
== misty.cs.umd.edu (3 distinct, 4 total) ==
Sep 21 00:10:15 misty.cs.umd.edu systemd[1]: New main PID 15396 does not belong to service, and PID file is not owned by root. Refusing. [x2]
Sep 21 00:10:35 misty.cs.umd.edu systemd[1]: Daemon never wrote its PID file. Failing.
Sep 21 00:10:51 misty.cs.umd.edu systemd[1]: pmlogger.service: Supervising process 22722 which is not our child. We'll most likely not notice when it exits.
== munin (2 distinct, 44 total) ==
Sep 21 00:13:05 munin sudo[1051211]: pam_systemd(sudo:session): Failed to stat() runtime directory '/run/user/0': No such file or directory [x22]
Sep 21 00:13:05 munin sudo[1051211]: pam_systemd(sudo:session): Not setting $XDG_RUNTIME_DIR, as the directory is not in order. [x22]
== netman.cs.umd.edu (3 distinct, 6 total) ==
Sep 21 00:45:43 netman.cs.umd.edu krb5_child[2999775]: Client 'admin(a)UMD.EDU' not found in Kerberos database [x4]
Sep 21 00:45:48 netman.cs.umd.edu sshd[2999764]: error: PAM: Authentication failure for admin from 207.175.19.96
Sep 21 00:45:59 netman.cs.umd.edu sshd[2999788]: error: Protocol major versions differ: 2 vs. 1
== newhonors2 (1 distinct, 24 total) ==
Sep 21 00:13:02 newhonors2 dhcpcd[2926864]: dhcpcd is not running [x24]
== ntop00 (100 distinct, 144 total) ==
Sep 21 00:05:01 ntop00 nfacctd[791663]: INFO ( m1/mysql ): *** Purging cache - START (PID: 394) ***
Sep 21 00:05:31 ntop00 sfacctd[791587]: INFO ( m1/mysql ): *** Purging cache - END (PID: 394, QN: 6524/6524, ET: 30) ***
Sep 21 00:05:31 ntop00 nfacctd[791663]: INFO ( m1/mysql ): *** Purging cache - END (PID: 394, QN: 44/44, ET: 30) ***
Sep 21 00:08:01 ntop00 sfacctd[791587]: INFO ( p1/print ): *** Purging cache - START (PID: 395) ***
Sep 21 00:08:01 ntop00 sfacctd[791587]: INFO ( p1/print ): *** Purging cache - END (PID: 395, QN: 6913/6913, ET: 0) ***
Sep 21 00:08:01 ntop00 nfacctd[791663]: INFO ( p1/print ): *** Purging cache - START (PID: 395) ***
Sep 21 00:08:01 ntop00 nfacctd[791663]: INFO ( p1/print ): *** Purging cache - END (PID: 395, QN: 41/41, ET: 0) ***
Sep 21 00:08:02 ntop00 setroubleshoot[921096]: SELinux is preventing /usr/local/sbin/sfacctd from append access on the file sflow.json. For complete SELinux messages run: sealert -l aec09a24-8fd6-4c2f-ba24-2e4b38b93f4c [x12]
Sep 21 00:08:02 ntop00 setroubleshoot[921096]: SELinux is preventing /usr/local/sbin/sfacctd from write access on the file sflow.json. For complete SELinux messages run: sealert -l b2869c09-acbd-427c-b7c9-edae08c37a0e [x12]
Sep 21 00:08:02 ntop00 setroubleshoot[921096]: failed to retrieve rpm info for path '/srv/pmacct/sflow.json': [x12]
Sep 21 00:08:02 ntop00 setroubleshoot[921096]: SELinux is preventing /usr/local/sbin/sfacctd from lock access on the file /srv/pmacct/sflow.json. For complete SELinux messages run: sealert -l dbd70a69-3ee5-4fce-87ea-309297754109 [x12]
Sep 21 00:10:01 ntop00 sfacctd[791587]: INFO ( m1/mysql ): *** Purging cache - START (PID: 396) ***
Sep 21 00:10:01 ntop00 nfacctd[791663]: INFO ( m1/mysql ): *** Purging cache - START (PID: 396) ***
Sep 21 00:10:34 ntop00 sfacctd[791587]: INFO ( m1/mysql ): *** Purging cache - END (PID: 396, QN: 6791/6791, ET: 33) ***
Sep 21 00:10:34 ntop00 nfacctd[791663]: INFO ( m1/mysql ): *** Purging cache - END (PID: 396, QN: 41/41, ET: 33) ***
Sep 21 00:13:01 ntop00 sfacctd[791587]: INFO ( p1/print ): *** Purging cache - START (PID: 397) ***
Sep 21 00:13:01 ntop00 sfacctd[791587]: INFO ( p1/print ): *** Purging cache - END (PID: 397, QN: 6594/6594, ET: 0) ***
Sep 21 00:13:01 ntop00 nfacctd[791663]: INFO ( p1/print ): *** Purging cache - START (PID: 397) ***
Sep 21 00:13:01 ntop00 nfacctd[791663]: INFO ( p1/print ): *** Purging cache - END (PID: 397, QN: 37/37, ET: 0) ***
Sep 21 00:15:01 ntop00 sfacctd[791587]: INFO ( m1/mysql ): *** Purging cache - START (PID: 398) ***
Sep 21 00:15:01 ntop00 nfacctd[791663]: INFO ( m1/mysql ): *** Purging cache - START (PID: 398) ***
Sep 21 00:15:32 ntop00 sfacctd[791587]: INFO ( m1/mysql ): *** Purging cache - END (PID: 398, QN: 6749/6749, ET: 31) ***
Sep 21 00:15:33 ntop00 nfacctd[791663]: INFO ( m1/mysql ): *** Purging cache - END (PID: 398, QN: 36/36, ET: 32) ***
Sep 21 00:18:01 ntop00 sfacctd[791587]: INFO ( p1/print ): *** Purging cache - START (PID: 399) ***
Sep 21 00:18:01 ntop00 sfacctd[791587]: INFO ( p1/print ): *** Purging cache - END (PID: 399, QN: 6805/6805, ET: 0) ***
Sep 21 00:18:01 ntop00 nfacctd[791663]: INFO ( p1/print ): *** Purging cache - START (PID: 399) ***
Sep 21 00:18:01 ntop00 nfacctd[791663]: INFO ( p1/print ): *** Purging cache - END (PID: 399, QN: 43/43, ET: 0) ***
Sep 21 00:20:01 ntop00 sfacctd[791587]: INFO ( m1/mysql ): *** Purging cache - START (PID: 400) ***
Sep 21 00:20:01 ntop00 nfacctd[791663]: INFO ( m1/mysql ): *** Purging cache - START (PID: 400) ***
Sep 21 00:20:32 ntop00 sfacctd[791587]: INFO ( m1/mysql ): *** Purging cache - END (PID: 400, QN: 6763/6763, ET: 31) ***
... 70 more distinct messages not shown
== openrepo (1 distinct, 1 total) ==
Sep 21 00:05:53 openrepo (nin-node)[3231015]: munin-node.service: Referenced but unset environment variable evaluates to an empty string: DAEMON_ARGS
== outbound00.cs.umd.edu (3 distinct, 8 total) ==
Sep 21 00:09:09 outbound00.cs.umd.edu python3[2202145]: ldapdb [x6]
Sep 21 00:11:21 outbound00.cs.umd.edu krb5_child[2203191]: Client 'admin(a)UMD.EDU' not found in Kerberos database
Sep 21 00:11:55 outbound00.cs.umd.edu sshd-session[2203349]: error: Protocol major versions differ: 2 vs. 1
== outbound01.cs.umd.edu (1 distinct, 6 total) ==
Sep 21 00:13:07 outbound01.cs.umd.edu python3[269064]: ldapdb [x6]
== sentry-docker00.cs.umd.edu (36 distinct, 36 total) ==
Sep 21 00:22:17 sentry-docker00.cs.umd.edu systemd-udevd[456707]: link_config: could not get ethtool features for veth16874e8
Sep 21 00:22:17 sentry-docker00.cs.umd.edu systemd-udevd[456707]: Could not set offload features of veth16874e8: No such device
Sep 21 00:22:17 sentry-docker00.cs.umd.edu systemd-udevd[456781]: Could not generate persistent MAC address for veth995b502: No such file or directory
Sep 21 00:22:17 sentry-docker00.cs.umd.edu systemd-udevd[456782]: Could not generate persistent MAC address for vethe1bbaad: No such file or directory
Sep 21 00:22:17 sentry-docker00.cs.umd.edu systemd-udevd[456785]: Could not generate persistent MAC address for veth005cba0: No such file or directory
Sep 21 00:22:17 sentry-docker00.cs.umd.edu systemd-udevd[456786]: Could not generate persistent MAC address for veth99cec5e: No such file or directory
Sep 21 00:22:17 sentry-docker00.cs.umd.edu systemd-udevd[456810]: Could not generate persistent MAC address for veth5af871e: No such file or directory
Sep 21 00:22:17 sentry-docker00.cs.umd.edu systemd-udevd[456809]: Could not generate persistent MAC address for vethca01728: No such file or directory
Sep 21 00:22:17 sentry-docker00.cs.umd.edu systemd-udevd[456859]: Could not generate persistent MAC address for vethb9f0bdf: No such file or directory
Sep 21 00:22:17 sentry-docker00.cs.umd.edu systemd-udevd[456861]: Could not generate persistent MAC address for vethe69c6f3: No such file or directory
Sep 21 00:22:17 sentry-docker00.cs.umd.edu systemd-udevd[456896]: Could not generate persistent MAC address for veth9589ead: No such file or directory
Sep 21 00:22:17 sentry-docker00.cs.umd.edu systemd-udevd[456898]: Could not generate persistent MAC address for veth2d0b712: No such file or directory
Sep 21 00:42:25 sentry-docker00.cs.umd.edu systemd-udevd[466227]: link_config: could not get ethtool features for veth9589ead
Sep 21 00:42:25 sentry-docker00.cs.umd.edu systemd-udevd[466227]: Could not set offload features of veth9589ead: No such device
Sep 21 00:42:26 sentry-docker00.cs.umd.edu systemd-udevd[466267]: Could not generate persistent MAC address for vethe03bced: No such file or directory
Sep 21 00:42:26 sentry-docker00.cs.umd.edu systemd-udevd[466268]: Could not generate persistent MAC address for veth0f9fda7: No such file or directory
Sep 21 00:42:26 sentry-docker00.cs.umd.edu systemd-udevd[466271]: Could not generate persistent MAC address for veth4ae5136: No such file or directory
Sep 21 00:42:26 sentry-docker00.cs.umd.edu systemd-udevd[466272]: Could not generate persistent MAC address for veth8a20ed6: No such file or directory
Sep 21 00:42:26 sentry-docker00.cs.umd.edu systemd-udevd[466282]: Could not generate persistent MAC address for veth56036c9: No such file or directory
Sep 21 00:42:26 sentry-docker00.cs.umd.edu systemd-udevd[466292]: Could not generate persistent MAC address for veth278b962: No such file or directory
Sep 21 00:42:26 sentry-docker00.cs.umd.edu systemd-udevd[466272]: Could not generate persistent MAC address for vethb1efa9c: No such file or directory
Sep 21 00:42:26 sentry-docker00.cs.umd.edu systemd-udevd[466293]: Could not generate persistent MAC address for veth89feda2: No such file or directory
Sep 21 00:42:26 sentry-docker00.cs.umd.edu systemd-udevd[466282]: Could not generate persistent MAC address for vethafac709: No such file or directory
Sep 21 00:42:26 sentry-docker00.cs.umd.edu systemd-udevd[466292]: Could not generate persistent MAC address for vethc7c1793: No such file or directory
Sep 21 01:02:33 sentry-docker00.cs.umd.edu systemd-udevd[475643]: link_config: could not get ethtool features for veth4ae5136
Sep 21 01:02:33 sentry-docker00.cs.umd.edu systemd-udevd[475643]: Could not set offload features of veth4ae5136: No such device
Sep 21 01:02:34 sentry-docker00.cs.umd.edu systemd-udevd[475696]: Could not generate persistent MAC address for vetheadb795: No such file or directory
Sep 21 01:02:34 sentry-docker00.cs.umd.edu systemd-udevd[475697]: Could not generate persistent MAC address for veth04b034f: No such file or directory
Sep 21 01:02:34 sentry-docker00.cs.umd.edu systemd-udevd[475740]: Could not generate persistent MAC address for veth78969ab: No such file or directory
Sep 21 01:02:34 sentry-docker00.cs.umd.edu systemd-udevd[475741]: Could not generate persistent MAC address for vethb0dfeeb: No such file or directory
... 6 more distinct messages not shown
== soul (1 distinct, 1 total) ==
Sep 21 00:27:43 soul krb5_child[3871402]: Client 'admin(a)UMD.EDU' not found in Kerberos database
== strawberry (8 distinct, 39 total) ==
Sep 21 00:07:03 strawberry kernel: I/O error, dev sda, sector 206848 op 0x0:(READ) flags 0x80700 phys_seg 1 prio class 2 [x6]
Sep 21 00:07:03 strawberry kernel: I/O error, dev sda, sector 206848 op 0x0:(READ) flags 0x0 phys_seg 1 prio class 2 [x6]
Sep 21 00:07:03 strawberry kernel: Buffer I/O error on dev sda2, logical block 0, async page read [x6]
Sep 21 00:07:03 strawberry kernel: I/O error, dev sda, sector 2048 op 0x0:(READ) flags 0x80700 phys_seg 1 prio class 2 [x6]
Sep 21 00:07:03 strawberry kernel: I/O error, dev sda, sector 2048 op 0x0:(READ) flags 0x0 phys_seg 1 prio class 2 [x6]
Sep 21 00:07:03 strawberry kernel: Buffer I/O error on dev sda1, logical block 0, async page read [x6]
Sep 21 00:34:42 strawberry smartd[5314]: Device: /dev/sda [SAT], failed to read SMART Attribute Data [x2]
Sep 21 01:04:42 strawberry smartd[5314]: Device: /dev/sda [SAT], not capable of Offline or Self-Testing.
== submit10-cln25 (3 distinct, 4 total) ==
Sep 21 00:10:11 submit10-cln25 systemd: New main PID 26437 does not belong to service, and PID file is not owned by root. Refusing. [x2]
Sep 21 00:10:31 submit10-cln25 systemd: Daemon never wrote its PID file. Failing.
Sep 21 00:10:37 submit10-cln25 systemd: pmlogger.service: Supervising process 985 which is not our child. We'll most likely not notice when it exits.
== submit26-b9-f1 (1 distinct, 3 total) ==
Sep 21 00:12:18 submit26-b9-f1 systemd[1]: user(a)1001.service: Main process exited, code=killed, status=9/KILL [x3]
== submit26-b9-f2 (1 distinct, 2 total) ==
Sep 21 00:18:07 submit26-b9-f2 systemd[1]: user(a)1001.service: Main process exited, code=killed, status=9/KILL [x2]
== submit26-b9-f3 (1 distinct, 4 total) ==
Sep 21 00:25:05 submit26-b9-f3 systemd[1]: user(a)1001.service: Main process exited, code=killed, status=9/KILL [x4]
== submit26-b9-f4 (1 distinct, 1 total) ==
Sep 21 00:39:20 submit26-b9-f4 systemd[1]: user(a)1001.service: Main process exited, code=killed, status=9/KILL
== submit26-b9-fclone (9 distinct, 9 total) ==
Sep 21 00:21:57 submit26-b9-fclone setroubleshoot[207433]: SELinux is preventing /usr/bin/python3.9 from create access on the directory /(null). For complete SELinux messages run: sealert -l 9355d9d9-a311-48d2-bd37-6c0f6947dfff
Sep 21 00:21:57 submit26-b9-fclone setroubleshoot[207433]: SELinux is preventing /usr/bin/python3.9 from add_name access on the directory /(null). For complete SELinux messages run: sealert -l cc4658d7-9db1-405d-9eee-de0ccee5857f
Sep 21 00:21:57 submit26-b9-fclone setroubleshoot[207433]: SELinux is preventing /usr/bin/python3.9 from create access on the file /(null). For complete SELinux messages run: sealert -l 568a2429-0b1b-49df-af41-49b5cd298ae8
Sep 21 00:21:57 submit26-b9-fclone setroubleshoot[207433]: SELinux is preventing /usr/bin/python3.9 from open access on the file /tmp/libdnf.0dNKJH/repodata/repomd.xml. For complete SELinux messages run: sealert -l 03e2f521-0e7c-481f-8e92-0602c6adeedc
Sep 21 00:21:57 submit26-b9-fclone setroubleshoot[207433]: SELinux is preventing /usr/bin/python3.9 from setattr access on the file repomd.xml. For complete SELinux messages run: sealert -l 0d6b7b1f-ebe3-4beb-915a-b06b63bf2566
Sep 21 00:21:57 submit26-b9-fclone setroubleshoot[207433]: SELinux is preventing /usr/bin/python3.9 from read access on the directory libdnf.0dNKJH. For complete SELinux messages run: sealert -l 887adbf9-2bb9-4009-b800-36ddf9ba0db5
Sep 21 00:21:57 submit26-b9-fclone setroubleshoot[207433]: SELinux is preventing /usr/bin/python3.9 from remove_name access on the directory repomd.xml. For complete SELinux messages run: sealert -l 092e0644-8373-4017-b77f-1afa6c6da4ac
Sep 21 00:21:57 submit26-b9-fclone setroubleshoot[207433]: SELinux is preventing /usr/bin/python3.9 from unlink access on the file repomd.xml. For complete SELinux messages run: sealert -l ce429a92-56de-4de1-b859-cbfb69ae123c
Sep 21 00:21:57 submit26-b9-fclone setroubleshoot[207433]: SELinux is preventing /usr/bin/python3.9 from rmdir access on the directory repodata. For complete SELinux messages run: sealert -l 99b886eb-497b-406d-8206-afe76a1086b4
== tma-0 (3 distinct, 4 total) ==
Sep 21 00:10:13 tma-0 systemd[1]: New main PID 24886 does not belong to service, and PID file is not owned by root. Refusing. [x2]
Sep 21 00:10:31 tma-0 systemd[1]: Daemon never wrote its PID file. Failing.
Sep 21 00:10:39 tma-0 systemd[1]: pmlogger.service: Supervising process 32469 which is not our child. We'll most likely not notice when it exits.
== uffish.cs.umd.edu (3 distinct, 4 total) ==
Sep 21 00:10:14 uffish.cs.umd.edu systemd[1]: New main PID 2327203 does not belong to service, and PID file is not owned by root. Refusing. [x2]
Sep 21 00:10:40 uffish.cs.umd.edu systemd[1]: Daemon never wrote its PID file. Failing.
Sep 21 00:10:57 uffish.cs.umd.edu systemd[1]: pmlogger.service: Supervising process 2334839 which is not our child. We'll most likely not notice when it exits.
== vacuum.cs.umd.edu (3 distinct, 4 total) ==
Sep 21 00:10:14 vacuum.cs.umd.edu systemd[1]: New main PID 23083 does not belong to service, and PID file is not owned by root. Refusing. [x2]
Sep 21 00:10:33 vacuum.cs.umd.edu systemd[1]: Daemon never wrote its PID file. Failing.
Sep 21 00:10:44 vacuum.cs.umd.edu systemd[1]: pmlogger.service: Supervising process 30187 which is not our child. We'll most likely not notice when it exits.
== whiffle.cs.umd.edu (3 distinct, 4 total) ==
Sep 21 00:10:13 whiffle.cs.umd.edu systemd[1]: New main PID 1882501 does not belong to service, and PID file is not owned by root. Refusing. [x2]
Sep 21 00:10:38 whiffle.cs.umd.edu systemd[1]: Daemon never wrote its PID file. Failing.
Sep 21 00:10:52 whiffle.cs.umd.edu systemd[1]: pmlogger.service: Supervising process 1889773 which is not our child. We'll most likely not notice when it exits.
1
0
Command: /usr/local/sbin/syslog-digest.py
Time : 0.0488s
Status : exited 0
Output :
Syslog digest — 2026-09-21 00:05 EDT
Processed 1,974 lines, filtered 1,472 (74%). 502 unknown (164 distinct) from 22 host(s).
== abadi-computer (1 distinct, 1 total) ==
Sep 21 00:00:00 abadi-computer systemctl[1611468]: Warning: The unit file, source configuration file or drop-ins of cups.service changed on disk. Run 'systemctl daemon-reload' to reload units.
== b0b02.cs.umd.edu (1 distinct, 1 total) ==
Sep 20 23:53:04 b0b02.cs.umd.edu rustdesk[3427732]: cannot open display:
== bale (5 distinct, 85 total) ==
Sep 20 23:05:55 bale setroubleshoot[1306205]: failed to retrieve rpm info for /dev/nvme0 [x36]
Sep 20 23:05:56 bale setroubleshoot[1306205]: SELinux is preventing /usr/libexec/platform-python3.6 from getattr access on the chr_file /dev/nvme0. For complete SELinux messages run: sealert -l e098d0bd-ac29-4737-9018-de9a71e328ee [x12]
Sep 20 23:05:58 bale setroubleshoot[1306205]: SELinux is preventing smartctl from read access on the chr_file nvme0. For complete SELinux messages run: sealert -l fc305ce6-663c-4aa2-8640-0ee0f8dce1a9 [x13]
Sep 20 23:06:01 bale setroubleshoot[1306205]: SELinux is preventing smartctl from open access on the chr_file /dev/nvme0. For complete SELinux messages run: sealert -l 2c1d6b29-3343-488c-84c7-92d46f8010b6 [x11]
Sep 20 23:06:13 bale setroubleshoot[1306819]: SELinux is preventing /usr/sbin/smartctl from ioctl access on the chr_file /dev/nvme0. For complete SELinux messages run: sealert -l 8ea740c2-97d8-42fb-b550-a236b114507d [x13]
== csfw00a (1 distinct, 145 total) ==
Sep 20 23:04:54 csfw00a kernel: bnxt_en 0000:09:00.0 eth3: NIC Link is Down [x145]
== idm00 (1 distinct, 1 total) ==
Sep 20 23:54:01 idm00 named[4166701]: client @0x7f11a9430488 10.73.240.42#60642: update '73.10.in-addr.arpa/IN' denied
== idmp0 (1 distinct, 1 total) ==
Sep 20 23:37:56 idmp0 named[1598691]: client @0x7f2d48000cc8 10.73.240.43#58896: update '73.10.in-addr.arpa/IN' denied
== itmon02 (1 distinct, 1 total) ==
Sep 20 23:08:55 itmon02 sshd[1750555]: error: beginning MaxStartups throttling
== matrix (1 distinct, 1 total) ==
Sep 21 00:00:25 matrix (nin-node)[3588685]: munin-node.service: Referenced but unset environment variable evaluates to an empty string: DAEMON_ARGS
== mcstic (2 distinct, 5 total) ==
Sep 20 23:49:06 mcstic krb5_child[883152]: Client 'admin(a)UMD.EDU' not found in Kerberos database [x4]
Sep 20 23:49:12 mcstic sshd[883147]: error: PAM: Authentication failure for admin from 34.38.229.202
== neo-gizmonic (1 distinct, 1 total) ==
Sep 21 00:00:01 neo-gizmonic (nin-node)[1895724]: munin-node.service: Referenced but unset environment variable evaluates to an empty string: DAEMON_ARGS
== neoavion (1 distinct, 1 total) ==
Sep 21 00:00:09 neoavion (nin-node)[3857075]: munin-node.service: Referenced but unset environment variable evaluates to an empty string: DAEMON_ARGS
== newhonors2 (2 distinct, 25 total) ==
Sep 20 23:13:03 newhonors2 dhcpcd[2924820]: dhcpcd is not running [x24]
Sep 21 00:00:16 newhonors2 (nin-node)[2926335]: munin-node.service: Referenced but unset environment variable evaluates to an empty string: DAEMON_ARGS
== ntop00 (100 distinct, 144 total) ==
Sep 20 23:05:01 ntop00 nfacctd[791663]: INFO ( m1/mysql ): *** Purging cache - START (PID: 370) ***
Sep 20 23:05:26 ntop00 sfacctd[791587]: INFO ( m1/mysql ): *** Purging cache - END (PID: 370, QN: 5967/5967, ET: 25) ***
Sep 20 23:05:26 ntop00 nfacctd[791663]: INFO ( m1/mysql ): *** Purging cache - END (PID: 370, QN: 42/42, ET: 25) ***
Sep 20 23:08:01 ntop00 sfacctd[791587]: INFO ( p1/print ): *** Purging cache - START (PID: 371) ***
Sep 20 23:08:01 ntop00 sfacctd[791587]: INFO ( p1/print ): *** Purging cache - END (PID: 371, QN: 6072/6072, ET: 0) ***
Sep 20 23:08:01 ntop00 nfacctd[791663]: INFO ( p1/print ): *** Purging cache - START (PID: 371) ***
Sep 20 23:08:01 ntop00 nfacctd[791663]: INFO ( p1/print ): *** Purging cache - END (PID: 371, QN: 47/47, ET: 0) ***
Sep 20 23:08:02 ntop00 setroubleshoot[913209]: SELinux is preventing /usr/local/sbin/sfacctd from append access on the file sflow.json. For complete SELinux messages run: sealert -l aec09a24-8fd6-4c2f-ba24-2e4b38b93f4c [x12]
Sep 20 23:08:02 ntop00 setroubleshoot[913209]: SELinux is preventing /usr/local/sbin/sfacctd from write access on the file sflow.json. For complete SELinux messages run: sealert -l b2869c09-acbd-427c-b7c9-edae08c37a0e [x12]
Sep 20 23:08:02 ntop00 setroubleshoot[913209]: failed to retrieve rpm info for path '/srv/pmacct/sflow.json': [x12]
Sep 20 23:08:02 ntop00 setroubleshoot[913209]: SELinux is preventing /usr/local/sbin/sfacctd from lock access on the file /srv/pmacct/sflow.json. For complete SELinux messages run: sealert -l dbd70a69-3ee5-4fce-87ea-309297754109 [x12]
Sep 20 23:10:01 ntop00 sfacctd[791587]: INFO ( m1/mysql ): *** Purging cache - START (PID: 372) ***
Sep 20 23:10:01 ntop00 nfacctd[791663]: INFO ( m1/mysql ): *** Purging cache - START (PID: 372) ***
Sep 20 23:10:27 ntop00 sfacctd[791587]: INFO ( m1/mysql ): *** Purging cache - END (PID: 372, QN: 6301/6301, ET: 26) ***
Sep 20 23:10:27 ntop00 nfacctd[791663]: INFO ( m1/mysql ): *** Purging cache - END (PID: 372, QN: 51/51, ET: 26) ***
Sep 20 23:13:01 ntop00 sfacctd[791587]: INFO ( p1/print ): *** Purging cache - START (PID: 373) ***
Sep 20 23:13:01 ntop00 sfacctd[791587]: INFO ( p1/print ): *** Purging cache - END (PID: 373, QN: 6074/6074, ET: 0) ***
Sep 20 23:13:01 ntop00 nfacctd[791663]: INFO ( p1/print ): *** Purging cache - START (PID: 373) ***
Sep 20 23:13:01 ntop00 nfacctd[791663]: INFO ( p1/print ): *** Purging cache - END (PID: 373, QN: 63/63, ET: 0) ***
Sep 20 23:15:01 ntop00 sfacctd[791587]: INFO ( m1/mysql ): *** Purging cache - START (PID: 374) ***
Sep 20 23:15:02 ntop00 nfacctd[791663]: INFO ( m1/mysql ): *** Purging cache - START (PID: 374) ***
Sep 20 23:15:25 ntop00 sfacctd[791587]: INFO ( m1/mysql ): *** Purging cache - END (PID: 374, QN: 5910/5910, ET: 24) ***
Sep 20 23:15:25 ntop00 nfacctd[791663]: INFO ( m1/mysql ): *** Purging cache - END (PID: 374, QN: 55/55, ET: 23) ***
Sep 20 23:18:01 ntop00 sfacctd[791587]: INFO ( p1/print ): *** Purging cache - START (PID: 375) ***
Sep 20 23:18:01 ntop00 sfacctd[791587]: INFO ( p1/print ): *** Purging cache - END (PID: 375, QN: 6149/6149, ET: 0) ***
Sep 20 23:18:01 ntop00 nfacctd[791663]: INFO ( p1/print ): *** Purging cache - START (PID: 375) ***
Sep 20 23:18:01 ntop00 nfacctd[791663]: INFO ( p1/print ): *** Purging cache - END (PID: 375, QN: 38/38, ET: 0) ***
Sep 20 23:20:01 ntop00 nfacctd[791663]: INFO ( m1/mysql ): *** Purging cache - START (PID: 376) ***
Sep 20 23:20:01 ntop00 sfacctd[791587]: INFO ( m1/mysql ): *** Purging cache - START (PID: 376) ***
Sep 20 23:20:01 ntop00 nfacctd[791663]: INFO ( m1/mysql ): *** Purging cache - END (PID: 376, QN: 41/41, ET: 0) ***
... 70 more distinct messages not shown
== outbound00.cs.umd.edu (1 distinct, 6 total) ==
Sep 20 23:09:09 outbound00.cs.umd.edu python3[2187950]: ldapdb [x6]
== outbound01.cs.umd.edu (1 distinct, 6 total) ==
Sep 20 23:13:06 outbound01.cs.umd.edu python3[254283]: ldapdb [x6]
== sentry-docker00.cs.umd.edu (32 distinct, 32 total) ==
Sep 20 23:21:52 sentry-docker00.cs.umd.edu systemd-udevd[428347]: link_config: could not get ethtool features for veth76b01be
Sep 20 23:21:52 sentry-docker00.cs.umd.edu systemd-udevd[428347]: Could not set offload features of veth76b01be: No such device
Sep 20 23:21:52 sentry-docker00.cs.umd.edu systemd-udevd[428432]: Could not generate persistent MAC address for vethc833a44: No such file or directory
Sep 20 23:21:52 sentry-docker00.cs.umd.edu systemd-udevd[428433]: Could not generate persistent MAC address for vethf4c153d: No such file or directory
Sep 20 23:21:52 sentry-docker00.cs.umd.edu systemd-udevd[428436]: Could not generate persistent MAC address for vethfe0f4be: No such file or directory
Sep 20 23:21:52 sentry-docker00.cs.umd.edu systemd-udevd[428437]: Could not generate persistent MAC address for veth37e0e14: No such file or directory
Sep 20 23:21:52 sentry-docker00.cs.umd.edu systemd-udevd[428453]: Could not generate persistent MAC address for vethdb28c7b: No such file or directory
Sep 20 23:21:52 sentry-docker00.cs.umd.edu systemd-udevd[428449]: Could not generate persistent MAC address for veth86857e8: No such file or directory
Sep 20 23:21:52 sentry-docker00.cs.umd.edu systemd-udevd[428453]: Could not generate persistent MAC address for veth9b0da49: No such file or directory
Sep 20 23:21:52 sentry-docker00.cs.umd.edu systemd-udevd[428448]: Could not generate persistent MAC address for veth7370ac4: No such file or directory
Sep 20 23:21:52 sentry-docker00.cs.umd.edu systemd-udevd[428453]: Could not generate persistent MAC address for veth4385a62: No such file or directory
Sep 20 23:21:52 sentry-docker00.cs.umd.edu systemd-udevd[428437]: Could not generate persistent MAC address for veth3fca32b: No such file or directory
Sep 20 23:42:01 sentry-docker00.cs.umd.edu systemd-udevd[437898]: Could not generate persistent MAC address for vethea296ea: No such file or directory
Sep 20 23:42:01 sentry-docker00.cs.umd.edu systemd-udevd[437899]: Could not generate persistent MAC address for vethde7a261: No such file or directory
Sep 20 23:42:01 sentry-docker00.cs.umd.edu systemd-udevd[437917]: Could not generate persistent MAC address for vethe06a6a8: No such file or directory
Sep 20 23:42:01 sentry-docker00.cs.umd.edu systemd-udevd[437909]: Could not generate persistent MAC address for veth1245985: No such file or directory
Sep 20 23:42:01 sentry-docker00.cs.umd.edu systemd-udevd[437920]: Could not generate persistent MAC address for vethad215ac: No such file or directory
Sep 20 23:42:01 sentry-docker00.cs.umd.edu systemd-udevd[437919]: Could not generate persistent MAC address for veth5b456f8: No such file or directory
Sep 20 23:42:01 sentry-docker00.cs.umd.edu systemd-udevd[437909]: Could not generate persistent MAC address for vethab8270a: No such file or directory
Sep 20 23:42:01 sentry-docker00.cs.umd.edu systemd-udevd[437919]: Could not generate persistent MAC address for veth88196e0: No such file or directory
Sep 20 23:42:01 sentry-docker00.cs.umd.edu systemd-udevd[437930]: Could not generate persistent MAC address for veth5f302ce: No such file or directory
Sep 20 23:42:01 sentry-docker00.cs.umd.edu systemd-udevd[437931]: Could not generate persistent MAC address for vetha81bbf1: No such file or directory
Sep 21 00:02:09 sentry-docker00.cs.umd.edu systemd-udevd[447337]: Could not generate persistent MAC address for veth2511f31: No such file or directory
Sep 21 00:02:09 sentry-docker00.cs.umd.edu systemd-udevd[447338]: Could not generate persistent MAC address for veth794c511: No such file or directory
Sep 21 00:02:09 sentry-docker00.cs.umd.edu systemd-udevd[447341]: Could not generate persistent MAC address for veth9ca3162: No such file or directory
Sep 21 00:02:09 sentry-docker00.cs.umd.edu systemd-udevd[447342]: Could not generate persistent MAC address for vethf593b51: No such file or directory
Sep 21 00:02:09 sentry-docker00.cs.umd.edu systemd-udevd[447366]: Could not generate persistent MAC address for veth4a23615: No such file or directory
Sep 21 00:02:09 sentry-docker00.cs.umd.edu systemd-udevd[447365]: Could not generate persistent MAC address for vethe34f5bd: No such file or directory
Sep 21 00:02:09 sentry-docker00.cs.umd.edu systemd-udevd[447384]: Could not generate persistent MAC address for veth16874e8: No such file or directory
Sep 21 00:02:09 sentry-docker00.cs.umd.edu systemd-udevd[447369]: Could not generate persistent MAC address for veth36ffb5f: No such file or directory
... 2 more distinct messages not shown
== strawberry (7 distinct, 38 total) ==
Sep 20 23:07:03 strawberry kernel: I/O error, dev sda, sector 206848 op 0x0:(READ) flags 0x80700 phys_seg 1 prio class 2 [x6]
Sep 20 23:07:03 strawberry kernel: I/O error, dev sda, sector 206848 op 0x0:(READ) flags 0x0 phys_seg 1 prio class 2 [x6]
Sep 20 23:07:03 strawberry kernel: Buffer I/O error on dev sda2, logical block 0, async page read [x6]
Sep 20 23:07:03 strawberry kernel: I/O error, dev sda, sector 2048 op 0x0:(READ) flags 0x80700 phys_seg 1 prio class 2 [x6]
Sep 20 23:07:03 strawberry kernel: I/O error, dev sda, sector 2048 op 0x0:(READ) flags 0x0 phys_seg 1 prio class 2 [x6]
Sep 20 23:07:03 strawberry kernel: Buffer I/O error on dev sda1, logical block 0, async page read [x6]
Sep 20 23:34:42 strawberry smartd[5314]: Device: /dev/sda [SAT], failed to read SMART Attribute Data [x2]
== submit26-b9-f1 (1 distinct, 1 total) ==
Sep 20 23:13:07 submit26-b9-f1 systemd[1]: user(a)1001.service: Main process exited, code=killed, status=9/KILL
== submit26-b9-f2 (1 distinct, 2 total) ==
Sep 20 23:22:50 submit26-b9-f2 systemd[1]: user(a)1001.service: Main process exited, code=killed, status=9/KILL [x2]
== submit26-b9-f3 (1 distinct, 2 total) ==
Sep 20 23:05:06 submit26-b9-f3 systemd[1]: user(a)1001.service: Main process exited, code=killed, status=9/KILL [x2]
== submit26-b9-f4 (1 distinct, 2 total) ==
Sep 20 23:25:10 submit26-b9-f4 systemd[1]: user(a)1001.service: Main process exited, code=killed, status=9/KILL [x2]
== wraith (1 distinct, 1 total) ==
Sep 21 00:00:00 wraith (nin-node)[826982]: munin-node.service: Referenced but unset environment variable evaluates to an empty string: DAEMON_ARGS
1
0
Command: /usr/local/sbin/syslog-digest.py
Time : 0.0512s
Status : exited 0
Output :
Syslog digest — 2026-09-20 23:05 EDT
Processed 2,088 lines, filtered 1,530 (73%). 558 unknown (193 distinct) from 22 host(s).
== atif01.cs.umd.edu (2 distinct, 2 total) ==
Sep 20 22:13:29 atif01.cs.umd.edu kernel: net_ratelimit: 6 callbacks suppressed
Sep 20 22:40:29 atif01.cs.umd.edu kernel: nfsd: peername failed (err 107)!
== b0b02.cs.umd.edu (1 distinct, 1 total) ==
Sep 20 22:53:00 b0b02.cs.umd.edu rustdesk[3412508]: cannot open display:
== bale (5 distinct, 88 total) ==
Sep 20 22:05:31 bale setroubleshoot[1293442]: failed to retrieve rpm info for /dev/nvme0 [x38]
Sep 20 22:05:31 bale setroubleshoot[1293442]: SELinux is preventing /usr/libexec/platform-python3.6 from getattr access on the chr_file /dev/nvme0. For complete SELinux messages run: sealert -l e098d0bd-ac29-4737-9018-de9a71e328ee [x12]
Sep 20 22:05:34 bale setroubleshoot[1293442]: SELinux is preventing smartctl from read access on the chr_file nvme0. For complete SELinux messages run: sealert -l fc305ce6-663c-4aa2-8640-0ee0f8dce1a9 [x12]
Sep 20 22:05:37 bale setroubleshoot[1293442]: SELinux is preventing smartctl from open access on the chr_file /dev/nvme0. For complete SELinux messages run: sealert -l 2c1d6b29-3343-488c-84c7-92d46f8010b6 [x12]
Sep 20 22:05:49 bale setroubleshoot[1294080]: SELinux is preventing /usr/sbin/smartctl from ioctl access on the chr_file /dev/nvme0. For complete SELinux messages run: sealert -l 8ea740c2-97d8-42fb-b550-a236b114507d [x14]
== biggulp.cs.umd.edu (2 distinct, 2 total) ==
Sep 20 22:51:29 biggulp.cs.umd.edu sshd-session[2916301]: pam_access(sshd:auth): access denied for user `operator' from `193.187.110.214'
Sep 20 22:51:31 biggulp.cs.umd.edu sshd-session[2916295]: error: PAM: Authentication failure for operator from 193.187.110.214
== cmsc436-0101-redis (3 distinct, 3 total) ==
Sep 20 22:10:08 cmsc436-0101-redis sshd-session[3357493]: error: PAM: Authentication failure for root from 193.187.110.214
Sep 20 22:34:15 cmsc436-0101-redis krb5_child[3358346]: Client 'admin(a)UMD.EDU' not found in Kerberos database
Sep 20 22:34:17 cmsc436-0101-redis sshd-session[3358342]: error: PAM: Authentication failure for admin from 34.156.126.241
== csfw00a (2 distinct, 140 total) ==
Sep 20 22:03:49 csfw00a kernel: bnxt_en 0000:09:00.0 eth3: NIC Link is Down [x138]
Sep 20 22:54:21 csfw00a ospf6d[1477]: [EC 100663307] Could not send entire message [x2]
== idm00 (1 distinct, 1 total) ==
Sep 20 22:54:01 idm00 named[4166701]: client @0x7f11986ceb28 10.73.240.42#53770: update '73.10.in-addr.arpa/IN' denied
== idmp0 (1 distinct, 1 total) ==
Sep 20 22:37:56 idmp0 named[1598691]: client @0x7f2d3002f808 10.73.240.43#49191: update '73.10.in-addr.arpa/IN' denied
== itmon02 (1 distinct, 3 total) ==
Sep 20 22:08:07 itmon02 sshd[1750555]: error: beginning MaxStartups throttling [x3]
== munin (2 distinct, 28 total) ==
Sep 20 22:43:33 munin sudo[1019808]: pam_systemd(sudo:session): Failed to stat() runtime directory '/run/user/0': No such file or directory [x14]
Sep 20 22:43:33 munin sudo[1019808]: pam_systemd(sudo:session): Not setting $XDG_RUNTIME_DIR, as the directory is not in order. [x14]
== newhonors.cs.umd.edu (1 distinct, 1 total) ==
Sep 20 22:59:41 newhonors.cs.umd.edu systemd-tmpfiles: [/usr/lib/tmpfiles.d/var.conf:14] Duplicate line for path "/var/log", ignoring.
== newhonors2 (1 distinct, 24 total) ==
Sep 20 22:13:03 newhonors2 dhcpcd[2922976]: dhcpcd is not running [x24]
== ntop00 (99 distinct, 143 total) ==
Sep 20 22:05:28 ntop00 sfacctd[791587]: INFO ( m1/mysql ): *** Purging cache - END (PID: 346, QN: 6458/6458, ET: 27) ***
Sep 20 22:05:28 ntop00 nfacctd[791663]: INFO ( m1/mysql ): *** Purging cache - END (PID: 346, QN: 56/56, ET: 27) ***
Sep 20 22:08:01 ntop00 sfacctd[791587]: INFO ( p1/print ): *** Purging cache - START (PID: 347) ***
Sep 20 22:08:01 ntop00 sfacctd[791587]: INFO ( p1/print ): *** Purging cache - END (PID: 347, QN: 5966/5966, ET: 0) ***
Sep 20 22:08:01 ntop00 nfacctd[791663]: INFO ( p1/print ): *** Purging cache - START (PID: 347) ***
Sep 20 22:08:01 ntop00 nfacctd[791663]: INFO ( p1/print ): *** Purging cache - END (PID: 347, QN: 61/61, ET: 0) ***
Sep 20 22:08:02 ntop00 setroubleshoot[905324]: SELinux is preventing /usr/local/sbin/sfacctd from append access on the file sflow.json. For complete SELinux messages run: sealert -l aec09a24-8fd6-4c2f-ba24-2e4b38b93f4c [x12]
Sep 20 22:08:02 ntop00 setroubleshoot[905324]: SELinux is preventing /usr/local/sbin/sfacctd from write access on the file sflow.json. For complete SELinux messages run: sealert -l b2869c09-acbd-427c-b7c9-edae08c37a0e [x12]
Sep 20 22:08:02 ntop00 setroubleshoot[905324]: failed to retrieve rpm info for path '/srv/pmacct/sflow.json': [x12]
Sep 20 22:08:02 ntop00 setroubleshoot[905324]: SELinux is preventing /usr/local/sbin/sfacctd from lock access on the file /srv/pmacct/sflow.json. For complete SELinux messages run: sealert -l dbd70a69-3ee5-4fce-87ea-309297754109 [x12]
Sep 20 22:10:01 ntop00 sfacctd[791587]: INFO ( m1/mysql ): *** Purging cache - START (PID: 348) ***
Sep 20 22:10:01 ntop00 nfacctd[791663]: INFO ( m1/mysql ): *** Purging cache - START (PID: 348) ***
Sep 20 22:10:25 ntop00 sfacctd[791587]: INFO ( m1/mysql ): *** Purging cache - END (PID: 348, QN: 5864/5864, ET: 24) ***
Sep 20 22:10:26 ntop00 nfacctd[791663]: INFO ( m1/mysql ): *** Purging cache - END (PID: 348, QN: 60/60, ET: 25) ***
Sep 20 22:13:01 ntop00 sfacctd[791587]: INFO ( p1/print ): *** Purging cache - START (PID: 349) ***
Sep 20 22:13:01 ntop00 sfacctd[791587]: INFO ( p1/print ): *** Purging cache - END (PID: 349, QN: 6461/6461, ET: 0) ***
Sep 20 22:13:01 ntop00 nfacctd[791663]: INFO ( p1/print ): *** Purging cache - START (PID: 349) ***
Sep 20 22:13:01 ntop00 nfacctd[791663]: INFO ( p1/print ): *** Purging cache - END (PID: 349, QN: 69/69, ET: 0) ***
Sep 20 22:15:01 ntop00 sfacctd[791587]: INFO ( m1/mysql ): *** Purging cache - START (PID: 350) ***
Sep 20 22:15:02 ntop00 nfacctd[791663]: INFO ( m1/mysql ): *** Purging cache - START (PID: 350) ***
Sep 20 22:15:28 ntop00 sfacctd[791587]: INFO ( m1/mysql ): *** Purging cache - END (PID: 350, QN: 6625/6625, ET: 27) ***
Sep 20 22:15:28 ntop00 nfacctd[791663]: INFO ( m1/mysql ): *** Purging cache - END (PID: 350, QN: 68/68, ET: 26) ***
Sep 20 22:18:01 ntop00 sfacctd[791587]: INFO ( p1/print ): *** Purging cache - START (PID: 351) ***
Sep 20 22:18:01 ntop00 sfacctd[791587]: INFO ( p1/print ): *** Purging cache - END (PID: 351, QN: 6410/6410, ET: 0) ***
Sep 20 22:18:01 ntop00 nfacctd[791663]: INFO ( p1/print ): *** Purging cache - START (PID: 351) ***
Sep 20 22:18:01 ntop00 nfacctd[791663]: INFO ( p1/print ): *** Purging cache - END (PID: 351, QN: 84/84, ET: 0) ***
Sep 20 22:20:01 ntop00 sfacctd[791587]: INFO ( m1/mysql ): *** Purging cache - START (PID: 352) ***
Sep 20 22:20:01 ntop00 nfacctd[791663]: INFO ( m1/mysql ): *** Purging cache - START (PID: 352) ***
Sep 20 22:20:27 ntop00 sfacctd[791587]: INFO ( m1/mysql ): *** Purging cache - END (PID: 352, QN: 6172/6172, ET: 26) ***
Sep 20 22:20:27 ntop00 nfacctd[791663]: INFO ( m1/mysql ): *** Purging cache - END (PID: 352, QN: 77/77, ET: 26) ***
... 69 more distinct messages not shown
== outbound00.cs.umd.edu (1 distinct, 6 total) ==
Sep 20 22:09:09 outbound00.cs.umd.edu python3[2173321]: ldapdb [x6]
== outbound01.cs.umd.edu (3 distinct, 8 total) ==
Sep 20 22:13:07 outbound01.cs.umd.edu python3[239672]: ldapdb [x6]
Sep 20 22:13:30 outbound01.cs.umd.edu krb5_child[239844]: Client 'admin(a)UMD.EDU' not found in Kerberos database
Sep 20 22:20:30 outbound01.cs.umd.edu sshd-session[240980]: error: Protocol major versions differ: 2 vs. 1
== sentry-docker00.cs.umd.edu (34 distinct, 34 total) ==
Sep 20 22:21:27 sentry-docker00.cs.umd.edu systemd-udevd[399967]: link_config: could not get ethtool features for vethce0bb98
Sep 20 22:21:27 sentry-docker00.cs.umd.edu systemd-udevd[399967]: Could not set offload features of vethce0bb98: No such device
Sep 20 22:21:27 sentry-docker00.cs.umd.edu systemd-udevd[400002]: Could not generate persistent MAC address for veth85f034d: No such file or directory
Sep 20 22:21:27 sentry-docker00.cs.umd.edu systemd-udevd[400003]: Could not generate persistent MAC address for vethb3a3e11: No such file or directory
Sep 20 22:21:27 sentry-docker00.cs.umd.edu systemd-udevd[400006]: Could not generate persistent MAC address for vethbe17271: No such file or directory
Sep 20 22:21:27 sentry-docker00.cs.umd.edu systemd-udevd[400007]: Could not generate persistent MAC address for veth11b2042: No such file or directory
Sep 20 22:21:27 sentry-docker00.cs.umd.edu systemd-udevd[400011]: Could not generate persistent MAC address for vetha2e2eb4: No such file or directory
Sep 20 22:21:27 sentry-docker00.cs.umd.edu systemd-udevd[400019]: Could not generate persistent MAC address for veth8ba3604: No such file or directory
Sep 20 22:21:27 sentry-docker00.cs.umd.edu systemd-udevd[400019]: Could not generate persistent MAC address for veth224563b: No such file or directory
Sep 20 22:21:27 sentry-docker00.cs.umd.edu systemd-udevd[400011]: Could not generate persistent MAC address for veth310e414: No such file or directory
Sep 20 22:21:27 sentry-docker00.cs.umd.edu systemd-udevd[400014]: Could not generate persistent MAC address for veth2381731: No such file or directory
Sep 20 22:21:27 sentry-docker00.cs.umd.edu systemd-udevd[400013]: Could not generate persistent MAC address for veth1d9d829: No such file or directory
Sep 20 22:41:36 sentry-docker00.cs.umd.edu systemd-udevd[409464]: Could not generate persistent MAC address for vetha18ac36: No such file or directory
Sep 20 22:41:36 sentry-docker00.cs.umd.edu systemd-udevd[409465]: Could not generate persistent MAC address for veth605402f: No such file or directory
Sep 20 22:41:36 sentry-docker00.cs.umd.edu systemd-udevd[409468]: Could not generate persistent MAC address for veth41eb912: No such file or directory
Sep 20 22:41:36 sentry-docker00.cs.umd.edu systemd-udevd[409469]: Could not generate persistent MAC address for vethe149c0f: No such file or directory
Sep 20 22:41:36 sentry-docker00.cs.umd.edu systemd-udevd[409484]: Could not generate persistent MAC address for veth7e5c7dc: No such file or directory
Sep 20 22:41:36 sentry-docker00.cs.umd.edu systemd-udevd[409471]: Could not generate persistent MAC address for veth2e54722: No such file or directory
Sep 20 22:41:36 sentry-docker00.cs.umd.edu systemd-udevd[409494]: Could not generate persistent MAC address for veth763e633: No such file or directory
Sep 20 22:41:36 sentry-docker00.cs.umd.edu systemd-udevd[409495]: Could not generate persistent MAC address for veth52b4004: No such file or directory
Sep 20 22:41:36 sentry-docker00.cs.umd.edu systemd-udevd[409511]: Could not generate persistent MAC address for vethd997755: No such file or directory
Sep 20 22:41:36 sentry-docker00.cs.umd.edu systemd-udevd[409517]: Could not generate persistent MAC address for veth44f7944: No such file or directory
Sep 20 23:01:43 sentry-docker00.cs.umd.edu systemd-udevd[418861]: link_config: could not get ethtool features for veth763e633
Sep 20 23:01:43 sentry-docker00.cs.umd.edu systemd-udevd[418861]: Could not set offload features of veth763e633: No such device
Sep 20 23:01:44 sentry-docker00.cs.umd.edu systemd-udevd[418895]: Could not generate persistent MAC address for vethf86a822: No such file or directory
Sep 20 23:01:44 sentry-docker00.cs.umd.edu systemd-udevd[418896]: Could not generate persistent MAC address for veth73dff1a: No such file or directory
Sep 20 23:01:44 sentry-docker00.cs.umd.edu systemd-udevd[418899]: Could not generate persistent MAC address for veth902b1c2: No such file or directory
Sep 20 23:01:44 sentry-docker00.cs.umd.edu systemd-udevd[418900]: Could not generate persistent MAC address for veth4879303: No such file or directory
Sep 20 23:01:44 sentry-docker00.cs.umd.edu systemd-udevd[418923]: Could not generate persistent MAC address for veth76b01be: No such file or directory
Sep 20 23:01:44 sentry-docker00.cs.umd.edu systemd-udevd[418924]: Could not generate persistent MAC address for vethad4f364: No such file or directory
... 4 more distinct messages not shown
== strawberry (7 distinct, 38 total) ==
Sep 20 22:07:04 strawberry kernel: I/O error, dev sda, sector 206848 op 0x0:(READ) flags 0x80700 phys_seg 1 prio class 2 [x6]
Sep 20 22:07:04 strawberry kernel: I/O error, dev sda, sector 206848 op 0x0:(READ) flags 0x0 phys_seg 1 prio class 2 [x6]
Sep 20 22:07:04 strawberry kernel: Buffer I/O error on dev sda2, logical block 0, async page read [x6]
Sep 20 22:07:04 strawberry kernel: I/O error, dev sda, sector 2048 op 0x0:(READ) flags 0x80700 phys_seg 1 prio class 2 [x6]
Sep 20 22:07:04 strawberry kernel: I/O error, dev sda, sector 2048 op 0x0:(READ) flags 0x0 phys_seg 1 prio class 2 [x6]
Sep 20 22:07:04 strawberry kernel: Buffer I/O error on dev sda1, logical block 0, async page read [x6]
Sep 20 22:34:42 strawberry smartd[5314]: Device: /dev/sda [SAT], failed to read SMART Attribute Data [x2]
== submit26-b9-f1 (10 distinct, 14 total) ==
Sep 20 22:10:08 submit26-b9-f1 systemd[1]: user(a)1001.service: Main process exited, code=killed, status=9/KILL [x5]
Sep 20 22:25:54 submit26-b9-f1 setroubleshoot[2649468]: SELinux is preventing /usr/bin/python3.9 from create access on the directory /(null). For complete SELinux messages run: sealert -l 3ef7d677-731f-46bf-9c34-c2c55fea665c
Sep 20 22:25:54 submit26-b9-f1 setroubleshoot[2649468]: SELinux is preventing /usr/bin/python3.9 from add_name access on the directory /(null). For complete SELinux messages run: sealert -l aa60e26f-72e1-45f1-bc12-aa8b3b669e36
Sep 20 22:25:54 submit26-b9-f1 setroubleshoot[2649468]: SELinux is preventing /usr/bin/python3.9 from create access on the file /(null). For complete SELinux messages run: sealert -l d088fb43-23ee-4ae8-ae6a-5d1c041ee2d6
Sep 20 22:25:54 submit26-b9-f1 setroubleshoot[2649468]: SELinux is preventing /usr/bin/python3.9 from open access on the file /tmp/libdnf.h0ESKV/repodata/repomd.xml. For complete SELinux messages run: sealert -l 3b0d8c9a-6637-4d6e-a864-f1dd7c00377d
Sep 20 22:25:54 submit26-b9-f1 setroubleshoot[2649468]: SELinux is preventing /usr/bin/python3.9 from setattr access on the file repomd.xml. For complete SELinux messages run: sealert -l 0fd3339f-3ef2-45f3-9e58-65a58b42f3ee
Sep 20 22:25:54 submit26-b9-f1 setroubleshoot[2649468]: SELinux is preventing /usr/bin/python3.9 from read access on the directory libdnf.h0ESKV. For complete SELinux messages run: sealert -l 0d661d88-dc9e-469d-986b-52e29b353aa8
Sep 20 22:25:54 submit26-b9-f1 setroubleshoot[2649468]: SELinux is preventing /usr/bin/python3.9 from remove_name access on the directory repomd.xml. For complete SELinux messages run: sealert -l 405a8556-cf9f-4ef4-8525-0dca18d4259d
Sep 20 22:25:54 submit26-b9-f1 setroubleshoot[2649468]: SELinux is preventing /usr/bin/python3.9 from unlink access on the file repomd.xml. For complete SELinux messages run: sealert -l 3c38e23e-3631-4cb5-81c7-992675c836d9
Sep 20 22:25:54 submit26-b9-f1 setroubleshoot[2649468]: SELinux is preventing /usr/bin/python3.9 from rmdir access on the directory repodata. For complete SELinux messages run: sealert -l a070e9b5-2867-47d6-b2e3-3b7d99725848
== submit26-b9-f2 (10 distinct, 12 total) ==
Sep 20 22:06:49 submit26-b9-f2 setroubleshoot[1759123]: SELinux is preventing /usr/bin/python3.9 from create access on the directory /(null). For complete SELinux messages run: sealert -l 0659d546-3107-4f75-b00f-008c85f41dc6
Sep 20 22:06:49 submit26-b9-f2 setroubleshoot[1759123]: SELinux is preventing /usr/bin/python3.9 from add_name access on the directory /(null). For complete SELinux messages run: sealert -l 156d9270-3466-4356-b86f-1a128825961a
Sep 20 22:06:49 submit26-b9-f2 setroubleshoot[1759123]: SELinux is preventing /usr/bin/python3.9 from create access on the file /(null). For complete SELinux messages run: sealert -l c8a40bf5-2fc4-46b3-b813-8592b3523339
Sep 20 22:06:49 submit26-b9-f2 setroubleshoot[1759123]: SELinux is preventing /usr/bin/python3.9 from open access on the file /tmp/libdnf.CcGYzx/repodata/repomd.xml. For complete SELinux messages run: sealert -l 7f4c3a8e-0f99-47c4-9baf-e1336fe24876
Sep 20 22:06:49 submit26-b9-f2 setroubleshoot[1759123]: SELinux is preventing /usr/bin/python3.9 from setattr access on the file repomd.xml. For complete SELinux messages run: sealert -l 988123da-b724-4e6a-900c-33a2723fdaf1
Sep 20 22:06:49 submit26-b9-f2 setroubleshoot[1759123]: SELinux is preventing /usr/bin/python3.9 from read access on the directory libdnf.CcGYzx. For complete SELinux messages run: sealert -l ca585e2b-d50f-4264-8127-6b3fa04070c8
Sep 20 22:06:49 submit26-b9-f2 setroubleshoot[1759123]: SELinux is preventing /usr/bin/python3.9 from remove_name access on the directory repomd.xml. For complete SELinux messages run: sealert -l 3a749560-1cec-40ca-a4dc-596841be3885
Sep 20 22:06:49 submit26-b9-f2 setroubleshoot[1759123]: SELinux is preventing /usr/bin/python3.9 from unlink access on the file repomd.xml. For complete SELinux messages run: sealert -l 0aa52f08-94f8-474e-96d8-e818846941af
Sep 20 22:06:49 submit26-b9-f2 setroubleshoot[1759123]: SELinux is preventing /usr/bin/python3.9 from rmdir access on the directory repodata. For complete SELinux messages run: sealert -l de019dc4-408f-439c-902a-676d18dfe8e7
Sep 20 22:15:07 submit26-b9-f2 systemd[1]: user(a)1001.service: Main process exited, code=killed, status=9/KILL [x3]
== submit26-b9-f3 (1 distinct, 3 total) ==
Sep 20 22:15:04 submit26-b9-f3 systemd[1]: user(a)1001.service: Main process exited, code=killed, status=9/KILL [x3]
== teaching-awards (2 distinct, 2 total) ==
Sep 20 22:23:35 teaching-awards krb5_child[1202557]: Client 'admin(a)UMD.EDU' not found in Kerberos database
Sep 20 22:30:20 teaching-awards sshd-session[1203046]: error: Protocol major versions differ: 2 vs. 1
== vacuum.cs.umd.edu (4 distinct, 4 total) ==
Sep 20 22:12:00 vacuum.cs.umd.edu abrt-hook-ccpp[24837]: Process 20422 (driver) of user 33 killed by SIGABRT - dumping core
Sep 20 22:12:00 vacuum.cs.umd.edu abrt-server[24838]: Package 'amanda-backup_server' isn't signed with proper key
Sep 20 22:12:00 vacuum.cs.umd.edu abrt-server[24838]: 'post-create' on '/var/spool/abrt/ccpp-2026-09-20-22:12:00-20422' exited with 1
Sep 20 22:12:00 vacuum.cs.umd.edu abrt-server[24838]: Deleting problem directory '/var/spool/abrt/ccpp-2026-09-20-22:12:00-20422'
1
0
Command: /usr/local/sbin/syslog-digest.py
Time : 0.0512s
Status : exited 0
Output :
Syslog digest — 2026-09-20 22:05 EDT
Processed 1,995 lines, filtered 1,450 (72%). 545 unknown (198 distinct) from 21 host(s).
== b0b02.cs.umd.edu (1 distinct, 1 total) ==
Sep 20 21:52:56 b0b02.cs.umd.edu rustdesk[3397319]: cannot open display:
== bale (5 distinct, 90 total) ==
Sep 20 21:05:53 bale setroubleshoot[1280569]: failed to retrieve rpm info for /dev/nvme0 [x39]
Sep 20 21:05:53 bale setroubleshoot[1280569]: SELinux is preventing /usr/libexec/platform-python3.6 from getattr access on the chr_file /dev/nvme0. For complete SELinux messages run: sealert -l e098d0bd-ac29-4737-9018-de9a71e328ee [x12]
Sep 20 21:05:56 bale setroubleshoot[1280569]: SELinux is preventing smartctl from read access on the chr_file nvme0. For complete SELinux messages run: sealert -l fc305ce6-663c-4aa2-8640-0ee0f8dce1a9 [x12]
Sep 20 21:05:59 bale setroubleshoot[1280569]: SELinux is preventing smartctl from open access on the chr_file /dev/nvme0. For complete SELinux messages run: sealert -l 2c1d6b29-3343-488c-84c7-92d46f8010b6 [x12]
Sep 20 21:06:11 bale setroubleshoot[1281185]: SELinux is preventing /usr/sbin/smartctl from ioctl access on the chr_file /dev/nvme0. For complete SELinux messages run: sealert -l 8ea740c2-97d8-42fb-b550-a236b114507d [x15]
== cheezit.cs.umd.edu (6 distinct, 6 total) ==
Sep 20 21:46:07 cheezit.cs.umd.edu sshd-session[1367147]: error: kex_protocol_error: type 20 seq 2 [preauth]
Sep 20 21:46:07 cheezit.cs.umd.edu sshd-session[1367147]: error: kex_protocol_error: type 30 seq 3 [preauth]
Sep 20 21:46:09 cheezit.cs.umd.edu sshd-session[1367147]: error: kex_protocol_error: type 20 seq 4 [preauth]
Sep 20 21:46:09 cheezit.cs.umd.edu sshd-session[1367147]: error: kex_protocol_error: type 30 seq 5 [preauth]
Sep 20 21:46:11 cheezit.cs.umd.edu sshd-session[1367147]: error: kex_protocol_error: type 20 seq 6 [preauth]
Sep 20 21:46:11 cheezit.cs.umd.edu sshd-session[1367147]: error: kex_protocol_error: type 30 seq 7 [preauth]
== csfw00a (1 distinct, 140 total) ==
Sep 20 21:04:49 csfw00a kernel: bnxt_en 0000:09:00.0 eth3: NIC Link is Down [x140]
== idm00 (1 distinct, 1 total) ==
Sep 20 21:54:00 idm00 named[4166701]: client @0x7f11a0062908 10.73.240.42#49275: update '73.10.in-addr.arpa/IN' denied
== idmp0 (1 distinct, 1 total) ==
Sep 20 21:37:56 idmp0 named[1598691]: client @0x7f2d3802f8f8 10.73.240.43#54734: update '73.10.in-addr.arpa/IN' denied
== inbound00.cs.umd.edu (1 distinct, 1 total) ==
Sep 20 21:34:52 inbound00.cs.umd.edu krb5_child[2298408]: Client 'admin(a)UMD.EDU' not found in Kerberos database
== itmon02 (1 distinct, 2 total) ==
Sep 20 21:38:16 itmon02 sshd[1750555]: error: beginning MaxStartups throttling [x2]
== krispykreme.cs.umd.edu (9 distinct, 9 total) ==
Sep 20 21:18:12 krispykreme.cs.umd.edu sshd-session[452223]: pam_access(sshd:auth): access denied for user `admin' from `193.187.110.214'
Sep 20 21:18:12 krispykreme.cs.umd.edu krb5_child[452225]: Client 'admin(a)UMD.EDU' not found in Kerberos database
Sep 20 21:18:12 krispykreme.cs.umd.edu sshd-session[452221]: error: PAM: System error for admin from 193.187.110.214
Sep 20 21:58:20 krispykreme.cs.umd.edu sshd-session[464903]: error: kex_protocol_error: type 20 seq 2 [preauth]
Sep 20 21:58:20 krispykreme.cs.umd.edu sshd-session[464903]: error: kex_protocol_error: type 30 seq 3 [preauth]
Sep 20 21:58:21 krispykreme.cs.umd.edu sshd-session[464903]: error: kex_protocol_error: type 20 seq 4 [preauth]
Sep 20 21:58:21 krispykreme.cs.umd.edu sshd-session[464903]: error: kex_protocol_error: type 30 seq 5 [preauth]
Sep 20 21:58:23 krispykreme.cs.umd.edu sshd-session[464903]: error: kex_protocol_error: type 20 seq 6 [preauth]
Sep 20 21:58:23 krispykreme.cs.umd.edu sshd-session[464903]: error: kex_protocol_error: type 30 seq 7 [preauth]
== matrix (2 distinct, 3 total) ==
Sep 20 21:25:39 matrix krb5_child[3498994]: Client 'admin(a)UMD.EDU' not found in Kerberos database [x2]
Sep 20 21:25:41 matrix sshd[3498969]: error: PAM: Authentication failure for admin from 193.187.110.214
== munin (2 distinct, 8 total) ==
Sep 20 21:33:20 munin sudo[993998]: pam_systemd(sudo:session): Failed to stat() runtime directory '/run/user/0': No such file or directory [x4]
Sep 20 21:33:20 munin sudo[993998]: pam_systemd(sudo:session): Not setting $XDG_RUNTIME_DIR, as the directory is not in order. [x4]
== newhonors2 (1 distinct, 24 total) ==
Sep 20 21:13:02 newhonors2 dhcpcd[2921039]: dhcpcd is not running [x24]
== ntop00 (100 distinct, 140 total) ==
Sep 20 21:05:31 ntop00 sfacctd[791587]: INFO ( m1/mysql ): *** Purging cache - END (PID: 322, QN: 7176/7176, ET: 30) ***
Sep 20 21:05:31 ntop00 nfacctd[791663]: INFO ( m1/mysql ): *** Purging cache - END (PID: 322, QN: 88/88, ET: 30) ***
Sep 20 21:08:01 ntop00 sfacctd[791587]: INFO ( p1/print ): *** Purging cache - START (PID: 323) ***
Sep 20 21:08:01 ntop00 sfacctd[791587]: INFO ( p1/print ): *** Purging cache - END (PID: 323, QN: 7322/7322, ET: 0) ***
Sep 20 21:08:01 ntop00 nfacctd[791663]: INFO ( p1/print ): *** Purging cache - START (PID: 323) ***
Sep 20 21:08:01 ntop00 nfacctd[791663]: INFO ( p1/print ): *** Purging cache - END (PID: 323, QN: 52/52, ET: 0) ***
Sep 20 21:08:02 ntop00 setroubleshoot[897288]: SELinux is preventing /usr/local/sbin/sfacctd from append access on the file sflow.json. For complete SELinux messages run: sealert -l aec09a24-8fd6-4c2f-ba24-2e4b38b93f4c [x11]
Sep 20 21:08:02 ntop00 setroubleshoot[897288]: SELinux is preventing /usr/local/sbin/sfacctd from write access on the file sflow.json. For complete SELinux messages run: sealert -l b2869c09-acbd-427c-b7c9-edae08c37a0e [x11]
Sep 20 21:08:02 ntop00 setroubleshoot[897288]: failed to retrieve rpm info for path '/srv/pmacct/sflow.json': [x11]
Sep 20 21:08:02 ntop00 setroubleshoot[897288]: SELinux is preventing /usr/local/sbin/sfacctd from lock access on the file /srv/pmacct/sflow.json. For complete SELinux messages run: sealert -l dbd70a69-3ee5-4fce-87ea-309297754109 [x11]
Sep 20 21:10:01 ntop00 sfacctd[791587]: INFO ( m1/mysql ): *** Purging cache - START (PID: 324) ***
Sep 20 21:10:01 ntop00 nfacctd[791663]: INFO ( m1/mysql ): *** Purging cache - START (PID: 324) ***
Sep 20 21:10:29 ntop00 sfacctd[791587]: INFO ( m1/mysql ): *** Purging cache - END (PID: 324, QN: 7033/7033, ET: 28) ***
Sep 20 21:10:30 ntop00 nfacctd[791663]: INFO ( m1/mysql ): *** Purging cache - END (PID: 324, QN: 50/50, ET: 29) ***
Sep 20 21:13:01 ntop00 sfacctd[791587]: INFO ( p1/print ): *** Purging cache - START (PID: 325) ***
Sep 20 21:13:01 ntop00 sfacctd[791587]: INFO ( p1/print ): *** Purging cache - END (PID: 325, QN: 6743/6743, ET: 0) ***
Sep 20 21:13:01 ntop00 nfacctd[791663]: INFO ( p1/print ): *** Purging cache - START (PID: 325) ***
Sep 20 21:13:01 ntop00 nfacctd[791663]: INFO ( p1/print ): *** Purging cache - END (PID: 325, QN: 42/42, ET: 0) ***
Sep 20 21:15:01 ntop00 sfacctd[791587]: INFO ( m1/mysql ): *** Purging cache - START (PID: 326) ***
Sep 20 21:15:01 ntop00 nfacctd[791663]: INFO ( m1/mysql ): *** Purging cache - START (PID: 326) ***
Sep 20 21:15:30 ntop00 sfacctd[791587]: INFO ( m1/mysql ): *** Purging cache - END (PID: 326, QN: 6711/6711, ET: 29) ***
Sep 20 21:15:30 ntop00 nfacctd[791663]: INFO ( m1/mysql ): *** Purging cache - END (PID: 326, QN: 49/49, ET: 29) ***
Sep 20 21:18:01 ntop00 sfacctd[791587]: INFO ( p1/print ): *** Purging cache - START (PID: 327) ***
Sep 20 21:18:01 ntop00 sfacctd[791587]: INFO ( p1/print ): *** Purging cache - END (PID: 327, QN: 7282/7282, ET: 0) ***
Sep 20 21:18:01 ntop00 nfacctd[791663]: INFO ( p1/print ): *** Purging cache - START (PID: 327) ***
Sep 20 21:18:01 ntop00 nfacctd[791663]: INFO ( p1/print ): *** Purging cache - END (PID: 327, QN: 56/56, ET: 0) ***
Sep 20 21:20:01 ntop00 sfacctd[791587]: INFO ( m1/mysql ): *** Purging cache - START (PID: 328) ***
Sep 20 21:20:01 ntop00 nfacctd[791663]: INFO ( m1/mysql ): *** Purging cache - START (PID: 328) ***
Sep 20 21:20:37 ntop00 sfacctd[791587]: INFO ( m1/mysql ): *** Purging cache - END (PID: 328, QN: 7369/7369, ET: 36) ***
Sep 20 21:20:38 ntop00 nfacctd[791663]: INFO ( m1/mysql ): *** Purging cache - END (PID: 328, QN: 56/56, ET: 37) ***
... 70 more distinct messages not shown
== outbound00.cs.umd.edu (1 distinct, 6 total) ==
Sep 20 21:09:09 outbound00.cs.umd.edu python3[2159290]: ldapdb [x6]
== outbound01.cs.umd.edu (1 distinct, 6 total) ==
Sep 20 21:13:06 outbound01.cs.umd.edu python3[225448]: ldapdb [x6]
== sentry-docker00.cs.umd.edu (36 distinct, 36 total) ==
Sep 20 21:21:02 sentry-docker00.cs.umd.edu systemd-udevd[371254]: link_config: could not get ethtool features for vethdae63ea
Sep 20 21:21:02 sentry-docker00.cs.umd.edu systemd-udevd[371254]: Could not set offload features of vethdae63ea: No such device
Sep 20 21:21:02 sentry-docker00.cs.umd.edu systemd-udevd[371283]: Could not generate persistent MAC address for vethe3db1ab: No such file or directory
Sep 20 21:21:02 sentry-docker00.cs.umd.edu systemd-udevd[371284]: Could not generate persistent MAC address for veth764c61a: No such file or directory
Sep 20 21:21:02 sentry-docker00.cs.umd.edu systemd-udevd[371287]: Could not generate persistent MAC address for veth8fa5827: No such file or directory
Sep 20 21:21:02 sentry-docker00.cs.umd.edu systemd-udevd[371288]: Could not generate persistent MAC address for veth1341e5d: No such file or directory
Sep 20 21:21:02 sentry-docker00.cs.umd.edu systemd-udevd[371288]: Could not generate persistent MAC address for veth0b14eb0: No such file or directory
Sep 20 21:21:02 sentry-docker00.cs.umd.edu systemd-udevd[371300]: Could not generate persistent MAC address for veth39e0e50: No such file or directory
Sep 20 21:21:02 sentry-docker00.cs.umd.edu systemd-udevd[371283]: Could not generate persistent MAC address for vethbc14b63: No such file or directory
Sep 20 21:21:02 sentry-docker00.cs.umd.edu systemd-udevd[371303]: Could not generate persistent MAC address for veth2719d2b: No such file or directory
Sep 20 21:21:02 sentry-docker00.cs.umd.edu systemd-udevd[371377]: Could not generate persistent MAC address for vethd0f618e: No such file or directory
Sep 20 21:21:02 sentry-docker00.cs.umd.edu systemd-udevd[371378]: Could not generate persistent MAC address for vethed3ac50: No such file or directory
Sep 20 21:41:10 sentry-docker00.cs.umd.edu systemd-udevd[380895]: link_config: could not get ethtool features for vethbc14b63
Sep 20 21:41:10 sentry-docker00.cs.umd.edu systemd-udevd[380895]: Could not set offload features of vethbc14b63: No such device
Sep 20 21:41:11 sentry-docker00.cs.umd.edu systemd-udevd[380929]: Could not generate persistent MAC address for vethcd5c892: No such file or directory
Sep 20 21:41:11 sentry-docker00.cs.umd.edu systemd-udevd[380930]: Could not generate persistent MAC address for vethbc08448: No such file or directory
Sep 20 21:41:11 sentry-docker00.cs.umd.edu systemd-udevd[380933]: Could not generate persistent MAC address for veth4bd5303: No such file or directory
Sep 20 21:41:11 sentry-docker00.cs.umd.edu systemd-udevd[380935]: Could not generate persistent MAC address for veth44c9cbe: No such file or directory
Sep 20 21:41:11 sentry-docker00.cs.umd.edu systemd-udevd[380944]: Could not generate persistent MAC address for veth95cf018: No such file or directory
Sep 20 21:41:11 sentry-docker00.cs.umd.edu systemd-udevd[380940]: Could not generate persistent MAC address for veth180ebcd: No such file or directory
Sep 20 21:41:11 sentry-docker00.cs.umd.edu systemd-udevd[380946]: Could not generate persistent MAC address for veth9827b60: No such file or directory
Sep 20 21:41:11 sentry-docker00.cs.umd.edu systemd-udevd[380945]: Could not generate persistent MAC address for veth83b4502: No such file or directory
Sep 20 21:41:11 sentry-docker00.cs.umd.edu systemd-udevd[380955]: Could not generate persistent MAC address for veth2200e39: No such file or directory
Sep 20 21:41:11 sentry-docker00.cs.umd.edu systemd-udevd[380937]: Could not generate persistent MAC address for veth89d4c33: No such file or directory
Sep 20 22:01:19 sentry-docker00.cs.umd.edu systemd-udevd[390519]: link_config: could not get ethtool features for veth9827b60
Sep 20 22:01:19 sentry-docker00.cs.umd.edu systemd-udevd[390519]: Could not set offload features of veth9827b60: No such device
Sep 20 22:01:19 sentry-docker00.cs.umd.edu systemd-udevd[390544]: Could not generate persistent MAC address for vethd17332f: No such file or directory
Sep 20 22:01:19 sentry-docker00.cs.umd.edu systemd-udevd[390545]: Could not generate persistent MAC address for veth6c0b4d0: No such file or directory
Sep 20 22:01:19 sentry-docker00.cs.umd.edu systemd-udevd[390548]: Could not generate persistent MAC address for veth6316cfc: No such file or directory
Sep 20 22:01:19 sentry-docker00.cs.umd.edu systemd-udevd[390549]: Could not generate persistent MAC address for vethff53c67: No such file or directory
... 6 more distinct messages not shown
== strawberry (7 distinct, 38 total) ==
Sep 20 21:07:03 strawberry kernel: I/O error, dev sda, sector 206848 op 0x0:(READ) flags 0x80700 phys_seg 1 prio class 2 [x6]
Sep 20 21:07:03 strawberry kernel: I/O error, dev sda, sector 206848 op 0x0:(READ) flags 0x0 phys_seg 1 prio class 2 [x6]
Sep 20 21:07:03 strawberry kernel: Buffer I/O error on dev sda2, logical block 0, async page read [x6]
Sep 20 21:07:03 strawberry kernel: I/O error, dev sda, sector 2048 op 0x0:(READ) flags 0x80700 phys_seg 1 prio class 2 [x6]
Sep 20 21:07:03 strawberry kernel: I/O error, dev sda, sector 2048 op 0x0:(READ) flags 0x0 phys_seg 1 prio class 2 [x6]
Sep 20 21:07:03 strawberry kernel: Buffer I/O error on dev sda1, logical block 0, async page read [x6]
Sep 20 21:34:42 strawberry smartd[5314]: Device: /dev/sda [SAT], failed to read SMART Attribute Data [x2]
== submit26-b9-f1 (1 distinct, 1 total) ==
Sep 20 21:54:35 submit26-b9-f1 systemd[1]: user(a)1001.service: Main process exited, code=killed, status=9/KILL
== submit26-b9-f2 (1 distinct, 3 total) ==
Sep 20 21:08:08 submit26-b9-f2 systemd[1]: user(a)1001.service: Main process exited, code=killed, status=9/KILL [x3]
== submit26-b9-f3 (10 distinct, 15 total) ==
Sep 20 21:06:43 submit26-b9-f3 setroubleshoot[2175733]: SELinux is preventing /usr/bin/python3.9 from create access on the directory /(null). For complete SELinux messages run: sealert -l a653b772-cbcd-438b-bae5-23c3dc69b31b [x2]
Sep 20 21:06:43 submit26-b9-f3 setroubleshoot[2175733]: SELinux is preventing /usr/bin/python3.9 from add_name access on the directory /(null). For complete SELinux messages run: sealert -l 3e904634-6caa-4202-8c92-f139db798859 [x2]
Sep 20 21:06:43 submit26-b9-f3 setroubleshoot[2175733]: SELinux is preventing /usr/bin/python3.9 from create access on the file /(null). For complete SELinux messages run: sealert -l 580b20e4-ec2c-433d-905c-5bd417fba033
Sep 20 21:06:43 submit26-b9-f3 setroubleshoot[2175733]: SELinux is preventing /usr/bin/python3.9 from open access on the file /tmp/libdnf.yphl3N/repodata/repomd.xml. For complete SELinux messages run: sealert -l 27f29d48-5e7c-4db7-b051-8ac055737d6f
Sep 20 21:06:43 submit26-b9-f3 setroubleshoot[2175733]: SELinux is preventing /usr/bin/python3.9 from setattr access on the file repomd.xml. For complete SELinux messages run: sealert -l bff72452-d40a-430b-9060-dd0a48f5b6ba
Sep 20 21:06:43 submit26-b9-f3 setroubleshoot[2175733]: SELinux is preventing /usr/bin/python3.9 from read access on the directory libdnf.yphl3N. For complete SELinux messages run: sealert -l 9638d396-8ce5-4e6a-ae47-45cd3985e1cd
Sep 20 21:06:43 submit26-b9-f3 setroubleshoot[2175733]: SELinux is preventing /usr/bin/python3.9 from remove_name access on the directory repomd.xml. For complete SELinux messages run: sealert -l 6da64b94-7024-45a9-b8c2-3b9812517407
Sep 20 21:06:43 submit26-b9-f3 setroubleshoot[2175733]: SELinux is preventing /usr/bin/python3.9 from unlink access on the file repomd.xml. For complete SELinux messages run: sealert -l 64cbe179-abf1-4d5a-bade-bb164897ee65
Sep 20 21:06:43 submit26-b9-f3 setroubleshoot[2175733]: SELinux is preventing /usr/bin/python3.9 from rmdir access on the directory repodata. For complete SELinux messages run: sealert -l d2e35b1a-e27c-4f91-9217-2bb1204e1e68
Sep 20 21:12:26 submit26-b9-f3 systemd[1]: user(a)1001.service: Main process exited, code=killed, status=9/KILL [x4]
== submit26-b9-f4 (10 distinct, 14 total) ==
Sep 20 21:15:06 submit26-b9-f4 systemd[1]: user(a)1001.service: Main process exited, code=killed, status=9/KILL [x5]
Sep 20 21:24:46 submit26-b9-f4 setroubleshoot[1565218]: SELinux is preventing /usr/bin/python3.9 from create access on the directory /(null). For complete SELinux messages run: sealert -l ee160f23-b161-4f4a-9985-c4edfd3a5beb
Sep 20 21:24:46 submit26-b9-f4 setroubleshoot[1565218]: SELinux is preventing /usr/bin/python3.9 from add_name access on the directory /(null). For complete SELinux messages run: sealert -l 89a83821-4b24-4081-9973-0a79ca6ed5b4
Sep 20 21:24:46 submit26-b9-f4 setroubleshoot[1565218]: SELinux is preventing /usr/bin/python3.9 from create access on the file /(null). For complete SELinux messages run: sealert -l f73955d6-1416-45f9-bab6-ff1f3ea07e9d
Sep 20 21:24:46 submit26-b9-f4 setroubleshoot[1565218]: SELinux is preventing /usr/bin/python3.9 from open access on the file /tmp/libdnf.csCqFH/repodata/repomd.xml. For complete SELinux messages run: sealert -l 9f8f24a0-8fb6-454d-a103-31a8f7a6efa0
Sep 20 21:24:46 submit26-b9-f4 setroubleshoot[1565218]: SELinux is preventing /usr/bin/python3.9 from setattr access on the file repomd.xml. For complete SELinux messages run: sealert -l 20293136-86a3-40ba-a651-cff48d36059e
Sep 20 21:24:46 submit26-b9-f4 setroubleshoot[1565218]: SELinux is preventing /usr/bin/python3.9 from read access on the directory libdnf.csCqFH. For complete SELinux messages run: sealert -l 25f86b49-4ee7-4f60-ad1c-73a70032560c
Sep 20 21:24:46 submit26-b9-f4 setroubleshoot[1565218]: SELinux is preventing /usr/bin/python3.9 from remove_name access on the directory repomd.xml. For complete SELinux messages run: sealert -l eec250fb-073f-456d-93bc-f98776fd476d
Sep 20 21:24:46 submit26-b9-f4 setroubleshoot[1565218]: SELinux is preventing /usr/bin/python3.9 from unlink access on the file repomd.xml. For complete SELinux messages run: sealert -l c9209e04-a349-43d5-8cb2-3e303e48df74
Sep 20 21:24:46 submit26-b9-f4 setroubleshoot[1565218]: SELinux is preventing /usr/bin/python3.9 from rmdir access on the directory repodata. For complete SELinux messages run: sealert -l 3178d5f5-80e9-404b-92b7-9bef397a8915
1
0
Command: /usr/local/sbin/syslog-digest.py
Time : 0.0519s
Status : exited 0
Output :
Syslog digest — 2026-09-20 21:05 EDT
Processed 2,019 lines, filtered 1,470 (72%). 549 unknown (175 distinct) from 19 host(s).
== b0b02.cs.umd.edu (1 distinct, 1 total) ==
Sep 20 20:52:52 b0b02.cs.umd.edu rustdesk[3382164]: cannot open display:
== bale (5 distinct, 84 total) ==
Sep 20 20:05:57 bale setroubleshoot[1267865]: failed to retrieve rpm info for /dev/nvme0 [x36]
Sep 20 20:05:57 bale setroubleshoot[1267865]: SELinux is preventing /usr/libexec/platform-python3.6 from getattr access on the chr_file /dev/nvme0. For complete SELinux messages run: sealert -l e098d0bd-ac29-4737-9018-de9a71e328ee [x12]
Sep 20 20:06:00 bale setroubleshoot[1267865]: SELinux is preventing smartctl from read access on the chr_file nvme0. For complete SELinux messages run: sealert -l fc305ce6-663c-4aa2-8640-0ee0f8dce1a9 [x12]
Sep 20 20:06:03 bale setroubleshoot[1267865]: SELinux is preventing smartctl from open access on the chr_file /dev/nvme0. For complete SELinux messages run: sealert -l 2c1d6b29-3343-488c-84c7-92d46f8010b6 [x12]
Sep 20 20:06:15 bale setroubleshoot[1268479]: SELinux is preventing /usr/sbin/smartctl from ioctl access on the chr_file /dev/nvme0. For complete SELinux messages run: sealert -l 8ea740c2-97d8-42fb-b550-a236b114507d [x12]
== cheezit.cs.umd.edu (2 distinct, 2 total) ==
Sep 20 20:18:54 cheezit.cs.umd.edu sshd-session[1345854]: pam_access(sshd:auth): access denied for user `lin' from `74.96.151.253'
Sep 20 21:02:47 cheezit.cs.umd.edu sshd-session[1356825]: pam_access(sshd:auth): access denied for user `asriniv1' from `108.40.120.8'
== csfw00a (1 distinct, 149 total) ==
Sep 20 20:04:04 csfw00a kernel: bnxt_en 0000:09:00.0 eth3: NIC Link is Down [x149]
== idm00 (1 distinct, 1 total) ==
Sep 20 20:54:00 idm00 named[4166701]: client @0x7f11a4059f88 10.73.240.42#62494: update '73.10.in-addr.arpa/IN' denied
== idmp0 (1 distinct, 1 total) ==
Sep 20 20:37:56 idmp0 named[1598691]: client @0x7f2d28029f68 10.73.240.43#58975: update '73.10.in-addr.arpa/IN' denied
== itmon02 (1 distinct, 2 total) ==
Sep 20 20:43:35 itmon02 sshd[1750555]: error: beginning MaxStartups throttling [x2]
== munin (2 distinct, 32 total) ==
Sep 20 20:13:45 munin sudo[964348]: pam_systemd(sudo:session): Failed to stat() runtime directory '/run/user/0': No such file or directory [x16]
Sep 20 20:13:45 munin sudo[964348]: pam_systemd(sudo:session): Not setting $XDG_RUNTIME_DIR, as the directory is not in order. [x16]
== newhonors2 (1 distinct, 24 total) ==
Sep 20 20:13:03 newhonors2 dhcpcd[2919213]: dhcpcd is not running [x24]
== ntop00 (102 distinct, 146 total) ==
Sep 20 20:05:01 ntop00 sfacctd[791587]: INFO ( m1/mysql ): *** Purging cache - START (PID: 298) ***
Sep 20 20:05:01 ntop00 nfacctd[791663]: INFO ( m1/mysql ): *** Purging cache - START (PID: 298) ***
Sep 20 20:05:24 ntop00 sfacctd[791587]: INFO ( m1/mysql ): *** Purging cache - END (PID: 298, QN: 5717/5717, ET: 23) ***
Sep 20 20:05:24 ntop00 nfacctd[791663]: INFO ( m1/mysql ): *** Purging cache - END (PID: 298, QN: 57/57, ET: 23) ***
Sep 20 20:08:01 ntop00 sfacctd[791587]: INFO ( p1/print ): *** Purging cache - START (PID: 299) ***
Sep 20 20:08:01 ntop00 sfacctd[791587]: INFO ( p1/print ): *** Purging cache - END (PID: 299, QN: 5775/5775, ET: 0) ***
Sep 20 20:08:01 ntop00 nfacctd[791663]: INFO ( p1/print ): *** Purging cache - START (PID: 299) ***
Sep 20 20:08:01 ntop00 nfacctd[791663]: INFO ( p1/print ): *** Purging cache - END (PID: 299, QN: 54/54, ET: 0) ***
Sep 20 20:08:02 ntop00 setroubleshoot[889408]: SELinux is preventing /usr/local/sbin/sfacctd from append access on the file sflow.json. For complete SELinux messages run: sealert -l aec09a24-8fd6-4c2f-ba24-2e4b38b93f4c [x12]
Sep 20 20:08:02 ntop00 setroubleshoot[889408]: SELinux is preventing /usr/local/sbin/sfacctd from write access on the file sflow.json. For complete SELinux messages run: sealert -l b2869c09-acbd-427c-b7c9-edae08c37a0e [x12]
Sep 20 20:08:02 ntop00 setroubleshoot[889408]: failed to retrieve rpm info for path '/srv/pmacct/sflow.json': [x12]
Sep 20 20:08:02 ntop00 setroubleshoot[889408]: SELinux is preventing /usr/local/sbin/sfacctd from lock access on the file /srv/pmacct/sflow.json. For complete SELinux messages run: sealert -l dbd70a69-3ee5-4fce-87ea-309297754109 [x12]
Sep 20 20:10:01 ntop00 sfacctd[791587]: INFO ( m1/mysql ): *** Purging cache - START (PID: 300) ***
Sep 20 20:10:01 ntop00 nfacctd[791663]: INFO ( m1/mysql ): *** Purging cache - START (PID: 300) ***
Sep 20 20:10:25 ntop00 sfacctd[791587]: INFO ( m1/mysql ): *** Purging cache - END (PID: 300, QN: 6000/6000, ET: 24) ***
Sep 20 20:10:25 ntop00 nfacctd[791663]: INFO ( m1/mysql ): *** Purging cache - END (PID: 300, QN: 58/58, ET: 24) ***
Sep 20 20:13:01 ntop00 sfacctd[791587]: INFO ( p1/print ): *** Purging cache - START (PID: 301) ***
Sep 20 20:13:01 ntop00 sfacctd[791587]: INFO ( p1/print ): *** Purging cache - END (PID: 301, QN: 5891/5891, ET: 0) ***
Sep 20 20:13:01 ntop00 nfacctd[791663]: INFO ( p1/print ): *** Purging cache - START (PID: 301) ***
Sep 20 20:13:01 ntop00 nfacctd[791663]: INFO ( p1/print ): *** Purging cache - END (PID: 301, QN: 69/69, ET: 0) ***
Sep 20 20:15:01 ntop00 nfacctd[791663]: INFO ( m1/mysql ): *** Purging cache - START (PID: 302) ***
Sep 20 20:15:01 ntop00 sfacctd[791587]: INFO ( m1/mysql ): *** Purging cache - START (PID: 302) ***
Sep 20 20:15:01 ntop00 nfacctd[791663]: INFO ( m1/mysql ): *** Purging cache - END (PID: 302, QN: 62/62, ET: 0) ***
Sep 20 20:15:24 ntop00 sfacctd[791587]: INFO ( m1/mysql ): *** Purging cache - END (PID: 302, QN: 5744/5744, ET: 23) ***
Sep 20 20:18:01 ntop00 sfacctd[791587]: INFO ( p1/print ): *** Purging cache - START (PID: 303) ***
Sep 20 20:18:01 ntop00 sfacctd[791587]: INFO ( p1/print ): *** Purging cache - END (PID: 303, QN: 5696/5696, ET: 0) ***
Sep 20 20:18:01 ntop00 nfacctd[791663]: INFO ( p1/print ): *** Purging cache - START (PID: 303) ***
Sep 20 20:18:01 ntop00 nfacctd[791663]: INFO ( p1/print ): *** Purging cache - END (PID: 303, QN: 58/58, ET: 0) ***
Sep 20 20:20:01 ntop00 sfacctd[791587]: INFO ( m1/mysql ): *** Purging cache - START (PID: 304) ***
Sep 20 20:20:01 ntop00 nfacctd[791663]: INFO ( m1/mysql ): *** Purging cache - START (PID: 304) ***
... 72 more distinct messages not shown
== outbound00.cs.umd.edu (1 distinct, 6 total) ==
Sep 20 20:09:09 outbound00.cs.umd.edu python3[2145387]: ldapdb [x6]
== outbound01.cs.umd.edu (1 distinct, 6 total) ==
Sep 20 20:13:06 outbound01.cs.umd.edu python3[211448]: ldapdb [x6]
== sentry-docker00.cs.umd.edu (36 distinct, 36 total) ==
Sep 20 20:20:37 sentry-docker00.cs.umd.edu systemd-udevd[343376]: link_config: could not get ethtool features for veth6879fff
Sep 20 20:20:37 sentry-docker00.cs.umd.edu systemd-udevd[343376]: Could not set offload features of veth6879fff: No such device
Sep 20 20:20:37 sentry-docker00.cs.umd.edu systemd-udevd[343410]: Could not generate persistent MAC address for vethae3a394: No such file or directory
Sep 20 20:20:37 sentry-docker00.cs.umd.edu systemd-udevd[343411]: Could not generate persistent MAC address for veth8a087b1: No such file or directory
Sep 20 20:20:37 sentry-docker00.cs.umd.edu systemd-udevd[343414]: Could not generate persistent MAC address for vethc832288: No such file or directory
Sep 20 20:20:37 sentry-docker00.cs.umd.edu systemd-udevd[343431]: Could not generate persistent MAC address for veth3fbccc5: No such file or directory
Sep 20 20:20:37 sentry-docker00.cs.umd.edu systemd-udevd[343436]: Could not generate persistent MAC address for veth1b26cb4: No such file or directory
Sep 20 20:20:37 sentry-docker00.cs.umd.edu systemd-udevd[343433]: Could not generate persistent MAC address for veth327eb02: No such file or directory
Sep 20 20:20:37 sentry-docker00.cs.umd.edu systemd-udevd[343427]: Could not generate persistent MAC address for veth1c84c4e: No such file or directory
Sep 20 20:20:37 sentry-docker00.cs.umd.edu systemd-udevd[343425]: Could not generate persistent MAC address for vethf08f76d: No such file or directory
Sep 20 20:20:37 sentry-docker00.cs.umd.edu systemd-udevd[343427]: Could not generate persistent MAC address for vethe26db3e: No such file or directory
Sep 20 20:20:37 sentry-docker00.cs.umd.edu systemd-udevd[343431]: Could not generate persistent MAC address for veth74fde09: No such file or directory
Sep 20 20:40:45 sentry-docker00.cs.umd.edu systemd-udevd[352732]: link_config: could not get ethtool features for vethc832288
Sep 20 20:40:45 sentry-docker00.cs.umd.edu systemd-udevd[352732]: Could not set offload features of vethc832288: No such device
Sep 20 20:40:46 sentry-docker00.cs.umd.edu systemd-udevd[352761]: Could not generate persistent MAC address for vethe20f63b: No such file or directory
Sep 20 20:40:46 sentry-docker00.cs.umd.edu systemd-udevd[352762]: Could not generate persistent MAC address for veth0d0bf39: No such file or directory
Sep 20 20:40:46 sentry-docker00.cs.umd.edu systemd-udevd[352765]: Could not generate persistent MAC address for veth95df242: No such file or directory
Sep 20 20:40:46 sentry-docker00.cs.umd.edu systemd-udevd[352766]: Could not generate persistent MAC address for veth94e8c3f: No such file or directory
Sep 20 20:40:46 sentry-docker00.cs.umd.edu systemd-udevd[352789]: Could not generate persistent MAC address for vethcbb4577: No such file or directory
Sep 20 20:40:46 sentry-docker00.cs.umd.edu systemd-udevd[352790]: Could not generate persistent MAC address for veth8038274: No such file or directory
Sep 20 20:40:46 sentry-docker00.cs.umd.edu systemd-udevd[352814]: Could not generate persistent MAC address for veth8ca72c6: No such file or directory
Sep 20 20:40:46 sentry-docker00.cs.umd.edu systemd-udevd[352799]: Could not generate persistent MAC address for veth8d944af: No such file or directory
Sep 20 20:40:46 sentry-docker00.cs.umd.edu systemd-udevd[352800]: Could not generate persistent MAC address for veth171eac8: No such file or directory
Sep 20 20:40:46 sentry-docker00.cs.umd.edu systemd-udevd[352799]: Could not generate persistent MAC address for veth49a6517: No such file or directory
Sep 20 21:00:54 sentry-docker00.cs.umd.edu systemd-udevd[362109]: link_config: could not get ethtool features for vethcbb4577
Sep 20 21:00:54 sentry-docker00.cs.umd.edu systemd-udevd[362109]: Could not set offload features of vethcbb4577: No such device
Sep 20 21:00:54 sentry-docker00.cs.umd.edu systemd-udevd[362142]: Could not generate persistent MAC address for vethf2fb91e: No such file or directory
Sep 20 21:00:54 sentry-docker00.cs.umd.edu systemd-udevd[362143]: Could not generate persistent MAC address for veth3a8c089: No such file or directory
Sep 20 21:00:54 sentry-docker00.cs.umd.edu systemd-udevd[362146]: Could not generate persistent MAC address for veth740b9d8: No such file or directory
Sep 20 21:00:54 sentry-docker00.cs.umd.edu systemd-udevd[362147]: Could not generate persistent MAC address for vetha7f69a5: No such file or directory
... 6 more distinct messages not shown
== strawberry (7 distinct, 38 total) ==
Sep 20 20:07:03 strawberry kernel: I/O error, dev sda, sector 206848 op 0x0:(READ) flags 0x80700 phys_seg 1 prio class 2 [x6]
Sep 20 20:07:03 strawberry kernel: I/O error, dev sda, sector 206848 op 0x0:(READ) flags 0x0 phys_seg 1 prio class 2 [x6]
Sep 20 20:07:03 strawberry kernel: Buffer I/O error on dev sda2, logical block 0, async page read [x6]
Sep 20 20:07:03 strawberry kernel: I/O error, dev sda, sector 2048 op 0x0:(READ) flags 0x80700 phys_seg 1 prio class 2 [x6]
Sep 20 20:07:03 strawberry kernel: I/O error, dev sda, sector 2048 op 0x0:(READ) flags 0x0 phys_seg 1 prio class 2 [x6]
Sep 20 20:07:03 strawberry kernel: Buffer I/O error on dev sda1, logical block 0, async page read [x6]
Sep 20 20:34:42 strawberry smartd[5314]: Device: /dev/sda [SAT], failed to read SMART Attribute Data [x2]
== submit26-b9-f1 (1 distinct, 2 total) ==
Sep 20 20:34:32 submit26-b9-f1 systemd[1]: user(a)1001.service: Main process exited, code=killed, status=9/KILL [x2]
== submit26-b9-f2 (1 distinct, 4 total) ==
Sep 20 20:08:51 submit26-b9-f2 systemd[1]: user(a)1001.service: Main process exited, code=killed, status=9/KILL [x4]
== submit26-b9-f3 (1 distinct, 4 total) ==
Sep 20 20:18:05 submit26-b9-f3 systemd[1]: user(a)1001.service: Main process exited, code=killed, status=9/KILL [x4]
== submit26-b9-f4 (1 distinct, 2 total) ==
Sep 20 20:33:10 submit26-b9-f4 systemd[1]: user(a)1001.service: Main process exited, code=killed, status=9/KILL [x2]
== submit26-b9-fclone (9 distinct, 9 total) ==
Sep 20 20:21:57 submit26-b9-fclone setroubleshoot[197699]: SELinux is preventing /usr/bin/python3.9 from create access on the directory /(null). For complete SELinux messages run: sealert -l 9355d9d9-a311-48d2-bd37-6c0f6947dfff
Sep 20 20:21:57 submit26-b9-fclone setroubleshoot[197699]: SELinux is preventing /usr/bin/python3.9 from add_name access on the directory /(null). For complete SELinux messages run: sealert -l cc4658d7-9db1-405d-9eee-de0ccee5857f
Sep 20 20:21:57 submit26-b9-fclone setroubleshoot[197699]: SELinux is preventing /usr/bin/python3.9 from create access on the file /(null). For complete SELinux messages run: sealert -l 568a2429-0b1b-49df-af41-49b5cd298ae8
Sep 20 20:21:57 submit26-b9-fclone setroubleshoot[197699]: SELinux is preventing /usr/bin/python3.9 from open access on the file /tmp/libdnf.QimYga/repodata/repomd.xml. For complete SELinux messages run: sealert -l 03e2f521-0e7c-481f-8e92-0602c6adeedc
Sep 20 20:21:57 submit26-b9-fclone setroubleshoot[197699]: SELinux is preventing /usr/bin/python3.9 from setattr access on the file repomd.xml. For complete SELinux messages run: sealert -l 0d6b7b1f-ebe3-4beb-915a-b06b63bf2566
Sep 20 20:21:57 submit26-b9-fclone setroubleshoot[197699]: SELinux is preventing /usr/bin/python3.9 from read access on the directory libdnf.QimYga. For complete SELinux messages run: sealert -l 887adbf9-2bb9-4009-b800-36ddf9ba0db5
Sep 20 20:21:57 submit26-b9-fclone setroubleshoot[197699]: SELinux is preventing /usr/bin/python3.9 from remove_name access on the directory repomd.xml. For complete SELinux messages run: sealert -l 092e0644-8373-4017-b77f-1afa6c6da4ac
Sep 20 20:21:57 submit26-b9-fclone setroubleshoot[197699]: SELinux is preventing /usr/bin/python3.9 from unlink access on the file repomd.xml. For complete SELinux messages run: sealert -l ce429a92-56de-4de1-b859-cbfb69ae123c
Sep 20 20:21:57 submit26-b9-fclone setroubleshoot[197699]: SELinux is preventing /usr/bin/python3.9 from rmdir access on the directory repodata. For complete SELinux messages run: sealert -l 99b886eb-497b-406d-8206-afe76a1086b4
1
0
Command: /usr/local/sbin/syslog-digest.py
Time : 0.0514s
Status : exited 0
Output :
Syslog digest — 2026-09-20 20:05 EDT
Processed 2,016 lines, filtered 1,443 (71%). 573 unknown (194 distinct) from 18 host(s).
== b0b02.cs.umd.edu (1 distinct, 1 total) ==
Sep 20 19:52:48 b0b02.cs.umd.edu rustdesk[3366818]: cannot open display:
== bachata (10 distinct, 10 total) ==
Sep 20 19:14:31 bachata smbd[877905]: [2026/09/20 19:14:31.438109, 0] ../../source3/smbd/smb2_service.c:117(chdir_current_service)
Sep 20 19:14:31 bachata smbd[877905]: chdir_current_service: vfs_ChDir(/fs/junkfood/nelson) failed: Permission denied. Current token: uid=20608, gid=20608, 19 groups: 20608 31006 30043 319050000 30736 30871 25274 15248 15206 25025 15294 15228 319000009 30872 25057 30742 25200 25038 25195
Sep 20 19:14:31 bachata smbd[877905]: [2026/09/20 19:14:31.438371, 0] ../../source3/smbd/smbXsrv_tcon.c:914(smbXsrv_tcon_disconnect)
Sep 20 19:14:31 bachata smbd[877905]: smbXsrv_tcon_disconnect: disconnect(0xd7a60fdf, 'nelson'): chdir_current_service() failed: NT_STATUS_INTERNAL_ERROR
Sep 20 19:14:31 bachata smbd[877905]: [2026/09/20 19:14:31.438445, 0] ../../source3/smbd/smbXsrv_tcon.c:1028(smbXsrv_tcon_disconnect_all)
Sep 20 19:14:31 bachata smbd[877905]: smbXsrv_tcon_disconnect_all: count[3] errors[1] first[NT_STATUS_INTERNAL_ERROR]
Sep 20 19:14:31 bachata smbd[877905]: [2026/09/20 19:14:31.438482, 0] ../../source3/smbd/smbXsrv_session.c:1900(smbXsrv_session_logoff)
Sep 20 19:14:31 bachata smbd[877905]: smbXsrv_session_logoff: smbXsrv_session_logoff(0x578a4a8f): smb2srv_tcon_disconnect_all() failed: NT_STATUS_INTERNAL_ERROR
Sep 20 19:14:31 bachata smbd[877905]: [2026/09/20 19:14:31.438538, 0] ../../source3/smbd/smbXsrv_session.c:1728(smbXsrv_session_remove_channel_done)
Sep 20 19:14:31 bachata smbd[877905]: smbXsrv_session_remove_channel_done: smbXsrv_session_logoff(1468680847) failed: NT_STATUS_INTERNAL_ERROR
== bale (5 distinct, 86 total) ==
Sep 20 19:05:34 bale setroubleshoot[1255159]: failed to retrieve rpm info for /dev/nvme0 [x36]
Sep 20 19:05:35 bale setroubleshoot[1255159]: SELinux is preventing /usr/libexec/platform-python3.6 from getattr access on the chr_file /dev/nvme0. For complete SELinux messages run: sealert -l e098d0bd-ac29-4737-9018-de9a71e328ee [x13]
Sep 20 19:05:37 bale setroubleshoot[1255159]: SELinux is preventing smartctl from read access on the chr_file nvme0. For complete SELinux messages run: sealert -l fc305ce6-663c-4aa2-8640-0ee0f8dce1a9 [x14]
Sep 20 19:05:40 bale setroubleshoot[1255159]: SELinux is preventing smartctl from open access on the chr_file /dev/nvme0. For complete SELinux messages run: sealert -l 2c1d6b29-3343-488c-84c7-92d46f8010b6 [x10]
Sep 20 19:05:52 bale setroubleshoot[1255773]: SELinux is preventing /usr/sbin/smartctl from ioctl access on the chr_file /dev/nvme0. For complete SELinux messages run: sealert -l 8ea740c2-97d8-42fb-b550-a236b114507d [x13]
== csfw00a (1 distinct, 122 total) ==
Sep 20 19:03:48 csfw00a kernel: bnxt_en 0000:09:00.0 eth3: NIC Link is Down [x122]
== hazfs.cs.umd.edu (11 distinct, 66 total) ==
Sep 20 19:55:12 hazfs.cs.umd.edu snmpd[1431]: send response: Failure in sendto [x6]
Sep 20 19:55:12 hazfs.cs.umd.edu snmpd[1431]: -- NET-SNMP-EXTEND-MIB::nsExtendStatus."userweb" [x6]
Sep 20 19:55:12 hazfs.cs.umd.edu snmpd[1431]: -- NET-SNMP-EXTEND-MIB::nsExtendStatus."zfslist" [x6]
Sep 20 19:55:12 hazfs.cs.umd.edu snmpd[1431]: -- NET-SNMP-EXTEND-MIB::nsExtendStatus."userhome" [x6]
Sep 20 19:55:12 hazfs.cs.umd.edu snmpd[1431]: -- NET-SNMP-EXTEND-MIB::nsExtendOutput1Line."userweb" [x6]
Sep 20 19:55:12 hazfs.cs.umd.edu snmpd[1431]: -- NET-SNMP-EXTEND-MIB::nsExtendOutput1Line."zfslist" [x6]
Sep 20 19:55:12 hazfs.cs.umd.edu snmpd[1431]: -- NET-SNMP-EXTEND-MIB::nsExtendOutput1Line."userhome" [x6]
Sep 20 19:55:12 hazfs.cs.umd.edu snmpd[1431]: -- NET-SNMP-EXTEND-MIB::nsExtendOutputFull."userweb" [x6]
Sep 20 19:55:12 hazfs.cs.umd.edu snmpd[1431]: -- NET-SNMP-EXTEND-MIB::nsExtendOutputFull."zfslist" [x6]
Sep 20 19:55:12 hazfs.cs.umd.edu snmpd[1431]: -- NET-SNMP-EXTEND-MIB::nsExtendOutputFull."userhome" [x6]
Sep 20 19:55:12 hazfs.cs.umd.edu snmpd[1431]: -- NET-SNMP-EXTEND-MIB::nsExtendOutNumLines."userweb" [x6]
== idm00 (1 distinct, 1 total) ==
Sep 20 19:54:00 idm00 named[4166701]: client @0x7f11a004fb78 10.73.240.42#56051: update '73.10.in-addr.arpa/IN' denied
== idmp0 (1 distinct, 1 total) ==
Sep 20 19:37:56 idmp0 named[1598691]: client @0x7f2d44000cc8 10.73.240.43#55489: update '73.10.in-addr.arpa/IN' denied
== itmon02 (7 distinct, 11 total) ==
Sep 20 19:13:47 itmon02 sshd[1750555]: error: beginning MaxStartups throttling
Sep 20 19:22:49 itmon02 SetroubleshootPrivileged.py[5077 failed to retrieve rpm info for path '/var/lib/selinux/targeted/active/modules/200/grafana':
Sep 20 19:22:49 itmon02 setroubleshoot[507757]: SELinux is preventing /usr/sbin/grafana from name_connect access on the tcp_socket port 3306. For complete SELinux messages run: sealert -l deb40268-1414-43e0-8915-0a3785a3ecd5 [x5]
Sep 20 19:23:12 itmon02 SetroubleshootPrivileged.py[5085 failed to retrieve rpm info for path '/var/lib/selinux/targeted/active/modules/200/grafana':
Sep 20 19:23:45 itmon02 SetroubleshootPrivileged.py[5106 failed to retrieve rpm info for path '/var/lib/selinux/targeted/active/modules/200/grafana':
Sep 20 19:23:59 itmon02 SetroubleshootPrivileged.py[5109 failed to retrieve rpm info for path '/var/lib/selinux/targeted/active/modules/200/grafana':
Sep 20 19:24:10 itmon02 SetroubleshootPrivileged.py[5111 failed to retrieve rpm info for path '/var/lib/selinux/targeted/active/modules/200/grafana':
== newhonors2 (1 distinct, 24 total) ==
Sep 20 19:13:03 newhonors2 dhcpcd[2917354]: dhcpcd is not running [x24]
== ntop00 (107 distinct, 151 total) ==
Sep 20 19:05:29 ntop00 sfacctd[791587]: INFO ( m1/mysql ): *** Purging cache - END (PID: 274, QN: 6484/6484, ET: 28) ***
Sep 20 19:08:01 ntop00 sfacctd[791587]: INFO ( p1/print ): *** Purging cache - START (PID: 275) ***
Sep 20 19:08:01 ntop00 sfacctd[791587]: INFO ( p1/print ): *** Purging cache - END (PID: 275, QN: 6802/6802, ET: 0) ***
Sep 20 19:08:01 ntop00 nfacctd[791663]: INFO ( p1/print ): *** Purging cache - START (PID: 275) ***
Sep 20 19:08:01 ntop00 nfacctd[791663]: INFO ( p1/print ): *** Purging cache - END (PID: 275, QN: 58/58, ET: 0) ***
Sep 20 19:08:02 ntop00 setroubleshoot[881505]: SELinux is preventing /usr/local/sbin/sfacctd from append access on the file sflow.json. For complete SELinux messages run: sealert -l aec09a24-8fd6-4c2f-ba24-2e4b38b93f4c [x12]
Sep 20 19:08:02 ntop00 setroubleshoot[881505]: SELinux is preventing /usr/local/sbin/sfacctd from write access on the file sflow.json. For complete SELinux messages run: sealert -l b2869c09-acbd-427c-b7c9-edae08c37a0e [x12]
Sep 20 19:08:02 ntop00 setroubleshoot[881505]: failed to retrieve rpm info for path '/srv/pmacct/sflow.json': [x12]
Sep 20 19:08:02 ntop00 setroubleshoot[881505]: SELinux is preventing /usr/local/sbin/sfacctd from lock access on the file /srv/pmacct/sflow.json. For complete SELinux messages run: sealert -l dbd70a69-3ee5-4fce-87ea-309297754109 [x12]
Sep 20 19:10:01 ntop00 sfacctd[791587]: INFO ( m1/mysql ): *** Purging cache - START (PID: 276) ***
Sep 20 19:10:01 ntop00 nfacctd[791663]: INFO ( m1/mysql ): *** Purging cache - START (PID: 276) ***
Sep 20 19:10:29 ntop00 sfacctd[791587]: INFO ( m1/mysql ): *** Purging cache - END (PID: 276, QN: 6530/6530, ET: 28) ***
Sep 20 19:10:29 ntop00 nfacctd[791663]: INFO ( m1/mysql ): *** Purging cache - END (PID: 276, QN: 68/68, ET: 28) ***
Sep 20 19:13:01 ntop00 sfacctd[791587]: INFO ( p1/print ): *** Purging cache - START (PID: 277) ***
Sep 20 19:13:01 ntop00 sfacctd[791587]: INFO ( p1/print ): *** Purging cache - END (PID: 277, QN: 6112/6112, ET: 0) ***
Sep 20 19:13:01 ntop00 nfacctd[791663]: INFO ( p1/print ): *** Purging cache - START (PID: 277) ***
Sep 20 19:13:01 ntop00 nfacctd[791663]: INFO ( p1/print ): *** Purging cache - END (PID: 277, QN: 60/60, ET: 0) ***
Sep 20 19:15:01 ntop00 sfacctd[791587]: INFO ( m1/mysql ): *** Purging cache - START (PID: 278) ***
Sep 20 19:15:01 ntop00 nfacctd[791663]: INFO ( m1/mysql ): *** Purging cache - START (PID: 278) ***
Sep 20 19:15:26 ntop00 sfacctd[791587]: INFO ( m1/mysql ): *** Purging cache - END (PID: 278, QN: 5860/5860, ET: 25) ***
Sep 20 19:15:26 ntop00 nfacctd[791663]: INFO ( m1/mysql ): *** Purging cache - END (PID: 278, QN: 51/51, ET: 25) ***
Sep 20 19:18:01 ntop00 sfacctd[791587]: INFO ( p1/print ): *** Purging cache - START (PID: 279) ***
Sep 20 19:18:01 ntop00 sfacctd[791587]: INFO ( p1/print ): *** Purging cache - END (PID: 279, QN: 6541/6541, ET: 0) ***
Sep 20 19:18:01 ntop00 nfacctd[791663]: INFO ( p1/print ): *** Purging cache - START (PID: 279) ***
Sep 20 19:18:01 ntop00 nfacctd[791663]: INFO ( p1/print ): *** Purging cache - END (PID: 279, QN: 52/52, ET: 0) ***
Sep 20 19:20:01 ntop00 sfacctd[791587]: INFO ( m1/mysql ): *** Purging cache - START (PID: 280) ***
Sep 20 19:20:02 ntop00 nfacctd[791663]: INFO ( m1/mysql ): *** Purging cache - START (PID: 280) ***
Sep 20 19:20:30 ntop00 sfacctd[791587]: INFO ( m1/mysql ): *** Purging cache - END (PID: 280, QN: 6719/6719, ET: 29) ***
Sep 20 19:20:30 ntop00 nfacctd[791663]: INFO ( m1/mysql ): *** Purging cache - END (PID: 280, QN: 50/50, ET: 28) ***
Sep 20 19:23:01 ntop00 sfacctd[791587]: INFO ( p1/print ): *** Purging cache - START (PID: 281) ***
... 77 more distinct messages not shown
== outbound00.cs.umd.edu (1 distinct, 6 total) ==
Sep 20 19:09:09 outbound00.cs.umd.edu python3[2131430]: ldapdb [x6]
== outbound01.cs.umd.edu (1 distinct, 6 total) ==
Sep 20 19:13:06 outbound01.cs.umd.edu python3[197453]: ldapdb [x6]
== sentry-docker00.cs.umd.edu (36 distinct, 36 total) ==
Sep 20 19:20:12 sentry-docker00.cs.umd.edu systemd-udevd[314828]: link_config: could not get ethtool features for veth2f43450
Sep 20 19:20:12 sentry-docker00.cs.umd.edu systemd-udevd[314828]: Could not set offload features of veth2f43450: No such device
Sep 20 19:20:12 sentry-docker00.cs.umd.edu systemd-udevd[314873]: Could not generate persistent MAC address for vethea671f7: No such file or directory
Sep 20 19:20:12 sentry-docker00.cs.umd.edu systemd-udevd[314874]: Could not generate persistent MAC address for veth1eb4116: No such file or directory
Sep 20 19:20:12 sentry-docker00.cs.umd.edu systemd-udevd[314877]: Could not generate persistent MAC address for vethd9494a2: No such file or directory
Sep 20 19:20:12 sentry-docker00.cs.umd.edu systemd-udevd[314878]: Could not generate persistent MAC address for vetheb493c1: No such file or directory
Sep 20 19:20:13 sentry-docker00.cs.umd.edu systemd-udevd[314888]: Could not generate persistent MAC address for vetha3fe57d: No such file or directory
Sep 20 19:20:13 sentry-docker00.cs.umd.edu systemd-udevd[314887]: Could not generate persistent MAC address for veth2dc6d29: No such file or directory
Sep 20 19:20:13 sentry-docker00.cs.umd.edu systemd-udevd[314900]: Could not generate persistent MAC address for veth808665b: No such file or directory
Sep 20 19:20:13 sentry-docker00.cs.umd.edu systemd-udevd[314882]: Could not generate persistent MAC address for veth558e8e4: No such file or directory
Sep 20 19:20:13 sentry-docker00.cs.umd.edu systemd-udevd[314887]: Could not generate persistent MAC address for vetha11b7e9: No such file or directory
Sep 20 19:20:13 sentry-docker00.cs.umd.edu systemd-udevd[314882]: Could not generate persistent MAC address for veth99b45c5: No such file or directory
Sep 20 19:40:20 sentry-docker00.cs.umd.edu systemd-udevd[324203]: link_config: could not get ethtool features for vetha11b7e9
Sep 20 19:40:20 sentry-docker00.cs.umd.edu systemd-udevd[324203]: Could not set offload features of vetha11b7e9: No such device
Sep 20 19:40:20 sentry-docker00.cs.umd.edu systemd-udevd[324236]: Could not generate persistent MAC address for veth4420446: No such file or directory
Sep 20 19:40:20 sentry-docker00.cs.umd.edu systemd-udevd[324237]: Could not generate persistent MAC address for veth525550f: No such file or directory
Sep 20 19:40:20 sentry-docker00.cs.umd.edu systemd-udevd[324240]: Could not generate persistent MAC address for veth780e19f: No such file or directory
Sep 20 19:40:20 sentry-docker00.cs.umd.edu systemd-udevd[324241]: Could not generate persistent MAC address for vethfdd6beb: No such file or directory
Sep 20 19:40:20 sentry-docker00.cs.umd.edu systemd-udevd[324252]: Could not generate persistent MAC address for vethba4720b: No such file or directory
Sep 20 19:40:20 sentry-docker00.cs.umd.edu systemd-udevd[324240]: Could not generate persistent MAC address for veth75a3ebd: No such file or directory
Sep 20 19:40:21 sentry-docker00.cs.umd.edu systemd-udevd[324275]: Could not generate persistent MAC address for vethe8b1872: No such file or directory
Sep 20 19:40:21 sentry-docker00.cs.umd.edu systemd-udevd[324280]: Could not generate persistent MAC address for vethd550b63: No such file or directory
Sep 20 19:40:21 sentry-docker00.cs.umd.edu systemd-udevd[324307]: Could not generate persistent MAC address for veth0c29c96: No such file or directory
Sep 20 19:40:21 sentry-docker00.cs.umd.edu systemd-udevd[324304]: Could not generate persistent MAC address for veth4ababaa: No such file or directory
Sep 20 20:00:29 sentry-docker00.cs.umd.edu systemd-udevd[333606]: link_config: could not get ethtool features for veth4420446
Sep 20 20:00:29 sentry-docker00.cs.umd.edu systemd-udevd[333606]: Could not set offload features of veth4420446: No such device
Sep 20 20:00:29 sentry-docker00.cs.umd.edu systemd-udevd[333638]: Could not generate persistent MAC address for veth047476a: No such file or directory
Sep 20 20:00:29 sentry-docker00.cs.umd.edu systemd-udevd[333639]: Could not generate persistent MAC address for veth71939b4: No such file or directory
Sep 20 20:00:29 sentry-docker00.cs.umd.edu systemd-udevd[333642]: Could not generate persistent MAC address for veth09ec793: No such file or directory
Sep 20 20:00:29 sentry-docker00.cs.umd.edu systemd-udevd[333643]: Could not generate persistent MAC address for veth2770be2: No such file or directory
... 6 more distinct messages not shown
== strawberry (7 distinct, 38 total) ==
Sep 20 19:07:03 strawberry kernel: I/O error, dev sda, sector 206848 op 0x0:(READ) flags 0x80700 phys_seg 1 prio class 2 [x6]
Sep 20 19:07:03 strawberry kernel: I/O error, dev sda, sector 206848 op 0x0:(READ) flags 0x0 phys_seg 1 prio class 2 [x6]
Sep 20 19:07:03 strawberry kernel: Buffer I/O error on dev sda2, logical block 0, async page read [x6]
Sep 20 19:07:03 strawberry kernel: I/O error, dev sda, sector 2048 op 0x0:(READ) flags 0x80700 phys_seg 1 prio class 2 [x6]
Sep 20 19:07:03 strawberry kernel: I/O error, dev sda, sector 2048 op 0x0:(READ) flags 0x0 phys_seg 1 prio class 2 [x6]
Sep 20 19:07:03 strawberry kernel: Buffer I/O error on dev sda1, logical block 0, async page read [x6]
Sep 20 19:34:42 strawberry smartd[5314]: Device: /dev/sda [SAT], failed to read SMART Attribute Data [x2]
== submit26-b9-f1 (1 distinct, 4 total) ==
Sep 20 19:08:08 submit26-b9-f1 systemd[1]: user(a)1001.service: Main process exited, code=killed, status=9/KILL [x4]
== submit26-b9-f2 (1 distinct, 3 total) ==
Sep 20 19:18:08 submit26-b9-f2 systemd[1]: user(a)1001.service: Main process exited, code=killed, status=9/KILL [x3]
== submit26-b9-f3 (1 distinct, 2 total) ==
Sep 20 19:13:10 submit26-b9-f3 systemd[1]: user(a)1001.service: Main process exited, code=killed, status=9/KILL [x2]
== submit26-b9-f4 (1 distinct, 5 total) ==
Sep 20 19:08:11 submit26-b9-f4 systemd[1]: user(a)1001.service: Main process exited, code=killed, status=9/KILL [x5]
1
0
Command: /usr/local/sbin/syslog-digest.py
Time : 0.0520s
Status : exited 0
Output :
Syslog digest — 2026-09-20 19:05 EDT
Processed 2,310 lines, filtered 1,772 (76%). 538 unknown (184 distinct) from 16 host(s).
== b0b02.cs.umd.edu (4 distinct, 4 total) ==
Sep 20 18:10:59 b0b02.cs.umd.edu csregistry[5224]: time="2026-09-20T22:10:59.427675008Z" level=info msg="PurgeUploads starting: olderThan=2026-09-13 22:10:59.427564468 +0000 UTC m=+4149420.187492783, actuallyDelete=true"
Sep 20 18:10:59 b0b02.cs.umd.edu csregistry[5224]: time="2026-09-20T22:10:59.428165689Z" level=info msg="Purge uploads finished. Num deleted=0, num errors=1"
Sep 20 18:10:59 b0b02.cs.umd.edu csregistry[5224]: time="2026-09-20T22:10:59.428185841Z" level=info msg="Starting upload purge in 24h0m0s" go.version=go1.11.2 instance.id=68469aa4-7857-4a69-bf12-c2190b4f96d8 service=registry version=v2.7.1
Sep 20 18:52:44 b0b02.cs.umd.edu rustdesk[3351603]: cannot open display:
== bale (5 distinct, 85 total) ==
Sep 20 18:05:20 bale setroubleshoot[1242410]: failed to retrieve rpm info for /dev/nvme0 [x36]
Sep 20 18:05:21 bale setroubleshoot[1242410]: SELinux is preventing /usr/libexec/platform-python3.6 from getattr access on the chr_file /dev/nvme0. For complete SELinux messages run: sealert -l e098d0bd-ac29-4737-9018-de9a71e328ee [x13]
Sep 20 18:05:23 bale setroubleshoot[1242410]: SELinux is preventing smartctl from read access on the chr_file nvme0. For complete SELinux messages run: sealert -l fc305ce6-663c-4aa2-8640-0ee0f8dce1a9 [x13]
Sep 20 18:05:26 bale setroubleshoot[1242410]: SELinux is preventing smartctl from open access on the chr_file /dev/nvme0. For complete SELinux messages run: sealert -l 2c1d6b29-3343-488c-84c7-92d46f8010b6 [x11]
Sep 20 18:05:38 bale setroubleshoot[1243039]: SELinux is preventing /usr/sbin/smartctl from ioctl access on the chr_file /dev/nvme0. For complete SELinux messages run: sealert -l 8ea740c2-97d8-42fb-b550-a236b114507d [x12]
== csfw00a (1 distinct, 146 total) ==
Sep 20 18:04:27 csfw00a kernel: bnxt_en 0000:09:00.0 eth3: NIC Link is Down [x146]
== idm00 (1 distinct, 1 total) ==
Sep 20 18:54:00 idm00 named[4166701]: client @0x7f11980511b8 10.73.240.42#60542: update '73.10.in-addr.arpa/IN' denied
== idmp0 (1 distinct, 1 total) ==
Sep 20 18:37:56 idmp0 named[1598691]: client @0x7f2d44005288 10.73.240.43#59178: update '73.10.in-addr.arpa/IN' denied
== itmon02 (1 distinct, 4 total) ==
Sep 20 18:18:25 itmon02 sshd[1750555]: error: beginning MaxStartups throttling [x4]
== newhonors2 (1 distinct, 24 total) ==
Sep 20 18:13:03 newhonors2 dhcpcd[2915509]: dhcpcd is not running [x24]
== ntop00 (102 distinct, 146 total) ==
Sep 20 18:05:01 ntop00 nfacctd[791663]: INFO ( m1/mysql ): *** Purging cache - START (PID: 250) ***
Sep 20 18:05:50 ntop00 sfacctd[791587]: INFO ( m1/mysql ): *** Purging cache - END (PID: 250, QN: 11876/11876, ET: 49) ***
Sep 20 18:05:50 ntop00 nfacctd[791663]: INFO ( m1/mysql ): *** Purging cache - END (PID: 250, QN: 78/78, ET: 49) ***
Sep 20 18:08:01 ntop00 sfacctd[791587]: INFO ( p1/print ): *** Purging cache - START (PID: 251) ***
Sep 20 18:08:01 ntop00 sfacctd[791587]: INFO ( p1/print ): *** Purging cache - END (PID: 251, QN: 8087/8087, ET: 0) ***
Sep 20 18:08:01 ntop00 nfacctd[791663]: INFO ( p1/print ): *** Purging cache - START (PID: 251) ***
Sep 20 18:08:01 ntop00 nfacctd[791663]: INFO ( p1/print ): *** Purging cache - END (PID: 251, QN: 77/77, ET: 0) ***
Sep 20 18:08:02 ntop00 setroubleshoot[873619]: SELinux is preventing /usr/local/sbin/sfacctd from append access on the file sflow.json. For complete SELinux messages run: sealert -l aec09a24-8fd6-4c2f-ba24-2e4b38b93f4c [x12]
Sep 20 18:08:02 ntop00 setroubleshoot[873619]: SELinux is preventing /usr/local/sbin/sfacctd from write access on the file sflow.json. For complete SELinux messages run: sealert -l b2869c09-acbd-427c-b7c9-edae08c37a0e [x12]
Sep 20 18:08:02 ntop00 setroubleshoot[873619]: failed to retrieve rpm info for path '/srv/pmacct/sflow.json': [x12]
Sep 20 18:08:02 ntop00 setroubleshoot[873619]: SELinux is preventing /usr/local/sbin/sfacctd from lock access on the file /srv/pmacct/sflow.json. For complete SELinux messages run: sealert -l dbd70a69-3ee5-4fce-87ea-309297754109 [x12]
Sep 20 18:10:01 ntop00 sfacctd[791587]: INFO ( m1/mysql ): *** Purging cache - START (PID: 252) ***
Sep 20 18:10:01 ntop00 nfacctd[791663]: INFO ( m1/mysql ): *** Purging cache - START (PID: 252) ***
Sep 20 18:10:31 ntop00 sfacctd[791587]: INFO ( m1/mysql ): *** Purging cache - END (PID: 252, QN: 7476/7476, ET: 30) ***
Sep 20 18:10:31 ntop00 nfacctd[791663]: INFO ( m1/mysql ): *** Purging cache - END (PID: 252, QN: 48/48, ET: 30) ***
Sep 20 18:13:01 ntop00 sfacctd[791587]: INFO ( p1/print ): *** Purging cache - START (PID: 253) ***
Sep 20 18:13:01 ntop00 sfacctd[791587]: INFO ( p1/print ): *** Purging cache - END (PID: 253, QN: 7460/7460, ET: 0) ***
Sep 20 18:13:01 ntop00 nfacctd[791663]: INFO ( p1/print ): *** Purging cache - START (PID: 253) ***
Sep 20 18:13:01 ntop00 nfacctd[791663]: INFO ( p1/print ): *** Purging cache - END (PID: 253, QN: 49/49, ET: 0) ***
Sep 20 18:15:01 ntop00 sfacctd[791587]: INFO ( m1/mysql ): *** Purging cache - START (PID: 254) ***
Sep 20 18:15:01 ntop00 nfacctd[791663]: INFO ( m1/mysql ): *** Purging cache - START (PID: 254) ***
Sep 20 18:15:31 ntop00 sfacctd[791587]: INFO ( m1/mysql ): *** Purging cache - END (PID: 254, QN: 7328/7328, ET: 30) ***
Sep 20 18:15:31 ntop00 nfacctd[791663]: INFO ( m1/mysql ): *** Purging cache - END (PID: 254, QN: 48/48, ET: 30) ***
Sep 20 18:18:01 ntop00 sfacctd[791587]: INFO ( p1/print ): *** Purging cache - START (PID: 255) ***
Sep 20 18:18:01 ntop00 sfacctd[791587]: INFO ( p1/print ): *** Purging cache - END (PID: 255, QN: 7297/7297, ET: 0) ***
Sep 20 18:18:01 ntop00 nfacctd[791663]: INFO ( p1/print ): *** Purging cache - START (PID: 255) ***
Sep 20 18:18:01 ntop00 nfacctd[791663]: INFO ( p1/print ): *** Purging cache - END (PID: 255, QN: 42/42, ET: 0) ***
Sep 20 18:20:01 ntop00 sfacctd[791587]: INFO ( m1/mysql ): *** Purging cache - START (PID: 256) ***
Sep 20 18:20:02 ntop00 nfacctd[791663]: INFO ( m1/mysql ): *** Purging cache - START (PID: 256) ***
Sep 20 18:20:32 ntop00 sfacctd[791587]: INFO ( m1/mysql ): *** Purging cache - END (PID: 256, QN: 7539/7539, ET: 31) ***
... 72 more distinct messages not shown
== outbound00.cs.umd.edu (1 distinct, 6 total) ==
Sep 20 18:09:09 outbound00.cs.umd.edu python3[2117351]: ldapdb [x6]
== outbound01.cs.umd.edu (1 distinct, 6 total) ==
Sep 20 18:13:06 outbound01.cs.umd.edu python3[183482]: ldapdb [x6]
== sentry-docker00.cs.umd.edu (36 distinct, 36 total) ==
Sep 20 18:19:47 sentry-docker00.cs.umd.edu systemd-udevd[286552]: link_config: could not get ethtool features for veth1c6a207
Sep 20 18:19:47 sentry-docker00.cs.umd.edu systemd-udevd[286552]: Could not set offload features of veth1c6a207: No such device
Sep 20 18:19:47 sentry-docker00.cs.umd.edu systemd-udevd[286587]: Could not generate persistent MAC address for veth342a5c1: No such file or directory
Sep 20 18:19:47 sentry-docker00.cs.umd.edu systemd-udevd[286588]: Could not generate persistent MAC address for vethe745d74: No such file or directory
Sep 20 18:19:47 sentry-docker00.cs.umd.edu systemd-udevd[286591]: Could not generate persistent MAC address for veth51152bd: No such file or directory
Sep 20 18:19:47 sentry-docker00.cs.umd.edu systemd-udevd[286592]: Could not generate persistent MAC address for veth9bfee7b: No such file or directory
Sep 20 18:19:47 sentry-docker00.cs.umd.edu systemd-udevd[286606]: Could not generate persistent MAC address for veth6675d1f: No such file or directory
Sep 20 18:19:47 sentry-docker00.cs.umd.edu systemd-udevd[286597]: Could not generate persistent MAC address for veth48a581f: No such file or directory
Sep 20 18:19:47 sentry-docker00.cs.umd.edu systemd-udevd[286617]: Could not generate persistent MAC address for veth3995cf4: No such file or directory
Sep 20 18:19:47 sentry-docker00.cs.umd.edu systemd-udevd[286618]: Could not generate persistent MAC address for veth5e952c9: No such file or directory
Sep 20 18:19:47 sentry-docker00.cs.umd.edu systemd-udevd[286629]: Could not generate persistent MAC address for vethe2ddda0: No such file or directory
Sep 20 18:19:47 sentry-docker00.cs.umd.edu systemd-udevd[286624]: Could not generate persistent MAC address for vethce36039: No such file or directory
Sep 20 18:39:55 sentry-docker00.cs.umd.edu systemd-udevd[295827]: link_config: could not get ethtool features for vethce36039
Sep 20 18:39:55 sentry-docker00.cs.umd.edu systemd-udevd[295827]: Could not set offload features of vethce36039: No such device
Sep 20 18:39:55 sentry-docker00.cs.umd.edu systemd-udevd[295949]: Could not generate persistent MAC address for vethb0e052a: No such file or directory
Sep 20 18:39:55 sentry-docker00.cs.umd.edu systemd-udevd[295950]: Could not generate persistent MAC address for veth76dcd1e: No such file or directory
Sep 20 18:39:56 sentry-docker00.cs.umd.edu systemd-udevd[296002]: Could not generate persistent MAC address for veth59cdc1f: No such file or directory
Sep 20 18:39:56 sentry-docker00.cs.umd.edu systemd-udevd[296003]: Could not generate persistent MAC address for veth07088bc: No such file or directory
Sep 20 18:39:56 sentry-docker00.cs.umd.edu systemd-udevd[296006]: Could not generate persistent MAC address for vethe07e097: No such file or directory
Sep 20 18:39:56 sentry-docker00.cs.umd.edu systemd-udevd[296007]: Could not generate persistent MAC address for vethdd4630e: No such file or directory
Sep 20 18:39:56 sentry-docker00.cs.umd.edu systemd-udevd[296037]: Could not generate persistent MAC address for vethc9767d5: No such file or directory
Sep 20 18:39:56 sentry-docker00.cs.umd.edu systemd-udevd[296038]: Could not generate persistent MAC address for veth6287d70: No such file or directory
Sep 20 18:39:56 sentry-docker00.cs.umd.edu systemd-udevd[296069]: Could not generate persistent MAC address for veth2dec529: No such file or directory
Sep 20 18:39:56 sentry-docker00.cs.umd.edu systemd-udevd[296070]: Could not generate persistent MAC address for vetha3991a4: No such file or directory
Sep 20 19:00:04 sentry-docker00.cs.umd.edu systemd-udevd[305380]: link_config: could not get ethtool features for veth2dec529
Sep 20 19:00:04 sentry-docker00.cs.umd.edu systemd-udevd[305380]: Could not set offload features of veth2dec529: No such device
Sep 20 19:00:04 sentry-docker00.cs.umd.edu systemd-udevd[305406]: Could not generate persistent MAC address for veth7452aee: No such file or directory
Sep 20 19:00:04 sentry-docker00.cs.umd.edu systemd-udevd[305407]: Could not generate persistent MAC address for vetha2d2750: No such file or directory
Sep 20 19:00:04 sentry-docker00.cs.umd.edu systemd-udevd[305410]: Could not generate persistent MAC address for veth08f1674: No such file or directory
Sep 20 19:00:04 sentry-docker00.cs.umd.edu systemd-udevd[305411]: Could not generate persistent MAC address for veth2d0e75a: No such file or directory
... 6 more distinct messages not shown
== strawberry (7 distinct, 38 total) ==
Sep 20 18:07:03 strawberry kernel: I/O error, dev sda, sector 206848 op 0x0:(READ) flags 0x80700 phys_seg 1 prio class 2 [x6]
Sep 20 18:07:03 strawberry kernel: I/O error, dev sda, sector 206848 op 0x0:(READ) flags 0x0 phys_seg 1 prio class 2 [x6]
Sep 20 18:07:03 strawberry kernel: Buffer I/O error on dev sda2, logical block 0, async page read [x6]
Sep 20 18:07:03 strawberry kernel: I/O error, dev sda, sector 2048 op 0x0:(READ) flags 0x80700 phys_seg 1 prio class 2 [x6]
Sep 20 18:07:03 strawberry kernel: I/O error, dev sda, sector 2048 op 0x0:(READ) flags 0x0 phys_seg 1 prio class 2 [x6]
Sep 20 18:07:03 strawberry kernel: Buffer I/O error on dev sda1, logical block 0, async page read [x6]
Sep 20 18:34:42 strawberry smartd[5314]: Device: /dev/sda [SAT], failed to read SMART Attribute Data [x2]
== submit26-b9-f1 (11 distinct, 15 total) ==
Sep 20 18:25:54 submit26-b9-f1 setroubleshoot[2616298]: SELinux is preventing /usr/bin/python3.9 from create access on the directory /(null). For complete SELinux messages run: sealert -l 3ef7d677-731f-46bf-9c34-c2c55fea665c
Sep 20 18:25:54 submit26-b9-f1 setroubleshoot[2616298]: SELinux is preventing /usr/bin/python3.9 from add_name access on the directory /(null). For complete SELinux messages run: sealert -l aa60e26f-72e1-45f1-bc12-aa8b3b669e36
Sep 20 18:25:54 submit26-b9-f1 setroubleshoot[2616298]: SELinux is preventing /usr/bin/python3.9 from create access on the file /(null). For complete SELinux messages run: sealert -l d088fb43-23ee-4ae8-ae6a-5d1c041ee2d6 [x2]
Sep 20 18:25:54 submit26-b9-f1 setroubleshoot[2616298]: SELinux is preventing /usr/bin/python3.9 from open access on the file /tmp/libdnf.3QNRtl/repodata/repomd.xml. For complete SELinux messages run: sealert -l 3b0d8c9a-6637-4d6e-a864-f1dd7c00377d
Sep 20 18:25:54 submit26-b9-f1 setroubleshoot[2616298]: SELinux is preventing /usr/bin/python3.9 from setattr access on the file repomd.xml. For complete SELinux messages run: sealert -l 0fd3339f-3ef2-45f3-9e58-65a58b42f3ee [x2]
Sep 20 18:25:54 submit26-b9-f1 setroubleshoot[2616298]: SELinux is preventing /usr/bin/python3.9 from read access on the directory libdnf.3QNRtl. For complete SELinux messages run: sealert -l 0d661d88-dc9e-469d-986b-52e29b353aa8
Sep 20 18:25:54 submit26-b9-f1 setroubleshoot[2616298]: SELinux is preventing /usr/bin/python3.9 from remove_name access on the directory repomd.xml. For complete SELinux messages run: sealert -l 405a8556-cf9f-4ef4-8525-0dca18d4259d
Sep 20 18:25:54 submit26-b9-f1 setroubleshoot[2616298]: SELinux is preventing /usr/bin/python3.9 from unlink access on the file repomd.xml. For complete SELinux messages run: sealert -l 3c38e23e-3631-4cb5-81c7-992675c836d9 [x2]
Sep 20 18:25:54 submit26-b9-f1 setroubleshoot[2616298]: SELinux is preventing /usr/bin/python3.9 from rmdir access on the directory repodata. For complete SELinux messages run: sealert -l a070e9b5-2867-47d6-b2e3-3b7d99725848
Sep 20 18:25:54 submit26-b9-f1 setroubleshoot[2616298]: SELinux is preventing /usr/bin/python3.9 from open access on the file /tmp/libdnf.ja69O0/repodata/repomd.xml. For complete SELinux messages run: sealert -l 3b0d8c9a-6637-4d6e-a864-f1dd7c00377d
Sep 20 18:41:44 submit26-b9-f1 systemd[1]: user(a)1001.service: Main process exited, code=killed, status=9/KILL [x2]
== submit26-b9-f2 (10 distinct, 16 total) ==
Sep 20 18:06:49 submit26-b9-f2 setroubleshoot[1730335]: SELinux is preventing /usr/bin/python3.9 from create access on the directory /(null). For complete SELinux messages run: sealert -l 0659d546-3107-4f75-b00f-008c85f41dc6 [x2]
Sep 20 18:06:49 submit26-b9-f2 setroubleshoot[1730335]: SELinux is preventing /usr/bin/python3.9 from add_name access on the directory /(null). For complete SELinux messages run: sealert -l 156d9270-3466-4356-b86f-1a128825961a [x2]
Sep 20 18:06:49 submit26-b9-f2 setroubleshoot[1730335]: SELinux is preventing /usr/bin/python3.9 from create access on the file /(null). For complete SELinux messages run: sealert -l c8a40bf5-2fc4-46b3-b813-8592b3523339
Sep 20 18:06:49 submit26-b9-f2 setroubleshoot[1730335]: SELinux is preventing /usr/bin/python3.9 from open access on the file /tmp/libdnf.FFqwug/repodata/repomd.xml. For complete SELinux messages run: sealert -l 7f4c3a8e-0f99-47c4-9baf-e1336fe24876
Sep 20 18:06:49 submit26-b9-f2 setroubleshoot[1730335]: SELinux is preventing /usr/bin/python3.9 from setattr access on the file repomd.xml. For complete SELinux messages run: sealert -l 988123da-b724-4e6a-900c-33a2723fdaf1
Sep 20 18:06:49 submit26-b9-f2 setroubleshoot[1730335]: SELinux is preventing /usr/bin/python3.9 from read access on the directory libdnf.FFqwug. For complete SELinux messages run: sealert -l ca585e2b-d50f-4264-8127-6b3fa04070c8
Sep 20 18:06:49 submit26-b9-f2 setroubleshoot[1730335]: SELinux is preventing /usr/bin/python3.9 from remove_name access on the directory repomd.xml. For complete SELinux messages run: sealert -l 3a749560-1cec-40ca-a4dc-596841be3885
Sep 20 18:06:49 submit26-b9-f2 setroubleshoot[1730335]: SELinux is preventing /usr/bin/python3.9 from unlink access on the file repomd.xml. For complete SELinux messages run: sealert -l 0aa52f08-94f8-474e-96d8-e818846941af
Sep 20 18:06:49 submit26-b9-f2 setroubleshoot[1730335]: SELinux is preventing /usr/bin/python3.9 from rmdir access on the directory repodata. For complete SELinux messages run: sealert -l de019dc4-408f-439c-902a-676d18dfe8e7
Sep 20 18:18:38 submit26-b9-f2 systemd[1]: user(a)1001.service: Main process exited, code=killed, status=9/KILL [x5]
== submit26-b9-f3 (1 distinct, 7 total) ==
Sep 20 18:07:58 submit26-b9-f3 systemd[1]: user(a)1001.service: Main process exited, code=killed, status=9/KILL [x7]
== submit26-b9-f4 (1 distinct, 3 total) ==
Sep 20 18:23:07 submit26-b9-f4 systemd[1]: user(a)1001.service: Main process exited, code=killed, status=9/KILL [x3]
1
0
Command: /usr/local/sbin/syslog-digest.py
Time : 0.0499s
Status : exited 0
Output :
Syslog digest — 2026-09-20 18:05 EDT
Processed 1,962 lines, filtered 1,438 (73%). 524 unknown (181 distinct) from 18 host(s).
== b0b02.cs.umd.edu (1 distinct, 1 total) ==
Sep 20 17:52:41 b0b02.cs.umd.edu rustdesk[3336434]: cannot open display:
== bale (5 distinct, 84 total) ==
Sep 20 17:06:06 bale setroubleshoot[1229553]: failed to retrieve rpm info for /dev/nvme0 [x36]
Sep 20 17:06:07 bale setroubleshoot[1229553]: SELinux is preventing /usr/libexec/platform-python3.6 from getattr access on the chr_file /dev/nvme0. For complete SELinux messages run: sealert -l e098d0bd-ac29-4737-9018-de9a71e328ee [x12]
Sep 20 17:06:09 bale setroubleshoot[1229553]: SELinux is preventing smartctl from read access on the chr_file nvme0. For complete SELinux messages run: sealert -l fc305ce6-663c-4aa2-8640-0ee0f8dce1a9 [x12]
Sep 20 17:06:12 bale setroubleshoot[1229553]: SELinux is preventing smartctl from open access on the chr_file /dev/nvme0. For complete SELinux messages run: sealert -l 2c1d6b29-3343-488c-84c7-92d46f8010b6 [x12]
Sep 20 17:06:24 bale setroubleshoot[1230167]: SELinux is preventing /usr/sbin/smartctl from ioctl access on the chr_file /dev/nvme0. For complete SELinux messages run: sealert -l 8ea740c2-97d8-42fb-b550-a236b114507d [x12]
== csfw00a (1 distinct, 140 total) ==
Sep 20 17:04:35 csfw00a kernel: bnxt_en 0000:09:00.0 eth3: NIC Link is Down [x140]
== frozone (1 distinct, 1 total) ==
Sep 20 17:35:39 frozone systemd-tmpfiles[2206449]: Failed to remove "/var/tmp/test.log", ignoring: Operation not permitted
== idm00 (1 distinct, 1 total) ==
Sep 20 17:54:00 idm00 named[4166701]: client @0x7f11a4068068 10.73.240.42#49378: update '73.10.in-addr.arpa/IN' denied
== idmp0 (1 distinct, 1 total) ==
Sep 20 17:37:56 idmp0 named[1598691]: client @0x7f2d3c07c928 10.73.240.43#50618: update '73.10.in-addr.arpa/IN' denied
== itmon02 (1 distinct, 1 total) ==
Sep 20 18:03:31 itmon02 sshd[1750555]: error: beginning MaxStartups throttling
== newhonors2 (1 distinct, 24 total) ==
Sep 20 17:13:02 newhonors2 dhcpcd[2913662]: dhcpcd is not running [x24]
== ntop00 (101 distinct, 141 total) ==
Sep 20 17:05:01 ntop00 sfacctd[791587]: INFO ( m1/mysql ): *** Purging cache - START (PID: 226) ***
Sep 20 17:05:01 ntop00 nfacctd[791663]: INFO ( m1/mysql ): *** Purging cache - START (PID: 226) ***
Sep 20 17:05:52 ntop00 sfacctd[791587]: INFO ( m1/mysql ): *** Purging cache - END (PID: 226, QN: 11927/11927, ET: 51) ***
Sep 20 17:05:52 ntop00 nfacctd[791663]: INFO ( m1/mysql ): *** Purging cache - END (PID: 226, QN: 74/74, ET: 51) ***
Sep 20 17:08:01 ntop00 sfacctd[791587]: INFO ( p1/print ): *** Purging cache - START (PID: 227) ***
Sep 20 17:08:01 ntop00 sfacctd[791587]: INFO ( p1/print ): *** Purging cache - END (PID: 227, QN: 12143/12143, ET: 0) ***
Sep 20 17:08:01 ntop00 nfacctd[791663]: INFO ( p1/print ): *** Purging cache - START (PID: 227) ***
Sep 20 17:08:01 ntop00 nfacctd[791663]: INFO ( p1/print ): *** Purging cache - END (PID: 227, QN: 72/72, ET: 0) ***
Sep 20 17:08:02 ntop00 setroubleshoot[865600]: SELinux is preventing /usr/local/sbin/sfacctd from append access on the file sflow.json. For complete SELinux messages run: sealert -l aec09a24-8fd6-4c2f-ba24-2e4b38b93f4c [x11]
Sep 20 17:08:02 ntop00 setroubleshoot[865600]: SELinux is preventing /usr/local/sbin/sfacctd from write access on the file sflow.json. For complete SELinux messages run: sealert -l b2869c09-acbd-427c-b7c9-edae08c37a0e [x11]
Sep 20 17:08:02 ntop00 setroubleshoot[865600]: failed to retrieve rpm info for path '/srv/pmacct/sflow.json': [x11]
Sep 20 17:08:02 ntop00 setroubleshoot[865600]: SELinux is preventing /usr/local/sbin/sfacctd from lock access on the file /srv/pmacct/sflow.json. For complete SELinux messages run: sealert -l dbd70a69-3ee5-4fce-87ea-309297754109 [x11]
Sep 20 17:10:01 ntop00 sfacctd[791587]: INFO ( m1/mysql ): *** Purging cache - START (PID: 228) ***
Sep 20 17:10:01 ntop00 nfacctd[791663]: INFO ( m1/mysql ): *** Purging cache - START (PID: 228) ***
Sep 20 17:10:49 ntop00 sfacctd[791587]: INFO ( m1/mysql ): *** Purging cache - END (PID: 228, QN: 11767/11767, ET: 48) ***
Sep 20 17:10:49 ntop00 nfacctd[791663]: INFO ( m1/mysql ): *** Purging cache - END (PID: 228, QN: 47/47, ET: 48) ***
Sep 20 17:13:01 ntop00 sfacctd[791587]: INFO ( p1/print ): *** Purging cache - START (PID: 229) ***
Sep 20 17:13:01 ntop00 sfacctd[791587]: INFO ( p1/print ): *** Purging cache - END (PID: 229, QN: 11757/11757, ET: 0) ***
Sep 20 17:13:01 ntop00 nfacctd[791663]: INFO ( p1/print ): *** Purging cache - START (PID: 229) ***
Sep 20 17:13:01 ntop00 nfacctd[791663]: INFO ( p1/print ): *** Purging cache - END (PID: 229, QN: 49/49, ET: 0) ***
Sep 20 17:15:01 ntop00 sfacctd[791587]: INFO ( m1/mysql ): *** Purging cache - START (PID: 230) ***
Sep 20 17:15:01 ntop00 nfacctd[791663]: INFO ( m1/mysql ): *** Purging cache - START (PID: 230) ***
Sep 20 17:15:52 ntop00 sfacctd[791587]: INFO ( m1/mysql ): *** Purging cache - END (PID: 230, QN: 11952/11952, ET: 51) ***
Sep 20 17:15:52 ntop00 nfacctd[791663]: INFO ( m1/mysql ): *** Purging cache - END (PID: 230, QN: 62/62, ET: 51) ***
Sep 20 17:18:01 ntop00 sfacctd[791587]: INFO ( p1/print ): *** Purging cache - START (PID: 231) ***
Sep 20 17:18:01 ntop00 sfacctd[791587]: INFO ( p1/print ): *** Purging cache - END (PID: 231, QN: 12029/12029, ET: 0) ***
Sep 20 17:18:01 ntop00 nfacctd[791663]: INFO ( p1/print ): *** Purging cache - START (PID: 231) ***
Sep 20 17:18:01 ntop00 nfacctd[791663]: INFO ( p1/print ): *** Purging cache - END (PID: 231, QN: 62/62, ET: 0) ***
Sep 20 17:20:01 ntop00 sfacctd[791587]: INFO ( m1/mysql ): *** Purging cache - START (PID: 232) ***
Sep 20 17:20:01 ntop00 nfacctd[791663]: INFO ( m1/mysql ): *** Purging cache - START (PID: 232) ***
... 71 more distinct messages not shown
== outbound00.cs.umd.edu (1 distinct, 6 total) ==
Sep 20 17:09:09 outbound00.cs.umd.edu python3[2103360]: ldapdb [x6]
== outbound01.cs.umd.edu (1 distinct, 6 total) ==
Sep 20 17:13:06 outbound01.cs.umd.edu python3[169305]: ldapdb [x6]
== sentry-docker00.cs.umd.edu (36 distinct, 36 total) ==
Sep 20 17:19:22 sentry-docker00.cs.umd.edu systemd-udevd[258053]: Could not generate persistent MAC address for veth83289bb: No such file or directory
Sep 20 17:19:22 sentry-docker00.cs.umd.edu systemd-udevd[258054]: Could not generate persistent MAC address for veth0af6606: No such file or directory
Sep 20 17:19:22 sentry-docker00.cs.umd.edu systemd-udevd[258072]: Could not generate persistent MAC address for vethbcdaf39: No such file or directory
Sep 20 17:19:22 sentry-docker00.cs.umd.edu systemd-udevd[258070]: Could not generate persistent MAC address for vethc467ff4: No such file or directory
Sep 20 17:19:22 sentry-docker00.cs.umd.edu systemd-udevd[258108]: Could not generate persistent MAC address for veth766fca5: No such file or directory
Sep 20 17:19:22 sentry-docker00.cs.umd.edu systemd-udevd[258109]: Could not generate persistent MAC address for veth9a1e06c: No such file or directory
Sep 20 17:19:22 sentry-docker00.cs.umd.edu systemd-udevd[258141]: Could not generate persistent MAC address for veth1cfdf82: No such file or directory
Sep 20 17:19:22 sentry-docker00.cs.umd.edu systemd-udevd[258143]: Could not generate persistent MAC address for veth81f0001: No such file or directory
Sep 20 17:19:22 sentry-docker00.cs.umd.edu systemd-udevd[258167]: Could not generate persistent MAC address for vethf656d72: No such file or directory
Sep 20 17:19:22 sentry-docker00.cs.umd.edu systemd-udevd[258171]: Could not generate persistent MAC address for vethbe55c8f: No such file or directory
Sep 20 17:39:30 sentry-docker00.cs.umd.edu systemd-udevd[267644]: link_config: could not set ethtool features for veth766fca5
Sep 20 17:39:30 sentry-docker00.cs.umd.edu systemd-udevd[267644]: Could not set offload features of veth766fca5: Operation not permitted
Sep 20 17:39:31 sentry-docker00.cs.umd.edu systemd-udevd[267713]: Could not generate persistent MAC address for veth83cfe9b: No such file or directory
Sep 20 17:39:31 sentry-docker00.cs.umd.edu systemd-udevd[267714]: Could not generate persistent MAC address for vethdc13dbd: No such file or directory
Sep 20 17:39:31 sentry-docker00.cs.umd.edu systemd-udevd[267717]: Could not generate persistent MAC address for veth6fa9d19: No such file or directory
Sep 20 17:39:31 sentry-docker00.cs.umd.edu systemd-udevd[267718]: Could not generate persistent MAC address for veth813b151: No such file or directory
Sep 20 17:39:31 sentry-docker00.cs.umd.edu systemd-udevd[267723]: Could not generate persistent MAC address for veth533af8e: No such file or directory
Sep 20 17:39:31 sentry-docker00.cs.umd.edu systemd-udevd[267737]: Could not generate persistent MAC address for vetha4578e6: No such file or directory
Sep 20 17:39:31 sentry-docker00.cs.umd.edu systemd-udevd[267723]: Could not generate persistent MAC address for veth9010f4f: No such file or directory
Sep 20 17:39:31 sentry-docker00.cs.umd.edu systemd-udevd[267737]: Could not generate persistent MAC address for veth3606fba: No such file or directory
Sep 20 17:39:31 sentry-docker00.cs.umd.edu systemd-udevd[267747]: Could not generate persistent MAC address for vetheea3c8f: No such file or directory
Sep 20 17:39:31 sentry-docker00.cs.umd.edu systemd-udevd[267751]: Could not generate persistent MAC address for veth0ad7074: No such file or directory
Sep 20 17:59:39 sentry-docker00.cs.umd.edu systemd-udevd[277132]: link_config: could not get ethtool features for veth83cfe9b
Sep 20 17:59:39 sentry-docker00.cs.umd.edu systemd-udevd[277132]: Could not set offload features of veth83cfe9b: No such device
Sep 20 17:59:39 sentry-docker00.cs.umd.edu systemd-udevd[277134]: link_config: could not get ethtool features for veth9010f4f
Sep 20 17:59:39 sentry-docker00.cs.umd.edu systemd-udevd[277134]: Could not set offload features of veth9010f4f: No such device
Sep 20 17:59:39 sentry-docker00.cs.umd.edu systemd-udevd[277164]: Could not generate persistent MAC address for vethf4ccda9: No such file or directory
Sep 20 17:59:39 sentry-docker00.cs.umd.edu systemd-udevd[277163]: Could not generate persistent MAC address for vetha25fc31: No such file or directory
Sep 20 17:59:39 sentry-docker00.cs.umd.edu systemd-udevd[277167]: Could not generate persistent MAC address for veth8939bc7: No such file or directory
Sep 20 17:59:39 sentry-docker00.cs.umd.edu systemd-udevd[277189]: Could not generate persistent MAC address for veth2cb00ed: No such file or directory
... 6 more distinct messages not shown
== soul (1 distinct, 1 total) ==
Sep 20 17:47:11 soul sshd-session[3807952]: fatal: userauth_pubkey: parse publickey packet: incomplete message [preauth]
== strawberry (7 distinct, 38 total) ==
Sep 20 17:07:03 strawberry kernel: I/O error, dev sda, sector 206848 op 0x0:(READ) flags 0x80700 phys_seg 1 prio class 2 [x6]
Sep 20 17:07:03 strawberry kernel: I/O error, dev sda, sector 206848 op 0x0:(READ) flags 0x0 phys_seg 1 prio class 2 [x6]
Sep 20 17:07:03 strawberry kernel: Buffer I/O error on dev sda2, logical block 0, async page read [x6]
Sep 20 17:07:03 strawberry kernel: I/O error, dev sda, sector 2048 op 0x0:(READ) flags 0x80700 phys_seg 1 prio class 2 [x6]
Sep 20 17:07:03 strawberry kernel: I/O error, dev sda, sector 2048 op 0x0:(READ) flags 0x0 phys_seg 1 prio class 2 [x6]
Sep 20 17:07:03 strawberry kernel: Buffer I/O error on dev sda1, logical block 0, async page read [x6]
Sep 20 17:34:42 strawberry smartd[5314]: Device: /dev/sda [SAT], failed to read SMART Attribute Data [x2]
== submit26-b9-f1 (1 distinct, 4 total) ==
Sep 20 17:08:07 submit26-b9-f1 systemd[1]: user(a)1001.service: Main process exited, code=killed, status=9/KILL [x4]
== submit26-b9-f2 (1 distinct, 5 total) ==
Sep 20 17:12:44 submit26-b9-f2 systemd[1]: user(a)1001.service: Main process exited, code=killed, status=9/KILL [x5]
== submit26-b9-f3 (10 distinct, 19 total) ==
Sep 20 17:06:43 submit26-b9-f3 setroubleshoot[2136880]: SELinux is preventing /usr/bin/python3.9 from create access on the directory /(null). For complete SELinux messages run: sealert -l a653b772-cbcd-438b-bae5-23c3dc69b31b
Sep 20 17:06:43 submit26-b9-f3 setroubleshoot[2136880]: SELinux is preventing /usr/bin/python3.9 from add_name access on the directory /(null). For complete SELinux messages run: sealert -l 3e904634-6caa-4202-8c92-f139db798859
Sep 20 17:06:43 submit26-b9-f3 setroubleshoot[2136880]: SELinux is preventing /usr/bin/python3.9 from create access on the file /(null). For complete SELinux messages run: sealert -l 580b20e4-ec2c-433d-905c-5bd417fba033 [x2]
Sep 20 17:06:43 submit26-b9-f3 setroubleshoot[2136880]: SELinux is preventing /usr/bin/python3.9 from open access on the file /tmp/libdnf.2Re9mh/repodata/repomd.xml. For complete SELinux messages run: sealert -l 27f29d48-5e7c-4db7-b051-8ac055737d6f [x2]
Sep 20 17:06:43 submit26-b9-f3 setroubleshoot[2136880]: SELinux is preventing /usr/bin/python3.9 from setattr access on the file repomd.xml. For complete SELinux messages run: sealert -l bff72452-d40a-430b-9060-dd0a48f5b6ba [x2]
Sep 20 17:06:43 submit26-b9-f3 setroubleshoot[2136880]: SELinux is preventing /usr/bin/python3.9 from read access on the directory libdnf.2Re9mh. For complete SELinux messages run: sealert -l 9638d396-8ce5-4e6a-ae47-45cd3985e1cd
Sep 20 17:06:43 submit26-b9-f3 setroubleshoot[2136880]: SELinux is preventing /usr/bin/python3.9 from remove_name access on the directory repomd.xml. For complete SELinux messages run: sealert -l 6da64b94-7024-45a9-b8c2-3b9812517407
Sep 20 17:06:43 submit26-b9-f3 setroubleshoot[2136880]: SELinux is preventing /usr/bin/python3.9 from unlink access on the file repomd.xml. For complete SELinux messages run: sealert -l 64cbe179-abf1-4d5a-bade-bb164897ee65
Sep 20 17:06:43 submit26-b9-f3 setroubleshoot[2136880]: SELinux is preventing /usr/bin/python3.9 from rmdir access on the directory repodata. For complete SELinux messages run: sealert -l d2e35b1a-e27c-4f91-9217-2bb1204e1e68
Sep 20 17:09:19 submit26-b9-f3 systemd[1]: user(a)1001.service: Main process exited, code=killed, status=9/KILL [x7]
== submit26-b9-f4 (10 distinct, 15 total) ==
Sep 20 17:13:12 submit26-b9-f4 systemd[1]: user(a)1001.service: Main process exited, code=killed, status=9/KILL [x3]
Sep 20 17:24:47 submit26-b9-f4 setroubleshoot[1530652]: SELinux is preventing /usr/bin/python3.9 from create access on the directory /(null). For complete SELinux messages run: sealert -l ee160f23-b161-4f4a-9985-c4edfd3a5beb
Sep 20 17:24:47 submit26-b9-f4 setroubleshoot[1530652]: SELinux is preventing /usr/bin/python3.9 from add_name access on the directory /(null). For complete SELinux messages run: sealert -l 89a83821-4b24-4081-9973-0a79ca6ed5b4
Sep 20 17:24:47 submit26-b9-f4 setroubleshoot[1530652]: SELinux is preventing /usr/bin/python3.9 from create access on the file /(null). For complete SELinux messages run: sealert -l f73955d6-1416-45f9-bab6-ff1f3ea07e9d [x2]
Sep 20 17:24:47 submit26-b9-f4 setroubleshoot[1530652]: SELinux is preventing /usr/bin/python3.9 from open access on the file /tmp/libdnf.HQWvAe/repodata/repomd.xml. For complete SELinux messages run: sealert -l 9f8f24a0-8fb6-454d-a103-31a8f7a6efa0 [x2]
Sep 20 17:24:47 submit26-b9-f4 setroubleshoot[1530652]: SELinux is preventing /usr/bin/python3.9 from setattr access on the file repomd.xml. For complete SELinux messages run: sealert -l 20293136-86a3-40ba-a651-cff48d36059e [x2]
Sep 20 17:24:47 submit26-b9-f4 setroubleshoot[1530652]: SELinux is preventing /usr/bin/python3.9 from read access on the directory libdnf.HQWvAe. For complete SELinux messages run: sealert -l 25f86b49-4ee7-4f60-ad1c-73a70032560c
Sep 20 17:24:47 submit26-b9-f4 setroubleshoot[1530652]: SELinux is preventing /usr/bin/python3.9 from remove_name access on the directory repomd.xml. For complete SELinux messages run: sealert -l eec250fb-073f-456d-93bc-f98776fd476d
Sep 20 17:24:47 submit26-b9-f4 setroubleshoot[1530652]: SELinux is preventing /usr/bin/python3.9 from unlink access on the file repomd.xml. For complete SELinux messages run: sealert -l c9209e04-a349-43d5-8cb2-3e303e48df74
Sep 20 17:24:47 submit26-b9-f4 setroubleshoot[1530652]: SELinux is preventing /usr/bin/python3.9 from rmdir access on the directory repodata. For complete SELinux messages run: sealert -l 3178d5f5-80e9-404b-92b7-9bef397a8915
1
0
Command: /usr/local/sbin/syslog-digest.py
Time : 0.0534s
Status : exited 0
Output :
Syslog digest — 2026-09-20 17:05 EDT
Processed 1,958 lines, filtered 1,403 (71%). 555 unknown (175 distinct) from 21 host(s).
== amoeba (1 distinct, 1 total) ==
Sep 20 16:40:31 amoeba krb5_child[2360193]: Preauthentication failed
== b0b02.cs.umd.edu (1 distinct, 1 total) ==
Sep 20 16:52:37 b0b02.cs.umd.edu rustdesk[3321244]: cannot open display:
== bale (5 distinct, 93 total) ==
Sep 20 16:05:59 bale setroubleshoot[1216811]: failed to retrieve rpm info for /dev/nvme0 [x40]
Sep 20 16:05:59 bale setroubleshoot[1216811]: SELinux is preventing /usr/libexec/platform-python3.6 from getattr access on the chr_file /dev/nvme0. For complete SELinux messages run: sealert -l e098d0bd-ac29-4737-9018-de9a71e328ee [x13]
Sep 20 16:06:02 bale setroubleshoot[1216811]: SELinux is preventing smartctl from read access on the chr_file nvme0. For complete SELinux messages run: sealert -l fc305ce6-663c-4aa2-8640-0ee0f8dce1a9 [x13]
Sep 20 16:06:05 bale setroubleshoot[1216811]: SELinux is preventing smartctl from open access on the chr_file /dev/nvme0. For complete SELinux messages run: sealert -l 2c1d6b29-3343-488c-84c7-92d46f8010b6 [x11]
Sep 20 16:06:17 bale setroubleshoot[1217426]: SELinux is preventing /usr/sbin/smartctl from ioctl access on the chr_file /dev/nvme0. For complete SELinux messages run: sealert -l 8ea740c2-97d8-42fb-b550-a236b114507d [x16]
== csfw00a (1 distinct, 167 total) ==
Sep 20 16:03:53 csfw00a kernel: bnxt_en 0000:09:00.0 eth3: NIC Link is Down [x167]
== idm00 (1 distinct, 1 total) ==
Sep 20 16:54:00 idm00 named[4166701]: client @0x7f11a0062908 10.73.240.42#53925: update '73.10.in-addr.arpa/IN' denied
== idmp0 (1 distinct, 1 total) ==
Sep 20 16:37:56 idmp0 named[1598691]: client @0x7f2d2c0368e8 10.73.240.43#60274: update '73.10.in-addr.arpa/IN' denied
== inbound01.cs.umd.edu (2 distinct, 4 total) ==
Sep 20 16:36:35 inbound01.cs.umd.edu krb5_child[252857]: Client 'admin(a)UMD.EDU' not found in Kerberos database [x2]
Sep 20 16:46:27 inbound01.cs.umd.edu krb5_child[254909]: Preauthentication failed [x2]
== itmon02 (1 distinct, 7 total) ==
Sep 20 16:08:09 itmon02 sshd[1750555]: error: beginning MaxStartups throttling [x7]
== jaws.cs.umd.edu (3 distinct, 3 total) ==
Sep 20 17:01:36 jaws.cs.umd.edu systemd-coredump[2750409]: Process 2750395 (podman) of user 0 dumped core.#012#012Stack trace of thread 2750395:#012#0 0x000055fdd417546e internal/runtime/syscall/linux.Syscall6 (podman + 0x48c46e)#012#1 0x000055fdd4255326 syscall.Syscall (podman + 0x56c326)#012#2 0x000055fdd4255ed0 syscall.Syscall.abi0 (podman + 0x56ced0)#012#3 0x000055fdd43c036e github.com/containers/podman/vendor/golang.org/x/sys/unix.OpenTree (podman + 0x6d736e)#012#4 0x000055fdd4a1d44b github.com/containers/podman/vendor/github.com/cyphar/filepath-securejoin/p… (podman + 0xd3444b)#012#5 0x000055fdd4a1d354 github.com/containers/podman/vendor/github.com/cyphar/filepath-securejoin/p… (podman + 0xd34354)#012#6 0x000055fdd4208f8c sync.(*Once).doSlow (podman + 0x51ff8c)#012#7 0x000055fdd4208eb9 sync.(*Once).Do (podman + 0x51feb9)#012#8 0x000055fdd4a1d2c5
github.com/containers/podman/vendor/github.com/cyphar/filepath-securejoin/p… (podman + 0xd342c5)#012#9 0x000055fdd4a1e8e2 github.com/containers/podman/vendor/github.com/cyphar/filepath-securejoin/p… (podman + 0xd358e2)#012#10 0x000055fdd4a1ecf3 github.com/containers/podman/vendor/github.com/cyphar/filepath-securejoin/p… (podman + 0xd35cf3)#012#11 0x000055fdd4a1de1c github.com/containers/podman/vendor/github.com/cyphar/filepath-securejoin/p… (podman + 0xd34e1c)#012#12 0x000055fdd4a1d858 github.com/containers/podman/vendor/github.com/cyphar/filepath-securejoin/p… (podman + 0xd34858)#012#13 0x000055fdd4208f8c sync.(*Once).doSlow (podman + 0x51ff8c)#012#14 0x000055fdd4208eb9 sync.(*Once).Do
(podman + 0x51feb9)#012#15 0x000055fdd4a1d7c5 github.com/containers/podman/vendor/github.com/cyphar/filepath-securejoin/p… (podman + 0xd347c5)#012#16 0x000055fdd4a1ec9a github.com/containers/podman/vendor/github.com/cyphar/filepath-securejoin/p… (podman + 0xd35c9a)#012#17 0x000055fdd4a2584e github.com/containers/podman/vendor/github.com/opencontainers/selinux/go-se… (podman + 0xd3c84e)#012#18 0x000055fdd4a25d38 github.com/containers/podman/vendor/github.com/opencontainers/selinux/go-se… (podman + 0xd3cd38)#012#19 0x000055fdd4a24adf github.com/containers/podman/vendor/github.com/opencontainers/selinux/go-se… (podman + 0xd3badf)#012#20 0x000055fdd4a24d73 github.com/containers/podman/vendor/github.com/opencontainers/selinux/go-se… (podman + 0xd3bd73)#012#21 0x00005
5fdd4c1e6cb github.com/containers/podman/vendor/go.podman.io/common/pkg/config.defaultC… (podman + 0xf356cb)#012#22 0x000055fdd4c220b2 github.com/containers/podman/vendor/go.podman.io/common/pkg/config.newLocked (podman + 0xf390b2)#012#23 0x000055fdd4c21da5 github.com/containers/podman/vendor/go.podman.io/common/pkg/config.New (podman + 0xf38da5)#012#24 0x000055fdd539e7d3 github.com/containers/podman/cmd/podman/registry.newPodmanConfig (podman + 0x16b57d3)#012#25 0x000055fdd4208f8c sync.(*Once).doSlow (podman + 0x51ff8c)#012#26 0x000055fdd53bf550 github.com/containers/podman/cmd/podman/common.init (podman + 0x16d6550)#012#27 0x000055fdd41ceaf7 runtime.doInit1 (podman + 0x4e5af7)#012#28 0x000055fdd41bf030 runtime.main (podman + 0x4d6030)#012#29 0x000055fdd41ff061 runtime.goexit.abi0 (podman + 0x516061)#012ELF object binary architecture: AMD x86-64
Sep 20 17:01:37 jaws.cs.umd.edu systemd-coredump[2750433]: Process 2750416 (podman) of user 0 dumped core.#012#012Stack trace of thread 2750416:#012#0 0x0000561d5764d46e internal/runtime/syscall/linux.Syscall6 (podman + 0x48c46e)#012#1 0x0000561d5772d326 syscall.Syscall (podman + 0x56c326)#012#2 0x0000561d5772ded0 syscall.Syscall.abi0 (podman + 0x56ced0)#012#3 0x0000561d5789836e github.com/containers/podman/vendor/golang.org/x/sys/unix.OpenTree (podman + 0x6d736e)#012#4 0x0000561d57ef544b github.com/containers/podman/vendor/github.com/cyphar/filepath-securejoin/p… (podman + 0xd3444b)#012#5 0x0000561d57ef5354 github.com/containers/podman/vendor/github.com/cyphar/filepath-securejoin/p… (podman + 0xd34354)#012#6 0x0000561d576e0f8c sync.(*Once).doSlow (podman + 0x51ff8c)#012#7 0x0000561d576e0eb9 sync.(*Once).Do (podman + 0x51feb9)#012#8 0x0000561d57ef52c5
github.com/containers/podman/vendor/github.com/cyphar/filepath-securejoin/p… (podman + 0xd342c5)#012#9 0x0000561d57ef68e2 github.com/containers/podman/vendor/github.com/cyphar/filepath-securejoin/p… (podman + 0xd358e2)#012#10 0x0000561d57ef6cf3 github.com/containers/podman/vendor/github.com/cyphar/filepath-securejoin/p… (podman + 0xd35cf3)#012#11 0x0000561d57ef5e1c github.com/containers/podman/vendor/github.com/cyphar/filepath-securejoin/p… (podman + 0xd34e1c)#012#12 0x0000561d57ef5858 github.com/containers/podman/vendor/github.com/cyphar/filepath-securejoin/p… (podman + 0xd34858)#012#13 0x0000561d576e0f8c sync.(*Once).doSlow (podman + 0x51ff8c)#012#14 0x0000561d576e0eb9 sync.(*Once).Do
(podman + 0x51feb9)#012#15 0x0000561d57ef57c5 github.com/containers/podman/vendor/github.com/cyphar/filepath-securejoin/p… (podman + 0xd347c5)#012#16 0x0000561d57ef6c9a github.com/containers/podman/vendor/github.com/cyphar/filepath-securejoin/p… (podman + 0xd35c9a)#012#17 0x0000561d57efd84e github.com/containers/podman/vendor/github.com/opencontainers/selinux/go-se… (podman + 0xd3c84e)#012#18 0x0000561d57efdd38 github.com/containers/podman/vendor/github.com/opencontainers/selinux/go-se… (podman + 0xd3cd38)#012#19 0x0000561d57efcadf github.com/containers/podman/vendor/github.com/opencontainers/selinux/go-se… (podman + 0xd3badf)#012#20 0x0000561d57efcd73 github.com/containers/podman/vendor/github.com/opencontainers/selinux/go-se… (podman + 0xd3bd73)#012#21 0x00005
61d580f66cb github.com/containers/podman/vendor/go.podman.io/common/pkg/config.defaultC… (podman + 0xf356cb)#012#22 0x0000561d580fa0b2 github.com/containers/podman/vendor/go.podman.io/common/pkg/config.newLocked (podman + 0xf390b2)#012#23 0x0000561d580f9da5 github.com/containers/podman/vendor/go.podman.io/common/pkg/config.New (podman + 0xf38da5)#012#24 0x0000561d588767d3 github.com/containers/podman/cmd/podman/registry.newPodmanConfig (podman + 0x16b57d3)#012#25 0x0000561d576e0f8c sync.(*Once).doSlow (podman + 0x51ff8c)#012#26 0x0000561d58897550 github.com/containers/podman/cmd/podman/common.init (podman + 0x16d6550)#012#27 0x0000561d576a6af7 runtime.doInit1 (podman + 0x4e5af7)#012#28 0x0000561d57697030 runtime.main (podman + 0x4d6030)#012#29 0x0000561d576d7061 runtime.goexit.abi0 (podman + 0x516061)#012ELF object binary architecture: AMD x86-64
Sep 20 17:01:38 jaws.cs.umd.edu systemd-coredump[2750453]: Process 2750438 (podman) of user 0 dumped core.#012#012Stack trace of thread 2750438:#012#0 0x0000563b385ed46e internal/runtime/syscall/linux.Syscall6 (podman + 0x48c46e)#012#1 0x0000563b386cd326 syscall.Syscall (podman + 0x56c326)#012#2 0x0000563b386cded0 syscall.Syscall.abi0 (podman + 0x56ced0)#012#3 0x0000563b3883836e github.com/containers/podman/vendor/golang.org/x/sys/unix.OpenTree (podman + 0x6d736e)#012#4 0x0000563b38e9544b github.com/containers/podman/vendor/github.com/cyphar/filepath-securejoin/p… (podman + 0xd3444b)#012#5 0x0000563b38e95354 github.com/containers/podman/vendor/github.com/cyphar/filepath-securejoin/p… (podman + 0xd34354)#012#6 0x0000563b38680f8c sync.(*Once).doSlow (podman + 0x51ff8c)#012#7 0x0000563b38680eb9 sync.(*Once).Do (podman + 0x51feb9)#012#8 0x0000563b38e952c5
github.com/containers/podman/vendor/github.com/cyphar/filepath-securejoin/p… (podman + 0xd342c5)#012#9 0x0000563b38e968e2 github.com/containers/podman/vendor/github.com/cyphar/filepath-securejoin/p… (podman + 0xd358e2)#012#10 0x0000563b38e96cf3 github.com/containers/podman/vendor/github.com/cyphar/filepath-securejoin/p… (podman + 0xd35cf3)#012#11 0x0000563b38e95e1c github.com/containers/podman/vendor/github.com/cyphar/filepath-securejoin/p… (podman + 0xd34e1c)#012#12 0x0000563b38e95858 github.com/containers/podman/vendor/github.com/cyphar/filepath-securejoin/p… (podman + 0xd34858)#012#13 0x0000563b38680f8c sync.(*Once).doSlow (podman + 0x51ff8c)#012#14 0x0000563b38680eb9 sync.(*Once).Do
(podman + 0x51feb9)#012#15 0x0000563b38e957c5 github.com/containers/podman/vendor/github.com/cyphar/filepath-securejoin/p… (podman + 0xd347c5)#012#16 0x0000563b38e96c9a github.com/containers/podman/vendor/github.com/cyphar/filepath-securejoin/p… (podman + 0xd35c9a)#012#17 0x0000563b38e9d84e github.com/containers/podman/vendor/github.com/opencontainers/selinux/go-se… (podman + 0xd3c84e)#012#18 0x0000563b38e9dd38 github.com/containers/podman/vendor/github.com/opencontainers/selinux/go-se… (podman + 0xd3cd38)#012#19 0x0000563b38e9cadf github.com/containers/podman/vendor/github.com/opencontainers/selinux/go-se… (podman + 0xd3badf)#012#20 0x0000563b38e9cd73 github.com/containers/podman/vendor/github.com/opencontainers/selinux/go-se… (podman + 0xd3bd73)#012#21 0x00005
63b390966cb github.com/containers/podman/vendor/go.podman.io/common/pkg/config.defaultC… (podman + 0xf356cb)#012#22 0x0000563b3909a0b2 github.com/containers/podman/vendor/go.podman.io/common/pkg/config.newLocked (podman + 0xf390b2)#012#23 0x0000563b39099da5 github.com/containers/podman/vendor/go.podman.io/common/pkg/config.New (podman + 0xf38da5)#012#24 0x0000563b398167d3 github.com/containers/podman/cmd/podman/registry.newPodmanConfig (podman + 0x16b57d3)#012#25 0x0000563b38680f8c sync.(*Once).doSlow (podman + 0x51ff8c)#012#26 0x0000563b39837550 github.com/containers/podman/cmd/podman/common.init (podman + 0x16d6550)#012#27 0x0000563b38646af7 runtime.doInit1 (podman + 0x4e5af7)#012#28 0x0000563b38637030 runtime.main (podman + 0x4d6030)#012#29 0x0000563b38677061 runtime.goexit.abi0 (podman + 0x516061)#012ELF object binary architecture: AMD x86-64
== munin (2 distinct, 2 total) ==
Sep 20 16:08:16 munin sudo[876492]: pam_systemd(sudo:session): Failed to stat() runtime directory '/run/user/0': No such file or directory
Sep 20 16:08:16 munin sudo[876492]: pam_systemd(sudo:session): Not setting $XDG_RUNTIME_DIR, as the directory is not in order.
== newhonors2 (1 distinct, 24 total) ==
Sep 20 16:13:03 newhonors2 dhcpcd[2911839]: dhcpcd is not running [x24]
== ntop00 (100 distinct, 144 total) ==
Sep 20 16:05:01 ntop00 sfacctd[791587]: INFO ( m1/mysql ): *** Purging cache - START (PID: 202) ***
Sep 20 16:05:01 ntop00 nfacctd[791663]: INFO ( m1/mysql ): *** Purging cache - START (PID: 202) ***
Sep 20 16:05:56 ntop00 sfacctd[791587]: INFO ( m1/mysql ): *** Purging cache - END (PID: 202, QN: 13397/13397, ET: 55) ***
Sep 20 16:05:56 ntop00 nfacctd[791663]: INFO ( m1/mysql ): *** Purging cache - END (PID: 202, QN: 57/57, ET: 55) ***
Sep 20 16:08:01 ntop00 sfacctd[791587]: INFO ( p1/print ): *** Purging cache - START (PID: 203) ***
Sep 20 16:08:01 ntop00 sfacctd[791587]: INFO ( p1/print ): *** Purging cache - END (PID: 203, QN: 20481/20481, ET: 0) ***
Sep 20 16:08:01 ntop00 nfacctd[791663]: INFO ( p1/print ): *** Purging cache - START (PID: 203) ***
Sep 20 16:08:01 ntop00 nfacctd[791663]: INFO ( p1/print ): *** Purging cache - END (PID: 203, QN: 73/73, ET: 0) ***
Sep 20 16:08:02 ntop00 setroubleshoot[857724]: SELinux is preventing /usr/local/sbin/sfacctd from append access on the file sflow.json. For complete SELinux messages run: sealert -l aec09a24-8fd6-4c2f-ba24-2e4b38b93f4c [x12]
Sep 20 16:08:02 ntop00 setroubleshoot[857724]: SELinux is preventing /usr/local/sbin/sfacctd from write access on the file sflow.json. For complete SELinux messages run: sealert -l b2869c09-acbd-427c-b7c9-edae08c37a0e [x12]
Sep 20 16:08:02 ntop00 setroubleshoot[857724]: failed to retrieve rpm info for path '/srv/pmacct/sflow.json': [x12]
Sep 20 16:08:02 ntop00 setroubleshoot[857724]: SELinux is preventing /usr/local/sbin/sfacctd from lock access on the file /srv/pmacct/sflow.json. For complete SELinux messages run: sealert -l dbd70a69-3ee5-4fce-87ea-309297754109 [x12]
Sep 20 16:10:01 ntop00 sfacctd[791587]: INFO ( m1/mysql ): *** Purging cache - START (PID: 204) ***
Sep 20 16:10:01 ntop00 nfacctd[791663]: INFO ( m1/mysql ): *** Purging cache - START (PID: 204) ***
Sep 20 16:11:21 ntop00 sfacctd[791587]: INFO ( m1/mysql ): *** Purging cache - END (PID: 204, QN: 19512/19512, ET: 80) ***
Sep 20 16:11:21 ntop00 nfacctd[791663]: INFO ( m1/mysql ): *** Purging cache - END (PID: 204, QN: 72/72, ET: 80) ***
Sep 20 16:13:01 ntop00 sfacctd[791587]: INFO ( p1/print ): *** Purging cache - START (PID: 205) ***
Sep 20 16:13:01 ntop00 sfacctd[791587]: INFO ( p1/print ): *** Purging cache - END (PID: 205, QN: 14047/14047, ET: 0) ***
Sep 20 16:13:01 ntop00 nfacctd[791663]: INFO ( p1/print ): *** Purging cache - START (PID: 205) ***
Sep 20 16:13:01 ntop00 nfacctd[791663]: INFO ( p1/print ): *** Purging cache - END (PID: 205, QN: 73/73, ET: 0) ***
Sep 20 16:15:01 ntop00 sfacctd[791587]: INFO ( m1/mysql ): *** Purging cache - START (PID: 206) ***
Sep 20 16:15:01 ntop00 nfacctd[791663]: INFO ( m1/mysql ): *** Purging cache - START (PID: 206) ***
Sep 20 16:15:43 ntop00 sfacctd[791587]: INFO ( m1/mysql ): *** Purging cache - END (PID: 206, QN: 10702/10702, ET: 42) ***
Sep 20 16:15:43 ntop00 nfacctd[791663]: INFO ( m1/mysql ): *** Purging cache - END (PID: 206, QN: 46/46, ET: 42) ***
Sep 20 16:18:01 ntop00 sfacctd[791587]: INFO ( p1/print ): *** Purging cache - START (PID: 207) ***
Sep 20 16:18:01 ntop00 sfacctd[791587]: INFO ( p1/print ): *** Purging cache - END (PID: 207, QN: 10438/10438, ET: 0) ***
Sep 20 16:18:02 ntop00 nfacctd[791663]: INFO ( p1/print ): *** Purging cache - START (PID: 207) ***
Sep 20 16:18:02 ntop00 nfacctd[791663]: INFO ( p1/print ): *** Purging cache - END (PID: 207, QN: 43/43, ET: 1) ***
Sep 20 16:20:01 ntop00 nfacctd[791663]: INFO ( m1/mysql ): *** Purging cache - START (PID: 208) ***
Sep 20 16:20:01 ntop00 sfacctd[791587]: INFO ( m1/mysql ): *** Purging cache - START (PID: 208) ***
... 70 more distinct messages not shown
== outbound00.cs.umd.edu (1 distinct, 6 total) ==
Sep 20 16:09:09 outbound00.cs.umd.edu python3[2089432]: ldapdb [x6]
== outbound01.cs.umd.edu (1 distinct, 6 total) ==
Sep 20 16:13:06 outbound01.cs.umd.edu python3[155337]: ldapdb [x6]
== sentry-docker00.cs.umd.edu (34 distinct, 34 total) ==
Sep 20 16:18:57 sentry-docker00.cs.umd.edu systemd-udevd[229820]: link_config: could not get ethtool features for veth9ee282d
Sep 20 16:18:57 sentry-docker00.cs.umd.edu systemd-udevd[229820]: Could not set offload features of veth9ee282d: No such device
Sep 20 16:18:57 sentry-docker00.cs.umd.edu systemd-udevd[229849]: Could not generate persistent MAC address for veth0d248e5: No such file or directory
Sep 20 16:18:57 sentry-docker00.cs.umd.edu systemd-udevd[229850]: Could not generate persistent MAC address for veth44ef439: No such file or directory
Sep 20 16:18:57 sentry-docker00.cs.umd.edu systemd-udevd[229853]: Could not generate persistent MAC address for veth53a0fb8: No such file or directory
Sep 20 16:18:57 sentry-docker00.cs.umd.edu systemd-udevd[229854]: Could not generate persistent MAC address for veth8f35272: No such file or directory
Sep 20 16:18:57 sentry-docker00.cs.umd.edu systemd-udevd[229877]: Could not generate persistent MAC address for veth4f0a8ef: No such file or directory
Sep 20 16:18:57 sentry-docker00.cs.umd.edu systemd-udevd[229878]: Could not generate persistent MAC address for vethbafe788: No such file or directory
Sep 20 16:18:57 sentry-docker00.cs.umd.edu systemd-udevd[229896]: Could not generate persistent MAC address for veth80f5ae8: No such file or directory
Sep 20 16:18:57 sentry-docker00.cs.umd.edu systemd-udevd[229888]: Could not generate persistent MAC address for veth1f05552: No such file or directory
Sep 20 16:18:57 sentry-docker00.cs.umd.edu systemd-udevd[229894]: Could not generate persistent MAC address for veth64433a2: No such file or directory
Sep 20 16:18:57 sentry-docker00.cs.umd.edu systemd-udevd[229882]: Could not generate persistent MAC address for veth9feb048: No such file or directory
Sep 20 16:39:05 sentry-docker00.cs.umd.edu systemd-udevd[239224]: link_config: could not get ethtool features for veth80f5ae8
Sep 20 16:39:05 sentry-docker00.cs.umd.edu systemd-udevd[239224]: Could not set offload features of veth80f5ae8: No such device
Sep 20 16:39:06 sentry-docker00.cs.umd.edu systemd-udevd[239258]: Could not generate persistent MAC address for veth11236c2: No such file or directory
Sep 20 16:39:06 sentry-docker00.cs.umd.edu systemd-udevd[239259]: Could not generate persistent MAC address for vethaecd696: No such file or directory
Sep 20 16:39:06 sentry-docker00.cs.umd.edu systemd-udevd[239262]: Could not generate persistent MAC address for veth6f8060a: No such file or directory
Sep 20 16:39:06 sentry-docker00.cs.umd.edu systemd-udevd[239263]: Could not generate persistent MAC address for veth9f08e60: No such file or directory
Sep 20 16:39:06 sentry-docker00.cs.umd.edu systemd-udevd[239286]: Could not generate persistent MAC address for veth14ca866: No such file or directory
Sep 20 16:39:06 sentry-docker00.cs.umd.edu systemd-udevd[239287]: Could not generate persistent MAC address for vetheed0d70: No such file or directory
Sep 20 16:39:06 sentry-docker00.cs.umd.edu systemd-udevd[239310]: Could not generate persistent MAC address for veth0adcfbd: No such file or directory
Sep 20 16:39:06 sentry-docker00.cs.umd.edu systemd-udevd[239303]: Could not generate persistent MAC address for vethefb7c59: No such file or directory
Sep 20 16:39:06 sentry-docker00.cs.umd.edu systemd-udevd[239310]: Could not generate persistent MAC address for veth699bb52: No such file or directory
Sep 20 16:39:06 sentry-docker00.cs.umd.edu systemd-udevd[239293]: Could not generate persistent MAC address for vethcfde447: No such file or directory
Sep 20 16:59:14 sentry-docker00.cs.umd.edu systemd-udevd[248668]: Could not generate persistent MAC address for vethc96abce: No such file or directory
Sep 20 16:59:14 sentry-docker00.cs.umd.edu systemd-udevd[248669]: Could not generate persistent MAC address for vethca86986: No such file or directory
Sep 20 16:59:14 sentry-docker00.cs.umd.edu systemd-udevd[248672]: Could not generate persistent MAC address for veth29f42b1: No such file or directory
Sep 20 16:59:14 sentry-docker00.cs.umd.edu systemd-udevd[248673]: Could not generate persistent MAC address for veth9aa1148: No such file or directory
Sep 20 16:59:14 sentry-docker00.cs.umd.edu systemd-udevd[248686]: Could not generate persistent MAC address for veth6c1fea8: No such file or directory
Sep 20 16:59:14 sentry-docker00.cs.umd.edu systemd-udevd[248676]: Could not generate persistent MAC address for veth6bd26df: No such file or directory
... 4 more distinct messages not shown
== strawberry (7 distinct, 38 total) ==
Sep 20 16:07:04 strawberry kernel: I/O error, dev sda, sector 206848 op 0x0:(READ) flags 0x80700 phys_seg 1 prio class 2 [x6]
Sep 20 16:07:04 strawberry kernel: I/O error, dev sda, sector 206848 op 0x0:(READ) flags 0x0 phys_seg 1 prio class 2 [x6]
Sep 20 16:07:04 strawberry kernel: Buffer I/O error on dev sda2, logical block 0, async page read [x6]
Sep 20 16:07:04 strawberry kernel: I/O error, dev sda, sector 2048 op 0x0:(READ) flags 0x80700 phys_seg 1 prio class 2 [x6]
Sep 20 16:07:04 strawberry kernel: I/O error, dev sda, sector 2048 op 0x0:(READ) flags 0x0 phys_seg 1 prio class 2 [x6]
Sep 20 16:07:04 strawberry kernel: Buffer I/O error on dev sda1, logical block 0, async page read [x6]
Sep 20 16:34:42 strawberry smartd[5314]: Device: /dev/sda [SAT], failed to read SMART Attribute Data [x2]
== submit26-b9-f1 (1 distinct, 2 total) ==
Sep 20 16:50:07 submit26-b9-f1 systemd[1]: user(a)1001.service: Main process exited, code=killed, status=9/KILL [x2]
== submit26-b9-f2 (1 distinct, 1 total) ==
Sep 20 16:38:08 submit26-b9-f2 systemd[1]: user(a)1001.service: Main process exited, code=killed, status=9/KILL
== submit26-b9-f3 (1 distinct, 9 total) ==
Sep 20 16:17:43 submit26-b9-f3 systemd[1]: user(a)1001.service: Main process exited, code=killed, status=9/KILL [x9]
== submit26-b9-f4 (1 distinct, 1 total) ==
Sep 20 17:03:08 submit26-b9-f4 systemd[1]: user(a)1001.service: Main process exited, code=killed, status=9/KILL
== submit26-b9-fclone (9 distinct, 10 total) ==
Sep 20 16:21:57 submit26-b9-fclone setroubleshoot[187960]: SELinux is preventing /usr/bin/python3.9 from create access on the directory /(null). For complete SELinux messages run: sealert -l 9355d9d9-a311-48d2-bd37-6c0f6947dfff
Sep 20 16:21:57 submit26-b9-fclone setroubleshoot[187960]: SELinux is preventing /usr/bin/python3.9 from add_name access on the directory /(null). For complete SELinux messages run: sealert -l cc4658d7-9db1-405d-9eee-de0ccee5857f
Sep 20 16:21:57 submit26-b9-fclone setroubleshoot[187960]: SELinux is preventing /usr/bin/python3.9 from create access on the file /(null). For complete SELinux messages run: sealert -l 568a2429-0b1b-49df-af41-49b5cd298ae8 [x2]
Sep 20 16:21:57 submit26-b9-fclone setroubleshoot[187960]: SELinux is preventing /usr/bin/python3.9 from open access on the file /tmp/libdnf.JYlzv0/repodata/repomd.xml. For complete SELinux messages run: sealert -l 03e2f521-0e7c-481f-8e92-0602c6adeedc
Sep 20 16:21:57 submit26-b9-fclone setroubleshoot[187960]: SELinux is preventing /usr/bin/python3.9 from setattr access on the file repomd.xml. For complete SELinux messages run: sealert -l 0d6b7b1f-ebe3-4beb-915a-b06b63bf2566
Sep 20 16:21:57 submit26-b9-fclone setroubleshoot[187960]: SELinux is preventing /usr/bin/python3.9 from read access on the directory libdnf.JYlzv0. For complete SELinux messages run: sealert -l 887adbf9-2bb9-4009-b800-36ddf9ba0db5
Sep 20 16:21:57 submit26-b9-fclone setroubleshoot[187960]: SELinux is preventing /usr/bin/python3.9 from remove_name access on the directory repomd.xml. For complete SELinux messages run: sealert -l 092e0644-8373-4017-b77f-1afa6c6da4ac
Sep 20 16:21:57 submit26-b9-fclone setroubleshoot[187960]: SELinux is preventing /usr/bin/python3.9 from unlink access on the file repomd.xml. For complete SELinux messages run: sealert -l ce429a92-56de-4de1-b859-cbfb69ae123c
Sep 20 16:21:57 submit26-b9-fclone setroubleshoot[187960]: SELinux is preventing /usr/bin/python3.9 from rmdir access on the directory repodata. For complete SELinux messages run: sealert -l 99b886eb-497b-406d-8206-afe76a1086b4
1
0