Command: /usr/local/sbin/syslog-digest.py
Time : 0.0738s
Status : exited 0
Output :
Syslog digest — 2026-10-12 02:05 EDT
Processed 3,398 lines, filtered 2,752 (80%). 646 unknown (165 distinct) from 23 host(s).
== abuse (1 distinct, 346 total) ==
Oct 12 01:05:25 abuse rsyslogd[1033]: imjournal: open() failed for path: '/var/lib/rsyslog/imjournal.state.tmp': Input/output error [v8.2404.0 try https://www.rsyslog.com/e/2433 ] [x346]
== b0b02.cs.umd.edu (1 distinct, 1 total) ==
Oct 12 01:23:54 b0b02.cs.umd.edu rustdesk[2890537]: cannot open display:
== cheezit.cs.umd.edu (4 distinct, 4 total) ==
Oct 12 01:19:55 cheezit.cs.umd.edu sshd-session[1829346]: pam_access(sshd:auth): access denied for user `admin' from `104.199.86.173'
Oct 12 01:19:55 cheezit.cs.umd.edu krb5_child[1829348]: Client 'admin(a)UMD.EDU' not found in Kerberos database
Oct 12 01:19:55 cheezit.cs.umd.edu sshd-session[1829344]: error: PAM: System error for admin from 104.199.86.173
Oct 12 01:21:27 cheezit.cs.umd.edu sshd-session[1830120]: error: Protocol major versions differ: 2 vs. 1
== hazfs.cs.umd.edu (11 distinct, 66 total) ==
Oct 12 01:32:41 hazfs.cs.umd.edu snmpd[1431]: send response: Failure in sendto [x6]
Oct 12 01:32:41 hazfs.cs.umd.edu snmpd[1431]: -- NET-SNMP-EXTEND-MIB::nsExtendStatus."userweb" [x6]
Oct 12 01:32:41 hazfs.cs.umd.edu snmpd[1431]: -- NET-SNMP-EXTEND-MIB::nsExtendStatus."zfslist" [x6]
Oct 12 01:32:41 hazfs.cs.umd.edu snmpd[1431]: -- NET-SNMP-EXTEND-MIB::nsExtendStatus."userhome" [x6]
Oct 12 01:32:41 hazfs.cs.umd.edu snmpd[1431]: -- NET-SNMP-EXTEND-MIB::nsExtendOutput1Line."userweb" [x6]
Oct 12 01:32:41 hazfs.cs.umd.edu snmpd[1431]: -- NET-SNMP-EXTEND-MIB::nsExtendOutput1Line."zfslist" [x6]
Oct 12 01:32:41 hazfs.cs.umd.edu snmpd[1431]: -- NET-SNMP-EXTEND-MIB::nsExtendOutput1Line."userhome" [x6]
Oct 12 01:32:41 hazfs.cs.umd.edu snmpd[1431]: -- NET-SNMP-EXTEND-MIB::nsExtendOutputFull."userweb" [x6]
Oct 12 01:32:41 hazfs.cs.umd.edu snmpd[1431]: -- NET-SNMP-EXTEND-MIB::nsExtendOutputFull."zfslist" [x6]
Oct 12 01:32:41 hazfs.cs.umd.edu snmpd[1431]: -- NET-SNMP-EXTEND-MIB::nsExtendOutputFull."userhome" [x6]
Oct 12 01:32:41 hazfs.cs.umd.edu snmpd[1431]: -- NET-SNMP-EXTEND-MIB::nsExtendOutNumLines."userweb" [x6]
== idm00 (1 distinct, 1 total) ==
Oct 12 01:54:46 idm00 named[3155984]: client @0x7f459c086b28 10.73.240.42#56966: update '73.10.in-addr.arpa/IN' denied
== idmp0 (1 distinct, 1 total) ==
Oct 12 01:39:22 idmp0 named[412677]: client @0x7fb32c007ab8 10.73.240.43#61285: update '73.10.in-addr.arpa/IN' denied
== inbound00.cs.umd.edu (1 distinct, 1 total) ==
Oct 12 02:03:04 inbound00.cs.umd.edu krb5_child[1213971]: Client 'admin(a)UMD.EDU' not found in Kerberos database
== itmon02 (1 distinct, 3 total) ==
Oct 12 01:08:03 itmon02 sshd[805675]: error: beginning MaxStartups throttling [x3]
== krispykreme.cs.umd.edu (4 distinct, 4 total) ==
Oct 12 01:21:32 krispykreme.cs.umd.edu sshd-session[680988]: pam_access(sshd:auth): access denied for user `admin' from `207.175.66.120'
Oct 12 01:21:32 krispykreme.cs.umd.edu krb5_child[680990]: Client 'admin(a)UMD.EDU' not found in Kerberos database
Oct 12 01:21:32 krispykreme.cs.umd.edu sshd-session[680986]: error: PAM: System error for admin from 207.175.66.120
Oct 12 01:22:02 krispykreme.cs.umd.edu sshd-session[681057]: error: Protocol major versions differ: 2 vs. 1
== mcstic (3 distinct, 6 total) ==
Oct 12 01:43:17 mcstic krb5_child[1876396]: Client 'admin(a)UMD.EDU' not found in Kerberos database [x4]
Oct 12 01:43:23 mcstic sshd[1876391]: error: PAM: Authentication failure for admin from 35.205.235.226
Oct 12 01:45:59 mcstic sshd[1876648]: error: Protocol major versions differ: 2 vs. 1
== munin (2 distinct, 8 total) ==
Oct 12 01:18:35 munin sudo[3643413]: pam_systemd(sudo:session): Failed to stat() runtime directory '/run/user/0': No such file or directory [x4]
Oct 12 01:18:35 munin sudo[3643413]: pam_systemd(sudo:session): Not setting $XDG_RUNTIME_DIR, as the directory is not in order. [x4]
== netman.cs.umd.edu (2 distinct, 5 total) ==
Oct 12 01:53:08 netman.cs.umd.edu krb5_child[2173248]: Client 'admin(a)UMD.EDU' not found in Kerberos database [x4]
Oct 12 01:53:15 netman.cs.umd.edu sshd[2173245]: error: PAM: Authentication failure for admin from 34.53.138.9
== newhonors2 (1 distinct, 24 total) ==
Oct 12 01:13:03 newhonors2 dhcpcd[3902929]: dhcpcd is not running [x24]
== ntop00 (97 distinct, 97 total) ==
Oct 12 01:05:01 ntop00 nfacctd[1075699]: INFO ( m1/mysql ): *** Purging cache - START (PID: 7330) ***
Oct 12 01:05:01 ntop00 nfacctd[1075699]: INFO ( m1/mysql ): *** Purging cache - END (PID: 7330, QN: 79/79, ET: 0) ***
Oct 12 01:05:14 ntop00 sfacctd[1075592]: INFO ( m1/mysql ): *** Purging cache - END (PID: 7330, QN: 5822/5822, ET: 13) ***
Oct 12 01:08:01 ntop00 sfacctd[1075592]: INFO ( p1/print ): *** Purging cache - START (PID: 7331) ***
Oct 12 01:08:01 ntop00 nfacctd[1075699]: INFO ( p1/print ): *** Purging cache - START (PID: 7331) ***
Oct 12 01:08:01 ntop00 nfacctd[1075699]: INFO ( p1/print ): *** Purging cache - END (PID: 7331, QN: 99/99, ET: 0) ***
Oct 12 01:08:01 ntop00 sfacctd[1075592]: INFO ( p1/print ): *** Purging cache - END (PID: 7331, QN: 5070/5070, ET: 0) ***
Oct 12 01:10:01 ntop00 sfacctd[1075592]: INFO ( m1/mysql ): *** Purging cache - START (PID: 7332) ***
Oct 12 01:10:01 ntop00 nfacctd[1075699]: INFO ( m1/mysql ): *** Purging cache - START (PID: 7332) ***
Oct 12 01:10:01 ntop00 nfacctd[1075699]: INFO ( m1/mysql ): *** Purging cache - END (PID: 7332, QN: 87/87, ET: 0) ***
Oct 12 01:10:13 ntop00 sfacctd[1075592]: INFO ( m1/mysql ): *** Purging cache - END (PID: 7332, QN: 4977/4977, ET: 12) ***
Oct 12 01:13:01 ntop00 sfacctd[1075592]: INFO ( p1/print ): *** Purging cache - START (PID: 7333) ***
Oct 12 01:13:01 ntop00 sfacctd[1075592]: INFO ( p1/print ): *** Purging cache - END (PID: 7333, QN: 4760/4760, ET: 0) ***
Oct 12 01:13:01 ntop00 nfacctd[1075699]: INFO ( p1/print ): *** Purging cache - START (PID: 7333) ***
Oct 12 01:13:01 ntop00 nfacctd[1075699]: INFO ( p1/print ): *** Purging cache - END (PID: 7333, QN: 58/58, ET: 0) ***
Oct 12 01:15:01 ntop00 sfacctd[1075592]: INFO ( m1/mysql ): *** Purging cache - START (PID: 7334) ***
Oct 12 01:15:01 ntop00 nfacctd[1075699]: INFO ( m1/mysql ): *** Purging cache - START (PID: 7334) ***
Oct 12 01:15:01 ntop00 nfacctd[1075699]: INFO ( m1/mysql ): *** Purging cache - END (PID: 7334, QN: 51/51, ET: 0) ***
Oct 12 01:15:12 ntop00 sfacctd[1075592]: INFO ( m1/mysql ): *** Purging cache - END (PID: 7334, QN: 4653/4653, ET: 11) ***
Oct 12 01:18:01 ntop00 sfacctd[1075592]: INFO ( p1/print ): *** Purging cache - START (PID: 7335) ***
Oct 12 01:18:01 ntop00 sfacctd[1075592]: INFO ( p1/print ): *** Purging cache - END (PID: 7335, QN: 4835/4835, ET: 0) ***
Oct 12 01:18:01 ntop00 nfacctd[1075699]: INFO ( p1/print ): *** Purging cache - START (PID: 7335) ***
Oct 12 01:18:01 ntop00 nfacctd[1075699]: INFO ( p1/print ): *** Purging cache - END (PID: 7335, QN: 61/61, ET: 0) ***
Oct 12 01:20:01 ntop00 sfacctd[1075592]: INFO ( m1/mysql ): *** Purging cache - START (PID: 7336) ***
Oct 12 01:20:01 ntop00 nfacctd[1075699]: INFO ( m1/mysql ): *** Purging cache - START (PID: 7336) ***
Oct 12 01:20:01 ntop00 nfacctd[1075699]: INFO ( m1/mysql ): *** Purging cache - END (PID: 7336, QN: 74/74, ET: 0) ***
Oct 12 01:20:11 ntop00 sfacctd[1075592]: INFO ( m1/mysql ): *** Purging cache - END (PID: 7336, QN: 4891/4891, ET: 10) ***
Oct 12 01:23:01 ntop00 sfacctd[1075592]: INFO ( p1/print ): *** Purging cache - START (PID: 7337) ***
Oct 12 01:23:01 ntop00 sfacctd[1075592]: INFO ( p1/print ): *** Purging cache - END (PID: 7337, QN: 4929/4929, ET: 0) ***
Oct 12 01:23:01 ntop00 nfacctd[1075699]: INFO ( p1/print ): *** Purging cache - START (PID: 7337) ***
... 67 more distinct messages not shown
== outbound00.cs.umd.edu (3 distinct, 8 total) ==
Oct 12 01:09:09 outbound00.cs.umd.edu python3[1792122]: ldapdb [x6]
Oct 12 01:55:19 outbound00.cs.umd.edu krb5_child[1802480]: Client 'admin(a)UMD.EDU' not found in Kerberos database
Oct 12 01:55:46 outbound00.cs.umd.edu sshd-session[1803105]: error: Protocol major versions differ: 2 vs. 1
== outbound01.cs.umd.edu (1 distinct, 6 total) ==
Oct 12 01:13:06 outbound01.cs.umd.edu python3[3272690]: ldapdb [x6]
== soul (1 distinct, 1 total) ==
Oct 12 01:50:13 soul krb5_child[342151]: Client 'admin(a)UMD.EDU' not found in Kerberos database
== strawberry (7 distinct, 38 total) ==
Oct 12 01:07:03 strawberry kernel: I/O error, dev sda, sector 206848 op 0x0:(READ) flags 0x80700 phys_seg 1 prio class 2 [x6]
Oct 12 01:07:03 strawberry kernel: I/O error, dev sda, sector 206848 op 0x0:(READ) flags 0x0 phys_seg 1 prio class 2 [x6]
Oct 12 01:07:03 strawberry kernel: Buffer I/O error on dev sda2, logical block 0, async page read [x6]
Oct 12 01:07:03 strawberry kernel: I/O error, dev sda, sector 2048 op 0x0:(READ) flags 0x80700 phys_seg 1 prio class 2 [x6]
Oct 12 01:07:03 strawberry kernel: I/O error, dev sda, sector 2048 op 0x0:(READ) flags 0x0 phys_seg 1 prio class 2 [x6]
Oct 12 01:07:03 strawberry kernel: Buffer I/O error on dev sda1, logical block 0, async page read [x6]
Oct 12 01:34:42 strawberry smartd[5314]: Device: /dev/sda [SAT], failed to read SMART Attribute Data [x2]
== submit26-b9-3 (1 distinct, 1 total) ==
Sep 14 09:10:06 submit26-b9-3 systemd[1]: user(a)1001.service: Main process exited, code=killed, status=9/KILL
== submit26-b9-f1 (1 distinct, 3 total) ==
Oct 12 01:38:07 submit26-b9-f1 systemd[1]: user(a)1001.service: Main process exited, code=killed, status=9/KILL [x3]
== submit26-b9-f2 (1 distinct, 2 total) ==
Oct 12 01:08:08 submit26-b9-f2 systemd[1]: user(a)1001.service: Main process exited, code=killed, status=9/KILL [x2]
== submit26-b9-f3 (10 distinct, 10 total) ==
Oct 12 01:06:51 submit26-b9-f3 setroubleshoot[2950708]: SELinux is preventing /usr/bin/python3.9 from create access on the directory /(null). For complete SELinux messages run: sealert -l a653b772-cbcd-438b-bae5-23c3dc69b31b
Oct 12 01:06:51 submit26-b9-f3 setroubleshoot[2950708]: SELinux is preventing /usr/bin/python3.9 from add_name access on the directory /(null). For complete SELinux messages run: sealert -l 3e904634-6caa-4202-8c92-f139db798859
Oct 12 01:06:51 submit26-b9-f3 setroubleshoot[2950708]: SELinux is preventing /usr/bin/python3.9 from create access on the file /(null). For complete SELinux messages run: sealert -l 580b20e4-ec2c-433d-905c-5bd417fba033
Oct 12 01:06:51 submit26-b9-f3 setroubleshoot[2950708]: SELinux is preventing /usr/bin/python3.9 from open access on the file /tmp/libdnf.P7lcmu/repodata/repomd.xml. For complete SELinux messages run: sealert -l 27f29d48-5e7c-4db7-b051-8ac055737d6f
Oct 12 01:06:51 submit26-b9-f3 setroubleshoot[2950708]: SELinux is preventing /usr/bin/python3.9 from setattr access on the file repomd.xml. For complete SELinux messages run: sealert -l bff72452-d40a-430b-9060-dd0a48f5b6ba
Oct 12 01:06:51 submit26-b9-f3 setroubleshoot[2950708]: SELinux is preventing /usr/bin/python3.9 from read access on the directory libdnf.P7lcmu. For complete SELinux messages run: sealert -l 9638d396-8ce5-4e6a-ae47-45cd3985e1cd
Oct 12 01:06:51 submit26-b9-f3 setroubleshoot[2950708]: SELinux is preventing /usr/bin/python3.9 from remove_name access on the directory repomd.xml. For complete SELinux messages run: sealert -l 6da64b94-7024-45a9-b8c2-3b9812517407
Oct 12 01:06:51 submit26-b9-f3 setroubleshoot[2950708]: SELinux is preventing /usr/bin/python3.9 from unlink access on the file repomd.xml. For complete SELinux messages run: sealert -l 64cbe179-abf1-4d5a-bade-bb164897ee65
Oct 12 01:06:51 submit26-b9-f3 setroubleshoot[2950708]: SELinux is preventing /usr/bin/python3.9 from rmdir access on the directory repodata. For complete SELinux messages run: sealert -l d2e35b1a-e27c-4f91-9217-2bb1204e1e68
Oct 12 01:16:39 submit26-b9-f3 systemd[1]: user(a)1001.service: Main process exited, code=killed, status=9/KILL
== submit26-b9-f4 (10 distinct, 10 total) ==
Oct 12 01:24:55 submit26-b9-f4 setroubleshoot[887369]: SELinux is preventing /usr/bin/python3.9 from create access on the directory /(null). For complete SELinux messages run: sealert -l ee160f23-b161-4f4a-9985-c4edfd3a5beb
Oct 12 01:24:55 submit26-b9-f4 setroubleshoot[887369]: SELinux is preventing /usr/bin/python3.9 from add_name access on the directory /(null). For complete SELinux messages run: sealert -l 89a83821-4b24-4081-9973-0a79ca6ed5b4
Oct 12 01:24:55 submit26-b9-f4 setroubleshoot[887369]: SELinux is preventing /usr/bin/python3.9 from create access on the file /(null). For complete SELinux messages run: sealert -l f73955d6-1416-45f9-bab6-ff1f3ea07e9d
Oct 12 01:24:55 submit26-b9-f4 setroubleshoot[887369]: SELinux is preventing /usr/bin/python3.9 from open access on the file /tmp/libdnf.thrI6Y/repodata/repomd.xml. For complete SELinux messages run: sealert -l 9f8f24a0-8fb6-454d-a103-31a8f7a6efa0
Oct 12 01:24:55 submit26-b9-f4 setroubleshoot[887369]: SELinux is preventing /usr/bin/python3.9 from setattr access on the file repomd.xml. For complete SELinux messages run: sealert -l 20293136-86a3-40ba-a651-cff48d36059e
Oct 12 01:24:55 submit26-b9-f4 setroubleshoot[887369]: SELinux is preventing /usr/bin/python3.9 from read access on the directory libdnf.thrI6Y. For complete SELinux messages run: sealert -l 25f86b49-4ee7-4f60-ad1c-73a70032560c
Oct 12 01:24:56 submit26-b9-f4 setroubleshoot[887369]: SELinux is preventing /usr/bin/python3.9 from remove_name access on the directory repomd.xml. For complete SELinux messages run: sealert -l eec250fb-073f-456d-93bc-f98776fd476d
Oct 12 01:24:56 submit26-b9-f4 setroubleshoot[887369]: SELinux is preventing /usr/bin/python3.9 from unlink access on the file repomd.xml. For complete SELinux messages run: sealert -l c9209e04-a349-43d5-8cb2-3e303e48df74
Oct 12 01:24:56 submit26-b9-f4 setroubleshoot[887369]: SELinux is preventing /usr/bin/python3.9 from rmdir access on the directory repodata. For complete SELinux messages run: sealert -l 3178d5f5-80e9-404b-92b7-9bef397a8915
Oct 12 01:28:11 submit26-b9-f4 systemd[1]: user(a)1001.service: Main process exited, code=killed, status=9/KILL
1
0
Command: /usr/local/sbin/syslog-digest.py
Time : 0.0904s
Status : exited 0
Output :
Syslog digest — 2026-10-12 01:05 EDT
Processed 4,308 lines, filtered 3,065 (71%). 1,243 unknown (214 distinct) from 30 host(s).
== abuse (1 distinct, 346 total) ==
Oct 12 00:05:25 abuse rsyslogd[1033]: imjournal: open() failed for path: '/var/lib/rsyslog/imjournal.state.tmp': Input/output error [v8.2404.0 try https://www.rsyslog.com/e/2433 ] [x346]
== b0b02.cs.umd.edu (1 distinct, 1 total) ==
Oct 12 00:23:50 b0b02.cs.umd.edu rustdesk[2875434]: cannot open display:
== biggulp.cs.umd.edu (4 distinct, 4 total) ==
Oct 12 00:11:42 biggulp.cs.umd.edu sshd-session[1402868]: pam_access(sshd:auth): access denied for user `admin' from `34.53.138.9'
Oct 12 00:11:42 biggulp.cs.umd.edu krb5_child[1402873]: Client 'admin(a)UMD.EDU' not found in Kerberos database
Oct 12 00:11:42 biggulp.cs.umd.edu sshd-session[1402866]: error: PAM: System error for admin from 34.53.138.9
Oct 12 00:12:48 biggulp.cs.umd.edu sshd-session[1402994]: error: Protocol major versions differ: 2 vs. 1
== grades01.cs.umd.edu (3 distinct, 4 total) ==
Oct 12 00:10:14 grades01.cs.umd.edu systemd[1]: New main PID 19729 does not belong to service, and PID file is not owned by root. Refusing. [x2]
Oct 12 00:10:34 grades01.cs.umd.edu systemd[1]: Daemon never wrote its PID file. Failing.
Oct 12 00:10:49 grades01.cs.umd.edu systemd[1]: pmlogger.service: Supervising process 26935 which is not our child. We'll most likely not notice when it exits.
== idm00 (2 distinct, 2 total) ==
Oct 12 00:52:22 idm00 named[3155984]: client @0x7f4594010098 10.73.245.12#60612: update '73.10.in-addr.arpa/IN' denied
Oct 12 00:54:46 idm00 named[3155984]: client @0x7f45a5368978 10.73.240.42#52649: update '73.10.in-addr.arpa/IN' denied
== idmp0 (1 distinct, 1 total) ==
Oct 12 00:39:22 idmp0 named[412677]: client @0x7fb334007ab8 10.73.240.43#64868: update '73.10.in-addr.arpa/IN' denied
== itmon02 (1 distinct, 5 total) ==
Oct 12 00:08:28 itmon02 sshd[805675]: error: beginning MaxStartups throttling [x5]
== jubjub.cs.umd.edu (3 distinct, 4 total) ==
Oct 12 00:10:13 jubjub.cs.umd.edu systemd[1]: New main PID 1983486 does not belong to service, and PID file is not owned by root. Refusing. [x2]
Oct 12 00:10:33 jubjub.cs.umd.edu systemd[1]: Daemon never wrote its PID file. Failing.
Oct 12 00:10:41 jubjub.cs.umd.edu systemd[1]: pmlogger.service: Supervising process 1990607 which is not our child. We'll most likely not notice when it exits.
== krispykreme.cs.umd.edu (1 distinct, 1 total) ==
Oct 12 00:26:22 krispykreme.cs.umd.edu sshd[705415]: error: beginning MaxStartups throttling
== mashie (54 distinct, 606 total) ==
Oct 12 00:43:17 mashie kernel: EXT4-fs error (device vda1): ext4_journal_check_start:83: comm find: Detected aborted journal [x277]
Oct 12 00:43:17 mashie kernel: EXT4-fs (vda1): Remounting filesystem read-only [x277]
Oct 12 00:43:22 mashie kernel: EXT4-fs error: 1935 callbacks suppressed
Oct 12 00:43:22 mashie kernel: EXT4-fs: 1935 callbacks suppressed
Oct 12 00:43:27 mashie kernel: EXT4-fs error: 2432 callbacks suppressed
Oct 12 00:43:27 mashie kernel: EXT4-fs: 2432 callbacks suppressed
Oct 12 00:43:32 mashie kernel: EXT4-fs error: 3118 callbacks suppressed
Oct 12 00:43:32 mashie kernel: EXT4-fs: 3118 callbacks suppressed
Oct 12 00:43:37 mashie kernel: EXT4-fs error: 3194 callbacks suppressed
Oct 12 00:43:37 mashie kernel: EXT4-fs: 3195 callbacks suppressed
Oct 12 00:43:42 mashie kernel: EXT4-fs error: 4351 callbacks suppressed
Oct 12 00:43:42 mashie kernel: EXT4-fs: 4351 callbacks suppressed
Oct 12 00:43:47 mashie kernel: EXT4-fs error: 2070 callbacks suppressed
Oct 12 00:43:47 mashie kernel: EXT4-fs: 2069 callbacks suppressed
Oct 12 00:43:52 mashie kernel: EXT4-fs error: 1070 callbacks suppressed
Oct 12 00:43:52 mashie kernel: EXT4-fs: 1070 callbacks suppressed
Oct 12 00:43:57 mashie kernel: EXT4-fs error: 849 callbacks suppressed
Oct 12 00:43:57 mashie kernel: EXT4-fs: 849 callbacks suppressed
Oct 12 00:44:02 mashie kernel: EXT4-fs error: 835 callbacks suppressed
Oct 12 00:44:02 mashie kernel: EXT4-fs: 835 callbacks suppressed
Oct 12 00:44:07 mashie kernel: EXT4-fs error: 702 callbacks suppressed
Oct 12 00:44:07 mashie kernel: EXT4-fs: 702 callbacks suppressed
Oct 12 00:44:12 mashie kernel: EXT4-fs error: 1536 callbacks suppressed
Oct 12 00:44:12 mashie kernel: EXT4-fs: 1537 callbacks suppressed
Oct 12 00:44:17 mashie kernel: EXT4-fs error: 2268 callbacks suppressed
Oct 12 00:44:17 mashie kernel: EXT4-fs: 2267 callbacks suppressed
Oct 12 00:44:22 mashie kernel: EXT4-fs error: 2217 callbacks suppressed
Oct 12 00:44:22 mashie kernel: EXT4-fs: 2218 callbacks suppressed
Oct 12 00:44:27 mashie kernel: EXT4-fs error: 2774 callbacks suppressed
Oct 12 00:44:27 mashie kernel: EXT4-fs: 2774 callbacks suppressed
... 24 more distinct messages not shown
== matrix (2 distinct, 3 total) ==
Oct 12 00:34:41 matrix krb5_child[129495]: Client 'admin(a)UMD.EDU' not found in Kerberos database [x2]
Oct 12 00:34:43 matrix sshd[129489]: error: PAM: Authentication failure for admin from 34.156.239.15
== misty.cs.umd.edu (3 distinct, 4 total) ==
Oct 12 00:10:15 misty.cs.umd.edu systemd[1]: New main PID 1961 does not belong to service, and PID file is not owned by root. Refusing. [x2]
Oct 12 00:10:35 misty.cs.umd.edu systemd[1]: Daemon never wrote its PID file. Failing.
Oct 12 00:10:50 misty.cs.umd.edu systemd[1]: pmlogger.service: Supervising process 9763 which is not our child. We'll most likely not notice when it exits.
== munin (2 distinct, 48 total) ==
Oct 12 00:13:26 munin sudo[3618409]: pam_systemd(sudo:session): Failed to stat() runtime directory '/run/user/0': No such file or directory [x24]
Oct 12 00:13:26 munin sudo[3618409]: pam_systemd(sudo:session): Not setting $XDG_RUNTIME_DIR, as the directory is not in order. [x24]
== newhonors2 (1 distinct, 24 total) ==
Oct 12 00:13:03 newhonors2 dhcpcd[3901086]: dhcpcd is not running [x24]
== ntop00 (94 distinct, 94 total) ==
Oct 12 00:05:13 ntop00 sfacctd[1075592]: INFO ( m1/mysql ): *** Purging cache - END (PID: 7306, QN: 5665/5665, ET: 12) ***
Oct 12 00:08:01 ntop00 sfacctd[1075592]: INFO ( p1/print ): *** Purging cache - START (PID: 7307) ***
Oct 12 00:08:01 ntop00 sfacctd[1075592]: INFO ( p1/print ): *** Purging cache - END (PID: 7307, QN: 5760/5760, ET: 0) ***
Oct 12 00:08:01 ntop00 nfacctd[1075699]: INFO ( p1/print ): *** Purging cache - START (PID: 7307) ***
Oct 12 00:08:01 ntop00 nfacctd[1075699]: INFO ( p1/print ): *** Purging cache - END (PID: 7307, QN: 68/68, ET: 0) ***
Oct 12 00:10:01 ntop00 sfacctd[1075592]: INFO ( m1/mysql ): *** Purging cache - START (PID: 7308) ***
Oct 12 00:10:01 ntop00 nfacctd[1075699]: INFO ( m1/mysql ): *** Purging cache - START (PID: 7308) ***
Oct 12 00:10:01 ntop00 nfacctd[1075699]: INFO ( m1/mysql ): *** Purging cache - END (PID: 7308, QN: 69/69, ET: 0) ***
Oct 12 00:10:15 ntop00 sfacctd[1075592]: INFO ( m1/mysql ): *** Purging cache - END (PID: 7308, QN: 5762/5762, ET: 14) ***
Oct 12 00:13:01 ntop00 sfacctd[1075592]: INFO ( p1/print ): *** Purging cache - START (PID: 7309) ***
Oct 12 00:13:01 ntop00 sfacctd[1075592]: INFO ( p1/print ): *** Purging cache - END (PID: 7309, QN: 5309/5309, ET: 0) ***
Oct 12 00:13:01 ntop00 nfacctd[1075699]: INFO ( p1/print ): *** Purging cache - START (PID: 7309) ***
Oct 12 00:13:01 ntop00 nfacctd[1075699]: INFO ( p1/print ): *** Purging cache - END (PID: 7309, QN: 58/58, ET: 0) ***
Oct 12 00:15:01 ntop00 sfacctd[1075592]: INFO ( m1/mysql ): *** Purging cache - START (PID: 7310) ***
Oct 12 00:15:01 ntop00 nfacctd[1075699]: INFO ( m1/mysql ): *** Purging cache - START (PID: 7310) ***
Oct 12 00:15:01 ntop00 nfacctd[1075699]: INFO ( m1/mysql ): *** Purging cache - END (PID: 7310, QN: 59/59, ET: 0) ***
Oct 12 00:15:12 ntop00 sfacctd[1075592]: INFO ( m1/mysql ): *** Purging cache - END (PID: 7310, QN: 5100/5100, ET: 11) ***
Oct 12 00:18:01 ntop00 sfacctd[1075592]: INFO ( p1/print ): *** Purging cache - START (PID: 7311) ***
Oct 12 00:18:01 ntop00 sfacctd[1075592]: INFO ( p1/print ): *** Purging cache - END (PID: 7311, QN: 4984/4984, ET: 0) ***
Oct 12 00:18:01 ntop00 nfacctd[1075699]: INFO ( p1/print ): *** Purging cache - START (PID: 7311) ***
Oct 12 00:18:01 ntop00 nfacctd[1075699]: INFO ( p1/print ): *** Purging cache - END (PID: 7311, QN: 75/75, ET: 0) ***
Oct 12 00:20:01 ntop00 sfacctd[1075592]: INFO ( m1/mysql ): *** Purging cache - START (PID: 7312) ***
Oct 12 00:20:01 ntop00 nfacctd[1075699]: INFO ( m1/mysql ): *** Purging cache - START (PID: 7312) ***
Oct 12 00:20:01 ntop00 nfacctd[1075699]: INFO ( m1/mysql ): *** Purging cache - END (PID: 7312, QN: 72/72, ET: 0) ***
Oct 12 00:20:11 ntop00 sfacctd[1075592]: INFO ( m1/mysql ): *** Purging cache - END (PID: 7312, QN: 4831/4831, ET: 10) ***
Oct 12 00:23:01 ntop00 sfacctd[1075592]: INFO ( p1/print ): *** Purging cache - START (PID: 7313) ***
Oct 12 00:23:01 ntop00 sfacctd[1075592]: INFO ( p1/print ): *** Purging cache - END (PID: 7313, QN: 4779/4779, ET: 0) ***
Oct 12 00:23:01 ntop00 nfacctd[1075699]: INFO ( p1/print ): *** Purging cache - START (PID: 7313) ***
Oct 12 00:23:01 ntop00 nfacctd[1075699]: INFO ( p1/print ): *** Purging cache - END (PID: 7313, QN: 76/76, ET: 0) ***
Oct 12 00:25:01 ntop00 sfacctd[1075592]: INFO ( m1/mysql ): *** Purging cache - START (PID: 7314) ***
... 64 more distinct messages not shown
== openrepo (1 distinct, 1 total) ==
Oct 12 00:38:27 openrepo (nin-node)[1774160]: munin-node.service: Referenced but unset environment variable evaluates to an empty string: DAEMON_ARGS
== outbound00.cs.umd.edu (1 distinct, 6 total) ==
Oct 12 00:09:09 outbound00.cs.umd.edu python3[1777860]: ldapdb [x6]
== outbound01.cs.umd.edu (1 distinct, 6 total) ==
Oct 12 00:13:06 outbound01.cs.umd.edu python3[3258833]: ldapdb [x6]
== strawberry (8 distinct, 39 total) ==
Oct 12 00:07:03 strawberry kernel: I/O error, dev sda, sector 206848 op 0x0:(READ) flags 0x80700 phys_seg 1 prio class 2 [x6]
Oct 12 00:07:03 strawberry kernel: I/O error, dev sda, sector 206848 op 0x0:(READ) flags 0x0 phys_seg 1 prio class 2 [x6]
Oct 12 00:07:03 strawberry kernel: Buffer I/O error on dev sda2, logical block 0, async page read [x6]
Oct 12 00:07:03 strawberry kernel: I/O error, dev sda, sector 2048 op 0x0:(READ) flags 0x80700 phys_seg 1 prio class 2 [x6]
Oct 12 00:07:03 strawberry kernel: I/O error, dev sda, sector 2048 op 0x0:(READ) flags 0x0 phys_seg 1 prio class 2 [x6]
Oct 12 00:07:03 strawberry kernel: Buffer I/O error on dev sda1, logical block 0, async page read [x6]
Oct 12 00:34:42 strawberry smartd[5314]: Device: /dev/sda [SAT], failed to read SMART Attribute Data [x2]
Oct 12 01:04:42 strawberry smartd[5314]: Device: /dev/sda [SAT], not capable of Offline or Self-Testing.
== submit10-cln25 (3 distinct, 4 total) ==
Oct 12 00:10:12 submit10-cln25 systemd: New main PID 4959 does not belong to service, and PID file is not owned by root. Refusing. [x2]
Oct 12 00:10:30 submit10-cln25 systemd: Daemon never wrote its PID file. Failing.
Oct 12 00:10:36 submit10-cln25 systemd: pmlogger.service: Supervising process 11854 which is not our child. We'll most likely not notice when it exits.
== submit26-b9-3 (1 distinct, 5 total) ==
Sep 14 07:49:39 submit26-b9-3 systemd[1]: user(a)1001.service: Main process exited, code=killed, status=9/KILL [x5]
== submit26-b9-f1 (1 distinct, 2 total) ==
Oct 12 00:23:08 submit26-b9-f1 systemd[1]: user(a)1001.service: Main process exited, code=killed, status=9/KILL [x2]
== submit26-b9-f2 (1 distinct, 1 total) ==
Oct 12 00:40:18 submit26-b9-f2 systemd[1]: user(a)1001.service: Main process exited, code=killed, status=9/KILL
== submit26-b9-f3 (1 distinct, 3 total) ==
Oct 12 00:33:06 submit26-b9-f3 systemd[1]: user(a)1001.service: Main process exited, code=killed, status=9/KILL [x3]
== submit26-b9-f4 (1 distinct, 1 total) ==
Oct 12 01:00:58 submit26-b9-f4 systemd[1]: user(a)1001.service: Main process exited, code=killed, status=9/KILL
== submit26-b9-fclone (9 distinct, 11 total) ==
Oct 12 00:22:06 submit26-b9-fclone setroubleshoot[1434187]: SELinux is preventing /usr/bin/python3.9 from create access on the directory /(null). For complete SELinux messages run: sealert -l 9355d9d9-a311-48d2-bd37-6c0f6947dfff [x2]
Oct 12 00:22:06 submit26-b9-fclone setroubleshoot[1434187]: SELinux is preventing /usr/bin/python3.9 from add_name access on the directory /(null). For complete SELinux messages run: sealert -l cc4658d7-9db1-405d-9eee-de0ccee5857f [x2]
Oct 12 00:22:06 submit26-b9-fclone setroubleshoot[1434187]: SELinux is preventing /usr/bin/python3.9 from create access on the file /(null). For complete SELinux messages run: sealert -l 568a2429-0b1b-49df-af41-49b5cd298ae8
Oct 12 00:22:06 submit26-b9-fclone setroubleshoot[1434187]: SELinux is preventing /usr/bin/python3.9 from open access on the file /tmp/libdnf.6ObwQX/repodata/repomd.xml. For complete SELinux messages run: sealert -l 03e2f521-0e7c-481f-8e92-0602c6adeedc
Oct 12 00:22:06 submit26-b9-fclone setroubleshoot[1434187]: SELinux is preventing /usr/bin/python3.9 from setattr access on the file repomd.xml. For complete SELinux messages run: sealert -l 0d6b7b1f-ebe3-4beb-915a-b06b63bf2566
Oct 12 00:22:06 submit26-b9-fclone setroubleshoot[1434187]: SELinux is preventing /usr/bin/python3.9 from read access on the directory libdnf.6ObwQX. For complete SELinux messages run: sealert -l 887adbf9-2bb9-4009-b800-36ddf9ba0db5
Oct 12 00:22:06 submit26-b9-fclone setroubleshoot[1434187]: SELinux is preventing /usr/bin/python3.9 from remove_name access on the directory repomd.xml. For complete SELinux messages run: sealert -l 092e0644-8373-4017-b77f-1afa6c6da4ac
Oct 12 00:22:06 submit26-b9-fclone setroubleshoot[1434187]: SELinux is preventing /usr/bin/python3.9 from unlink access on the file repomd.xml. For complete SELinux messages run: sealert -l ce429a92-56de-4de1-b859-cbfb69ae123c
Oct 12 00:22:06 submit26-b9-fclone setroubleshoot[1434187]: SELinux is preventing /usr/bin/python3.9 from rmdir access on the directory repodata. For complete SELinux messages run: sealert -l 99b886eb-497b-406d-8206-afe76a1086b4
== tma-0 (4 distinct, 5 total) ==
Oct 12 00:10:13 tma-0 systemd[1]: New main PID 29851 does not belong to service, and PID file is not owned by root. Refusing. [x2]
Oct 12 00:10:30 tma-0 systemd[1]: Daemon never wrote its PID file. Failing.
Oct 12 00:10:38 tma-0 systemd[1]: pmlogger.service: Supervising process 4838 which is not our child. We'll most likely not notice when it exits.
Oct 12 00:11:53 tma-0 sshd[5862]: error: PAM: Authentication failure for admin from 154.56.62.34.bc.googleusercontent.com
== uffish.cs.umd.edu (3 distinct, 4 total) ==
Oct 12 00:10:13 uffish.cs.umd.edu systemd[1]: New main PID 4157070 does not belong to service, and PID file is not owned by root. Refusing. [x2]
Oct 12 00:10:33 uffish.cs.umd.edu systemd[1]: Daemon never wrote its PID file. Failing.
Oct 12 00:10:49 uffish.cs.umd.edu systemd[1]: pmlogger.service: Supervising process 4164243 which is not our child. We'll most likely not notice when it exits.
== vacuum.cs.umd.edu (3 distinct, 4 total) ==
Oct 12 00:10:14 vacuum.cs.umd.edu systemd[1]: New main PID 14225 does not belong to service, and PID file is not owned by root. Refusing. [x2]
Oct 12 00:10:33 vacuum.cs.umd.edu systemd[1]: Daemon never wrote its PID file. Failing.
Oct 12 00:10:44 vacuum.cs.umd.edu systemd[1]: pmlogger.service: Supervising process 21369 which is not our child. We'll most likely not notice when it exits.
== whiffle.cs.umd.edu (3 distinct, 4 total) ==
Oct 12 00:10:14 whiffle.cs.umd.edu systemd[1]: New main PID 3617399 does not belong to service, and PID file is not owned by root. Refusing. [x2]
Oct 12 00:10:33 whiffle.cs.umd.edu systemd[1]: Daemon never wrote its PID file. Failing.
Oct 12 00:10:46 whiffle.cs.umd.edu systemd[1]: pmlogger.service: Supervising process 3624552 which is not our child. We'll most likely not notice when it exits.
1
0
Command: /usr/local/sbin/syslog-digest.py
Time : 0.0737s
Status : exited 0
Output :
Syslog digest — 2026-10-12 00:05 EDT
Processed 3,476 lines, filtered 2,854 (82%). 622 unknown (141 distinct) from 24 host(s).
== abuse (1 distinct, 347 total) ==
Oct 11 23:05:25 abuse rsyslogd[1033]: imjournal: open() failed for path: '/var/lib/rsyslog/imjournal.state.tmp': Input/output error [v8.2404.0 try https://www.rsyslog.com/e/2433 ] [x347]
== b0b02.cs.umd.edu (1 distinct, 1 total) ==
Oct 11 23:23:46 b0b02.cs.umd.edu rustdesk[2859401]: cannot open display:
== cmsc436-0101-redis (2 distinct, 2 total) ==
Oct 12 00:00:26 cmsc436-0101-redis krb5_child[304694]: Client 'admin(a)UMD.EDU' not found in Kerberos database
Oct 12 00:00:29 cmsc436-0101-redis sshd-session[304690]: error: PAM: Authentication failure for admin from 34.52.139.129
== idm00 (1 distinct, 1 total) ==
Oct 11 23:54:46 idm00 named[3155984]: client @0x7f45a53a6d28 10.73.240.42#57310: update '73.10.in-addr.arpa/IN' denied
== idmp0 (1 distinct, 1 total) ==
Oct 11 23:39:22 idmp0 named[412677]: client @0x7fb33c02ff38 10.73.240.43#53900: update '73.10.in-addr.arpa/IN' denied
== inbound01.cs.umd.edu (2 distinct, 2 total) ==
Oct 11 23:53:39 inbound01.cs.umd.edu krb5_child[3387602]: Client 'admin(a)UMD.EDU' not found in Kerberos database
Oct 11 23:54:13 inbound01.cs.umd.edu sshd-session[3387705]: error: Protocol major versions differ: 2 vs. 1
== itmon02 (1 distinct, 5 total) ==
Oct 11 23:18:44 itmon02 sshd[805675]: error: beginning MaxStartups throttling [x5]
== matrix (1 distinct, 1 total) ==
Oct 12 00:00:26 matrix (nin-node)[107992]: munin-node.service: Referenced but unset environment variable evaluates to an empty string: DAEMON_ARGS
== munin (2 distinct, 50 total) ==
Oct 11 23:08:43 munin sudo[3596125]: pam_systemd(sudo:session): Failed to stat() runtime directory '/run/user/0': No such file or directory [x25]
Oct 11 23:08:43 munin sudo[3596125]: pam_systemd(sudo:session): Not setting $XDG_RUNTIME_DIR, as the directory is not in order. [x25]
== neo-gizmonic (1 distinct, 1 total) ==
Oct 12 00:00:02 neo-gizmonic (nin-node)[183547]: munin-node.service: Referenced but unset environment variable evaluates to an empty string: DAEMON_ARGS
== neoavion (1 distinct, 1 total) ==
Oct 12 00:00:10 neoavion (nin-node)[981874]: munin-node.service: Referenced but unset environment variable evaluates to an empty string: DAEMON_ARGS
== newhonors.cs.umd.edu (1 distinct, 1 total) ==
Oct 11 23:13:05 newhonors.cs.umd.edu systemd-tmpfiles: [/usr/lib/tmpfiles.d/var.conf:14] Duplicate line for path "/var/log", ignoring.
== newhonors2 (2 distinct, 25 total) ==
Oct 11 23:13:02 newhonors2 dhcpcd[3899055]: dhcpcd is not running [x24]
Oct 12 00:00:16 newhonors2 (nin-node)[3900557]: munin-node.service: Referenced but unset environment variable evaluates to an empty string: DAEMON_ARGS
== ntop00 (98 distinct, 98 total) ==
Oct 11 23:05:01 ntop00 nfacctd[1075699]: INFO ( m1/mysql ): *** Purging cache - START (PID: 7282) ***
Oct 11 23:05:01 ntop00 nfacctd[1075699]: INFO ( m1/mysql ): *** Purging cache - END (PID: 7282, QN: 78/78, ET: 0) ***
Oct 11 23:05:21 ntop00 sfacctd[1075592]: INFO ( m1/mysql ): *** Purging cache - END (PID: 7282, QN: 9855/9855, ET: 20) ***
Oct 11 23:08:01 ntop00 sfacctd[1075592]: INFO ( p1/print ): *** Purging cache - START (PID: 7283) ***
Oct 11 23:08:01 ntop00 sfacctd[1075592]: INFO ( p1/print ): *** Purging cache - END (PID: 7283, QN: 9117/9117, ET: 0) ***
Oct 11 23:08:01 ntop00 nfacctd[1075699]: INFO ( p1/print ): *** Purging cache - START (PID: 7283) ***
Oct 11 23:08:01 ntop00 nfacctd[1075699]: INFO ( p1/print ): *** Purging cache - END (PID: 7283, QN: 74/74, ET: 0) ***
Oct 11 23:10:01 ntop00 sfacctd[1075592]: INFO ( m1/mysql ): *** Purging cache - START (PID: 7284) ***
Oct 11 23:10:01 ntop00 nfacctd[1075699]: INFO ( m1/mysql ): *** Purging cache - START (PID: 7284) ***
Oct 11 23:10:01 ntop00 nfacctd[1075699]: INFO ( m1/mysql ): *** Purging cache - END (PID: 7284, QN: 72/72, ET: 0) ***
Oct 11 23:10:19 ntop00 sfacctd[1075592]: INFO ( m1/mysql ): *** Purging cache - END (PID: 7284, QN: 8843/8843, ET: 18) ***
Oct 11 23:13:01 ntop00 sfacctd[1075592]: INFO ( p1/print ): *** Purging cache - START (PID: 7285) ***
Oct 11 23:13:01 ntop00 sfacctd[1075592]: INFO ( p1/print ): *** Purging cache - END (PID: 7285, QN: 7972/7972, ET: 0) ***
Oct 11 23:13:01 ntop00 nfacctd[1075699]: INFO ( p1/print ): *** Purging cache - START (PID: 7285) ***
Oct 11 23:13:01 ntop00 nfacctd[1075699]: INFO ( p1/print ): *** Purging cache - END (PID: 7285, QN: 78/78, ET: 0) ***
Oct 11 23:15:01 ntop00 sfacctd[1075592]: INFO ( m1/mysql ): *** Purging cache - START (PID: 7286) ***
Oct 11 23:15:01 ntop00 nfacctd[1075699]: INFO ( m1/mysql ): *** Purging cache - START (PID: 7286) ***
Oct 11 23:15:01 ntop00 nfacctd[1075699]: INFO ( m1/mysql ): *** Purging cache - END (PID: 7286, QN: 77/77, ET: 0) ***
Oct 11 23:15:22 ntop00 sfacctd[1075592]: INFO ( m1/mysql ): *** Purging cache - END (PID: 7286, QN: 10353/10353, ET: 21) ***
Oct 11 23:18:01 ntop00 sfacctd[1075592]: INFO ( p1/print ): *** Purging cache - START (PID: 7287) ***
Oct 11 23:18:01 ntop00 sfacctd[1075592]: INFO ( p1/print ): *** Purging cache - END (PID: 7287, QN: 16235/16235, ET: 0) ***
Oct 11 23:18:01 ntop00 nfacctd[1075699]: INFO ( p1/print ): *** Purging cache - START (PID: 7287) ***
Oct 11 23:18:01 ntop00 nfacctd[1075699]: INFO ( p1/print ): *** Purging cache - END (PID: 7287, QN: 89/89, ET: 0) ***
Oct 11 23:20:01 ntop00 sfacctd[1075592]: INFO ( m1/mysql ): *** Purging cache - START (PID: 7288) ***
Oct 11 23:20:01 ntop00 nfacctd[1075699]: INFO ( m1/mysql ): *** Purging cache - START (PID: 7288) ***
Oct 11 23:20:01 ntop00 nfacctd[1075699]: INFO ( m1/mysql ): *** Purging cache - END (PID: 7288, QN: 103/103, ET: 0) ***
Oct 11 23:20:35 ntop00 sfacctd[1075592]: INFO ( m1/mysql ): *** Purging cache - END (PID: 7288, QN: 15752/15752, ET: 34) ***
Oct 11 23:23:01 ntop00 sfacctd[1075592]: INFO ( p1/print ): *** Purging cache - START (PID: 7289) ***
Oct 11 23:23:01 ntop00 sfacctd[1075592]: INFO ( p1/print ): *** Purging cache - END (PID: 7289, QN: 9309/9309, ET: 0) ***
Oct 11 23:23:01 ntop00 nfacctd[1075699]: INFO ( p1/print ): *** Purging cache - START (PID: 7289) ***
... 68 more distinct messages not shown
== outbound00.cs.umd.edu (2 distinct, 7 total) ==
Oct 11 23:09:09 outbound00.cs.umd.edu python3[1763913]: ldapdb [x6]
Oct 11 23:47:38 outbound00.cs.umd.edu krb5_child[1772483]: Preauthentication failed
== outbound01.cs.umd.edu (1 distinct, 6 total) ==
Oct 11 23:13:06 outbound01.cs.umd.edu python3[3244135]: ldapdb [x6]
== quiss (7 distinct, 10 total) ==
Oct 11 23:08:37 quiss gnome-software[191719]: failed to commit changes to dconf: GDBus.Error:org.gtk.GDBus.UnmappedGError.Quark._g_2dfile_2derror_2dquark.Code2: Failed to create file “/adminhomes/josephao/.config/dconf/user.WDISW3”: Permission denied
Oct 11 23:08:40 quiss gnome-software[191719]: failed to get featured apps: no apps to show
Oct 11 23:08:40 quiss gnome-software[191719]: Only 0 apps for curated list, hiding
Oct 11 23:08:40 quiss gnome-software[191719]: Only 0 apps for recent list, hiding
Oct 11 23:08:43 quiss packagekitd[1852185]: Failed to get cache filename for gnome-control-center-filesystem [x2]
Oct 11 23:08:43 quiss packagekitd[1852185]: Failed to get cache filename for perl [x2]
Oct 11 23:08:43 quiss packagekitd[1852185]: Failed to get cache filename for kernel [x2]
== strawberry (7 distinct, 38 total) ==
Oct 11 23:07:03 strawberry kernel: I/O error, dev sda, sector 206848 op 0x0:(READ) flags 0x80700 phys_seg 1 prio class 2 [x6]
Oct 11 23:07:03 strawberry kernel: I/O error, dev sda, sector 206848 op 0x0:(READ) flags 0x0 phys_seg 1 prio class 2 [x6]
Oct 11 23:07:03 strawberry kernel: Buffer I/O error on dev sda2, logical block 0, async page read [x6]
Oct 11 23:07:03 strawberry kernel: I/O error, dev sda, sector 2048 op 0x0:(READ) flags 0x80700 phys_seg 1 prio class 2 [x6]
Oct 11 23:07:03 strawberry kernel: I/O error, dev sda, sector 2048 op 0x0:(READ) flags 0x0 phys_seg 1 prio class 2 [x6]
Oct 11 23:07:03 strawberry kernel: Buffer I/O error on dev sda1, logical block 0, async page read [x6]
Oct 11 23:34:42 strawberry smartd[5314]: Device: /dev/sda [SAT], failed to read SMART Attribute Data [x2]
== submit26-b9-3 (3 distinct, 7 total) ==
Sep 14 06:50:05 submit26-b9-3 systemd[1]: user(a)1001.service: Main process exited, code=killed, status=9/KILL [x5]
Sep 14 06:53:24 submit26-b9-3 systemd-coredump[3090917]: Process 3090914 (secret02) of user 1001 dumped core.#012#012Stack trace of thread 3090914:#012#0 0x00007f8f6e88d02c __pthread_kill_implementation (libc.so.6 + 0x8d02c)#012#1 0x00007f8f6e83fb86 raise (libc.so.6 + 0x3fb86)#012#2 0x00007f8f6e829873 abort (libc.so.6 + 0x29873)#012#3 0x00007f8f6e82a1b2 __libc_message.cold (libc.so.6 + 0x2a1b2)#012#4 0x00007f8f6e91d19b __fortify_fail (libc.so.6 + 0x11d19b)#012#5 0x00007f8f6e91e416 __stack_chk_fail (libc.so.6 + 0x11e416)#012#6 0x0000000000401261 main (secret02 + 0x1261)#012ELF object binary architecture: AMD x86-64
Sep 14 07:15:08 submit26-b9-3 systemd-coredump[3096578]: Process 3096575 (secret02) of user 1001 dumped core.#012#012Stack trace of thread 3096575:#012#0 0x00007ff1fe48d02c __pthread_kill_implementation (libc.so.6 + 0x8d02c)#012#1 0x00007ff1fe43fb86 raise (libc.so.6 + 0x3fb86)#012#2 0x00007ff1fe429873 abort (libc.so.6 + 0x29873)#012#3 0x00007ff1fe42a1b2 __libc_message.cold (libc.so.6 + 0x2a1b2)#012#4 0x00007ff1fe51d19b __fortify_fail (libc.so.6 + 0x11d19b)#012#5 0x00007ff1fe51e416 __stack_chk_fail (libc.so.6 + 0x11e416)#012#6 0x0000000000401261 main (secret02 + 0x1261)#012ELF object binary architecture: AMD x86-64
== submit26-b9-f1 (1 distinct, 4 total) ==
Oct 11 23:08:11 submit26-b9-f1 systemd[1]: user(a)1001.service: Main process exited, code=killed, status=9/KILL [x4]
== submit26-b9-f2 (1 distinct, 3 total) ==
Oct 11 23:08:08 submit26-b9-f2 systemd[1]: user(a)1001.service: Main process exited, code=killed, status=9/KILL [x3]
== submit26-b9-f3 (1 distinct, 5 total) ==
Oct 11 23:08:12 submit26-b9-f3 systemd[1]: user(a)1001.service: Main process exited, code=killed, status=9/KILL [x5]
== submit26-b9-f4 (2 distinct, 5 total) ==
Oct 11 23:18:10 submit26-b9-f4 systemd[1]: user(a)1001.service: Main process exited, code=killed, status=9/KILL [x4]
Oct 11 23:18:13 submit26-b9-f4 systemd-coredump[873326]: Process 873323 (secret01) of user 1001 dumped core.#012#012Stack trace of thread 873323:#012#0 0x00007f01b1eadb28 __strcpy_sse2_unaligned (libc.so.6 + 0xadb28)#012#1 0x0000000000401249 init_document (secret01 + 0x1249)#012#2 0x00000000004011d3 main (secret01 + 0x11d3)#012#3 0x00007f01b1e2a610 __libc_start_call_main (libc.so.6 + 0x2a610)#012#4 0x00007f01b1e2a6c0 __libc_start_main@@GLIBC_2.34 (libc.so.6 + 0x2a6c0)#012#5 0x00000000004010a5 _start (secret01 + 0x10a5)#012ELF object binary architecture: AMD x86-64
== wraith (1 distinct, 1 total) ==
Oct 12 00:00:11 wraith (nin-node)[403431]: munin-node.service: Referenced but unset environment variable evaluates to an empty string: DAEMON_ARGS
1
0
Command: /usr/local/sbin/syslog-digest.py
Time : 0.0759s
Status : exited 0
Output :
Syslog digest — 2026-10-11 23:05 EDT
Processed 3,457 lines, filtered 2,856 (82%). 601 unknown (156 distinct) from 21 host(s).
== abuse (1 distinct, 346 total) ==
Oct 11 22:05:25 abuse rsyslogd[1033]: imjournal: open() failed for path: '/var/lib/rsyslog/imjournal.state.tmp': Input/output error [v8.2404.0 try https://www.rsyslog.com/e/2433 ] [x346]
== b0b02.cs.umd.edu (1 distinct, 1 total) ==
Oct 11 22:23:42 b0b02.cs.umd.edu rustdesk[2844241]: cannot open display:
== cheezit.cs.umd.edu (1 distinct, 5 total) ==
Oct 11 22:13:47 cheezit.cs.umd.edu sshd-session[1786381]: pam_access(sshd:auth): access denied for user `ekmolloy' from `173.66.237.173' [x5]
== idm00 (1 distinct, 1 total) ==
Oct 11 22:54:46 idm00 named[3155984]: client @0x7f45a53ab308 10.73.240.42#50082: update '73.10.in-addr.arpa/IN' denied
== idmp0 (1 distinct, 1 total) ==
Oct 11 22:39:22 idmp0 named[412677]: client @0x7fb30c898f98 10.73.240.43#50777: update '73.10.in-addr.arpa/IN' denied
== itmon02 (1 distinct, 3 total) ==
Oct 11 22:22:57 itmon02 sshd[805675]: error: beginning MaxStartups throttling [x3]
== krispykreme.cs.umd.edu (1 distinct, 1 total) ==
Oct 11 22:14:09 krispykreme.cs.umd.edu sshd-session[628639]: pam_access(sshd:auth): access denied for user `ekmolloy' from `173.66.237.173'
== munin (2 distinct, 6 total) ==
Oct 11 22:22:58 munin sudo[3578851]: pam_systemd(sudo:session): Failed to stat() runtime directory '/run/user/0': No such file or directory [x3]
Oct 11 22:22:58 munin sudo[3578851]: pam_systemd(sudo:session): Not setting $XDG_RUNTIME_DIR, as the directory is not in order. [x3]
== newhonors2 (1 distinct, 24 total) ==
Oct 11 22:13:03 newhonors2 dhcpcd[3897216]: dhcpcd is not running [x24]
== ntop00 (96 distinct, 96 total) ==
Oct 11 22:05:01 ntop00 nfacctd[1075699]: INFO ( m1/mysql ): *** Purging cache - START (PID: 7258) ***
Oct 11 22:05:01 ntop00 nfacctd[1075699]: INFO ( m1/mysql ): *** Purging cache - END (PID: 7258, QN: 74/74, ET: 0) ***
Oct 11 22:05:19 ntop00 sfacctd[1075592]: INFO ( m1/mysql ): *** Purging cache - END (PID: 7258, QN: 8072/8072, ET: 18) ***
Oct 11 22:08:01 ntop00 sfacctd[1075592]: INFO ( p1/print ): *** Purging cache - START (PID: 7259) ***
Oct 11 22:08:01 ntop00 sfacctd[1075592]: INFO ( p1/print ): *** Purging cache - END (PID: 7259, QN: 7941/7941, ET: 0) ***
Oct 11 22:08:01 ntop00 nfacctd[1075699]: INFO ( p1/print ): *** Purging cache - START (PID: 7259) ***
Oct 11 22:08:01 ntop00 nfacctd[1075699]: INFO ( p1/print ): *** Purging cache - END (PID: 7259, QN: 93/93, ET: 0) ***
Oct 11 22:10:01 ntop00 sfacctd[1075592]: INFO ( m1/mysql ): *** Purging cache - START (PID: 7260) ***
Oct 11 22:10:01 ntop00 nfacctd[1075699]: INFO ( m1/mysql ): *** Purging cache - START (PID: 7260) ***
Oct 11 22:10:01 ntop00 nfacctd[1075699]: INFO ( m1/mysql ): *** Purging cache - END (PID: 7260, QN: 89/89, ET: 0) ***
Oct 11 22:10:18 ntop00 sfacctd[1075592]: INFO ( m1/mysql ): *** Purging cache - END (PID: 7260, QN: 7773/7773, ET: 17) ***
Oct 11 22:13:01 ntop00 sfacctd[1075592]: INFO ( p1/print ): *** Purging cache - START (PID: 7261) ***
Oct 11 22:13:01 ntop00 sfacctd[1075592]: INFO ( p1/print ): *** Purging cache - END (PID: 7261, QN: 7762/7762, ET: 0) ***
Oct 11 22:13:01 ntop00 nfacctd[1075699]: INFO ( p1/print ): *** Purging cache - START (PID: 7261) ***
Oct 11 22:13:01 ntop00 nfacctd[1075699]: INFO ( p1/print ): *** Purging cache - END (PID: 7261, QN: 60/60, ET: 0) ***
Oct 11 22:15:01 ntop00 sfacctd[1075592]: INFO ( m1/mysql ): *** Purging cache - START (PID: 7262) ***
Oct 11 22:15:01 ntop00 nfacctd[1075699]: INFO ( m1/mysql ): *** Purging cache - START (PID: 7262) ***
Oct 11 22:15:01 ntop00 nfacctd[1075699]: INFO ( m1/mysql ): *** Purging cache - END (PID: 7262, QN: 65/65, ET: 0) ***
Oct 11 22:15:19 ntop00 sfacctd[1075592]: INFO ( m1/mysql ): *** Purging cache - END (PID: 7262, QN: 7873/7873, ET: 18) ***
Oct 11 22:18:01 ntop00 sfacctd[1075592]: INFO ( p1/print ): *** Purging cache - START (PID: 7263) ***
Oct 11 22:18:01 ntop00 sfacctd[1075592]: INFO ( p1/print ): *** Purging cache - END (PID: 7263, QN: 7782/7782, ET: 0) ***
Oct 11 22:18:01 ntop00 nfacctd[1075699]: INFO ( p1/print ): *** Purging cache - START (PID: 7263) ***
Oct 11 22:18:01 ntop00 nfacctd[1075699]: INFO ( p1/print ): *** Purging cache - END (PID: 7263, QN: 89/89, ET: 0) ***
Oct 11 22:20:01 ntop00 sfacctd[1075592]: INFO ( m1/mysql ): *** Purging cache - START (PID: 7264) ***
Oct 11 22:20:01 ntop00 nfacctd[1075699]: INFO ( m1/mysql ): *** Purging cache - START (PID: 7264) ***
Oct 11 22:20:01 ntop00 nfacctd[1075699]: INFO ( m1/mysql ): *** Purging cache - END (PID: 7264, QN: 89/89, ET: 0) ***
Oct 11 22:20:18 ntop00 sfacctd[1075592]: INFO ( m1/mysql ): *** Purging cache - END (PID: 7264, QN: 7815/7815, ET: 17) ***
Oct 11 22:23:01 ntop00 sfacctd[1075592]: INFO ( p1/print ): *** Purging cache - START (PID: 7265) ***
Oct 11 22:23:01 ntop00 sfacctd[1075592]: INFO ( p1/print ): *** Purging cache - END (PID: 7265, QN: 7895/7895, ET: 0) ***
Oct 11 22:23:01 ntop00 nfacctd[1075699]: INFO ( p1/print ): *** Purging cache - START (PID: 7265) ***
... 66 more distinct messages not shown
== outbound00.cs.umd.edu (1 distinct, 6 total) ==
Oct 11 22:09:09 outbound00.cs.umd.edu python3[1750045]: ldapdb [x6]
== outbound01.cs.umd.edu (3 distinct, 8 total) ==
Oct 11 22:10:17 outbound01.cs.umd.edu krb5_child[3229504]: Client 'admin(a)UMD.EDU' not found in Kerberos database
Oct 11 22:12:41 outbound01.cs.umd.edu sshd-session[3230027]: error: Protocol major versions differ: 2 vs. 1
Oct 11 22:13:06 outbound01.cs.umd.edu python3[3230291]: ldapdb [x6]
== quiss (7 distinct, 10 total) ==
Oct 11 22:08:37 quiss gnome-software[191719]: failed to commit changes to dconf: GDBus.Error:org.gtk.GDBus.UnmappedGError.Quark._g_2dfile_2derror_2dquark.Code2: Failed to create file “/adminhomes/josephao/.config/dconf/user.2B1TW3”: Permission denied
Oct 11 22:08:40 quiss gnome-software[191719]: failed to get featured apps: no apps to show
Oct 11 22:08:40 quiss gnome-software[191719]: Only 0 apps for curated list, hiding
Oct 11 22:08:40 quiss gnome-software[191719]: Only 0 apps for recent list, hiding
Oct 11 22:08:43 quiss packagekitd[1768290]: Failed to get cache filename for gnome-control-center-filesystem [x2]
Oct 11 22:08:43 quiss packagekitd[1768290]: Failed to get cache filename for perl [x2]
Oct 11 22:08:43 quiss packagekitd[1768290]: Failed to get cache filename for kernel [x2]
== strawberry (7 distinct, 38 total) ==
Oct 11 22:07:03 strawberry kernel: I/O error, dev sda, sector 206848 op 0x0:(READ) flags 0x80700 phys_seg 1 prio class 2 [x6]
Oct 11 22:07:03 strawberry kernel: I/O error, dev sda, sector 206848 op 0x0:(READ) flags 0x0 phys_seg 1 prio class 2 [x6]
Oct 11 22:07:03 strawberry kernel: Buffer I/O error on dev sda2, logical block 0, async page read [x6]
Oct 11 22:07:03 strawberry kernel: I/O error, dev sda, sector 2048 op 0x0:(READ) flags 0x80700 phys_seg 1 prio class 2 [x6]
Oct 11 22:07:03 strawberry kernel: I/O error, dev sda, sector 2048 op 0x0:(READ) flags 0x0 phys_seg 1 prio class 2 [x6]
Oct 11 22:07:03 strawberry kernel: Buffer I/O error on dev sda1, logical block 0, async page read [x6]
Oct 11 22:34:42 strawberry smartd[5314]: Device: /dev/sda [SAT], failed to read SMART Attribute Data [x2]
== submit26-b9-3 (2 distinct, 12 total) ==
Sep 14 05:46:41 submit26-b9-3 systemd[1]: user(a)1001.service: Main process exited, code=killed, status=9/KILL [x11]
Sep 14 06:33:26 submit26-b9-3 systemd-coredump[3086768]: Process 3086765 (secret01) of user 1001 dumped core.#012#012Stack trace of thread 3086765:#012#0 0x00007f8745b665ab __strcpy_avx2_rtm (libc.so.6 + 0x1665ab)#012#1 0x0000000000401249 init_document (secret01 + 0x1249)#012#2 0x00000000004011d3 main (secret01 + 0x11d3)#012#3 0x00007f8745a2a610 __libc_start_call_main (libc.so.6 + 0x2a610)#012#4 0x00007f8745a2a6c0 __libc_start_main@@GLIBC_2.34 (libc.so.6 + 0x2a6c0)#012#5 0x00000000004010a5 _start (secret01 + 0x10a5)#012ELF object binary architecture: AMD x86-64
== submit26-b9-f1 (10 distinct, 12 total) ==
Oct 11 22:15:27 submit26-b9-f1 systemd[1]: user(a)1001.service: Main process exited, code=killed, status=9/KILL [x3]
Oct 11 22:26:04 submit26-b9-f1 setroubleshoot[2408573]: SELinux is preventing /usr/bin/python3.9 from create access on the directory /(null). For complete SELinux messages run: sealert -l 3ef7d677-731f-46bf-9c34-c2c55fea665c
Oct 11 22:26:04 submit26-b9-f1 setroubleshoot[2408573]: SELinux is preventing /usr/bin/python3.9 from add_name access on the directory /(null). For complete SELinux messages run: sealert -l aa60e26f-72e1-45f1-bc12-aa8b3b669e36
Oct 11 22:26:04 submit26-b9-f1 setroubleshoot[2408573]: SELinux is preventing /usr/bin/python3.9 from create access on the file /(null). For complete SELinux messages run: sealert -l d088fb43-23ee-4ae8-ae6a-5d1c041ee2d6
Oct 11 22:26:04 submit26-b9-f1 setroubleshoot[2408573]: SELinux is preventing /usr/bin/python3.9 from open access on the file /tmp/libdnf.dc9zNm/repodata/repomd.xml. For complete SELinux messages run: sealert -l 3b0d8c9a-6637-4d6e-a864-f1dd7c00377d
Oct 11 22:26:04 submit26-b9-f1 setroubleshoot[2408573]: SELinux is preventing /usr/bin/python3.9 from setattr access on the file repomd.xml. For complete SELinux messages run: sealert -l 0fd3339f-3ef2-45f3-9e58-65a58b42f3ee
Oct 11 22:26:04 submit26-b9-f1 setroubleshoot[2408573]: SELinux is preventing /usr/bin/python3.9 from read access on the directory libdnf.dc9zNm. For complete SELinux messages run: sealert -l 0d661d88-dc9e-469d-986b-52e29b353aa8
Oct 11 22:26:04 submit26-b9-f1 setroubleshoot[2408573]: SELinux is preventing /usr/bin/python3.9 from remove_name access on the directory repomd.xml. For complete SELinux messages run: sealert -l 405a8556-cf9f-4ef4-8525-0dca18d4259d
Oct 11 22:26:04 submit26-b9-f1 setroubleshoot[2408573]: SELinux is preventing /usr/bin/python3.9 from unlink access on the file repomd.xml. For complete SELinux messages run: sealert -l 3c38e23e-3631-4cb5-81c7-992675c836d9
Oct 11 22:26:04 submit26-b9-f1 setroubleshoot[2408573]: SELinux is preventing /usr/bin/python3.9 from rmdir access on the directory repodata. For complete SELinux messages run: sealert -l a070e9b5-2867-47d6-b2e3-3b7d99725848
== submit26-b9-f2 (11 distinct, 14 total) ==
Oct 11 22:06:57 submit26-b9-f2 setroubleshoot[1498845]: SELinux is preventing /usr/bin/python3.9 from create access on the directory /(null). For complete SELinux messages run: sealert -l 0659d546-3107-4f75-b00f-008c85f41dc6
Oct 11 22:06:57 submit26-b9-f2 setroubleshoot[1498845]: SELinux is preventing /usr/bin/python3.9 from add_name access on the directory /(null). For complete SELinux messages run: sealert -l 156d9270-3466-4356-b86f-1a128825961a
Oct 11 22:06:57 submit26-b9-f2 setroubleshoot[1498845]: SELinux is preventing /usr/bin/python3.9 from create access on the file /(null). For complete SELinux messages run: sealert -l c8a40bf5-2fc4-46b3-b813-8592b3523339
Oct 11 22:06:57 submit26-b9-f2 setroubleshoot[1498845]: SELinux is preventing /usr/bin/python3.9 from open access on the file /tmp/libdnf.FfqicW/repodata/repomd.xml. For complete SELinux messages run: sealert -l 7f4c3a8e-0f99-47c4-9baf-e1336fe24876
Oct 11 22:06:57 submit26-b9-f2 setroubleshoot[1498845]: SELinux is preventing /usr/bin/python3.9 from setattr access on the file repomd.xml. For complete SELinux messages run: sealert -l 988123da-b724-4e6a-900c-33a2723fdaf1
Oct 11 22:06:57 submit26-b9-f2 setroubleshoot[1498845]: SELinux is preventing /usr/bin/python3.9 from read access on the directory libdnf.FfqicW. For complete SELinux messages run: sealert -l ca585e2b-d50f-4264-8127-6b3fa04070c8
Oct 11 22:06:57 submit26-b9-f2 setroubleshoot[1498845]: SELinux is preventing /usr/bin/python3.9 from remove_name access on the directory repomd.xml. For complete SELinux messages run: sealert -l 3a749560-1cec-40ca-a4dc-596841be3885
Oct 11 22:06:57 submit26-b9-f2 setroubleshoot[1498845]: SELinux is preventing /usr/bin/python3.9 from unlink access on the file repomd.xml. For complete SELinux messages run: sealert -l 0aa52f08-94f8-474e-96d8-e818846941af
Oct 11 22:06:57 submit26-b9-f2 setroubleshoot[1498845]: SELinux is preventing /usr/bin/python3.9 from rmdir access on the directory repodata. For complete SELinux messages run: sealert -l de019dc4-408f-439c-902a-676d18dfe8e7
Oct 11 22:08:09 submit26-b9-f2 systemd[1]: user(a)1001.service: Main process exited, code=killed, status=9/KILL [x4]
Oct 11 22:55:53 submit26-b9-f2 systemd-coredump[1501577]: Process 1501574 (secret02) of user 1001 dumped core.#012#012Stack trace of thread 1501574:#012#0 0x00007fb5cb48d02c __pthread_kill_implementation (libc.so.6 + 0x8d02c)#012#1 0x00007fb5cb43fb86 raise (libc.so.6 + 0x3fb86)#012#2 0x00007fb5cb429873 abort (libc.so.6 + 0x29873)#012#3 0x00007fb5cb42a1b2 __libc_message.cold (libc.so.6 + 0x2a1b2)#012#4 0x00007fb5cb51d19b __fortify_fail (libc.so.6 + 0x11d19b)#012#5 0x00007fb5cb51e416 __stack_chk_fail (libc.so.6 + 0x11e416)#012#6 0x0000000000401261 main (secret02 + 0x1261)#012ELF object binary architecture: AMD x86-64
== submit26-b9-f3 (2 distinct, 8 total) ==
Oct 11 22:07:08 submit26-b9-f3 systemd[1]: user(a)1001.service: Main process exited, code=killed, status=9/KILL [x7]
Oct 11 22:35:29 submit26-b9-f3 systemd-coredump[2925530]: Process 2925527 (secret01) of user 1001 dumped core.#012#012Stack trace of thread 2925527:#012#0 0x00007ff2c87665ab __strcpy_avx2_rtm (libc.so.6 + 0x1665ab)#012#1 0x0000000000401249 init_document (secret01 + 0x1249)#012#2 0x00000000004011d3 main (secret01 + 0x11d3)#012#3 0x00007ff2c862a610 __libc_start_call_main (libc.so.6 + 0x2a610)#012#4 0x00007ff2c862a6c0 __libc_start_main@@GLIBC_2.34 (libc.so.6 + 0x2a6c0)#012#5 0x00000000004010a5 _start (secret01 + 0x10a5)#012ELF object binary architecture: AMD x86-64
== submit26-b9-f4 (1 distinct, 3 total) ==
Oct 11 22:39:09 submit26-b9-f4 systemd[1]: user(a)1001.service: Main process exited, code=killed, status=9/KILL [x3]
== teaching-awards (2 distinct, 2 total) ==
Oct 11 22:21:30 teaching-awards krb5_child[396157]: Client 'admin(a)UMD.EDU' not found in Kerberos database
Oct 11 22:31:42 teaching-awards sshd-session[396739]: error: Protocol major versions differ: 2 vs. 1
== vacuum.cs.umd.edu (4 distinct, 4 total) ==
Oct 11 22:11:59 vacuum.cs.umd.edu abrt-hook-ccpp[16153]: Process 11711 (driver) of user 33 killed by SIGSEGV - dumping core
Oct 11 22:11:59 vacuum.cs.umd.edu abrt-server[16155]: Package 'amanda-backup_server' isn't signed with proper key
Oct 11 22:11:59 vacuum.cs.umd.edu abrt-server[16155]: 'post-create' on '/var/spool/abrt/ccpp-2026-10-11-22:11:59-11711' exited with 1
Oct 11 22:11:59 vacuum.cs.umd.edu abrt-server[16155]: Deleting problem directory '/var/spool/abrt/ccpp-2026-10-11-22:11:59-11711'
1
0
Command: /usr/local/sbin/syslog-digest.py
Time : 0.0723s
Status : exited 0
Output :
Syslog digest — 2026-10-11 22:05 EDT
Processed 3,335 lines, filtered 2,760 (82%). 575 unknown (140 distinct) from 16 host(s).
== abuse (1 distinct, 346 total) ==
Oct 11 21:05:25 abuse rsyslogd[1033]: imjournal: open() failed for path: '/var/lib/rsyslog/imjournal.state.tmp': Input/output error [v8.2404.0 try https://www.rsyslog.com/e/2433 ] [x346]
== b0b02.cs.umd.edu (1 distinct, 1 total) ==
Oct 11 21:23:38 b0b02.cs.umd.edu rustdesk[2829154]: cannot open display:
== idm00 (1 distinct, 1 total) ==
Oct 11 21:54:46 idm00 named[3155984]: client @0x7f45a5393df8 10.73.240.42#53154: update '73.10.in-addr.arpa/IN' denied
== idmp0 (1 distinct, 1 total) ==
Oct 11 21:39:22 idmp0 named[412677]: client @0x7fb348027d38 10.73.240.43#59115: update '73.10.in-addr.arpa/IN' denied
== itmon02 (1 distinct, 4 total) ==
Oct 11 21:33:03 itmon02 sshd[805675]: error: beginning MaxStartups throttling [x4]
== munin (2 distinct, 6 total) ==
Oct 11 21:33:16 munin sudo[3561676]: pam_systemd(sudo:session): Failed to stat() runtime directory '/run/user/0': No such file or directory [x3]
Oct 11 21:33:16 munin sudo[3561676]: pam_systemd(sudo:session): Not setting $XDG_RUNTIME_DIR, as the directory is not in order. [x3]
== newhonors2 (1 distinct, 24 total) ==
Oct 11 21:13:03 newhonors2 dhcpcd[3895275]: dhcpcd is not running [x24]
== ntop00 (94 distinct, 94 total) ==
Oct 11 21:05:14 ntop00 sfacctd[1075592]: INFO ( m1/mysql ): *** Purging cache - END (PID: 7234, QN: 5960/5960, ET: 13) ***
Oct 11 21:08:01 ntop00 sfacctd[1075592]: INFO ( p1/print ): *** Purging cache - START (PID: 7235) ***
Oct 11 21:08:01 ntop00 sfacctd[1075592]: INFO ( p1/print ): *** Purging cache - END (PID: 7235, QN: 6319/6319, ET: 0) ***
Oct 11 21:08:01 ntop00 nfacctd[1075699]: INFO ( p1/print ): *** Purging cache - START (PID: 7235) ***
Oct 11 21:08:01 ntop00 nfacctd[1075699]: INFO ( p1/print ): *** Purging cache - END (PID: 7235, QN: 62/62, ET: 0) ***
Oct 11 21:10:01 ntop00 sfacctd[1075592]: INFO ( m1/mysql ): *** Purging cache - START (PID: 7236) ***
Oct 11 21:10:01 ntop00 nfacctd[1075699]: INFO ( m1/mysql ): *** Purging cache - START (PID: 7236) ***
Oct 11 21:10:01 ntop00 nfacctd[1075699]: INFO ( m1/mysql ): *** Purging cache - END (PID: 7236, QN: 69/69, ET: 0) ***
Oct 11 21:10:14 ntop00 sfacctd[1075592]: INFO ( m1/mysql ): *** Purging cache - END (PID: 7236, QN: 6235/6235, ET: 13) ***
Oct 11 21:13:01 ntop00 sfacctd[1075592]: INFO ( p1/print ): *** Purging cache - START (PID: 7237) ***
Oct 11 21:13:01 ntop00 sfacctd[1075592]: INFO ( p1/print ): *** Purging cache - END (PID: 7237, QN: 6117/6117, ET: 0) ***
Oct 11 21:13:01 ntop00 nfacctd[1075699]: INFO ( p1/print ): *** Purging cache - START (PID: 7237) ***
Oct 11 21:13:01 ntop00 nfacctd[1075699]: INFO ( p1/print ): *** Purging cache - END (PID: 7237, QN: 89/89, ET: 0) ***
Oct 11 21:15:01 ntop00 sfacctd[1075592]: INFO ( m1/mysql ): *** Purging cache - START (PID: 7238) ***
Oct 11 21:15:01 ntop00 nfacctd[1075699]: INFO ( m1/mysql ): *** Purging cache - START (PID: 7238) ***
Oct 11 21:15:01 ntop00 nfacctd[1075699]: INFO ( m1/mysql ): *** Purging cache - END (PID: 7238, QN: 85/85, ET: 0) ***
Oct 11 21:15:15 ntop00 sfacctd[1075592]: INFO ( m1/mysql ): *** Purging cache - END (PID: 7238, QN: 6248/6248, ET: 14) ***
Oct 11 21:18:01 ntop00 sfacctd[1075592]: INFO ( p1/print ): *** Purging cache - START (PID: 7239) ***
Oct 11 21:18:01 ntop00 sfacctd[1075592]: INFO ( p1/print ): *** Purging cache - END (PID: 7239, QN: 6332/6332, ET: 0) ***
Oct 11 21:18:01 ntop00 nfacctd[1075699]: INFO ( p1/print ): *** Purging cache - START (PID: 7239) ***
Oct 11 21:18:01 ntop00 nfacctd[1075699]: INFO ( p1/print ): *** Purging cache - END (PID: 7239, QN: 74/74, ET: 0) ***
Oct 11 21:20:01 ntop00 sfacctd[1075592]: INFO ( m1/mysql ): *** Purging cache - START (PID: 7240) ***
Oct 11 21:20:01 ntop00 nfacctd[1075699]: INFO ( m1/mysql ): *** Purging cache - START (PID: 7240) ***
Oct 11 21:20:01 ntop00 nfacctd[1075699]: INFO ( m1/mysql ): *** Purging cache - END (PID: 7240, QN: 85/85, ET: 0) ***
Oct 11 21:20:17 ntop00 sfacctd[1075592]: INFO ( m1/mysql ): *** Purging cache - END (PID: 7240, QN: 6208/6208, ET: 16) ***
Oct 11 21:23:01 ntop00 sfacctd[1075592]: INFO ( p1/print ): *** Purging cache - START (PID: 7241) ***
Oct 11 21:23:01 ntop00 sfacctd[1075592]: INFO ( p1/print ): *** Purging cache - END (PID: 7241, QN: 6213/6213, ET: 0) ***
Oct 11 21:23:01 ntop00 nfacctd[1075699]: INFO ( p1/print ): *** Purging cache - START (PID: 7241) ***
Oct 11 21:23:01 ntop00 nfacctd[1075699]: INFO ( p1/print ): *** Purging cache - END (PID: 7241, QN: 91/91, ET: 0) ***
Oct 11 21:25:01 ntop00 sfacctd[1075592]: INFO ( m1/mysql ): *** Purging cache - START (PID: 7242) ***
... 64 more distinct messages not shown
== outbound00.cs.umd.edu (1 distinct, 6 total) ==
Oct 11 21:09:09 outbound00.cs.umd.edu python3[1736353]: ldapdb [x6]
== outbound01.cs.umd.edu (1 distinct, 6 total) ==
Oct 11 21:13:06 outbound01.cs.umd.edu python3[3216245]: ldapdb [x6]
== quiss (7 distinct, 10 total) ==
Oct 11 21:08:37 quiss gnome-software[191719]: failed to commit changes to dconf: GDBus.Error:org.gtk.GDBus.UnmappedGError.Quark._g_2dfile_2derror_2dquark.Code2: Failed to create file “/adminhomes/josephao/.config/dconf/user.OR8QW3”: Permission denied
Oct 11 21:08:40 quiss gnome-software[191719]: failed to get featured apps: no apps to show
Oct 11 21:08:40 quiss gnome-software[191719]: Only 0 apps for curated list, hiding
Oct 11 21:08:40 quiss gnome-software[191719]: Only 0 apps for recent list, hiding
Oct 11 21:08:43 quiss packagekitd[1684507]: Failed to get cache filename for gnome-control-center-filesystem [x2]
Oct 11 21:08:43 quiss packagekitd[1684507]: Failed to get cache filename for perl [x2]
Oct 11 21:08:43 quiss packagekitd[1684507]: Failed to get cache filename for kernel [x2]
== strawberry (7 distinct, 38 total) ==
Oct 11 21:07:04 strawberry kernel: I/O error, dev sda, sector 206848 op 0x0:(READ) flags 0x80700 phys_seg 1 prio class 2 [x6]
Oct 11 21:07:04 strawberry kernel: I/O error, dev sda, sector 206848 op 0x0:(READ) flags 0x0 phys_seg 1 prio class 2 [x6]
Oct 11 21:07:04 strawberry kernel: Buffer I/O error on dev sda2, logical block 0, async page read [x6]
Oct 11 21:07:04 strawberry kernel: I/O error, dev sda, sector 2048 op 0x0:(READ) flags 0x80700 phys_seg 1 prio class 2 [x6]
Oct 11 21:07:04 strawberry kernel: I/O error, dev sda, sector 2048 op 0x0:(READ) flags 0x0 phys_seg 1 prio class 2 [x6]
Oct 11 21:07:04 strawberry kernel: Buffer I/O error on dev sda1, logical block 0, async page read [x6]
Oct 11 21:34:42 strawberry smartd[5314]: Device: /dev/sda [SAT], failed to read SMART Attribute Data [x2]
== submit26-b9-3 (1 distinct, 4 total) ==
Sep 14 04:42:37 submit26-b9-3 systemd[1]: user(a)1001.service: Main process exited, code=killed, status=9/KILL [x4]
== submit26-b9-f2 (1 distinct, 2 total) ==
Oct 11 21:43:08 submit26-b9-f2 systemd[1]: user(a)1001.service: Main process exited, code=killed, status=9/KILL [x2]
== submit26-b9-f3 (10 distinct, 16 total) ==
Oct 11 21:05:05 submit26-b9-f3 systemd[1]: user(a)1001.service: Main process exited, code=killed, status=9/KILL [x5]
Oct 11 21:06:50 submit26-b9-f3 setroubleshoot[2917520]: SELinux is preventing /usr/bin/python3.9 from create access on the directory /(null). For complete SELinux messages run: sealert -l a653b772-cbcd-438b-bae5-23c3dc69b31b [x2]
Oct 11 21:06:50 submit26-b9-f3 setroubleshoot[2917520]: SELinux is preventing /usr/bin/python3.9 from add_name access on the directory /(null). For complete SELinux messages run: sealert -l 3e904634-6caa-4202-8c92-f139db798859 [x2]
Oct 11 21:06:50 submit26-b9-f3 setroubleshoot[2917520]: SELinux is preventing /usr/bin/python3.9 from create access on the file /(null). For complete SELinux messages run: sealert -l 580b20e4-ec2c-433d-905c-5bd417fba033
Oct 11 21:06:50 submit26-b9-f3 setroubleshoot[2917520]: SELinux is preventing /usr/bin/python3.9 from open access on the file /tmp/libdnf.Wan0PK/repodata/repomd.xml. For complete SELinux messages run: sealert -l 27f29d48-5e7c-4db7-b051-8ac055737d6f
Oct 11 21:06:50 submit26-b9-f3 setroubleshoot[2917520]: SELinux is preventing /usr/bin/python3.9 from setattr access on the file repomd.xml. For complete SELinux messages run: sealert -l bff72452-d40a-430b-9060-dd0a48f5b6ba
Oct 11 21:06:50 submit26-b9-f3 setroubleshoot[2917520]: SELinux is preventing /usr/bin/python3.9 from read access on the directory libdnf.Wan0PK. For complete SELinux messages run: sealert -l 9638d396-8ce5-4e6a-ae47-45cd3985e1cd
Oct 11 21:06:51 submit26-b9-f3 setroubleshoot[2917520]: SELinux is preventing /usr/bin/python3.9 from remove_name access on the directory repomd.xml. For complete SELinux messages run: sealert -l 6da64b94-7024-45a9-b8c2-3b9812517407
Oct 11 21:06:51 submit26-b9-f3 setroubleshoot[2917520]: SELinux is preventing /usr/bin/python3.9 from unlink access on the file repomd.xml. For complete SELinux messages run: sealert -l 64cbe179-abf1-4d5a-bade-bb164897ee65
Oct 11 21:06:51 submit26-b9-f3 setroubleshoot[2917520]: SELinux is preventing /usr/bin/python3.9 from rmdir access on the directory repodata. For complete SELinux messages run: sealert -l d2e35b1a-e27c-4f91-9217-2bb1204e1e68
== submit26-b9-f4 (10 distinct, 16 total) ==
Oct 11 21:20:58 submit26-b9-f4 systemd[1]: user(a)1001.service: Main process exited, code=killed, status=9/KILL [x4]
Oct 11 21:24:57 submit26-b9-f4 setroubleshoot[868091]: SELinux is preventing /usr/bin/python3.9 from create access on the directory /(null). For complete SELinux messages run: sealert -l ee160f23-b161-4f4a-9985-c4edfd3a5beb
Oct 11 21:24:57 submit26-b9-f4 setroubleshoot[868091]: SELinux is preventing /usr/bin/python3.9 from add_name access on the directory /(null). For complete SELinux messages run: sealert -l 89a83821-4b24-4081-9973-0a79ca6ed5b4
Oct 11 21:24:57 submit26-b9-f4 setroubleshoot[868091]: SELinux is preventing /usr/bin/python3.9 from create access on the file /(null). For complete SELinux messages run: sealert -l f73955d6-1416-45f9-bab6-ff1f3ea07e9d [x2]
Oct 11 21:24:57 submit26-b9-f4 setroubleshoot[868091]: SELinux is preventing /usr/bin/python3.9 from open access on the file /tmp/libdnf.6W0Wgp/repodata/repomd.xml. For complete SELinux messages run: sealert -l 9f8f24a0-8fb6-454d-a103-31a8f7a6efa0 [x2]
Oct 11 21:24:57 submit26-b9-f4 setroubleshoot[868091]: SELinux is preventing /usr/bin/python3.9 from setattr access on the file repomd.xml. For complete SELinux messages run: sealert -l 20293136-86a3-40ba-a651-cff48d36059e [x2]
Oct 11 21:24:57 submit26-b9-f4 setroubleshoot[868091]: SELinux is preventing /usr/bin/python3.9 from read access on the directory libdnf.6W0Wgp. For complete SELinux messages run: sealert -l 25f86b49-4ee7-4f60-ad1c-73a70032560c
Oct 11 21:24:57 submit26-b9-f4 setroubleshoot[868091]: SELinux is preventing /usr/bin/python3.9 from remove_name access on the directory repomd.xml. For complete SELinux messages run: sealert -l eec250fb-073f-456d-93bc-f98776fd476d
Oct 11 21:24:57 submit26-b9-f4 setroubleshoot[868091]: SELinux is preventing /usr/bin/python3.9 from unlink access on the file repomd.xml. For complete SELinux messages run: sealert -l c9209e04-a349-43d5-8cb2-3e303e48df74
Oct 11 21:24:57 submit26-b9-f4 setroubleshoot[868091]: SELinux is preventing /usr/bin/python3.9 from rmdir access on the directory repodata. For complete SELinux messages run: sealert -l 3178d5f5-80e9-404b-92b7-9bef397a8915
1
0
Command: /usr/local/sbin/syslog-digest.py
Time : 0.0727s
Status : exited 0
Output :
Syslog digest — 2026-10-11 21:05 EDT
Processed 3,435 lines, filtered 2,852 (83%). 583 unknown (141 distinct) from 16 host(s).
== abuse (1 distinct, 348 total) ==
Oct 11 20:05:25 abuse rsyslogd[1033]: imjournal: open() failed for path: '/var/lib/rsyslog/imjournal.state.tmp': Input/output error [v8.2404.0 try https://www.rsyslog.com/e/2433 ] [x348]
== b0b02.cs.umd.edu (1 distinct, 1 total) ==
Oct 11 20:23:33 b0b02.cs.umd.edu rustdesk[2814069]: cannot open display:
== biggulp.cs.umd.edu (7 distinct, 7 total) ==
Oct 11 20:13:43 biggulp.cs.umd.edu sshd-session[1361086]: pam_access(sshd:auth): access denied for user `jkatz2(a)umd.edu' from `34.162.209.157'
Oct 11 20:16:04 biggulp.cs.umd.edu sshd-session[1361605]: error: kex_protocol_error: type 20 seq 2 [preauth]
Oct 11 20:16:04 biggulp.cs.umd.edu sshd-session[1361605]: error: kex_protocol_error: type 30 seq 3 [preauth]
Oct 11 20:16:06 biggulp.cs.umd.edu sshd-session[1361605]: error: kex_protocol_error: type 20 seq 4 [preauth]
Oct 11 20:16:06 biggulp.cs.umd.edu sshd-session[1361605]: error: kex_protocol_error: type 30 seq 5 [preauth]
Oct 11 20:16:08 biggulp.cs.umd.edu sshd-session[1361605]: error: kex_protocol_error: type 20 seq 6 [preauth]
Oct 11 20:16:08 biggulp.cs.umd.edu sshd-session[1361605]: error: kex_protocol_error: type 30 seq 7 [preauth]
== cheezit.cs.umd.edu (3 distinct, 10 total) ==
Oct 11 20:31:31 cheezit.cs.umd.edu sshd-session[1764202]: pam_access(sshd:auth): access denied for user `anwar' from `71.241.227.222' [x6]
Oct 11 20:40:41 cheezit.cs.umd.edu krb5_child[1766190]: Preauthentication failed [x2]
Oct 11 20:40:41 cheezit.cs.umd.edu sshd-session[1766186]: error: PAM: Authentication failure for anwar from 71.241.227.222 [x2]
== idm00 (1 distinct, 1 total) ==
Oct 11 20:54:46 idm00 named[3155984]: client @0x7f45940178d8 10.73.240.42#51345: update '73.10.in-addr.arpa/IN' denied
== idmp0 (1 distinct, 1 total) ==
Oct 11 20:39:22 idmp0 named[412677]: client @0x7fb3500184a8 10.73.240.43#63539: update '73.10.in-addr.arpa/IN' denied
== itmon02 (1 distinct, 3 total) ==
Oct 11 20:23:40 itmon02 sshd[805675]: error: beginning MaxStartups throttling [x3]
== munin (2 distinct, 18 total) ==
Oct 11 20:07:58 munin sudo[3530020]: pam_systemd(sudo:session): Failed to stat() runtime directory '/run/user/0': No such file or directory [x9]
Oct 11 20:07:58 munin sudo[3530020]: pam_systemd(sudo:session): Not setting $XDG_RUNTIME_DIR, as the directory is not in order. [x9]
== newhonors2 (1 distinct, 24 total) ==
Oct 11 20:13:03 newhonors2 dhcpcd[3893392]: dhcpcd is not running [x24]
== ntop00 (96 distinct, 96 total) ==
Oct 11 20:05:15 ntop00 sfacctd[1075592]: INFO ( m1/mysql ): *** Purging cache - END (PID: 7210, QN: 7089/7089, ET: 14) ***
Oct 11 20:08:01 ntop00 sfacctd[1075592]: INFO ( p1/print ): *** Purging cache - START (PID: 7211) ***
Oct 11 20:08:01 ntop00 sfacctd[1075592]: INFO ( p1/print ): *** Purging cache - END (PID: 7211, QN: 6686/6686, ET: 0) ***
Oct 11 20:08:01 ntop00 nfacctd[1075699]: INFO ( p1/print ): *** Purging cache - START (PID: 7211) ***
Oct 11 20:08:01 ntop00 nfacctd[1075699]: INFO ( p1/print ): *** Purging cache - END (PID: 7211, QN: 45/45, ET: 0) ***
Oct 11 20:10:01 ntop00 sfacctd[1075592]: INFO ( m1/mysql ): *** Purging cache - START (PID: 7212) ***
Oct 11 20:10:01 ntop00 nfacctd[1075699]: INFO ( m1/mysql ): *** Purging cache - START (PID: 7212) ***
Oct 11 20:10:01 ntop00 nfacctd[1075699]: INFO ( m1/mysql ): *** Purging cache - END (PID: 7212, QN: 42/42, ET: 0) ***
Oct 11 20:10:16 ntop00 sfacctd[1075592]: INFO ( m1/mysql ): *** Purging cache - END (PID: 7212, QN: 6862/6862, ET: 15) ***
Oct 11 20:13:01 ntop00 sfacctd[1075592]: INFO ( p1/print ): *** Purging cache - START (PID: 7213) ***
Oct 11 20:13:01 ntop00 nfacctd[1075699]: INFO ( p1/print ): *** Purging cache - START (PID: 7213) ***
Oct 11 20:13:01 ntop00 nfacctd[1075699]: INFO ( p1/print ): *** Purging cache - END (PID: 7213, QN: 70/70, ET: 0) ***
Oct 11 20:13:01 ntop00 sfacctd[1075592]: INFO ( p1/print ): *** Purging cache - END (PID: 7213, QN: 6744/6744, ET: 0) ***
Oct 11 20:15:01 ntop00 sfacctd[1075592]: INFO ( m1/mysql ): *** Purging cache - START (PID: 7214) ***
Oct 11 20:15:01 ntop00 nfacctd[1075699]: INFO ( m1/mysql ): *** Purging cache - START (PID: 7214) ***
Oct 11 20:15:01 ntop00 nfacctd[1075699]: INFO ( m1/mysql ): *** Purging cache - END (PID: 7214, QN: 67/67, ET: 0) ***
Oct 11 20:15:16 ntop00 sfacctd[1075592]: INFO ( m1/mysql ): *** Purging cache - END (PID: 7214, QN: 6626/6626, ET: 15) ***
Oct 11 20:18:01 ntop00 sfacctd[1075592]: INFO ( p1/print ): *** Purging cache - START (PID: 7215) ***
Oct 11 20:18:01 ntop00 sfacctd[1075592]: INFO ( p1/print ): *** Purging cache - END (PID: 7215, QN: 7069/7069, ET: 0) ***
Oct 11 20:18:01 ntop00 nfacctd[1075699]: INFO ( p1/print ): *** Purging cache - START (PID: 7215) ***
Oct 11 20:18:01 ntop00 nfacctd[1075699]: INFO ( p1/print ): *** Purging cache - END (PID: 7215, QN: 74/74, ET: 0) ***
Oct 11 20:20:01 ntop00 sfacctd[1075592]: INFO ( m1/mysql ): *** Purging cache - START (PID: 7216) ***
Oct 11 20:20:01 ntop00 nfacctd[1075699]: INFO ( m1/mysql ): *** Purging cache - START (PID: 7216) ***
Oct 11 20:20:01 ntop00 nfacctd[1075699]: INFO ( m1/mysql ): *** Purging cache - END (PID: 7216, QN: 85/85, ET: 0) ***
Oct 11 20:20:17 ntop00 sfacctd[1075592]: INFO ( m1/mysql ): *** Purging cache - END (PID: 7216, QN: 7172/7172, ET: 16) ***
Oct 11 20:23:01 ntop00 nfacctd[1075699]: INFO ( p1/print ): *** Purging cache - START (PID: 7217) ***
Oct 11 20:23:01 ntop00 nfacctd[1075699]: INFO ( p1/print ): *** Purging cache - END (PID: 7217, QN: 81/81, ET: 0) ***
Oct 11 20:23:01 ntop00 sfacctd[1075592]: INFO ( p1/print ): *** Purging cache - START (PID: 7217) ***
Oct 11 20:23:01 ntop00 sfacctd[1075592]: INFO ( p1/print ): *** Purging cache - END (PID: 7217, QN: 7022/7022, ET: 0) ***
Oct 11 20:25:01 ntop00 sfacctd[1075592]: INFO ( m1/mysql ): *** Purging cache - START (PID: 7218) ***
... 66 more distinct messages not shown
== outbound00.cs.umd.edu (1 distinct, 6 total) ==
Oct 11 20:09:09 outbound00.cs.umd.edu python3[1722649]: ldapdb [x6]
== outbound01.cs.umd.edu (1 distinct, 6 total) ==
Oct 11 20:13:06 outbound01.cs.umd.edu python3[3202380]: ldapdb [x6]
== quiss (7 distinct, 10 total) ==
Oct 11 20:08:37 quiss gnome-software[191719]: failed to commit changes to dconf: GDBus.Error:org.gtk.GDBus.UnmappedGError.Quark._g_2dfile_2derror_2dquark.Code2: Failed to create file “/adminhomes/josephao/.config/dconf/user.952QW3”: Permission denied
Oct 11 20:08:40 quiss gnome-software[191719]: failed to get featured apps: no apps to show
Oct 11 20:08:40 quiss gnome-software[191719]: Only 0 apps for curated list, hiding
Oct 11 20:08:40 quiss gnome-software[191719]: Only 0 apps for recent list, hiding
Oct 11 20:08:43 quiss packagekitd[1600773]: Failed to get cache filename for gnome-control-center-filesystem [x2]
Oct 11 20:08:43 quiss packagekitd[1600773]: Failed to get cache filename for perl [x2]
Oct 11 20:08:43 quiss packagekitd[1600773]: Failed to get cache filename for kernel [x2]
== strawberry (7 distinct, 38 total) ==
Oct 11 20:07:04 strawberry kernel: I/O error, dev sda, sector 206848 op 0x0:(READ) flags 0x80700 phys_seg 1 prio class 2 [x6]
Oct 11 20:07:04 strawberry kernel: I/O error, dev sda, sector 206848 op 0x0:(READ) flags 0x0 phys_seg 1 prio class 2 [x6]
Oct 11 20:07:04 strawberry kernel: Buffer I/O error on dev sda2, logical block 0, async page read [x6]
Oct 11 20:07:04 strawberry kernel: I/O error, dev sda, sector 2048 op 0x0:(READ) flags 0x80700 phys_seg 1 prio class 2 [x6]
Oct 11 20:07:04 strawberry kernel: I/O error, dev sda, sector 2048 op 0x0:(READ) flags 0x0 phys_seg 1 prio class 2 [x6]
Oct 11 20:07:04 strawberry kernel: Buffer I/O error on dev sda1, logical block 0, async page read [x6]
Oct 11 20:34:42 strawberry smartd[5314]: Device: /dev/sda [SAT], failed to read SMART Attribute Data [x2]
== submit26-b9-f1 (1 distinct, 1 total) ==
Oct 11 20:44:03 submit26-b9-f1 systemd[1]: user(a)1001.service: Main process exited, code=killed, status=9/KILL
== submit26-b9-fclone (10 distinct, 13 total) ==
Oct 11 20:22:05 submit26-b9-fclone setroubleshoot[1424455]: SELinux is preventing /usr/bin/python3.9 from create access on the directory /(null). For complete SELinux messages run: sealert -l 9355d9d9-a311-48d2-bd37-6c0f6947dfff
Oct 11 20:22:05 submit26-b9-fclone setroubleshoot[1424455]: SELinux is preventing /usr/bin/python3.9 from add_name access on the directory /(null). For complete SELinux messages run: sealert -l cc4658d7-9db1-405d-9eee-de0ccee5857f
Oct 11 20:22:05 submit26-b9-fclone setroubleshoot[1424455]: SELinux is preventing /usr/bin/python3.9 from create access on the file /(null). For complete SELinux messages run: sealert -l 568a2429-0b1b-49df-af41-49b5cd298ae8 [x2]
Oct 11 20:22:05 submit26-b9-fclone setroubleshoot[1424455]: SELinux is preventing /usr/bin/python3.9 from open access on the file /tmp/libdnf.mrIcI1/repodata/repomd.xml. For complete SELinux messages run: sealert -l 03e2f521-0e7c-481f-8e92-0602c6adeedc
Oct 11 20:22:05 submit26-b9-fclone setroubleshoot[1424455]: SELinux is preventing /usr/bin/python3.9 from setattr access on the file repomd.xml. For complete SELinux messages run: sealert -l 0d6b7b1f-ebe3-4beb-915a-b06b63bf2566 [x2]
Oct 11 20:22:05 submit26-b9-fclone setroubleshoot[1424455]: SELinux is preventing /usr/bin/python3.9 from read access on the directory libdnf.mrIcI1. For complete SELinux messages run: sealert -l 887adbf9-2bb9-4009-b800-36ddf9ba0db5
Oct 11 20:22:05 submit26-b9-fclone setroubleshoot[1424455]: SELinux is preventing /usr/bin/python3.9 from remove_name access on the directory repomd.xml. For complete SELinux messages run: sealert -l 092e0644-8373-4017-b77f-1afa6c6da4ac
Oct 11 20:22:05 submit26-b9-fclone setroubleshoot[1424455]: SELinux is preventing /usr/bin/python3.9 from unlink access on the file repomd.xml. For complete SELinux messages run: sealert -l ce429a92-56de-4de1-b859-cbfb69ae123c [x2]
Oct 11 20:22:05 submit26-b9-fclone setroubleshoot[1424455]: SELinux is preventing /usr/bin/python3.9 from rmdir access on the directory repodata. For complete SELinux messages run: sealert -l 99b886eb-497b-406d-8206-afe76a1086b4
Oct 11 20:22:05 submit26-b9-fclone setroubleshoot[1424455]: SELinux is preventing /usr/bin/python3.9 from open access on the file /tmp/libdnf.eUVwSt/repodata/repomd.xml. For complete SELinux messages run: sealert -l 03e2f521-0e7c-481f-8e92-0602c6adeedc
1
0
Command: /usr/local/sbin/syslog-digest.py
Time : 0.1004s
Status : exited 0
Output :
Syslog digest — 2026-10-11 20:05 EDT
Processed 4,209 lines, filtered 2,870 (68%). 1,339 unknown (200 distinct) from 15 host(s).
== abuse (1 distinct, 349 total) ==
Oct 11 19:05:25 abuse rsyslogd[1033]: imjournal: open() failed for path: '/var/lib/rsyslog/imjournal.state.tmp': Input/output error [v8.2404.0 try https://www.rsyslog.com/e/2433 ] [x349]
== b0b02.cs.umd.edu (1 distinct, 1 total) ==
Oct 11 19:23:29 b0b02.cs.umd.edu rustdesk[2798771]: cannot open display:
== cheezit.cs.umd.edu (1 distinct, 1 total) ==
Oct 11 19:58:10 cheezit.cs.umd.edu sshd-session[1756403]: pam_access(sshd:auth): access denied for user `egolub' from `108.28.255.142'
== hazfs.cs.umd.edu (11 distinct, 66 total) ==
Oct 11 19:24:49 hazfs.cs.umd.edu snmpd[1431]: send response: Failure in sendto [x6]
Oct 11 19:24:49 hazfs.cs.umd.edu snmpd[1431]: -- NET-SNMP-EXTEND-MIB::nsExtendStatus."userweb" [x6]
Oct 11 19:24:49 hazfs.cs.umd.edu snmpd[1431]: -- NET-SNMP-EXTEND-MIB::nsExtendStatus."zfslist" [x6]
Oct 11 19:24:49 hazfs.cs.umd.edu snmpd[1431]: -- NET-SNMP-EXTEND-MIB::nsExtendStatus."userhome" [x6]
Oct 11 19:24:49 hazfs.cs.umd.edu snmpd[1431]: -- NET-SNMP-EXTEND-MIB::nsExtendOutput1Line."userweb" [x6]
Oct 11 19:24:49 hazfs.cs.umd.edu snmpd[1431]: -- NET-SNMP-EXTEND-MIB::nsExtendOutput1Line."zfslist" [x6]
Oct 11 19:24:49 hazfs.cs.umd.edu snmpd[1431]: -- NET-SNMP-EXTEND-MIB::nsExtendOutput1Line."userhome" [x6]
Oct 11 19:24:49 hazfs.cs.umd.edu snmpd[1431]: -- NET-SNMP-EXTEND-MIB::nsExtendOutputFull."userweb" [x6]
Oct 11 19:24:49 hazfs.cs.umd.edu snmpd[1431]: -- NET-SNMP-EXTEND-MIB::nsExtendOutputFull."zfslist" [x6]
Oct 11 19:24:49 hazfs.cs.umd.edu snmpd[1431]: -- NET-SNMP-EXTEND-MIB::nsExtendOutputFull."userhome" [x6]
Oct 11 19:24:49 hazfs.cs.umd.edu snmpd[1431]: -- NET-SNMP-EXTEND-MIB::nsExtendOutNumLines."userweb" [x6]
== idm00 (1 distinct, 1 total) ==
Oct 11 19:54:45 idm00 named[3155984]: client @0x7f459c0a33b8 10.73.240.42#53552: update '73.10.in-addr.arpa/IN' denied
== idmp0 (1 distinct, 1 total) ==
Oct 11 19:39:22 idmp0 named[412677]: client @0x7fb344000cc8 10.73.240.43#57448: update '73.10.in-addr.arpa/IN' denied
== itmon02 (1 distinct, 1 total) ==
Oct 11 19:58:06 itmon02 sshd[805675]: error: beginning MaxStartups throttling
== munin (2 distinct, 4 total) ==
Oct 11 20:03:11 munin sudo[3528848]: pam_systemd(sudo:session): Failed to stat() runtime directory '/run/user/0': No such file or directory [x2]
Oct 11 20:03:11 munin sudo[3528848]: pam_systemd(sudo:session): Not setting $XDG_RUNTIME_DIR, as the directory is not in order. [x2]
== newhonors2 (1 distinct, 24 total) ==
Oct 11 19:13:02 newhonors2 dhcpcd[3891567]: dhcpcd is not running [x24]
== ntop00 (99 distinct, 99 total) ==
Oct 11 19:05:01 ntop00 sfacctd[1075592]: INFO ( m1/mysql ): *** Purging cache - START (PID: 7186) ***
Oct 11 19:05:01 ntop00 nfacctd[1075699]: INFO ( m1/mysql ): *** Purging cache - START (PID: 7186) ***
Oct 11 19:05:01 ntop00 nfacctd[1075699]: INFO ( m1/mysql ): *** Purging cache - END (PID: 7186, QN: 63/63, ET: 0) ***
Oct 11 19:05:16 ntop00 sfacctd[1075592]: INFO ( m1/mysql ): *** Purging cache - END (PID: 7186, QN: 7112/7112, ET: 15) ***
Oct 11 19:08:01 ntop00 sfacctd[1075592]: INFO ( p1/print ): *** Purging cache - START (PID: 7187) ***
Oct 11 19:08:01 ntop00 sfacctd[1075592]: INFO ( p1/print ): *** Purging cache - END (PID: 7187, QN: 7164/7164, ET: 0) ***
Oct 11 19:08:01 ntop00 nfacctd[1075699]: INFO ( p1/print ): *** Purging cache - START (PID: 7187) ***
Oct 11 19:08:01 ntop00 nfacctd[1075699]: INFO ( p1/print ): *** Purging cache - END (PID: 7187, QN: 50/50, ET: 0) ***
Oct 11 19:10:01 ntop00 sfacctd[1075592]: INFO ( m1/mysql ): *** Purging cache - START (PID: 7188) ***
Oct 11 19:10:01 ntop00 nfacctd[1075699]: INFO ( m1/mysql ): *** Purging cache - START (PID: 7188) ***
Oct 11 19:10:01 ntop00 nfacctd[1075699]: INFO ( m1/mysql ): *** Purging cache - END (PID: 7188, QN: 77/77, ET: 0) ***
Oct 11 19:10:14 ntop00 sfacctd[1075592]: INFO ( m1/mysql ): *** Purging cache - END (PID: 7188, QN: 6388/6388, ET: 13) ***
Oct 11 19:13:01 ntop00 sfacctd[1075592]: INFO ( p1/print ): *** Purging cache - START (PID: 7189) ***
Oct 11 19:13:01 ntop00 sfacctd[1075592]: INFO ( p1/print ): *** Purging cache - END (PID: 7189, QN: 5101/5101, ET: 0) ***
Oct 11 19:13:01 ntop00 nfacctd[1075699]: INFO ( p1/print ): *** Purging cache - START (PID: 7189) ***
Oct 11 19:13:01 ntop00 nfacctd[1075699]: INFO ( p1/print ): *** Purging cache - END (PID: 7189, QN: 74/74, ET: 0) ***
Oct 11 19:15:01 ntop00 sfacctd[1075592]: INFO ( m1/mysql ): *** Purging cache - START (PID: 7190) ***
Oct 11 19:15:01 ntop00 nfacctd[1075699]: INFO ( m1/mysql ): *** Purging cache - START (PID: 7190) ***
Oct 11 19:15:01 ntop00 nfacctd[1075699]: INFO ( m1/mysql ): *** Purging cache - END (PID: 7190, QN: 60/60, ET: 0) ***
Oct 11 19:15:14 ntop00 sfacctd[1075592]: INFO ( m1/mysql ): *** Purging cache - END (PID: 7190, QN: 5959/5959, ET: 13) ***
Oct 11 19:18:01 ntop00 sfacctd[1075592]: INFO ( p1/print ): *** Purging cache - START (PID: 7191) ***
Oct 11 19:18:01 ntop00 sfacctd[1075592]: INFO ( p1/print ): *** Purging cache - END (PID: 7191, QN: 7265/7265, ET: 0) ***
Oct 11 19:18:01 ntop00 nfacctd[1075699]: INFO ( p1/print ): *** Purging cache - START (PID: 7191) ***
Oct 11 19:18:01 ntop00 nfacctd[1075699]: INFO ( p1/print ): *** Purging cache - END (PID: 7191, QN: 77/77, ET: 0) ***
Oct 11 19:20:01 ntop00 sfacctd[1075592]: INFO ( m1/mysql ): *** Purging cache - START (PID: 7192) ***
Oct 11 19:20:01 ntop00 nfacctd[1075699]: INFO ( m1/mysql ): *** Purging cache - START (PID: 7192) ***
Oct 11 19:20:01 ntop00 nfacctd[1075699]: INFO ( m1/mysql ): *** Purging cache - END (PID: 7192, QN: 81/81, ET: 0) ***
Oct 11 19:20:16 ntop00 sfacctd[1075592]: INFO ( m1/mysql ): *** Purging cache - END (PID: 7192, QN: 7270/7270, ET: 15) ***
Oct 11 19:23:01 ntop00 sfacctd[1075592]: INFO ( p1/print ): *** Purging cache - START (PID: 7193) ***
Oct 11 19:23:01 ntop00 sfacctd[1075592]: INFO ( p1/print ): *** Purging cache - END (PID: 7193, QN: 7235/7235, ET: 0) ***
... 69 more distinct messages not shown
== outbound00.cs.umd.edu (1 distinct, 6 total) ==
Oct 11 19:09:09 outbound00.cs.umd.edu python3[1708966]: ldapdb [x6]
== outbound01.cs.umd.edu (1 distinct, 6 total) ==
Oct 11 19:13:06 outbound01.cs.umd.edu python3[3188464]: ldapdb [x6]
== quiss (7 distinct, 10 total) ==
Oct 11 19:08:37 quiss gnome-software[191719]: failed to commit changes to dconf: GDBus.Error:org.gtk.GDBus.UnmappedGError.Quark._g_2dfile_2derror_2dquark.Code2: Failed to create file “/adminhomes/josephao/.config/dconf/user.X3BRW3”: Permission denied
Oct 11 19:08:40 quiss gnome-software[191719]: failed to get featured apps: no apps to show
Oct 11 19:08:40 quiss gnome-software[191719]: Only 0 apps for curated list, hiding
Oct 11 19:08:40 quiss gnome-software[191719]: Only 0 apps for recent list, hiding
Oct 11 19:08:43 quiss packagekitd[1516741]: Failed to get cache filename for gnome-control-center-filesystem [x2]
Oct 11 19:08:43 quiss packagekitd[1516741]: Failed to get cache filename for perl [x2]
Oct 11 19:08:43 quiss packagekitd[1516741]: Failed to get cache filename for kernel [x2]
== strawberry (7 distinct, 38 total) ==
Oct 11 19:07:03 strawberry kernel: I/O error, dev sda, sector 206848 op 0x0:(READ) flags 0x80700 phys_seg 1 prio class 2 [x6]
Oct 11 19:07:03 strawberry kernel: I/O error, dev sda, sector 206848 op 0x0:(READ) flags 0x0 phys_seg 1 prio class 2 [x6]
Oct 11 19:07:03 strawberry kernel: Buffer I/O error on dev sda2, logical block 0, async page read [x6]
Oct 11 19:07:03 strawberry kernel: I/O error, dev sda, sector 2048 op 0x0:(READ) flags 0x80700 phys_seg 1 prio class 2 [x6]
Oct 11 19:07:03 strawberry kernel: I/O error, dev sda, sector 2048 op 0x0:(READ) flags 0x0 phys_seg 1 prio class 2 [x6]
Oct 11 19:07:03 strawberry kernel: Buffer I/O error on dev sda1, logical block 0, async page read [x6]
Oct 11 19:34:42 strawberry smartd[5314]: Device: /dev/sda [SAT], failed to read SMART Attribute Data [x2]
== submit10-cln25 (65 distinct, 732 total) ==
Oct 11 19:05:18 submit10-cln25 rsyslogd: imjournal: fopen() failed for path: '/var/lib/rsyslog/imjournal.state.tmp': Input/output error [v8.24.0-57.el7_9.3 try http://www.rsyslog.com/e/2013 ] [x120]
Oct 11 19:05:22 submit10-cln25 rsyslogd: file '/var/log/messages': open error: Input/output error [v8.24.0-57.el7_9.3 try http://www.rsyslog.com/e/2433 ] [x250]
Oct 11 19:07:55 submit10-cln25 sshd[28519]: error: rexec of /usr/sbin/sshd failed: Input/output error [x44]
Oct 11 19:07:55 submit10-cln25 sshd[28519]: warning: cannot open /etc/hosts.allow: Input/output error [x43]
Oct 11 19:07:55 submit10-cln25 sshd[28519]: warning: cannot open /etc/hosts.deny: Input/output error [x43]
Oct 11 19:07:55 submit10-cln25 sshd[28519]: refused connect from 10.227.96.13 (10.227.96.13) [x40]
Oct 11 19:07:55 submit10-cln25 rsyslogd: file '/var/log/secure': open error: Input/output error [v8.24.0-57.el7_9.3 try http://www.rsyslog.com/e/2433 ] [x110]
Oct 11 19:09:11 submit10-cln25 systemd: Failed at step USER spawning /usr/sbin/remotectl: Input/output error [x5]
Oct 11 19:09:11 submit10-cln25 systemd: start request repeated too quickly for cockpit.service
Oct 11 19:09:11 submit10-cln25 systemd: Failed at step EXEC spawning /bin/ln: Input/output error
Oct 11 19:12:23 submit10-cln25 sshd[28788]: refused connect from 10.227.96.15 (10.227.96.15)
Oct 11 19:12:38 submit10-cln25 sshd[28801]: refused connect from 128.8.128.8 (128.8.128.8)
Oct 11 19:12:54 submit10-cln25 sshd[28815]: refused connect from 128.8.128.110 (128.8.128.110)
Oct 11 19:15:52 submit10-cln25 agetty[1672]: tty1: can't exec /bin/login: Input/output error
Oct 11 19:16:02 submit10-cln25 systemd: Failed at step EXEC spawning /sbin/agetty: Input/output error [x5]
Oct 11 19:16:03 submit10-cln25 systemd: start request repeated too quickly for getty(a)tty1.service
Oct 11 19:17:50 submit10-cln25 kernel: ACPI: RSDP 00000000000f5290 00014 (v00 BOCHS )
Oct 11 19:17:50 submit10-cln25 kernel: ACPI: RSDT 00000000bffe3bb0 00034 (v01 BOCHS BXPC 00000001 BXPC 00000001)
Oct 11 19:17:50 submit10-cln25 kernel: ACPI: FACP 00000000bffe39c2 00074 (v01 BOCHS BXPC 00000001 BXPC 00000001)
Oct 11 19:17:50 submit10-cln25 kernel: ACPI: DSDT 00000000bffdf040 04982 (v01 BOCHS BXPC 00000001 BXPC 00000001)
Oct 11 19:17:50 submit10-cln25 kernel: ACPI: FACS 00000000bffdf000 00040
Oct 11 19:17:50 submit10-cln25 kernel: ACPI: APIC 00000000bffe3a36 00088 (v03 BOCHS BXPC 00000001 BXPC 00000001)
Oct 11 19:17:50 submit10-cln25 kernel: ACPI: SSDT 00000000bffe3abe 000CA (v01 BOCHS VMGENID 00000001 BXPC 00000001)
Oct 11 19:17:50 submit10-cln25 kernel: ACPI: WAET 00000000bffe3b88 00028 (v01 BOCHS BXPC 00000001 BXPC 00000001)
Oct 11 19:17:50 submit10-cln25 kernel: Zone ranges:
Oct 11 19:17:50 submit10-cln25 kernel: DMA [mem 0x00001000-0x00ffffff]
Oct 11 19:17:50 submit10-cln25 kernel: DMA32 [mem 0x01000000-0xffffffff]
Oct 11 19:17:50 submit10-cln25 kernel: Normal [mem 0x100000000-0x23fffffff]
Oct 11 19:17:50 submit10-cln25 kernel: Movable zone start for each node
Oct 11 19:17:50 submit10-cln25 kernel: Early memory node ranges
... 35 more distinct messages not shown
1
0
Command: /usr/local/sbin/syslog-digest.py
Time : 0.1961s
Status : exited 0
Output :
Syslog digest — 2026-10-11 19:05 EDT
Processed 7,410 lines, filtered 3,205 (43%). 4,205 unknown (447 distinct) from 33 host(s).
== abuse (7 distinct, 355 total) ==
Oct 11 18:05:25 abuse rsyslogd[1033]: imjournal: open() failed for path: '/var/lib/rsyslog/imjournal.state.tmp': Input/output error [v8.2404.0 try https://www.rsyslog.com/e/2433 ] [x349]
Oct 11 18:07:24 abuse sshd[3602]: error: rexec of /usr/sbin/sshd failed: Input/output error
Oct 11 18:07:24 abuse sshd[3602]: warning: cannot open /etc/hosts.allow: Input/output error
Oct 11 18:07:24 abuse sshd[3602]: warning: cannot open /etc/hosts.deny: Input/output error
Oct 11 18:07:24 abuse sshd[3602]: refused connect from 10.227.96.13 (10.227.96.13)
Oct 11 18:07:24 abuse rsyslogd[1033]: file '/var/log/secure'[19] write error - see https://www.rsyslog.com/solving-rsyslog-write-errors/ for help OS error: Input/output error [v8.2404.0 try https://www.rsyslog.com/e/2027 ]
Oct 11 18:07:24 abuse rsyslogd[1033]: file '/var/log/secure': open error: Input/output error [v8.2404.0 try https://www.rsyslog.com/e/2433 ]
== b0b02.cs.umd.edu (4 distinct, 4 total) ==
Oct 11 18:10:59 b0b02.cs.umd.edu csregistry[5224]: time="2026-10-11T22:10:59.444576452Z" level=info msg="PurgeUploads starting: olderThan=2026-10-04 22:10:59.444464275 +0000 UTC m=+5963820.204392617, actuallyDelete=true"
Oct 11 18:10:59 b0b02.cs.umd.edu csregistry[5224]: time="2026-10-11T22:10:59.445158103Z" level=info msg="Purge uploads finished. Num deleted=0, num errors=1"
Oct 11 18:10:59 b0b02.cs.umd.edu csregistry[5224]: time="2026-10-11T22:10:59.445189336Z" level=info msg="Starting upload purge in 24h0m0s" go.version=go1.11.2 instance.id=68469aa4-7857-4a69-bf12-c2190b4f96d8 service=registry version=v2.7.1
Oct 11 18:23:25 b0b02.cs.umd.edu rustdesk[2783668]: cannot open display:
== emaar (2 distinct, 3 total) ==
Oct 11 18:05:57 emaar puppet-agent[801391]: (Facter) invalid or malformed lldp data: MalformedDataError: no lldp interface data found
Oct 11 18:09:35 emaar systemd[1]: Configuration file /usr/lib/systemd/system/gpd.service is marked executable. Please remove executable permission bits. Proceeding anyway. [x2]
== galax (31 distinct, 31 total) ==
Oct 11 18:08:28 galax puppet-agent[560396]: Could not update: Execution of '/usr/bin/apt-get -q -y -o DPkg::Options::=--force-confold --force-yes install choria=0.29.4+resolute' returned 100: W: --force-yes is deprecated, use one of the options starting with --allow instead.
Oct 11 18:08:28 galax puppet-agent[560396]: E: dpkg was interrupted, you must manually run 'dpkg --configure -a' to correct the problem.
Oct 11 18:08:28 galax puppet-agent[560396]: (/Stage[main]/Choria::Install/Package[choria]/ensure) change from 'absent' to '0.29.4+resolute' failed: Could not update: Execution of '/usr/bin/apt-get -q -y -o DPkg::Options::=--force-confold --force-yes install choria=0.29.4+resolute' returned 100: W: --force-yes is deprecated, use one of the options starting with --allow instead.
Oct 11 18:08:28 galax puppet-agent[560396]: (/Stage[main]/Choria::Install/Package[choria]/ensure) E: dpkg was interrupted, you must manually run 'dpkg --configure -a' to correct the problem. (corrective)
Oct 11 18:08:28 galax puppet-agent[560396]: (/Stage[main]/Choria::Config/File[/etc/choria]) Skipping because of failed dependencies
Oct 11 18:08:28 galax puppet-agent[560396]: (/Stage[main]/Choria::Config/File[/etc/choria/policies]) Skipping because of failed dependencies
Oct 11 18:08:28 galax puppet-agent[560396]: (/Stage[main]/Choria::Config/File[/etc/choria/policies/rego]) Skipping because of failed dependencies
Oct 11 18:08:28 galax puppet-agent[560396]: (/Stage[main]/Choria::Config/File[/etc/choria/plugin.d]) Skipping because of failed dependencies
Oct 11 18:08:28 galax puppet-agent[560396]: (/Stage[main]/Choria::Config/File[/etc/choria/overrides.json]) Skipping because of failed dependencies
Oct 11 18:08:29 galax puppet-agent[560396]: (/Stage[main]/Choria::Config/File[/etc/choria/machine]) Skipping because of failed dependencies
Oct 11 18:08:29 galax puppet-agent[560396]: (/Stage[main]/Choria::Config/File[/usr/bin/choria_mcollective_agent_compat.rb]) Skipping because of failed dependencies
Oct 11 18:08:29 galax puppet-agent[560396]: (/Stage[main]/Choria::Config/File[/etc/choria/server.conf]) Skipping because of failed dependencies
Oct 11 18:08:29 galax puppet-agent[560396]: (/Stage[main]/Mcollective::Config/File[/etc/choria/server.cfg]) Skipping because of failed dependencies
Oct 11 18:08:29 galax puppet-agent[560396]: (/Stage[main]/Mcollective::Config/File[/etc/choria/client.cfg]) Skipping because of failed dependencies
Oct 11 18:08:29 galax puppet-agent[560396]: (/Stage[main]/Mcollective::Config/File[/etc/choria/policies/choria_util.policy]) Skipping because of failed dependencies
Oct 11 18:08:29 galax puppet-agent[560396]: (/Stage[main]/Mcollective::Config/File[/etc/choria/policies/rpcutil.policy]) Skipping because of failed dependencies
Oct 11 18:08:29 galax puppet-agent[560396]: (/Stage[main]/Mcollective::Config/File[/etc/choria/policies/scout.policy]) Skipping because of failed dependencies
Oct 11 18:08:29 galax puppet-agent[560396]: (/Stage[main]/Mcollective::Config/File[/etc/choria/policies/rego/default.rego]) Skipping because of failed dependencies
Oct 11 18:08:30 galax puppet-agent[560396]: (/Stage[main]/Choria::Config/Concat[/etc/choria/policies/groups]/Concat_file[/etc/choria/policies/groups]) Skipping because of failed dependencies
Oct 11 18:08:30 galax puppet-agent[560396]: (/Stage[main]/Choria::Config/Concat[/etc/choria/policies/groups]/File[/etc/choria/policies/groups]) Skipping because of failed dependencies
Oct 11 18:08:30 galax puppet-agent[560396]: (/Stage[main]/Mcollective::Config/Mcollective::Config_file[/etc/choria/client.conf]/File[/etc/choria/client.conf]) Skipping because of failed dependencies
Oct 11 18:08:30 galax puppet-agent[560396]: (/Stage[main]/Mcollective::Config/Mcollective::Config_file[/etc/choria/choria-shim.cfg]/File[/etc/choria/choria-shim.cfg]) Skipping because of failed dependencies
Oct 11 18:08:30 galax puppet-agent[560396]: (/Stage[main]/Mcollective::Facts/Exec[mcollective_facts_yaml_refresh]) Skipping because of failed dependencies
Oct 11 18:08:34 galax puppet-agent[560396]: (/Stage[main]/Mcollective_agent_puppet/Mcollective::Module_plugin[mcollective_agent_puppet]/File[/etc/choria/policies/puppet.policy]) Skipping because of failed dependencies
Oct 11 18:08:34 galax puppet-agent[560396]: (/Stage[main]/Mcollective_agent_service/Mcollective::Module_plugin[mcollective_agent_service]/File[/etc/choria/policies/service.policy]) Skipping because of failed dependencies
Oct 11 18:08:34 galax puppet-agent[560396]: (/Stage[main]/Mcollective_agent_package/Mcollective::Module_plugin[mcollective_agent_package]/File[/etc/choria/policies/package.policy]) Skipping because of failed dependencies
Oct 11 18:08:34 galax puppet-agent[560396]: (/Stage[main]/Mcollective_agent_filemgr/Mcollective::Module_plugin[mcollective_agent_filemgr]/File[/etc/choria/policies/filemgr.policy]) Skipping because of failed dependencies
Oct 11 18:08:34 galax puppet-agent[560396]: (/Stage[main]/Mcollective_choria/Mcollective::Module_plugin[mcollective_choria]/Mcollective::Config_file[/etc/choria/plugin.d/choria.cfg]/File[/etc/choria/plugin.d/choria.cfg]) Skipping because of failed dependencies
Oct 11 18:08:34 galax puppet-agent[560396]: (/Stage[main]/Mcollective_agent_puppet/Mcollective::Module_plugin[mcollective_agent_puppet]/Mcollective::Config_file[/etc/choria/plugin.d/puppet.cfg]/File[/etc/choria/plugin.d/puppet.cfg]) Skipping because of failed dependencies
Oct 11 18:08:34 galax puppet-agent[560396]: (/Stage[main]/Mcollective_util_actionpolicy/Mcollective::Module_plugin[mcollective_util_actionpolicy]/Mcollective::Config_file[/etc/choria/plugin.d/actionpolicy.cfg]/File[/etc/choria/plugin.d/actionpolicy.cfg]) Skipping because of failed dependencies
... 1 more distinct messages not shown
== gle-dind04 (2 distinct, 2 total) ==
Oct 11 18:47:33 gle-dind04 falcon-sensor-bpf[1017]: CrowdStrike(4): Could not retrieve DisableProxy value: c0000225
Oct 11 18:47:33 gle-dind04 falcon-sensor-bpf[1017]: CrowdStrike(4): ConnectWithProxy: Unable to get application proxy host from CsConfig: c0000225
== grades01.cs.umd.edu (2 distinct, 2 total) ==
Oct 11 18:07:25 grades01.cs.umd.edu sshd[13133]: error: key_cert_check_authority: invalid certificate
Oct 11 18:09:57 grades01.cs.umd.edu puppet-agent[11803]: The directory '/srv/grades' contains 2471 entries, which exceeds the default soft limit 1000 and may cause excessive resource consumption and degraded performance. To remove this warning set a value for `max_files` parameter or consider using an alternate method to manage large directory trees
== hazfs.cs.umd.edu (2 distinct, 2 total) ==
Oct 11 18:09:39 hazfs.cs.umd.edu rpc.mountd[1586325]: refused mount request from 10.227.96.13 for /raid/newww (/): not exported
Oct 11 18:12:02 hazfs.cs.umd.edu rpc.mountd[1586325]: /export/home exported to both 10.73.255.0/24 and 10.73.0.0/16, arbitrarily choosing options from first
== idm00 (2 distinct, 4 total) ==
Oct 11 18:05:33 idm00 named[3155984]: checkhints: unable to get root NS rrset from cache: not found [x3]
Oct 11 18:54:45 idm00 named[3155984]: client @0x7f4594036b68 10.73.240.42#55990: update '73.10.in-addr.arpa/IN' denied
== idmh1 (1 distinct, 2 total) ==
Oct 11 18:07:30 idmh1 named[749308]: checkhints: unable to get root NS rrset from cache: not found [x2]
== idmp0 (2 distinct, 3 total) ==
Oct 11 18:07:30 idmp0 named[412677]: checkhints: unable to get root NS rrset from cache: not found [x2]
Oct 11 18:39:22 idmp0 named[412677]: client @0x7fb354001508 10.73.240.43#59506: update '73.10.in-addr.arpa/IN' denied
== inbound00.cs.umd.edu (1 distinct, 1 total) ==
Oct 11 18:06:00 inbound00.cs.umd.edu systemd[1]: Configuration file /usr/lib/systemd/system/authentication_milter.service is marked executable. Please remove executable permission bits. Proceeding anyway.
== itmon02 (1 distinct, 4 total) ==
Oct 11 18:38:53 itmon02 sshd[805675]: error: beginning MaxStartups throttling [x4]
== jubjub.cs.umd.edu (64 distinct, 84 total) ==
Oct 11 18:07:26 jubjub.cs.umd.edu sshd[1907677]: error: key_cert_check_authority: invalid certificate
Oct 11 18:09:59 jubjub.cs.umd.edu puppet-agent[1906197]: : transaction-actions, product-id, search-disabled-repos,
Oct 11 18:09:59 jubjub.cs.umd.edu puppet-agent[1906197]: : subscription-manager, versionlock
Oct 11 18:09:59 jubjub.cs.umd.edu puppet-agent[1906197]: [x11]
Oct 11 18:09:59 jubjub.cs.umd.edu puppet-agent[1906197]: Could not retrieve mirrorlist http://cdn.remirepo.net/enterprise/7/php84/mirror error was
Oct 11 18:09:59 jubjub.cs.umd.edu puppet-agent[1906197]: 14: HTTP Error 403 - Forbidden
Oct 11 18:09:59 jubjub.cs.umd.edu puppet-agent[1906197]: One of the configured repositories failed (Unknown),
Oct 11 18:09:59 jubjub.cs.umd.edu puppet-agent[1906197]: 1. Contact the upstream for the repository and get them to fix the problem.
Oct 11 18:09:59 jubjub.cs.umd.edu puppet-agent[1906197]: 2. Reconfigure the baseurl/etc. for the repository, to point to a working
Oct 11 18:09:59 jubjub.cs.umd.edu puppet-agent[1906197]: upstream. This is most often useful if you are using a newer
Oct 11 18:09:59 jubjub.cs.umd.edu puppet-agent[1906197]: distribution release than is supported by the repository (and the
Oct 11 18:09:59 jubjub.cs.umd.edu puppet-agent[1906197]: packages for the previous distribution release still work).
Oct 11 18:09:59 jubjub.cs.umd.edu puppet-agent[1906197]: 3. Run the command with the repository temporarily disabled
Oct 11 18:09:59 jubjub.cs.umd.edu puppet-agent[1906197]: will then just ignore the repository until you permanently enable it
Oct 11 18:09:59 jubjub.cs.umd.edu puppet-agent[1906197]: again or use --enablerepo for temporary usage:
Oct 11 18:09:59 jubjub.cs.umd.edu puppet-agent[1906197]: or
Oct 11 18:09:59 jubjub.cs.umd.edu puppet-agent[1906197]: subscription-manager repos --disable=<repoid>
Oct 11 18:09:59 jubjub.cs.umd.edu puppet-agent[1906197]: 5. Configure the failing repository to be skipped, if it is unavailable.
Oct 11 18:09:59 jubjub.cs.umd.edu puppet-agent[1906197]: slower). If it is a very temporary problem though, this is often a nice
Oct 11 18:09:59 jubjub.cs.umd.edu puppet-agent[1906197]: compromise:
Oct 11 18:09:59 jubjub.cs.umd.edu puppet-agent[1906197]: Cannot find a valid baseurl for repo: remi-php84
Oct 11 18:09:59 jubjub.cs.umd.edu puppet-agent[1906197]: Uploading Enabled Repositories Report
Oct 11 18:09:59 jubjub.cs.umd.edu puppet-agent[1906197]: Unable to upload Enabled Repositories Report
Oct 11 18:09:59 jubjub.cs.umd.edu puppet-agent[1906197]: (/Stage[main]/Puppet::Agent::Install/Package[openvox-agent]/ensure) : transaction-actions, product-id, search-disabled-repos,
Oct 11 18:09:59 jubjub.cs.umd.edu puppet-agent[1906197]: (/Stage[main]/Puppet::Agent::Install/Package[openvox-agent]/ensure) : subscription-manager, versionlock
Oct 11 18:09:59 jubjub.cs.umd.edu puppet-agent[1906197]: (/Stage[main]/Puppet::Agent::Install/Package[openvox-agent]/ensure) [x11]
Oct 11 18:09:59 jubjub.cs.umd.edu puppet-agent[1906197]: (/Stage[main]/Puppet::Agent::Install/Package[openvox-agent]/ensure) Could not retrieve mirrorlist http://cdn.remirepo.net/enterprise/7/php84/mirror error was
Oct 11 18:09:59 jubjub.cs.umd.edu puppet-agent[1906197]: (/Stage[main]/Puppet::Agent::Install/Package[openvox-agent]/ensure) 14: HTTP Error 403 - Forbidden
Oct 11 18:09:59 jubjub.cs.umd.edu puppet-agent[1906197]: (/Stage[main]/Puppet::Agent::Install/Package[openvox-agent]/ensure) One of the configured repositories failed (Unknown),
Oct 11 18:09:59 jubjub.cs.umd.edu puppet-agent[1906197]: (/Stage[main]/Puppet::Agent::Install/Package[openvox-agent]/ensure) 1. Contact the upstream for the repository and get them to fix the problem.
... 34 more distinct messages not shown
== librenms (1 distinct, 1 total) ==
Oct 11 18:09:06 librenms puppet-agent[3659821]: The directory '/opt/librenms/rrd' contains 16538 entries, which exceeds the default soft limit 1000 and may cause excessive resource consumption and degraded performance. To remove this warning set a value for `max_files` parameter or consider using an alternate method to manage large directory trees
== mashie (177 distinct, 1938 total) ==
Oct 11 18:43:04 mashie kernel: EXT4-fs error: 46 callbacks suppressed
Oct 11 18:43:04 mashie kernel: EXT4-fs error (device vda1): ext4_journal_check_start:83: comm find: Detected aborted journal [x862]
Oct 11 18:43:04 mashie kernel: EXT4-fs: 46 callbacks suppressed
Oct 11 18:43:04 mashie kernel: EXT4-fs (vda1): Remounting filesystem read-only [x883]
Oct 11 18:43:09 mashie kernel: EXT4-fs error: 989 callbacks suppressed
Oct 11 18:43:09 mashie kernel: EXT4-fs: 990 callbacks suppressed [x2]
Oct 11 18:43:14 mashie kernel: EXT4-fs error: 2004 callbacks suppressed
Oct 11 18:43:14 mashie kernel: EXT4-fs: 2004 callbacks suppressed
Oct 11 18:43:19 mashie kernel: EXT4-fs error: 1543 callbacks suppressed
Oct 11 18:43:19 mashie kernel: EXT4-fs: 1543 callbacks suppressed
Oct 11 18:43:24 mashie kernel: EXT4-fs error: 2339 callbacks suppressed
Oct 11 18:43:24 mashie kernel: EXT4-fs: 2344 callbacks suppressed
Oct 11 18:43:29 mashie kernel: EXT4-fs error: 1570 callbacks suppressed
Oct 11 18:43:29 mashie kernel: EXT4-fs: 1567 callbacks suppressed
Oct 11 18:43:34 mashie kernel: EXT4-fs error: 2175 callbacks suppressed
Oct 11 18:43:34 mashie kernel: EXT4-fs: 2177 callbacks suppressed
Oct 11 18:43:39 mashie kernel: EXT4-fs error: 2161 callbacks suppressed
Oct 11 18:43:39 mashie kernel: EXT4-fs: 2161 callbacks suppressed
Oct 11 18:43:44 mashie kernel: EXT4-fs error: 2866 callbacks suppressed
Oct 11 18:43:44 mashie kernel: EXT4-fs: 2866 callbacks suppressed
Oct 11 18:43:49 mashie kernel: EXT4-fs error: 1869 callbacks suppressed
Oct 11 18:43:49 mashie kernel: EXT4-fs: 1864 callbacks suppressed
Oct 11 18:43:54 mashie kernel: EXT4-fs error: 906 callbacks suppressed
Oct 11 18:43:54 mashie kernel: EXT4-fs: 906 callbacks suppressed
Oct 11 18:43:59 mashie kernel: EXT4-fs error: 798 callbacks suppressed
Oct 11 18:43:59 mashie kernel: EXT4-fs: 798 callbacks suppressed
Oct 11 18:44:04 mashie kernel: EXT4-fs error: 815 callbacks suppressed
Oct 11 18:44:04 mashie kernel: EXT4-fs: 815 callbacks suppressed
Oct 11 18:44:09 mashie kernel: EXT4-fs error: 614 callbacks suppressed
Oct 11 18:44:09 mashie kernel: EXT4-fs: 614 callbacks suppressed
... 147 more distinct messages not shown
== misty.cs.umd.edu (1 distinct, 1 total) ==
Oct 11 18:07:26 misty.cs.umd.edu sshd[36879]: error: key_cert_check_authority: invalid certificate
== munin (2 distinct, 14 total) ==
Oct 11 18:08:16 munin sudo[3487489]: pam_systemd(sudo:session): Failed to stat() runtime directory '/run/user/0': No such file or directory [x7]
Oct 11 18:08:16 munin sudo[3487489]: pam_systemd(sudo:session): Not setting $XDG_RUNTIME_DIR, as the directory is not in order. [x7]
== newhonors2 (1 distinct, 24 total) ==
Oct 11 18:13:03 newhonors2 dhcpcd[3889706]: dhcpcd is not running [x24]
== ntop00 (96 distinct, 96 total) ==
Oct 11 18:05:01 ntop00 sfacctd[1075592]: INFO ( m1/mysql ): *** Purging cache - START (PID: 7162) ***
Oct 11 18:05:01 ntop00 nfacctd[1075699]: INFO ( m1/mysql ): *** Purging cache - START (PID: 7162) ***
Oct 11 18:05:01 ntop00 nfacctd[1075699]: INFO ( m1/mysql ): *** Purging cache - END (PID: 7162, QN: 59/59, ET: 0) ***
Oct 11 18:05:14 ntop00 sfacctd[1075592]: INFO ( m1/mysql ): *** Purging cache - END (PID: 7162, QN: 5963/5963, ET: 13) ***
Oct 11 18:08:01 ntop00 sfacctd[1075592]: INFO ( p1/print ): *** Purging cache - START (PID: 7163) ***
Oct 11 18:08:01 ntop00 sfacctd[1075592]: INFO ( p1/print ): *** Purging cache - END (PID: 7163, QN: 5884/5884, ET: 0) ***
Oct 11 18:08:01 ntop00 nfacctd[1075699]: INFO ( p1/print ): *** Purging cache - START (PID: 7163) ***
Oct 11 18:08:01 ntop00 nfacctd[1075699]: INFO ( p1/print ): *** Purging cache - END (PID: 7163, QN: 65/65, ET: 0) ***
Oct 11 18:10:01 ntop00 sfacctd[1075592]: INFO ( m1/mysql ): *** Purging cache - START (PID: 7164) ***
Oct 11 18:10:01 ntop00 nfacctd[1075699]: INFO ( m1/mysql ): *** Purging cache - START (PID: 7164) ***
Oct 11 18:10:01 ntop00 nfacctd[1075699]: INFO ( m1/mysql ): *** Purging cache - END (PID: 7164, QN: 65/65, ET: 0) ***
Oct 11 18:10:13 ntop00 sfacctd[1075592]: INFO ( m1/mysql ): *** Purging cache - END (PID: 7164, QN: 5878/5878, ET: 12) ***
Oct 11 18:13:01 ntop00 sfacctd[1075592]: INFO ( p1/print ): *** Purging cache - START (PID: 7165) ***
Oct 11 18:13:01 ntop00 sfacctd[1075592]: INFO ( p1/print ): *** Purging cache - END (PID: 7165, QN: 5745/5745, ET: 0) ***
Oct 11 18:13:01 ntop00 nfacctd[1075699]: INFO ( p1/print ): *** Purging cache - START (PID: 7165) ***
Oct 11 18:13:01 ntop00 nfacctd[1075699]: INFO ( p1/print ): *** Purging cache - END (PID: 7165, QN: 74/74, ET: 0) ***
Oct 11 18:15:01 ntop00 sfacctd[1075592]: INFO ( m1/mysql ): *** Purging cache - START (PID: 7166) ***
Oct 11 18:15:01 ntop00 nfacctd[1075699]: INFO ( m1/mysql ): *** Purging cache - START (PID: 7166) ***
Oct 11 18:15:01 ntop00 nfacctd[1075699]: INFO ( m1/mysql ): *** Purging cache - END (PID: 7166, QN: 69/69, ET: 0) ***
Oct 11 18:15:14 ntop00 sfacctd[1075592]: INFO ( m1/mysql ): *** Purging cache - END (PID: 7166, QN: 5779/5779, ET: 13) ***
Oct 11 18:18:01 ntop00 sfacctd[1075592]: INFO ( p1/print ): *** Purging cache - START (PID: 7167) ***
Oct 11 18:18:01 ntop00 sfacctd[1075592]: INFO ( p1/print ): *** Purging cache - END (PID: 7167, QN: 5931/5931, ET: 0) ***
Oct 11 18:18:01 ntop00 nfacctd[1075699]: INFO ( p1/print ): *** Purging cache - START (PID: 7167) ***
Oct 11 18:18:01 ntop00 nfacctd[1075699]: INFO ( p1/print ): *** Purging cache - END (PID: 7167, QN: 49/49, ET: 0) ***
Oct 11 18:20:01 ntop00 sfacctd[1075592]: INFO ( m1/mysql ): *** Purging cache - START (PID: 7168) ***
Oct 11 18:20:01 ntop00 nfacctd[1075699]: INFO ( m1/mysql ): *** Purging cache - START (PID: 7168) ***
Oct 11 18:20:01 ntop00 nfacctd[1075699]: INFO ( m1/mysql ): *** Purging cache - END (PID: 7168, QN: 40/40, ET: 0) ***
Oct 11 18:20:14 ntop00 sfacctd[1075592]: INFO ( m1/mysql ): *** Purging cache - END (PID: 7168, QN: 5866/5866, ET: 13) ***
Oct 11 18:23:01 ntop00 sfacctd[1075592]: INFO ( p1/print ): *** Purging cache - START (PID: 7169) ***
Oct 11 18:23:01 ntop00 sfacctd[1075592]: INFO ( p1/print ): *** Purging cache - END (PID: 7169, QN: 5771/5771, ET: 0) ***
... 66 more distinct messages not shown
== outbound00.cs.umd.edu (2 distinct, 7 total) ==
Oct 11 18:06:34 outbound00.cs.umd.edu systemd[1]: Configuration file /usr/lib/systemd/system/authentication_milter.service is marked executable. Please remove executable permission bits. Proceeding anyway.
Oct 11 18:09:09 outbound00.cs.umd.edu python3[1695104]: ldapdb [x6]
== outbound01.cs.umd.edu (2 distinct, 7 total) ==
Oct 11 18:08:48 outbound01.cs.umd.edu systemd[1]: Configuration file /usr/lib/systemd/system/authentication_milter.service is marked executable. Please remove executable permission bits. Proceeding anyway.
Oct 11 18:13:06 outbound01.cs.umd.edu python3[3174585]: ldapdb [x6]
== quiss (7 distinct, 10 total) ==
Oct 11 18:08:37 quiss gnome-software[191719]: failed to commit changes to dconf: GDBus.Error:org.gtk.GDBus.UnmappedGError.Quark._g_2dfile_2derror_2dquark.Code2: Failed to create file “/adminhomes/josephao/.config/dconf/user.9KQ1W3”: Permission denied
Oct 11 18:08:40 quiss gnome-software[191719]: failed to get featured apps: no apps to show
Oct 11 18:08:40 quiss gnome-software[191719]: Only 0 apps for curated list, hiding
Oct 11 18:08:40 quiss gnome-software[191719]: Only 0 apps for recent list, hiding
Oct 11 18:08:43 quiss packagekitd[1432878]: Failed to get cache filename for gnome-control-center-filesystem [x2]
Oct 11 18:08:43 quiss packagekitd[1432878]: Failed to get cache filename for perl [x2]
Oct 11 18:08:43 quiss packagekitd[1432878]: Failed to get cache filename for kernel [x2]
== splunkforwarder.cs.umd.edu (1 distinct, 1 total) ==
Oct 11 18:07:24 splunkforwarder.cs.umd.edu sshd[11869]: error: key_cert_check_authority: invalid certificate
== strawberry (7 distinct, 38 total) ==
Oct 11 18:07:03 strawberry kernel: I/O error, dev sda, sector 206848 op 0x0:(READ) flags 0x80700 phys_seg 1 prio class 2 [x6]
Oct 11 18:07:03 strawberry kernel: I/O error, dev sda, sector 206848 op 0x0:(READ) flags 0x0 phys_seg 1 prio class 2 [x6]
Oct 11 18:07:03 strawberry kernel: Buffer I/O error on dev sda2, logical block 0, async page read [x6]
Oct 11 18:07:03 strawberry kernel: I/O error, dev sda, sector 2048 op 0x0:(READ) flags 0x80700 phys_seg 1 prio class 2 [x6]
Oct 11 18:07:03 strawberry kernel: I/O error, dev sda, sector 2048 op 0x0:(READ) flags 0x0 phys_seg 1 prio class 2 [x6]
Oct 11 18:07:03 strawberry kernel: Buffer I/O error on dev sda1, logical block 0, async page read [x6]
Oct 11 18:34:42 strawberry smartd[5314]: Device: /dev/sda [SAT], failed to read SMART Attribute Data [x2]
== submit10-cln25 (5 distinct, 1540 total) ==
Oct 11 18:05:22 submit10-cln25 rsyslogd: file '/var/log/messages': open error: Input/output error [v8.24.0-57.el7_9.3 try http://www.rsyslog.com/e/2433 ] [x1200]
Oct 11 18:05:22 submit10-cln25 rsyslogd: imjournal: fopen() failed for path: '/var/lib/rsyslog/imjournal.state.tmp': Input/output error [v8.24.0-57.el7_9.3 try http://www.rsyslog.com/e/2013 ] [x335]
Oct 11 18:25:01 submit10-cln25 systemd: Failed at step USER spawning /usr/libexec/pcp/bin/pmlogger_check: Input/output error [x2]
Oct 11 18:28:01 submit10-cln25 systemd: Failed at step USER spawning /usr/libexec/pcp/bin/pmie_check: Input/output error [x2]
Oct 11 18:30:01 submit10-cln25 systemd: Failed at step USER spawning /usr/libexec/pcp/bin/pmlogger_daily: Input/output error
== submit26-b9-3 (1 distinct, 2 total) ==
Sep 14 02:08:08 submit26-b9-3 sshd[3063432]: error: Certificate invalid: not yet valid [x2]
== submit26-b9-f1 (9 distinct, 12 total) ==
Oct 11 18:26:04 submit26-b9-f1 setroubleshoot[2396442]: SELinux is preventing /usr/bin/python3.9 from create access on the directory /(null). For complete SELinux messages run: sealert -l 3ef7d677-731f-46bf-9c34-c2c55fea665c
Oct 11 18:26:04 submit26-b9-f1 setroubleshoot[2396442]: SELinux is preventing /usr/bin/python3.9 from add_name access on the directory /(null). For complete SELinux messages run: sealert -l aa60e26f-72e1-45f1-bc12-aa8b3b669e36
Oct 11 18:26:04 submit26-b9-f1 setroubleshoot[2396442]: SELinux is preventing /usr/bin/python3.9 from create access on the file /(null). For complete SELinux messages run: sealert -l d088fb43-23ee-4ae8-ae6a-5d1c041ee2d6 [x2]
Oct 11 18:26:04 submit26-b9-f1 setroubleshoot[2396442]: SELinux is preventing /usr/bin/python3.9 from open access on the file /tmp/libdnf.ZUHgw7/repodata/repomd.xml. For complete SELinux messages run: sealert -l 3b0d8c9a-6637-4d6e-a864-f1dd7c00377d [x2]
Oct 11 18:26:04 submit26-b9-f1 setroubleshoot[2396442]: SELinux is preventing /usr/bin/python3.9 from setattr access on the file repomd.xml. For complete SELinux messages run: sealert -l 0fd3339f-3ef2-45f3-9e58-65a58b42f3ee [x2]
Oct 11 18:26:04 submit26-b9-f1 setroubleshoot[2396442]: SELinux is preventing /usr/bin/python3.9 from read access on the directory libdnf.ZUHgw7. For complete SELinux messages run: sealert -l 0d661d88-dc9e-469d-986b-52e29b353aa8
Oct 11 18:26:04 submit26-b9-f1 setroubleshoot[2396442]: SELinux is preventing /usr/bin/python3.9 from remove_name access on the directory repomd.xml. For complete SELinux messages run: sealert -l 405a8556-cf9f-4ef4-8525-0dca18d4259d
Oct 11 18:26:04 submit26-b9-f1 setroubleshoot[2396442]: SELinux is preventing /usr/bin/python3.9 from unlink access on the file repomd.xml. For complete SELinux messages run: sealert -l 3c38e23e-3631-4cb5-81c7-992675c836d9
Oct 11 18:26:04 submit26-b9-f1 setroubleshoot[2396442]: SELinux is preventing /usr/bin/python3.9 from rmdir access on the directory repodata. For complete SELinux messages run: sealert -l a070e9b5-2867-47d6-b2e3-3b7d99725848
== submit26-b9-f2 (9 distinct, 11 total) ==
Oct 11 18:06:57 submit26-b9-f2 setroubleshoot[1485346]: SELinux is preventing /usr/bin/python3.9 from create access on the directory /(null). For complete SELinux messages run: sealert -l 0659d546-3107-4f75-b00f-008c85f41dc6 [x2]
Oct 11 18:06:57 submit26-b9-f2 setroubleshoot[1485346]: SELinux is preventing /usr/bin/python3.9 from add_name access on the directory /(null). For complete SELinux messages run: sealert -l 156d9270-3466-4356-b86f-1a128825961a [x2]
Oct 11 18:06:57 submit26-b9-f2 setroubleshoot[1485346]: SELinux is preventing /usr/bin/python3.9 from create access on the file /(null). For complete SELinux messages run: sealert -l c8a40bf5-2fc4-46b3-b813-8592b3523339
Oct 11 18:06:57 submit26-b9-f2 setroubleshoot[1485346]: SELinux is preventing /usr/bin/python3.9 from open access on the file /tmp/libdnf.WZV8cj/repodata/repomd.xml. For complete SELinux messages run: sealert -l 7f4c3a8e-0f99-47c4-9baf-e1336fe24876
Oct 11 18:06:57 submit26-b9-f2 setroubleshoot[1485346]: SELinux is preventing /usr/bin/python3.9 from setattr access on the file repomd.xml. For complete SELinux messages run: sealert -l 988123da-b724-4e6a-900c-33a2723fdaf1
Oct 11 18:06:57 submit26-b9-f2 setroubleshoot[1485346]: SELinux is preventing /usr/bin/python3.9 from read access on the directory libdnf.WZV8cj. For complete SELinux messages run: sealert -l ca585e2b-d50f-4264-8127-6b3fa04070c8
Oct 11 18:06:57 submit26-b9-f2 setroubleshoot[1485346]: SELinux is preventing /usr/bin/python3.9 from remove_name access on the directory repomd.xml. For complete SELinux messages run: sealert -l 3a749560-1cec-40ca-a4dc-596841be3885
Oct 11 18:06:57 submit26-b9-f2 setroubleshoot[1485346]: SELinux is preventing /usr/bin/python3.9 from unlink access on the file repomd.xml. For complete SELinux messages run: sealert -l 0aa52f08-94f8-474e-96d8-e818846941af
Oct 11 18:06:57 submit26-b9-f2 setroubleshoot[1485346]: SELinux is preventing /usr/bin/python3.9 from rmdir access on the directory repodata. For complete SELinux messages run: sealert -l de019dc4-408f-439c-902a-676d18dfe8e7
== tma-0 (1 distinct, 1 total) ==
Oct 11 18:07:25 tma-0 sshd[19560]: error: key_cert_check_authority: invalid certificate
== uffish.cs.umd.edu (1 distinct, 1 total) ==
Oct 11 18:07:24 uffish.cs.umd.edu sshd[4086355]: error: key_cert_check_authority: invalid certificate
== vacuum.cs.umd.edu (1 distinct, 1 total) ==
Oct 11 18:07:27 vacuum.cs.umd.edu sshd[16734]: error: key_cert_check_authority: invalid certificate
== whiffle.cs.umd.edu (1 distinct, 1 total) ==
Oct 11 18:07:24 whiffle.cs.umd.edu sshd[3547801]: error: key_cert_check_authority: invalid certificate
== yogurt (1 distinct, 2 total) ==
Oct 11 18:05:24 yogurt systemd[1]: Configuration file /usr/lib/systemd/system/gpd.service is marked executable. Please remove executable permission bits. Proceeding anyway. [x2]
1
0
Command: /usr/local/sbin/syslog-digest.py
Time : 0.1625s
Status : exited 0
Output :
Syslog digest — 2026-10-11 18:05 EDT
Processed 5,672 lines, filtered 3,034 (53%). 2,638 unknown (204 distinct) from 25 host(s).
== abuse (1 distinct, 348 total) ==
Oct 11 17:05:20 abuse rsyslogd[1033]: imjournal: open() failed for path: '/var/lib/rsyslog/imjournal.state.tmp': Input/output error [v8.2404.0 try https://www.rsyslog.com/e/2433 ] [x348]
== b0b02.cs.umd.edu (1 distinct, 1 total) ==
Oct 11 17:23:21 b0b02.cs.umd.edu rustdesk[2767543]: cannot open display:
== frozone (1 distinct, 1 total) ==
Oct 11 17:22:20 frozone systemd-tmpfiles[454522]: Failed to remove "/var/tmp/test.log", ignoring: Operation not permitted
== gle-dind04 (7 distinct, 7 total) ==
Oct 11 17:37:10 gle-dind04 systemd-coredump[934235]: Process 934232 (ctr) of user 0 dumped core.#012#012Stack trace of thread 934232:#012#0 0x000055574cdd12ee n/a (/usr/bin/ctr + 0xe2ee)#012#1 0x000055574cdf02c7 n/a (/usr/bin/ctr + 0x2d2c7)#012#2 0x000055574cdeffc9 n/a (/usr/bin/ctr + 0x2cfc9)#012#3 0x000055574cdeb1d0 n/a (/usr/bin/ctr + 0x281d0)#012#4 0x000055574cdeb0a8 n/a (/usr/bin/ctr + 0x280a8)#012#5 0x000055574cdeb065 n/a (/usr/bin/ctr + 0x28065)#012#6 0x000055574ce0fada n/a (/usr/bin/ctr + 0x4cada)#012#7 0x000055574ce09651 n/a (/usr/bin/ctr + 0x46651)#012#8 0x000055574ce057a5 n/a (/usr/bin/ctr + 0x427a5)#012#9 0x000055574cde8edd n/a (/usr/bin/ctr + 0x25edd)#012#10 0x000055574ce19b52 n/a (/usr/bin/ctr + 0x56b52)#012#11 0x000055574ce53a47 n/a (/usr/bin/ctr + 0x90a47)#012ELF object binary architecture: AMD x86-64
Oct 11 17:37:10 gle-dind04 systemd-coredump[934244]: Process 934242 (ctr) of user 0 dumped core.#012#012Stack trace of thread 934242:#012#0 0x000055c8474522ee n/a (/usr/bin/ctr + 0xe2ee)#012#1 0x000055c8474712c7 n/a (/usr/bin/ctr + 0x2d2c7)#012#2 0x000055c847470fc9 n/a (/usr/bin/ctr + 0x2cfc9)#012#3 0x000055c84746c1d0 n/a (/usr/bin/ctr + 0x281d0)#012#4 0x000055c84746c0a8 n/a (/usr/bin/ctr + 0x280a8)#012#5 0x000055c84746c065 n/a (/usr/bin/ctr + 0x28065)#012#6 0x000055c847490ada n/a (/usr/bin/ctr + 0x4cada)#012#7 0x000055c84748a651 n/a (/usr/bin/ctr + 0x46651)#012#8 0x000055c8474867a5 n/a (/usr/bin/ctr + 0x427a5)#012#9 0x000055c847469edd n/a (/usr/bin/ctr + 0x25edd)#012#10 0x000055c84749ab52 n/a (/usr/bin/ctr + 0x56b52)#012#11 0x000055c8474d4a47 n/a (/usr/bin/ctr + 0x90a47)#012ELF object binary architecture: AMD x86-64
Oct 11 17:37:10 gle-dind04 systemd-coredump[934251]: Process 934249 (ctr) of user 0 dumped core.#012#012Stack trace of thread 934249:#012#0 0x000055f05739c2ee n/a (/usr/bin/ctr + 0xe2ee)#012#1 0x000055f0573bb2c7 n/a (/usr/bin/ctr + 0x2d2c7)#012#2 0x000055f0573bafc9 n/a (/usr/bin/ctr + 0x2cfc9)#012#3 0x000055f0573b61d0 n/a (/usr/bin/ctr + 0x281d0)#012#4 0x000055f0573b60a8 n/a (/usr/bin/ctr + 0x280a8)#012#5 0x000055f0573b6065 n/a (/usr/bin/ctr + 0x28065)#012#6 0x000055f0573daada n/a (/usr/bin/ctr + 0x4cada)#012#7 0x000055f0573d4651 n/a (/usr/bin/ctr + 0x46651)#012#8 0x000055f0573d07a5 n/a (/usr/bin/ctr + 0x427a5)#012#9 0x000055f0573b3edd n/a (/usr/bin/ctr + 0x25edd)#012#10 0x000055f0573e4b52 n/a (/usr/bin/ctr + 0x56b52)#012#11 0x000055f05741ea47 n/a (/usr/bin/ctr + 0x90a47)#012ELF object binary architecture: AMD x86-64
Oct 11 17:37:10 gle-dind04 systemd-coredump[934258]: Process 934256 (ctr) of user 0 dumped core.#012#012Stack trace of thread 934256:#012#0 0x0000559321b532ee n/a (/usr/bin/ctr + 0xe2ee)#012#1 0x0000559321b722c7 n/a (/usr/bin/ctr + 0x2d2c7)#012#2 0x0000559321b71fc9 n/a (/usr/bin/ctr + 0x2cfc9)#012#3 0x0000559321b6d1d0 n/a (/usr/bin/ctr + 0x281d0)#012#4 0x0000559321b6d0a8 n/a (/usr/bin/ctr + 0x280a8)#012#5 0x0000559321b6d065 n/a (/usr/bin/ctr + 0x28065)#012#6 0x0000559321b91ada n/a (/usr/bin/ctr + 0x4cada)#012#7 0x0000559321b8b651 n/a (/usr/bin/ctr + 0x46651)#012#8 0x0000559321b877a5 n/a (/usr/bin/ctr + 0x427a5)#012#9 0x0000559321b6aedd n/a (/usr/bin/ctr + 0x25edd)#012#10 0x0000559321b9bb52 n/a (/usr/bin/ctr + 0x56b52)#012#11 0x0000559321bd5a47 n/a (/usr/bin/ctr + 0x90a47)#012ELF object binary architecture: AMD x86-64
Oct 11 17:37:11 gle-dind04 systemd-coredump[934265]: Process 934263 (ctr) of user 0 dumped core.#012#012Stack trace of thread 934263:#012#0 0x000055cb1bee22ee n/a (/usr/bin/ctr + 0xe2ee)#012#1 0x000055cb1bf012c7 n/a (/usr/bin/ctr + 0x2d2c7)#012#2 0x000055cb1bf00fc9 n/a (/usr/bin/ctr + 0x2cfc9)#012#3 0x000055cb1befc1d0 n/a (/usr/bin/ctr + 0x281d0)#012#4 0x000055cb1befc0a8 n/a (/usr/bin/ctr + 0x280a8)#012#5 0x000055cb1befc065 n/a (/usr/bin/ctr + 0x28065)#012#6 0x000055cb1bf20ada n/a (/usr/bin/ctr + 0x4cada)#012#7 0x000055cb1bf1a651 n/a (/usr/bin/ctr + 0x46651)#012#8 0x000055cb1bf167a5 n/a (/usr/bin/ctr + 0x427a5)#012#9 0x000055cb1bef9edd n/a (/usr/bin/ctr + 0x25edd)#012#10 0x000055cb1bf2ab52 n/a (/usr/bin/ctr + 0x56b52)#012#11 0x000055cb1bf64a47 n/a (/usr/bin/ctr + 0x90a47)#012ELF object binary architecture: AMD x86-64
Oct 11 17:37:11 gle-dind04 systemd-coredump[934272]: Process 934270 (ctr) of user 0 dumped core.#012#012Stack trace of thread 934270:#012#0 0x0000557a969632ee n/a (/usr/bin/ctr + 0xe2ee)#012#1 0x0000557a969822c7 n/a (/usr/bin/ctr + 0x2d2c7)#012#2 0x0000557a96981fc9 n/a (/usr/bin/ctr + 0x2cfc9)#012#3 0x0000557a9697d1d0 n/a (/usr/bin/ctr + 0x281d0)#012#4 0x0000557a9697d0a8 n/a (/usr/bin/ctr + 0x280a8)#012#5 0x0000557a9697d065 n/a (/usr/bin/ctr + 0x28065)#012#6 0x0000557a969a1ada n/a (/usr/bin/ctr + 0x4cada)#012#7 0x0000557a9699b651 n/a (/usr/bin/ctr + 0x46651)#012#8 0x0000557a969977a5 n/a (/usr/bin/ctr + 0x427a5)#012#9 0x0000557a9697aedd n/a (/usr/bin/ctr + 0x25edd)#012#10 0x0000557a969abb52 n/a (/usr/bin/ctr + 0x56b52)#012#11 0x0000557a969e5a47 n/a (/usr/bin/ctr + 0x90a47)#012ELF object binary architecture: AMD x86-64
Oct 11 17:37:11 gle-dind04 systemd-coredump[934279]: Process 934276 (ctr) of user 0 dumped core.#012#012Stack trace of thread 934276:#012#0 0x000055b2d49942ee n/a (/usr/bin/ctr + 0xe2ee)#012#1 0x000055b2d49b32c7 n/a (/usr/bin/ctr + 0x2d2c7)#012#2 0x000055b2d49b2fc9 n/a (/usr/bin/ctr + 0x2cfc9)#012#3 0x000055b2d49ae1d0 n/a (/usr/bin/ctr + 0x281d0)#012#4 0x000055b2d49ae0a8 n/a (/usr/bin/ctr + 0x280a8)#012#5 0x000055b2d49ae065 n/a (/usr/bin/ctr + 0x28065)#012#6 0x000055b2d49d2ada n/a (/usr/bin/ctr + 0x4cada)#012#7 0x000055b2d49cc651 n/a (/usr/bin/ctr + 0x46651)#012#8 0x000055b2d49c87a5 n/a (/usr/bin/ctr + 0x427a5)#012#9 0x000055b2d49abedd n/a (/usr/bin/ctr + 0x25edd)#012#10 0x000055b2d49dcb52 n/a (/usr/bin/ctr + 0x56b52)#012#11 0x000055b2d4a16a47 n/a (/usr/bin/ctr + 0x90a47)#012ELF object binary architecture: AMD x86-64
== idm00 (1 distinct, 1 total) ==
Oct 11 17:54:45 idm00 named[2816192]: client @0x7fd0f93c1078 10.73.240.42#59735: update '73.10.in-addr.arpa/IN' denied
== idmh1 (14 distinct, 168 total) ==
Oct 11 17:08:29 idmh1 check-named-alive[715297]: zone cs.umd.edu: local SOA serial 1791691201 lags newest peer 1791695702 by 4501 (threshold 3600); not acting [x12]
Oct 11 17:08:29 idmh1 check-named-alive[715358]: zone csdlabs.umd.edu: local SOA serial 1791691201 lags newest peer 1791695702 by 4501 (threshold 3600); not acting [x12]
Oct 11 17:08:29 idmh1 check-named-alive[715419]: zone csic.umd.edu: local SOA serial 1791691201 lags newest peer 1791695702 by 4501 (threshold 3600); not acting [x12]
Oct 11 17:08:29 idmh1 check-named-alive[715480]: zone 72.10.in-addr.arpa: local SOA serial 1791691201 lags newest peer 1791695702 by 4501 (threshold 3600); not acting [x12]
Oct 11 17:08:30 idmh1 check-named-alive[715544]: zone 73.10.in-addr.arpa: local SOA serial 1791691201 lags newest peer 1791695702 by 4501 (threshold 3600); not acting [x12]
Oct 11 17:08:30 idmh1 check-named-alive[715605]: zone 88.10.in-addr.arpa: local SOA serial 1791691201 lags newest peer 1791695702 by 4501 (threshold 3600); not acting [x12]
Oct 11 17:08:30 idmh1 check-named-alive[715668]: zone 28.172.in-addr.arpa: local SOA serial 1791691201 lags newest peer 1791695702 by 4501 (threshold 3600); not acting [x12]
Oct 11 17:08:30 idmh1 check-named-alive[715731]: zone 125.8.128.in-addr.arpa: local SOA serial 1791691201 lags newest peer 1791695702 by 4501 (threshold 3600); not acting [x12]
Oct 11 17:08:30 idmh1 check-named-alive[715808]: zone 126.8.128.in-addr.arpa: local SOA serial 1791691201 lags newest peer 1791695702 by 4501 (threshold 3600); not acting [x12]
Oct 11 17:08:31 idmh1 check-named-alive[715907]: zone 127.8.128.in-addr.arpa: local SOA serial 1791691201 lags newest peer 1791695702 by 4501 (threshold 3600); not acting [x12]
Oct 11 17:08:31 idmh1 check-named-alive[715968]: zone 128.8.128.in-addr.arpa: local SOA serial 1791691201 lags newest peer 1791695702 by 4501 (threshold 3600); not acting [x12]
Oct 11 17:08:31 idmh1 check-named-alive[716029]: zone 129.8.128.in-addr.arpa: local SOA serial 1791691201 lags newest peer 1791695702 by 4501 (threshold 3600); not acting [x12]
Oct 11 17:08:31 idmh1 check-named-alive[716090]: zone 130.8.128.in-addr.arpa: local SOA serial 1791691201 lags newest peer 1791695702 by 4501 (threshold 3600); not acting [x12]
Oct 11 17:08:31 idmh1 check-named-alive[716156]: zone 131.8.128.in-addr.arpa: local SOA serial 1791691201 lags newest peer 1791695702 by 4501 (threshold 3600); not acting [x12]
== idmp0 (15 distinct, 169 total) ==
Oct 11 17:08:31 idmp0 check-named-alive[392199]: zone cs.umd.edu: local SOA serial 1791691939 lags newest peer 1791695702 by 3763 (threshold 3600); not acting [x12]
Oct 11 17:08:31 idmp0 check-named-alive[392260]: zone csdlabs.umd.edu: local SOA serial 1791691940 lags newest peer 1791695702 by 3762 (threshold 3600); not acting [x12]
Oct 11 17:08:32 idmp0 check-named-alive[392321]: zone csic.umd.edu: local SOA serial 1791691940 lags newest peer 1791695702 by 3762 (threshold 3600); not acting [x12]
Oct 11 17:08:32 idmp0 check-named-alive[392382]: zone 72.10.in-addr.arpa: local SOA serial 1791691940 lags newest peer 1791695702 by 3762 (threshold 3600); not acting [x12]
Oct 11 17:08:32 idmp0 check-named-alive[392443]: zone 73.10.in-addr.arpa: local SOA serial 1791691940 lags newest peer 1791695702 by 3762 (threshold 3600); not acting [x12]
Oct 11 17:08:33 idmp0 check-named-alive[392504]: zone 88.10.in-addr.arpa: local SOA serial 1791691940 lags newest peer 1791695702 by 3762 (threshold 3600); not acting [x12]
Oct 11 17:08:33 idmp0 check-named-alive[392565]: zone 28.172.in-addr.arpa: local SOA serial 1791691940 lags newest peer 1791695702 by 3762 (threshold 3600); not acting [x12]
Oct 11 17:08:33 idmp0 check-named-alive[392626]: zone 125.8.128.in-addr.arpa: local SOA serial 1791691940 lags newest peer 1791695702 by 3762 (threshold 3600); not acting [x12]
Oct 11 17:08:34 idmp0 check-named-alive[392687]: zone 126.8.128.in-addr.arpa: local SOA serial 1791691940 lags newest peer 1791695702 by 3762 (threshold 3600); not acting [x12]
Oct 11 17:08:34 idmp0 check-named-alive[392748]: zone 127.8.128.in-addr.arpa: local SOA serial 1791691939 lags newest peer 1791695702 by 3763 (threshold 3600); not acting [x12]
Oct 11 17:08:34 idmp0 check-named-alive[392809]: zone 128.8.128.in-addr.arpa: local SOA serial 1791691939 lags newest peer 1791695702 by 3763 (threshold 3600); not acting [x12]
Oct 11 17:08:34 idmp0 check-named-alive[392870]: zone 129.8.128.in-addr.arpa: local SOA serial 1791691939 lags newest peer 1791695702 by 3763 (threshold 3600); not acting [x12]
Oct 11 17:08:35 idmp0 check-named-alive[392931]: zone 130.8.128.in-addr.arpa: local SOA serial 1791691940 lags newest peer 1791695702 by 3762 (threshold 3600); not acting [x12]
Oct 11 17:08:35 idmp0 check-named-alive[392995]: zone 131.8.128.in-addr.arpa: local SOA serial 1791691940 lags newest peer 1791695702 by 3762 (threshold 3600); not acting [x12]
Oct 11 17:39:21 idmp0 named[61110]: client @0x7fd7f4036c28 10.73.240.43#49236: update '73.10.in-addr.arpa/IN' denied
== idmv0 (15 distinct, 170 total) ==
Oct 11 17:06:20 idmv0 check-named-alive[3673433]: zone cs.umd.edu: local SOA serial 1791691202 lags newest peer 1791695702 by 4500 (threshold 3600); not acting [x12]
Oct 11 17:06:20 idmv0 check-named-alive[3673494]: zone csdlabs.umd.edu: local SOA serial 1791691202 lags newest peer 1791695702 by 4500 (threshold 3600); not acting [x12]
Oct 11 17:06:20 idmv0 check-named-alive[3673555]: zone csic.umd.edu: local SOA serial 1791691202 lags newest peer 1791695702 by 4500 (threshold 3600); not acting [x12]
Oct 11 17:06:21 idmv0 check-named-alive[3673616]: zone 72.10.in-addr.arpa: local SOA serial 1791691202 lags newest peer 1791695702 by 4500 (threshold 3600); not acting [x12]
Oct 11 17:06:21 idmv0 check-named-alive[3673677]: zone 73.10.in-addr.arpa: local SOA serial 1791691202 lags newest peer 1791695702 by 4500 (threshold 3600); not acting [x12]
Oct 11 17:06:21 idmv0 check-named-alive[3673738]: zone 88.10.in-addr.arpa: local SOA serial 1791691202 lags newest peer 1791695702 by 4500 (threshold 3600); not acting [x12]
Oct 11 17:06:21 idmv0 check-named-alive[3673799]: zone 28.172.in-addr.arpa: local SOA serial 1791691202 lags newest peer 1791695702 by 4500 (threshold 3600); not acting [x12]
Oct 11 17:06:21 idmv0 check-named-alive[3673861]: zone 125.8.128.in-addr.arpa: local SOA serial 1791691202 lags newest peer 1791695702 by 4500 (threshold 3600); not acting [x12]
Oct 11 17:06:21 idmv0 check-named-alive[3673922]: zone 126.8.128.in-addr.arpa: local SOA serial 1791691202 lags newest peer 1791695702 by 4500 (threshold 3600); not acting [x12]
Oct 11 17:06:22 idmv0 check-named-alive[3673985]: zone 127.8.128.in-addr.arpa: local SOA serial 1791691202 lags newest peer 1791695702 by 4500 (threshold 3600); not acting [x12]
Oct 11 17:06:22 idmv0 check-named-alive[3674046]: zone 128.8.128.in-addr.arpa: local SOA serial 1791691202 lags newest peer 1791695702 by 4500 (threshold 3600); not acting [x12]
Oct 11 17:06:22 idmv0 check-named-alive[3674107]: zone 129.8.128.in-addr.arpa: local SOA serial 1791691202 lags newest peer 1791695702 by 4500 (threshold 3600); not acting [x12]
Oct 11 17:06:22 idmv0 check-named-alive[3674168]: zone 130.8.128.in-addr.arpa: local SOA serial 1791691202 lags newest peer 1791695702 by 4500 (threshold 3600); not acting [x12]
Oct 11 17:06:22 idmv0 check-named-alive[3674229]: zone 131.8.128.in-addr.arpa: local SOA serial 1791691202 lags newest peer 1791695702 by 4500 (threshold 3600); not acting [x12]
Oct 11 18:04:04 idmv0 named[3689763]: checkhints: unable to get root NS rrset from cache: not found [x2]
== inbound01.cs.umd.edu (1 distinct, 1 total) ==
Oct 11 18:04:25 inbound01.cs.umd.edu systemd[1]: Configuration file /usr/lib/systemd/system/authentication_milter.service is marked executable. Please remove executable permission bits. Proceeding anyway.
== itmon02 (1 distinct, 2 total) ==
Oct 11 17:23:37 itmon02 sshd[805675]: error: beginning MaxStartups throttling [x2]
== kadath.cs.umd.edu (1 distinct, 1 total) ==
Oct 11 18:02:51 kadath.cs.umd.edu puppet-agent[1258046]: (Facter) invalid or malformed lldp data: MalformedDataError: no lldp interface data found
== munin (2 distinct, 12 total) ==
Oct 11 17:08:55 munin sudo[3465344]: pam_systemd(sudo:session): Failed to stat() runtime directory '/run/user/0': No such file or directory [x6]
Oct 11 17:08:55 munin sudo[3465344]: pam_systemd(sudo:session): Not setting $XDG_RUNTIME_DIR, as the directory is not in order. [x6]
== neoavion (1 distinct, 1 total) ==
Oct 11 17:05:46 neoavion pipewire[928954]: mod.jackdbus-detect: Failed to receive jackdbus reply: org.freedesktop.DBus.Error.ServiceUnknown: The name org.jackaudio.service was not provided by any .service files
== netman.cs.umd.edu (1 distinct, 2 total) ==
Oct 11 17:07:28 netman.cs.umd.edu krb5_child[2018880]: Client 'george(a)UMD.EDU' not found in Kerberos database [x2]
== newhonors2 (1 distinct, 24 total) ==
Oct 11 17:13:03 newhonors2 dhcpcd[3887864]: dhcpcd is not running [x24]
== ntop00 (96 distinct, 96 total) ==
Oct 11 17:05:01 ntop00 sfacctd[1075592]: INFO ( m1/mysql ): *** Purging cache - START (PID: 7138) ***
Oct 11 17:05:01 ntop00 nfacctd[1075699]: INFO ( m1/mysql ): *** Purging cache - START (PID: 7138) ***
Oct 11 17:05:01 ntop00 nfacctd[1075699]: INFO ( m1/mysql ): *** Purging cache - END (PID: 7138, QN: 71/71, ET: 0) ***
Oct 11 17:05:15 ntop00 sfacctd[1075592]: INFO ( m1/mysql ): *** Purging cache - END (PID: 7138, QN: 6195/6195, ET: 14) ***
Oct 11 17:08:01 ntop00 sfacctd[1075592]: INFO ( p1/print ): *** Purging cache - START (PID: 7139) ***
Oct 11 17:08:01 ntop00 sfacctd[1075592]: INFO ( p1/print ): *** Purging cache - END (PID: 7139, QN: 6303/6303, ET: 0) ***
Oct 11 17:08:01 ntop00 nfacctd[1075699]: INFO ( p1/print ): *** Purging cache - START (PID: 7139) ***
Oct 11 17:08:01 ntop00 nfacctd[1075699]: INFO ( p1/print ): *** Purging cache - END (PID: 7139, QN: 62/62, ET: 0) ***
Oct 11 17:10:01 ntop00 sfacctd[1075592]: INFO ( m1/mysql ): *** Purging cache - START (PID: 7140) ***
Oct 11 17:10:01 ntop00 nfacctd[1075699]: INFO ( m1/mysql ): *** Purging cache - START (PID: 7140) ***
Oct 11 17:10:01 ntop00 nfacctd[1075699]: INFO ( m1/mysql ): *** Purging cache - END (PID: 7140, QN: 76/76, ET: 0) ***
Oct 11 17:10:13 ntop00 sfacctd[1075592]: INFO ( m1/mysql ): *** Purging cache - END (PID: 7140, QN: 6245/6245, ET: 12) ***
Oct 11 17:13:01 ntop00 sfacctd[1075592]: INFO ( p1/print ): *** Purging cache - START (PID: 7141) ***
Oct 11 17:13:01 ntop00 sfacctd[1075592]: INFO ( p1/print ): *** Purging cache - END (PID: 7141, QN: 6174/6174, ET: 0) ***
Oct 11 17:13:01 ntop00 nfacctd[1075699]: INFO ( p1/print ): *** Purging cache - START (PID: 7141) ***
Oct 11 17:13:01 ntop00 nfacctd[1075699]: INFO ( p1/print ): *** Purging cache - END (PID: 7141, QN: 86/86, ET: 0) ***
Oct 11 17:15:01 ntop00 sfacctd[1075592]: INFO ( m1/mysql ): *** Purging cache - START (PID: 7142) ***
Oct 11 17:15:01 ntop00 nfacctd[1075699]: INFO ( m1/mysql ): *** Purging cache - START (PID: 7142) ***
Oct 11 17:15:01 ntop00 nfacctd[1075699]: INFO ( m1/mysql ): *** Purging cache - END (PID: 7142, QN: 96/96, ET: 0) ***
Oct 11 17:15:14 ntop00 sfacctd[1075592]: INFO ( m1/mysql ): *** Purging cache - END (PID: 7142, QN: 6215/6215, ET: 13) ***
Oct 11 17:18:01 ntop00 sfacctd[1075592]: INFO ( p1/print ): *** Purging cache - START (PID: 7143) ***
Oct 11 17:18:01 ntop00 sfacctd[1075592]: INFO ( p1/print ): *** Purging cache - END (PID: 7143, QN: 6452/6452, ET: 0) ***
Oct 11 17:18:01 ntop00 nfacctd[1075699]: INFO ( p1/print ): *** Purging cache - START (PID: 7143) ***
Oct 11 17:18:01 ntop00 nfacctd[1075699]: INFO ( p1/print ): *** Purging cache - END (PID: 7143, QN: 79/79, ET: 0) ***
Oct 11 17:20:01 ntop00 sfacctd[1075592]: INFO ( m1/mysql ): *** Purging cache - START (PID: 7144) ***
Oct 11 17:20:01 ntop00 nfacctd[1075699]: INFO ( m1/mysql ): *** Purging cache - START (PID: 7144) ***
Oct 11 17:20:01 ntop00 nfacctd[1075699]: INFO ( m1/mysql ): *** Purging cache - END (PID: 7144, QN: 72/72, ET: 0) ***
Oct 11 17:20:16 ntop00 sfacctd[1075592]: INFO ( m1/mysql ): *** Purging cache - END (PID: 7144, QN: 6282/6282, ET: 15) ***
Oct 11 17:23:01 ntop00 sfacctd[1075592]: INFO ( p1/print ): *** Purging cache - START (PID: 7145) ***
Oct 11 17:23:01 ntop00 sfacctd[1075592]: INFO ( p1/print ): *** Purging cache - END (PID: 7145, QN: 6318/6318, ET: 0) ***
... 66 more distinct messages not shown
== outbound00.cs.umd.edu (1 distinct, 7 total) ==
Oct 11 17:09:09 outbound00.cs.umd.edu python3[1680533]: ldapdb [x7]
== outbound01.cs.umd.edu (1 distinct, 7 total) ==
Oct 11 17:13:06 outbound01.cs.umd.edu python3[3159705]: ldapdb [x7]
== quiss (7 distinct, 10 total) ==
Oct 11 17:08:37 quiss gnome-software[191719]: failed to commit changes to dconf: GDBus.Error:org.gtk.GDBus.UnmappedGError.Quark._g_2dfile_2derror_2dquark.Code2: Failed to create file “/adminhomes/josephao/.config/dconf/user.ZSJPW3”: Permission denied
Oct 11 17:08:40 quiss gnome-software[191719]: failed to get featured apps: no apps to show
Oct 11 17:08:40 quiss gnome-software[191719]: Only 0 apps for curated list, hiding
Oct 11 17:08:40 quiss gnome-software[191719]: Only 0 apps for recent list, hiding
Oct 11 17:08:44 quiss packagekitd[1347864]: Failed to get cache filename for gnome-control-center-filesystem [x2]
Oct 11 17:08:44 quiss packagekitd[1347864]: Failed to get cache filename for perl [x2]
Oct 11 17:08:44 quiss packagekitd[1347864]: Failed to get cache filename for kernel [x2]
== strawberry (7 distinct, 44 total) ==
Oct 11 17:07:03 strawberry kernel: I/O error, dev sda, sector 206848 op 0x0:(READ) flags 0x80700 phys_seg 1 prio class 2 [x7]
Oct 11 17:07:03 strawberry kernel: I/O error, dev sda, sector 206848 op 0x0:(READ) flags 0x0 phys_seg 1 prio class 2 [x7]
Oct 11 17:07:03 strawberry kernel: Buffer I/O error on dev sda2, logical block 0, async page read [x7]
Oct 11 17:07:03 strawberry kernel: I/O error, dev sda, sector 2048 op 0x0:(READ) flags 0x80700 phys_seg 1 prio class 2 [x7]
Oct 11 17:07:03 strawberry kernel: I/O error, dev sda, sector 2048 op 0x0:(READ) flags 0x0 phys_seg 1 prio class 2 [x7]
Oct 11 17:07:03 strawberry kernel: Buffer I/O error on dev sda1, logical block 0, async page read [x7]
Oct 11 17:34:42 strawberry smartd[5314]: Device: /dev/sda [SAT], failed to read SMART Attribute Data [x2]
== submit10-cln25 (5 distinct, 1539 total) ==
Oct 11 17:05:22 submit10-cln25 rsyslogd: file '/var/log/messages': open error: Input/output error [v8.24.0-57.el7_9.3 try http://www.rsyslog.com/e/2433 ] [x1200]
Oct 11 17:05:22 submit10-cln25 rsyslogd: imjournal: fopen() failed for path: '/var/lib/rsyslog/imjournal.state.tmp': Input/output error [v8.24.0-57.el7_9.3 try http://www.rsyslog.com/e/2013 ] [x334]
Oct 11 17:25:00 submit10-cln25 systemd: Failed at step USER spawning /usr/libexec/pcp/bin/pmlogger_check: Input/output error [x2]
Oct 11 17:28:00 submit10-cln25 systemd: Failed at step USER spawning /usr/libexec/pcp/bin/pmie_check: Input/output error [x2]
Oct 11 17:30:00 submit10-cln25 systemd: Failed at step USER spawning /usr/libexec/pcp/bin/pmlogger_daily: Input/output error
== submit26-b9-3 (5 distinct, 6 total) ==
Sep 14 00:13:22 submit26-b9-3 systemd[1]: user(a)1001.service: Main process exited, code=killed, status=9/KILL [x2]
Sep 14 00:13:25 submit26-b9-3 systemd-coredump[3053828]: Process 3053825 (release02) of user 1001 dumped core.#012#012Stack trace of thread 3053825:#012#0 0x0000000000402387 highlight_text (release02 + 0x2387)#012#1 0x0000000000401593 main (release02 + 0x1593)#012#2 0x5d5d5d5d5d5d5d5d n/a (n/a + 0x0)#012ELF object binary architecture: AMD x86-64
Sep 14 00:14:26 submit26-b9-3 systemd-coredump[3053856]: Process 3053853 (secret02) of user 1001 dumped core.#012#012Stack trace of thread 3053853:#012#0 0x00007f6e4b48d02c __pthread_kill_implementation (libc.so.6 + 0x8d02c)#012#1 0x00007f6e4b43fb86 raise (libc.so.6 + 0x3fb86)#012#2 0x00007f6e4b429873 abort (libc.so.6 + 0x29873)#012#3 0x00007f6e4b42a1b2 __libc_message.cold (libc.so.6 + 0x2a1b2)#012#4 0x00007f6e4b51d19b __fortify_fail (libc.so.6 + 0x11d19b)#012#5 0x00007f6e4b51e416 __stack_chk_fail (libc.so.6 + 0x11e416)#012#6 0x0000000000401241 main (secret02 + 0x1241)#012ELF object binary architecture: AMD x86-64
Sep 14 00:35:08 submit26-b9-3 systemd-coredump[3055756]: Process 3055753 (release02) of user 1001 dumped core.#012#012Stack trace of thread 3055753:#012#0 0x0000000000402387 highlight_text (release02 + 0x2387)#012#1 0x0000000000401593 main (release02 + 0x1593)#012#2 0x5d5d5d5d5d5d5d5d n/a (n/a + 0x0)#012ELF object binary architecture: AMD x86-64
Sep 14 00:36:10 submit26-b9-3 systemd-coredump[3055785]: Process 3055782 (secret02) of user 1001 dumped core.#012#012Stack trace of thread 3055782:#012#0 0x00007fa23dc8d02c __pthread_kill_implementation (libc.so.6 + 0x8d02c)#012#1 0x00007fa23dc3fb86 raise (libc.so.6 + 0x3fb86)#012#2 0x00007fa23dc29873 abort (libc.so.6 + 0x29873)#012#3 0x00007fa23dc2a1b2 __libc_message.cold (libc.so.6 + 0x2a1b2)#012#4 0x00007fa23dd1d19b __fortify_fail (libc.so.6 + 0x11d19b)#012#5 0x00007fa23dd1e416 __stack_chk_fail (libc.so.6 + 0x11e416)#012#6 0x0000000000401241 main (secret02 + 0x1241)#012ELF object binary architecture: AMD x86-64
== submit26-b9-f3 (9 distinct, 11 total) ==
Oct 11 17:06:50 submit26-b9-f3 setroubleshoot[2897985]: SELinux is preventing /usr/bin/python3.9 from create access on the directory /(null). For complete SELinux messages run: sealert -l a653b772-cbcd-438b-bae5-23c3dc69b31b [x2]
Oct 11 17:06:50 submit26-b9-f3 setroubleshoot[2897985]: SELinux is preventing /usr/bin/python3.9 from add_name access on the directory /(null). For complete SELinux messages run: sealert -l 3e904634-6caa-4202-8c92-f139db798859 [x2]
Oct 11 17:06:50 submit26-b9-f3 setroubleshoot[2897985]: SELinux is preventing /usr/bin/python3.9 from create access on the file /(null). For complete SELinux messages run: sealert -l 580b20e4-ec2c-433d-905c-5bd417fba033
Oct 11 17:06:50 submit26-b9-f3 setroubleshoot[2897985]: SELinux is preventing /usr/bin/python3.9 from open access on the file /tmp/libdnf.bxKq0P/repodata/repomd.xml. For complete SELinux messages run: sealert -l 27f29d48-5e7c-4db7-b051-8ac055737d6f
Oct 11 17:06:50 submit26-b9-f3 setroubleshoot[2897985]: SELinux is preventing /usr/bin/python3.9 from setattr access on the file repomd.xml. For complete SELinux messages run: sealert -l bff72452-d40a-430b-9060-dd0a48f5b6ba
Oct 11 17:06:50 submit26-b9-f3 setroubleshoot[2897985]: SELinux is preventing /usr/bin/python3.9 from read access on the directory libdnf.bxKq0P. For complete SELinux messages run: sealert -l 9638d396-8ce5-4e6a-ae47-45cd3985e1cd
Oct 11 17:06:51 submit26-b9-f3 setroubleshoot[2897985]: SELinux is preventing /usr/bin/python3.9 from remove_name access on the directory repomd.xml. For complete SELinux messages run: sealert -l 6da64b94-7024-45a9-b8c2-3b9812517407
Oct 11 17:06:51 submit26-b9-f3 setroubleshoot[2897985]: SELinux is preventing /usr/bin/python3.9 from unlink access on the file repomd.xml. For complete SELinux messages run: sealert -l 64cbe179-abf1-4d5a-bade-bb164897ee65
Oct 11 17:06:51 submit26-b9-f3 setroubleshoot[2897985]: SELinux is preventing /usr/bin/python3.9 from rmdir access on the directory repodata. For complete SELinux messages run: sealert -l d2e35b1a-e27c-4f91-9217-2bb1204e1e68
== submit26-b9-f4 (9 distinct, 9 total) ==
Oct 11 17:24:56 submit26-b9-f4 setroubleshoot[855763]: SELinux is preventing /usr/bin/python3.9 from create access on the directory /(null). For complete SELinux messages run: sealert -l ee160f23-b161-4f4a-9985-c4edfd3a5beb
Oct 11 17:24:56 submit26-b9-f4 setroubleshoot[855763]: SELinux is preventing /usr/bin/python3.9 from add_name access on the directory /(null). For complete SELinux messages run: sealert -l 89a83821-4b24-4081-9973-0a79ca6ed5b4
Oct 11 17:24:56 submit26-b9-f4 setroubleshoot[855763]: SELinux is preventing /usr/bin/python3.9 from create access on the file /(null). For complete SELinux messages run: sealert -l f73955d6-1416-45f9-bab6-ff1f3ea07e9d
Oct 11 17:24:56 submit26-b9-f4 setroubleshoot[855763]: SELinux is preventing /usr/bin/python3.9 from open access on the file /tmp/libdnf.UXzlwP/repodata/repomd.xml. For complete SELinux messages run: sealert -l 9f8f24a0-8fb6-454d-a103-31a8f7a6efa0
Oct 11 17:24:56 submit26-b9-f4 setroubleshoot[855763]: SELinux is preventing /usr/bin/python3.9 from setattr access on the file repomd.xml. For complete SELinux messages run: sealert -l 20293136-86a3-40ba-a651-cff48d36059e
Oct 11 17:24:56 submit26-b9-f4 setroubleshoot[855763]: SELinux is preventing /usr/bin/python3.9 from read access on the directory libdnf.UXzlwP. For complete SELinux messages run: sealert -l 25f86b49-4ee7-4f60-ad1c-73a70032560c
Oct 11 17:24:56 submit26-b9-f4 setroubleshoot[855763]: SELinux is preventing /usr/bin/python3.9 from remove_name access on the directory repomd.xml. For complete SELinux messages run: sealert -l eec250fb-073f-456d-93bc-f98776fd476d
Oct 11 17:24:56 submit26-b9-f4 setroubleshoot[855763]: SELinux is preventing /usr/bin/python3.9 from unlink access on the file repomd.xml. For complete SELinux messages run: sealert -l c9209e04-a349-43d5-8cb2-3e303e48df74
Oct 11 17:24:56 submit26-b9-f4 setroubleshoot[855763]: SELinux is preventing /usr/bin/python3.9 from rmdir access on the directory repodata. For complete SELinux messages run: sealert -l 3178d5f5-80e9-404b-92b7-9bef397a8915
== teaching-awards (1 distinct, 1 total) ==
Oct 11 17:18:58 teaching-awards krb5_child[377648]: Client 'admin(a)UMD.EDU' not found in Kerberos database
1
0
Command: /usr/local/sbin/syslog-digest.py
Time : 0.1665s
Status : exited 0
Output :
Syslog digest — 2026-10-11 17:05 EDT
Processed 5,573 lines, filtered 2,962 (53%). 2,611 unknown (188 distinct) from 24 host(s).
== abuse (1 distinct, 346 total) ==
Oct 11 16:05:03 abuse rsyslogd[1033]: imjournal: open() failed for path: '/var/lib/rsyslog/imjournal.state.tmp': Input/output error [v8.2404.0 try https://www.rsyslog.com/e/2433 ] [x346]
== b0b02.cs.umd.edu (1 distinct, 1 total) ==
Oct 11 16:23:17 b0b02.cs.umd.edu rustdesk[2752448]: cannot open display:
== idm00 (1 distinct, 1 total) ==
Oct 11 16:54:45 idm00 named[2816192]: client @0x7fd0f4042088 10.73.240.42#57923: update '73.10.in-addr.arpa/IN' denied
== idmh1 (14 distinct, 168 total) ==
Oct 11 16:08:22 idmh1 check-named-alive[681440]: zone cs.umd.edu: local SOA serial 1791691201 lags newest peer 1791695702 by 4501 (threshold 3600); not acting [x12]
Oct 11 16:08:22 idmh1 check-named-alive[681501]: zone csdlabs.umd.edu: local SOA serial 1791691201 lags newest peer 1791695702 by 4501 (threshold 3600); not acting [x12]
Oct 11 16:08:22 idmh1 check-named-alive[681562]: zone csic.umd.edu: local SOA serial 1791691201 lags newest peer 1791695702 by 4501 (threshold 3600); not acting [x12]
Oct 11 16:08:22 idmh1 check-named-alive[681623]: zone 72.10.in-addr.arpa: local SOA serial 1791691201 lags newest peer 1791695702 by 4501 (threshold 3600); not acting [x12]
Oct 11 16:08:22 idmh1 check-named-alive[681684]: zone 73.10.in-addr.arpa: local SOA serial 1791691201 lags newest peer 1791695702 by 4501 (threshold 3600); not acting [x12]
Oct 11 16:08:23 idmh1 check-named-alive[681745]: zone 88.10.in-addr.arpa: local SOA serial 1791691201 lags newest peer 1791695702 by 4501 (threshold 3600); not acting [x12]
Oct 11 16:08:23 idmh1 check-named-alive[681808]: zone 28.172.in-addr.arpa: local SOA serial 1791691201 lags newest peer 1791695702 by 4501 (threshold 3600); not acting [x12]
Oct 11 16:08:23 idmh1 check-named-alive[681869]: zone 125.8.128.in-addr.arpa: local SOA serial 1791691201 lags newest peer 1791695702 by 4501 (threshold 3600); not acting [x12]
Oct 11 16:08:23 idmh1 check-named-alive[681930]: zone 126.8.128.in-addr.arpa: local SOA serial 1791691201 lags newest peer 1791695702 by 4501 (threshold 3600); not acting [x12]
Oct 11 16:08:23 idmh1 check-named-alive[681992]: zone 127.8.128.in-addr.arpa: local SOA serial 1791691201 lags newest peer 1791695702 by 4501 (threshold 3600); not acting [x12]
Oct 11 16:08:24 idmh1 check-named-alive[682054]: zone 128.8.128.in-addr.arpa: local SOA serial 1791691201 lags newest peer 1791695702 by 4501 (threshold 3600); not acting [x12]
Oct 11 16:08:24 idmh1 check-named-alive[682120]: zone 129.8.128.in-addr.arpa: local SOA serial 1791691201 lags newest peer 1791695702 by 4501 (threshold 3600); not acting [x12]
Oct 11 16:08:24 idmh1 check-named-alive[682181]: zone 130.8.128.in-addr.arpa: local SOA serial 1791691201 lags newest peer 1791695702 by 4501 (threshold 3600); not acting [x12]
Oct 11 16:08:24 idmh1 check-named-alive[682244]: zone 131.8.128.in-addr.arpa: local SOA serial 1791691201 lags newest peer 1791695702 by 4501 (threshold 3600); not acting [x12]
== idmp0 (15 distinct, 169 total) ==
Oct 11 16:08:27 idmp0 check-named-alive[371722]: zone cs.umd.edu: local SOA serial 1791691939 lags newest peer 1791695702 by 3763 (threshold 3600); not acting [x12]
Oct 11 16:08:28 idmp0 check-named-alive[371799]: zone csdlabs.umd.edu: local SOA serial 1791691940 lags newest peer 1791695702 by 3762 (threshold 3600); not acting [x12]
Oct 11 16:08:28 idmp0 check-named-alive[371860]: zone csic.umd.edu: local SOA serial 1791691940 lags newest peer 1791695702 by 3762 (threshold 3600); not acting [x12]
Oct 11 16:08:28 idmp0 check-named-alive[371921]: zone 72.10.in-addr.arpa: local SOA serial 1791691940 lags newest peer 1791695702 by 3762 (threshold 3600); not acting [x12]
Oct 11 16:08:29 idmp0 check-named-alive[371982]: zone 73.10.in-addr.arpa: local SOA serial 1791691940 lags newest peer 1791695702 by 3762 (threshold 3600); not acting [x12]
Oct 11 16:08:29 idmp0 check-named-alive[372043]: zone 88.10.in-addr.arpa: local SOA serial 1791691940 lags newest peer 1791695702 by 3762 (threshold 3600); not acting [x12]
Oct 11 16:08:29 idmp0 check-named-alive[372104]: zone 28.172.in-addr.arpa: local SOA serial 1791691940 lags newest peer 1791695702 by 3762 (threshold 3600); not acting [x12]
Oct 11 16:08:29 idmp0 check-named-alive[372165]: zone 125.8.128.in-addr.arpa: local SOA serial 1791691940 lags newest peer 1791695702 by 3762 (threshold 3600); not acting [x12]
Oct 11 16:08:30 idmp0 check-named-alive[372226]: zone 126.8.128.in-addr.arpa: local SOA serial 1791691940 lags newest peer 1791695702 by 3762 (threshold 3600); not acting [x12]
Oct 11 16:08:30 idmp0 check-named-alive[372287]: zone 127.8.128.in-addr.arpa: local SOA serial 1791691939 lags newest peer 1791695702 by 3763 (threshold 3600); not acting [x12]
Oct 11 16:08:30 idmp0 check-named-alive[372348]: zone 128.8.128.in-addr.arpa: local SOA serial 1791691939 lags newest peer 1791695702 by 3763 (threshold 3600); not acting [x12]
Oct 11 16:08:31 idmp0 check-named-alive[372409]: zone 129.8.128.in-addr.arpa: local SOA serial 1791691939 lags newest peer 1791695702 by 3763 (threshold 3600); not acting [x12]
Oct 11 16:08:31 idmp0 check-named-alive[372470]: zone 130.8.128.in-addr.arpa: local SOA serial 1791691940 lags newest peer 1791695702 by 3762 (threshold 3600); not acting [x12]
Oct 11 16:08:31 idmp0 check-named-alive[372531]: zone 131.8.128.in-addr.arpa: local SOA serial 1791691940 lags newest peer 1791695702 by 3762 (threshold 3600); not acting [x12]
Oct 11 16:39:21 idmp0 named[61110]: client @0x7fd7f800c058 10.73.240.43#57801: update '73.10.in-addr.arpa/IN' denied
== idmv0 (14 distinct, 168 total) ==
Oct 11 16:06:16 idmv0 check-named-alive[3657318]: zone cs.umd.edu: local SOA serial 1791691202 lags newest peer 1791695702 by 4500 (threshold 3600); not acting [x12]
Oct 11 16:06:17 idmv0 check-named-alive[3657379]: zone csdlabs.umd.edu: local SOA serial 1791691202 lags newest peer 1791695702 by 4500 (threshold 3600); not acting [x12]
Oct 11 16:06:17 idmv0 check-named-alive[3657440]: zone csic.umd.edu: local SOA serial 1791691202 lags newest peer 1791695702 by 4500 (threshold 3600); not acting [x12]
Oct 11 16:06:17 idmv0 check-named-alive[3657501]: zone 72.10.in-addr.arpa: local SOA serial 1791691202 lags newest peer 1791695702 by 4500 (threshold 3600); not acting [x12]
Oct 11 16:06:17 idmv0 check-named-alive[3657562]: zone 73.10.in-addr.arpa: local SOA serial 1791691202 lags newest peer 1791695702 by 4500 (threshold 3600); not acting [x12]
Oct 11 16:06:17 idmv0 check-named-alive[3657623]: zone 88.10.in-addr.arpa: local SOA serial 1791691202 lags newest peer 1791695702 by 4500 (threshold 3600); not acting [x12]
Oct 11 16:06:17 idmv0 check-named-alive[3657684]: zone 28.172.in-addr.arpa: local SOA serial 1791691202 lags newest peer 1791695702 by 4500 (threshold 3600); not acting [x12]
Oct 11 16:06:18 idmv0 check-named-alive[3657745]: zone 125.8.128.in-addr.arpa: local SOA serial 1791691202 lags newest peer 1791695702 by 4500 (threshold 3600); not acting [x12]
Oct 11 16:06:18 idmv0 check-named-alive[3657806]: zone 126.8.128.in-addr.arpa: local SOA serial 1791691202 lags newest peer 1791695702 by 4500 (threshold 3600); not acting [x12]
Oct 11 16:06:18 idmv0 check-named-alive[3657867]: zone 127.8.128.in-addr.arpa: local SOA serial 1791691202 lags newest peer 1791695702 by 4500 (threshold 3600); not acting [x12]
Oct 11 16:06:18 idmv0 check-named-alive[3657928]: zone 128.8.128.in-addr.arpa: local SOA serial 1791691202 lags newest peer 1791695702 by 4500 (threshold 3600); not acting [x12]
Oct 11 16:06:18 idmv0 check-named-alive[3657989]: zone 129.8.128.in-addr.arpa: local SOA serial 1791691202 lags newest peer 1791695702 by 4500 (threshold 3600); not acting [x12]
Oct 11 16:06:18 idmv0 check-named-alive[3658050]: zone 130.8.128.in-addr.arpa: local SOA serial 1791691202 lags newest peer 1791695702 by 4500 (threshold 3600); not acting [x12]
Oct 11 16:06:18 idmv0 check-named-alive[3658111]: zone 131.8.128.in-addr.arpa: local SOA serial 1791691202 lags newest peer 1791695702 by 4500 (threshold 3600); not acting [x12]
== inbound01.cs.umd.edu (1 distinct, 1 total) ==
Oct 11 16:46:30 inbound01.cs.umd.edu krb5_child[3287334]: Client 'admin(a)UMD.EDU' not found in Kerberos database
== itmon02 (1 distinct, 4 total) ==
Oct 11 16:13:33 itmon02 sshd[805675]: error: beginning MaxStartups throttling [x4]
== jaws.cs.umd.edu (3 distinct, 3 total) ==
Oct 11 17:02:27 jaws.cs.umd.edu systemd-coredump[1189364]: Process 1189348 (podman) of user 0 dumped core.#012#012Stack trace of thread 1189348:#012#0 0x000055f8e53c846e internal/runtime/syscall/linux.Syscall6 (podman + 0x48c46e)#012#1 0x000055f8e54a8326 syscall.Syscall (podman + 0x56c326)#012#2 0x000055f8e54a8ed0 syscall.Syscall.abi0 (podman + 0x56ced0)#012#3 0x000055f8e561336e github.com/containers/podman/vendor/golang.org/x/sys/unix.OpenTree (podman + 0x6d736e)#012#4 0x000055f8e5c7044b github.com/containers/podman/vendor/github.com/cyphar/filepath-securejoin/p… (podman + 0xd3444b)#012#5 0x000055f8e5c70354 github.com/containers/podman/vendor/github.com/cyphar/filepath-securejoin/p… (podman + 0xd34354)#012#6 0x000055f8e545bf8c sync.(*Once).doSlow (podman + 0x51ff8c)#012#7 0x000055f8e545beb9 sync.(*Once).Do (podman + 0x51feb9)#012#8 0x000055f8e5c702c5
github.com/containers/podman/vendor/github.com/cyphar/filepath-securejoin/p… (podman + 0xd342c5)#012#9 0x000055f8e5c718e2 github.com/containers/podman/vendor/github.com/cyphar/filepath-securejoin/p… (podman + 0xd358e2)#012#10 0x000055f8e5c71cf3 github.com/containers/podman/vendor/github.com/cyphar/filepath-securejoin/p… (podman + 0xd35cf3)#012#11 0x000055f8e5c70e1c github.com/containers/podman/vendor/github.com/cyphar/filepath-securejoin/p… (podman + 0xd34e1c)#012#12 0x000055f8e5c70858 github.com/containers/podman/vendor/github.com/cyphar/filepath-securejoin/p… (podman + 0xd34858)#012#13 0x000055f8e545bf8c sync.(*Once).doSlow (podman + 0x51ff8c)#012#14 0x000055f8e545beb9 sync.(*Once).Do
(podman + 0x51feb9)#012#15 0x000055f8e5c707c5 github.com/containers/podman/vendor/github.com/cyphar/filepath-securejoin/p… (podman + 0xd347c5)#012#16 0x000055f8e5c71c9a github.com/containers/podman/vendor/github.com/cyphar/filepath-securejoin/p… (podman + 0xd35c9a)#012#17 0x000055f8e5c7884e github.com/containers/podman/vendor/github.com/opencontainers/selinux/go-se… (podman + 0xd3c84e)#012#18 0x000055f8e5c78d38 github.com/containers/podman/vendor/github.com/opencontainers/selinux/go-se… (podman + 0xd3cd38)#012#19 0x000055f8e5c77adf github.com/containers/podman/vendor/github.com/opencontainers/selinux/go-se… (podman + 0xd3badf)#012#20 0x000055f8e5c77d73 github.com/containers/podman/vendor/github.com/opencontainers/selinux/go-se… (podman + 0xd3bd73)#012#21 0x00005
5f8e5e716cb github.com/containers/podman/vendor/go.podman.io/common/pkg/config.defaultC… (podman + 0xf356cb)#012#22 0x000055f8e5e750b2 github.com/containers/podman/vendor/go.podman.io/common/pkg/config.newLocked (podman + 0xf390b2)#012#23 0x000055f8e5e74da5 github.com/containers/podman/vendor/go.podman.io/common/pkg/config.New (podman + 0xf38da5)#012#24 0x000055f8e65f17d3 github.com/containers/podman/cmd/podman/registry.newPodmanConfig (podman + 0x16b57d3)#012#25 0x000055f8e545bf8c sync.(*Once).doSlow (podman + 0x51ff8c)#012#26 0x000055f8e6612550 github.com/containers/podman/cmd/podman/common.init (podman + 0x16d6550)#012#27 0x000055f8e5421af7 runtime.doInit1 (podman + 0x4e5af7)#012#28 0x000055f8e5412030 runtime.main (podman + 0x4d6030)#012#29 0x000055f8e5452061 runtime.goexit.abi0 (podman + 0x516061)#012ELF object binary architecture: AMD x86-64
Oct 11 17:02:29 jaws.cs.umd.edu systemd-coredump[1189387]: Process 1189370 (podman) of user 0 dumped core.#012#012Stack trace of thread 1189370:#012#0 0x0000563c4c6eb46e internal/runtime/syscall/linux.Syscall6 (podman + 0x48c46e)#012#1 0x0000563c4c7cb326 syscall.Syscall (podman + 0x56c326)#012#2 0x0000563c4c7cbed0 syscall.Syscall.abi0 (podman + 0x56ced0)#012#3 0x0000563c4c93636e github.com/containers/podman/vendor/golang.org/x/sys/unix.OpenTree (podman + 0x6d736e)#012#4 0x0000563c4cf9344b github.com/containers/podman/vendor/github.com/cyphar/filepath-securejoin/p… (podman + 0xd3444b)#012#5 0x0000563c4cf93354 github.com/containers/podman/vendor/github.com/cyphar/filepath-securejoin/p… (podman + 0xd34354)#012#6 0x0000563c4c77ef8c sync.(*Once).doSlow (podman + 0x51ff8c)#012#7 0x0000563c4c77eeb9 sync.(*Once).Do (podman + 0x51feb9)#012#8 0x0000563c4cf932c5
github.com/containers/podman/vendor/github.com/cyphar/filepath-securejoin/p… (podman + 0xd342c5)#012#9 0x0000563c4cf948e2 github.com/containers/podman/vendor/github.com/cyphar/filepath-securejoin/p… (podman + 0xd358e2)#012#10 0x0000563c4cf94cf3 github.com/containers/podman/vendor/github.com/cyphar/filepath-securejoin/p… (podman + 0xd35cf3)#012#11 0x0000563c4cf93e1c github.com/containers/podman/vendor/github.com/cyphar/filepath-securejoin/p… (podman + 0xd34e1c)#012#12 0x0000563c4cf93858 github.com/containers/podman/vendor/github.com/cyphar/filepath-securejoin/p… (podman + 0xd34858)#012#13 0x0000563c4c77ef8c sync.(*Once).doSlow (podman + 0x51ff8c)#012#14 0x0000563c4c77eeb9 sync.(*Once).Do
(podman + 0x51feb9)#012#15 0x0000563c4cf937c5 github.com/containers/podman/vendor/github.com/cyphar/filepath-securejoin/p… (podman + 0xd347c5)#012#16 0x0000563c4cf94c9a github.com/containers/podman/vendor/github.com/cyphar/filepath-securejoin/p… (podman + 0xd35c9a)#012#17 0x0000563c4cf9b84e github.com/containers/podman/vendor/github.com/opencontainers/selinux/go-se… (podman + 0xd3c84e)#012#18 0x0000563c4cf9bd38 github.com/containers/podman/vendor/github.com/opencontainers/selinux/go-se… (podman + 0xd3cd38)#012#19 0x0000563c4cf9aadf github.com/containers/podman/vendor/github.com/opencontainers/selinux/go-se… (podman + 0xd3badf)#012#20 0x0000563c4cf9ad73 github.com/containers/podman/vendor/github.com/opencontainers/selinux/go-se… (podman + 0xd3bd73)#012#21 0x00005
63c4d1946cb github.com/containers/podman/vendor/go.podman.io/common/pkg/config.defaultC… (podman + 0xf356cb)#012#22 0x0000563c4d1980b2 github.com/containers/podman/vendor/go.podman.io/common/pkg/config.newLocked (podman + 0xf390b2)#012#23 0x0000563c4d197da5 github.com/containers/podman/vendor/go.podman.io/common/pkg/config.New (podman + 0xf38da5)#012#24 0x0000563c4d9147d3 github.com/containers/podman/cmd/podman/registry.newPodmanConfig (podman + 0x16b57d3)#012#25 0x0000563c4c77ef8c sync.(*Once).doSlow (podman + 0x51ff8c)#012#26 0x0000563c4d935550 github.com/containers/podman/cmd/podman/common.init (podman + 0x16d6550)#012#27 0x0000563c4c744af7 runtime.doInit1 (podman + 0x4e5af7)#012#28 0x0000563c4c735030 runtime.main (podman + 0x4d6030)#012#29 0x0000563c4c775061 runtime.goexit.abi0 (podman + 0x516061)#012ELF object binary architecture: AMD x86-64
Oct 11 17:02:30 jaws.cs.umd.edu systemd-coredump[1189408]: Process 1189392 (podman) of user 0 dumped core.#012#012Stack trace of thread 1189392:#012#0 0x000055dd7c4e546e internal/runtime/syscall/linux.Syscall6 (podman + 0x48c46e)#012#1 0x000055dd7c5c5326 syscall.Syscall (podman + 0x56c326)#012#2 0x000055dd7c5c5ed0 syscall.Syscall.abi0 (podman + 0x56ced0)#012#3 0x000055dd7c73036e github.com/containers/podman/vendor/golang.org/x/sys/unix.OpenTree (podman + 0x6d736e)#012#4 0x000055dd7cd8d44b github.com/containers/podman/vendor/github.com/cyphar/filepath-securejoin/p… (podman + 0xd3444b)#012#5 0x000055dd7cd8d354 github.com/containers/podman/vendor/github.com/cyphar/filepath-securejoin/p… (podman + 0xd34354)#012#6 0x000055dd7c578f8c sync.(*Once).doSlow (podman + 0x51ff8c)#012#7 0x000055dd7c578eb9 sync.(*Once).Do (podman + 0x51feb9)#012#8 0x000055dd7cd8d2c5
github.com/containers/podman/vendor/github.com/cyphar/filepath-securejoin/p… (podman + 0xd342c5)#012#9 0x000055dd7cd8e8e2 github.com/containers/podman/vendor/github.com/cyphar/filepath-securejoin/p… (podman + 0xd358e2)#012#10 0x000055dd7cd8ecf3 github.com/containers/podman/vendor/github.com/cyphar/filepath-securejoin/p… (podman + 0xd35cf3)#012#11 0x000055dd7cd8de1c github.com/containers/podman/vendor/github.com/cyphar/filepath-securejoin/p… (podman + 0xd34e1c)#012#12 0x000055dd7cd8d858 github.com/containers/podman/vendor/github.com/cyphar/filepath-securejoin/p… (podman + 0xd34858)#012#13 0x000055dd7c578f8c sync.(*Once).doSlow (podman + 0x51ff8c)#012#14 0x000055dd7c578eb9 sync.(*Once).Do
(podman + 0x51feb9)#012#15 0x000055dd7cd8d7c5 github.com/containers/podman/vendor/github.com/cyphar/filepath-securejoin/p… (podman + 0xd347c5)#012#16 0x000055dd7cd8ec9a github.com/containers/podman/vendor/github.com/cyphar/filepath-securejoin/p… (podman + 0xd35c9a)#012#17 0x000055dd7cd9584e github.com/containers/podman/vendor/github.com/opencontainers/selinux/go-se… (podman + 0xd3c84e)#012#18 0x000055dd7cd95d38 github.com/containers/podman/vendor/github.com/opencontainers/selinux/go-se… (podman + 0xd3cd38)#012#19 0x000055dd7cd94adf github.com/containers/podman/vendor/github.com/opencontainers/selinux/go-se… (podman + 0xd3badf)#012#20 0x000055dd7cd94d73 github.com/containers/podman/vendor/github.com/opencontainers/selinux/go-se… (podman + 0xd3bd73)#012#21 0x00005
5dd7cf8e6cb github.com/containers/podman/vendor/go.podman.io/common/pkg/config.defaultC… (podman + 0xf356cb)#012#22 0x000055dd7cf920b2 github.com/containers/podman/vendor/go.podman.io/common/pkg/config.newLocked (podman + 0xf390b2)#012#23 0x000055dd7cf91da5 github.com/containers/podman/vendor/go.podman.io/common/pkg/config.New (podman + 0xf38da5)#012#24 0x000055dd7d70e7d3 github.com/containers/podman/cmd/podman/registry.newPodmanConfig (podman + 0x16b57d3)#012#25 0x000055dd7c578f8c sync.(*Once).doSlow (podman + 0x51ff8c)#012#26 0x000055dd7d72f550 github.com/containers/podman/cmd/podman/common.init (podman + 0x16d6550)#012#27 0x000055dd7c53eaf7 runtime.doInit1 (podman + 0x4e5af7)#012#28 0x000055dd7c52f030 runtime.main (podman + 0x4d6030)#012#29 0x000055dd7c56f061 runtime.goexit.abi0 (podman + 0x516061)#012ELF object binary architecture: AMD x86-64
== krispykreme.cs.umd.edu (1 distinct, 1 total) ==
Oct 11 16:47:38 krispykreme.cs.umd.edu sshd-session[538862]: pam_access(sshd:auth): access denied for user `pulkit' from `165.85.249.65'
== misty.cs.umd.edu (1 distinct, 1 total) ==
Oct 11 16:22:59 misty.cs.umd.edu sshd[11699]: error: key_cert_check_authority: invalid certificate
== netman.cs.umd.edu (1 distinct, 4 total) ==
Oct 11 16:22:17 netman.cs.umd.edu krb5_child[2005756]: Preauthentication failed [x4]
== newhonors2 (1 distinct, 24 total) ==
Oct 11 16:13:03 newhonors2 dhcpcd[3886040]: dhcpcd is not running [x24]
== ntop00 (96 distinct, 96 total) ==
Oct 11 16:05:01 ntop00 nfacctd[1075699]: INFO ( m1/mysql ): *** Purging cache - START (PID: 7114) ***
Oct 11 16:05:01 ntop00 sfacctd[1075592]: INFO ( m1/mysql ): *** Purging cache - START (PID: 7114) ***
Oct 11 16:05:01 ntop00 nfacctd[1075699]: INFO ( m1/mysql ): *** Purging cache - END (PID: 7114, QN: 74/74, ET: 0) ***
Oct 11 16:05:15 ntop00 sfacctd[1075592]: INFO ( m1/mysql ): *** Purging cache - END (PID: 7114, QN: 6177/6177, ET: 14) ***
Oct 11 16:08:01 ntop00 sfacctd[1075592]: INFO ( p1/print ): *** Purging cache - START (PID: 7115) ***
Oct 11 16:08:01 ntop00 sfacctd[1075592]: INFO ( p1/print ): *** Purging cache - END (PID: 7115, QN: 6312/6312, ET: 0) ***
Oct 11 16:08:01 ntop00 nfacctd[1075699]: INFO ( p1/print ): *** Purging cache - START (PID: 7115) ***
Oct 11 16:08:01 ntop00 nfacctd[1075699]: INFO ( p1/print ): *** Purging cache - END (PID: 7115, QN: 64/64, ET: 0) ***
Oct 11 16:10:01 ntop00 sfacctd[1075592]: INFO ( m1/mysql ): *** Purging cache - START (PID: 7116) ***
Oct 11 16:10:02 ntop00 nfacctd[1075699]: INFO ( m1/mysql ): *** Purging cache - START (PID: 7116) ***
Oct 11 16:10:02 ntop00 nfacctd[1075699]: INFO ( m1/mysql ): *** Purging cache - END (PID: 7116, QN: 63/63, ET: 0) ***
Oct 11 16:10:14 ntop00 sfacctd[1075592]: INFO ( m1/mysql ): *** Purging cache - END (PID: 7116, QN: 6207/6207, ET: 13) ***
Oct 11 16:13:01 ntop00 sfacctd[1075592]: INFO ( p1/print ): *** Purging cache - START (PID: 7117) ***
Oct 11 16:13:01 ntop00 sfacctd[1075592]: INFO ( p1/print ): *** Purging cache - END (PID: 7117, QN: 6162/6162, ET: 0) ***
Oct 11 16:13:01 ntop00 nfacctd[1075699]: INFO ( p1/print ): *** Purging cache - START (PID: 7117) ***
Oct 11 16:13:01 ntop00 nfacctd[1075699]: INFO ( p1/print ): *** Purging cache - END (PID: 7117, QN: 70/70, ET: 0) ***
Oct 11 16:15:01 ntop00 nfacctd[1075699]: INFO ( m1/mysql ): *** Purging cache - START (PID: 7118) ***
Oct 11 16:15:01 ntop00 nfacctd[1075699]: INFO ( m1/mysql ): *** Purging cache - END (PID: 7118, QN: 66/66, ET: 0) ***
Oct 11 16:15:01 ntop00 sfacctd[1075592]: INFO ( m1/mysql ): *** Purging cache - START (PID: 7118) ***
Oct 11 16:15:14 ntop00 sfacctd[1075592]: INFO ( m1/mysql ): *** Purging cache - END (PID: 7118, QN: 6209/6209, ET: 13) ***
Oct 11 16:18:01 ntop00 sfacctd[1075592]: INFO ( p1/print ): *** Purging cache - START (PID: 7119) ***
Oct 11 16:18:01 ntop00 sfacctd[1075592]: INFO ( p1/print ): *** Purging cache - END (PID: 7119, QN: 6229/6229, ET: 0) ***
Oct 11 16:18:01 ntop00 nfacctd[1075699]: INFO ( p1/print ): *** Purging cache - START (PID: 7119) ***
Oct 11 16:18:01 ntop00 nfacctd[1075699]: INFO ( p1/print ): *** Purging cache - END (PID: 7119, QN: 50/50, ET: 0) ***
Oct 11 16:20:01 ntop00 sfacctd[1075592]: INFO ( m1/mysql ): *** Purging cache - START (PID: 7120) ***
Oct 11 16:20:01 ntop00 nfacctd[1075699]: INFO ( m1/mysql ): *** Purging cache - START (PID: 7120) ***
Oct 11 16:20:01 ntop00 nfacctd[1075699]: INFO ( m1/mysql ): *** Purging cache - END (PID: 7120, QN: 51/51, ET: 0) ***
Oct 11 16:20:13 ntop00 sfacctd[1075592]: INFO ( m1/mysql ): *** Purging cache - END (PID: 7120, QN: 6240/6240, ET: 12) ***
Oct 11 16:23:01 ntop00 sfacctd[1075592]: INFO ( p1/print ): *** Purging cache - START (PID: 7121) ***
Oct 11 16:23:01 ntop00 sfacctd[1075592]: INFO ( p1/print ): *** Purging cache - END (PID: 7121, QN: 6091/6091, ET: 0) ***
... 66 more distinct messages not shown
== outbound00.cs.umd.edu (1 distinct, 6 total) ==
Oct 11 16:09:09 outbound00.cs.umd.edu python3[1666805]: ldapdb [x6]
== outbound01.cs.umd.edu (2 distinct, 7 total) ==
Oct 11 16:05:07 outbound01.cs.umd.edu krb5_child[3144063]: Client 'admin(a)UMD.EDU' not found in Kerberos database
Oct 11 16:13:07 outbound01.cs.umd.edu python3[3145726]: ldapdb [x6]
== quiss (7 distinct, 10 total) ==
Oct 11 16:08:37 quiss gnome-software[191719]: failed to commit changes to dconf: GDBus.Error:org.gtk.GDBus.UnmappedGError.Quark._g_2dfile_2derror_2dquark.Code2: Failed to create file “/adminhomes/josephao/.config/dconf/user.E6MNW3”: Permission denied
Oct 11 16:08:40 quiss gnome-software[191719]: failed to get featured apps: no apps to show
Oct 11 16:08:40 quiss gnome-software[191719]: Only 0 apps for curated list, hiding
Oct 11 16:08:40 quiss gnome-software[191719]: Only 0 apps for recent list, hiding
Oct 11 16:08:43 quiss packagekitd[1264086]: Failed to get cache filename for gnome-control-center-filesystem [x2]
Oct 11 16:08:43 quiss packagekitd[1264086]: Failed to get cache filename for perl [x2]
Oct 11 16:08:43 quiss packagekitd[1264086]: Failed to get cache filename for kernel [x2]
== strawberry (7 distinct, 38 total) ==
Oct 11 16:07:03 strawberry kernel: I/O error, dev sda, sector 206848 op 0x0:(READ) flags 0x80700 phys_seg 1 prio class 2 [x6]
Oct 11 16:07:03 strawberry kernel: I/O error, dev sda, sector 206848 op 0x0:(READ) flags 0x0 phys_seg 1 prio class 2 [x6]
Oct 11 16:07:03 strawberry kernel: Buffer I/O error on dev sda2, logical block 0, async page read [x6]
Oct 11 16:07:03 strawberry kernel: I/O error, dev sda, sector 2048 op 0x0:(READ) flags 0x80700 phys_seg 1 prio class 2 [x6]
Oct 11 16:07:03 strawberry kernel: I/O error, dev sda, sector 2048 op 0x0:(READ) flags 0x0 phys_seg 1 prio class 2 [x6]
Oct 11 16:07:03 strawberry kernel: Buffer I/O error on dev sda1, logical block 0, async page read [x6]
Oct 11 16:34:42 strawberry smartd[5314]: Device: /dev/sda [SAT], failed to read SMART Attribute Data [x2]
== submit10-cln25 (5 distinct, 1540 total) ==
Oct 11 16:05:05 submit10-cln25 rsyslogd: imjournal: fopen() failed for path: '/var/lib/rsyslog/imjournal.state.tmp': Input/output error [v8.24.0-57.el7_9.3 try http://www.rsyslog.com/e/2013 ] [x335]
Oct 11 16:05:22 submit10-cln25 rsyslogd: file '/var/log/messages': open error: Input/output error [v8.24.0-57.el7_9.3 try http://www.rsyslog.com/e/2433 ] [x1200]
Oct 11 16:25:00 submit10-cln25 systemd: Failed at step USER spawning /usr/libexec/pcp/bin/pmlogger_check: Input/output error [x2]
Oct 11 16:28:00 submit10-cln25 systemd: Failed at step USER spawning /usr/libexec/pcp/bin/pmie_check: Input/output error [x2]
Oct 11 16:30:00 submit10-cln25 systemd: Failed at step USER spawning /usr/libexec/pcp/bin/pmlogger_daily: Input/output error
== submit26-b9-3 (1 distinct, 4 total) ==
Sep 13 23:08:22 submit26-b9-3 systemd[1]: user(a)1001.service: Main process exited, code=killed, status=9/KILL [x4]
== submit26-b9-f1 (1 distinct, 2 total) ==
Oct 11 16:18:08 submit26-b9-f1 systemd[1]: user(a)1001.service: Main process exited, code=killed, status=9/KILL [x2]
== submit26-b9-f2 (3 distinct, 3 total) ==
Oct 11 16:45:48 submit26-b9-f2 systemd[1]: user(a)1001.service: Main process exited, code=killed, status=9/KILL
Oct 11 16:45:52 submit26-b9-f2 systemd-coredump[1480189]: Process 1480176 (release02) of user 1001 dumped core.#012#012Stack trace of thread 1480176:#012#0 0x0000000000402387 highlight_text (release02 + 0x2387)#012#1 0x0000000000401593 main (release02 + 0x1593)#012#2 0x5d5d5d5d5d5d5d5d n/a (n/a + 0x0)#012ELF object binary architecture: AMD x86-64
Oct 11 16:46:54 submit26-b9-f2 systemd-coredump[1480218]: Process 1480215 (secret02) of user 1001 dumped core.#012#012Stack trace of thread 1480215:#012#0 0x00007f650468d02c __pthread_kill_implementation (libc.so.6 + 0x8d02c)#012#1 0x00007f650463fb86 raise (libc.so.6 + 0x3fb86)#012#2 0x00007f6504629873 abort (libc.so.6 + 0x29873)#012#3 0x00007f650462a1b2 __libc_message.cold (libc.so.6 + 0x2a1b2)#012#4 0x00007f650471d19b __fortify_fail (libc.so.6 + 0x11d19b)#012#5 0x00007f650471e416 __stack_chk_fail (libc.so.6 + 0x11e416)#012#6 0x0000000000401241 main (secret02 + 0x1241)#012ELF object binary architecture: AMD x86-64
== submit26-b9-f3 (1 distinct, 5 total) ==
Oct 11 16:10:05 submit26-b9-f3 systemd[1]: user(a)1001.service: Main process exited, code=killed, status=9/KILL [x5]
== submit26-b9-fclone (9 distinct, 9 total) ==
Oct 11 16:22:06 submit26-b9-fclone setroubleshoot[1414662]: SELinux is preventing /usr/bin/python3.9 from create access on the directory /(null). For complete SELinux messages run: sealert -l 9355d9d9-a311-48d2-bd37-6c0f6947dfff
Oct 11 16:22:06 submit26-b9-fclone setroubleshoot[1414662]: SELinux is preventing /usr/bin/python3.9 from add_name access on the directory /(null). For complete SELinux messages run: sealert -l cc4658d7-9db1-405d-9eee-de0ccee5857f
Oct 11 16:22:06 submit26-b9-fclone setroubleshoot[1414662]: SELinux is preventing /usr/bin/python3.9 from create access on the file /(null). For complete SELinux messages run: sealert -l 568a2429-0b1b-49df-af41-49b5cd298ae8
Oct 11 16:22:06 submit26-b9-fclone setroubleshoot[1414662]: SELinux is preventing /usr/bin/python3.9 from open access on the file /tmp/libdnf.tnGH4r/repodata/repomd.xml. For complete SELinux messages run: sealert -l 03e2f521-0e7c-481f-8e92-0602c6adeedc
Oct 11 16:22:06 submit26-b9-fclone setroubleshoot[1414662]: SELinux is preventing /usr/bin/python3.9 from setattr access on the file repomd.xml. For complete SELinux messages run: sealert -l 0d6b7b1f-ebe3-4beb-915a-b06b63bf2566
Oct 11 16:22:06 submit26-b9-fclone setroubleshoot[1414662]: SELinux is preventing /usr/bin/python3.9 from read access on the directory libdnf.tnGH4r. For complete SELinux messages run: sealert -l 887adbf9-2bb9-4009-b800-36ddf9ba0db5
Oct 11 16:22:06 submit26-b9-fclone setroubleshoot[1414662]: SELinux is preventing /usr/bin/python3.9 from remove_name access on the directory repomd.xml. For complete SELinux messages run: sealert -l 092e0644-8373-4017-b77f-1afa6c6da4ac
Oct 11 16:22:06 submit26-b9-fclone setroubleshoot[1414662]: SELinux is preventing /usr/bin/python3.9 from unlink access on the file repomd.xml. For complete SELinux messages run: sealert -l ce429a92-56de-4de1-b859-cbfb69ae123c
Oct 11 16:22:06 submit26-b9-fclone setroubleshoot[1414662]: SELinux is preventing /usr/bin/python3.9 from rmdir access on the directory repodata. For complete SELinux messages run: sealert -l 99b886eb-497b-406d-8206-afe76a1086b4
1
0