Command: /usr/local/sbin/syslog-digest.py
Time : 0.0930s
Status : exited 0
Output :
Syslog digest — 2026-10-12 11:05 EDT
Processed 3,972 lines, filtered 2,693 (67%). 1,279 unknown (385 distinct) from 20 host(s).
== abuse (1 distinct, 347 total) ==
Oct 12 10:05:02 abuse rsyslogd[1033]: imjournal: open() failed for path: '/var/lib/rsyslog/imjournal.state.tmp': Input/output error [v8.2404.0 try https://www.rsyslog.com/e/2433 ] [x347]
== b0b02.cs.umd.edu (1 distinct, 1 total) ==
Oct 12 10:24:28 b0b02.cs.umd.edu rustdesk[3027925]: cannot open display:
== borogove.cs.umd.edu (48 distinct, 252 total) ==
Oct 12 10:05:01 borogove.cs.umd.edu aardvark-dns[0]: 33839 dns request got empty response [x6]
Oct 12 10:05:01 borogove.cs.umd.edu aardvark-dns[0]: 4137 dns request got empty response [x6]
Oct 12 10:05:11 borogove.cs.umd.edu aardvark-dns[0]: 9403 dns request got empty response [x6]
Oct 12 10:05:11 borogove.cs.umd.edu aardvark-dns[0]: 5305 dns request got empty response [x6]
Oct 12 10:05:21 borogove.cs.umd.edu aardvark-dns[0]: 28798 dns request got empty response [x6]
Oct 12 10:05:21 borogove.cs.umd.edu aardvark-dns[0]: 57466 dns request got empty response [x6]
Oct 12 10:05:31 borogove.cs.umd.edu aardvark-dns[0]: 36611 dns request got empty response [x6]
Oct 12 10:05:31 borogove.cs.umd.edu aardvark-dns[0]: 59405 dns request got empty response [x6]
Oct 12 10:05:41 borogove.cs.umd.edu aardvark-dns[0]: 55205 dns request got empty response [x6]
Oct 12 10:05:41 borogove.cs.umd.edu aardvark-dns[0]: 40359 dns request got empty response [x6]
Oct 12 10:05:51 borogove.cs.umd.edu aardvark-dns[0]: 50112 dns request got empty response [x6]
Oct 12 10:05:51 borogove.cs.umd.edu aardvark-dns[0]: 13278 dns request got empty response [x6]
Oct 12 10:06:01 borogove.cs.umd.edu aardvark-dns[0]: 8306 dns request got empty response [x6]
Oct 12 10:06:01 borogove.cs.umd.edu aardvark-dns[0]: 46351 dns request got empty response [x6]
Oct 12 10:06:01 borogove.cs.umd.edu aardvark-dns[0]: 49394 dns request got empty response [x6]
Oct 12 10:06:01 borogove.cs.umd.edu aardvark-dns[0]: 56820 dns request got empty response [x6]
Oct 12 10:06:11 borogove.cs.umd.edu aardvark-dns[0]: 13208 dns request got empty response [x6]
Oct 12 10:06:11 borogove.cs.umd.edu aardvark-dns[0]: 4484 dns request got empty response [x6]
Oct 12 10:06:11 borogove.cs.umd.edu aardvark-dns[0]: 16411 dns request got empty response [x6]
Oct 12 10:06:11 borogove.cs.umd.edu aardvark-dns[0]: 51229 dns request got empty response [x6]
Oct 12 10:06:21 borogove.cs.umd.edu aardvark-dns[0]: 31158 dns request got empty response [x6]
Oct 12 10:06:21 borogove.cs.umd.edu aardvark-dns[0]: 57269 dns request got empty response [x6]
Oct 12 10:06:31 borogove.cs.umd.edu aardvark-dns[0]: 34500 dns request got empty response [x6]
Oct 12 10:06:31 borogove.cs.umd.edu aardvark-dns[0]: 36058 dns request got empty response [x6]
Oct 12 10:06:41 borogove.cs.umd.edu aardvark-dns[0]: 55044 dns request got empty response [x6]
Oct 12 10:06:41 borogove.cs.umd.edu aardvark-dns[0]: 34311 dns request got empty response [x6]
Oct 12 10:06:51 borogove.cs.umd.edu aardvark-dns[0]: 49510 dns request got empty response [x6]
Oct 12 10:06:51 borogove.cs.umd.edu aardvark-dns[0]: 61796 dns request got empty response [x6]
Oct 12 10:07:01 borogove.cs.umd.edu aardvark-dns[0]: 36108 dns request got empty response [x6]
Oct 12 10:07:01 borogove.cs.umd.edu aardvark-dns[0]: 33802 dns request got empty response [x6]
... 18 more distinct messages not shown
== defer (3 distinct, 3 total) ==
Oct 12 11:00:01 defer systemd[1]: amanda_udp.socket: Socket service amanda_udp.service already active, refusing.
Oct 12 11:00:01 defer systemd[1]: Failed to listen on Amanda UDP Socket.
Oct 12 11:00:01 defer systemctl[2646615]: Job failed. See "journalctl -xe" for details.
== idm00 (4 distinct, 5 total) ==
Oct 12 10:08:14 idm00 named[1029]: checkhints: unable to get root NS rrset from cache: not found [x2]
Oct 12 10:08:48 idm00 systemd[1]: pki-tomcatd(a)pki-tomcat.service: start-post operation timed out. Terminating.
Oct 12 10:08:48 idm00 systemd[1]: pki-tomcatd(a)pki-tomcat.service: Control process exited, code=killed, status=15/TERM
Oct 12 10:54:47 idm00 named[1029]: client @0x7fc479372138 10.73.240.42#64232: update '73.10.in-addr.arpa/IN' denied
== idmh1 (26 distinct, 78 total) ==
Oct 12 10:34:18 idmh1 check-named-alive[15646]: zone cs.umd.edu: local SOA serial 1791811218 lags newest peer 1791815625 by 4407 (threshold 3600); not acting [x5]
Oct 12 10:34:18 idmh1 check-named-alive[15707]: zone csdlabs.umd.edu: local SOA serial 1791811218 lags newest peer 1791815627 by 4409 (threshold 3600); not acting [x5]
Oct 12 10:34:19 idmh1 check-named-alive[15770]: zone csic.umd.edu: local SOA serial 1791811218 lags newest peer 1791815627 by 4409 (threshold 3600); not acting [x5]
Oct 12 10:34:19 idmh1 check-named-alive[15831]: zone 72.10.in-addr.arpa: local SOA serial 1791811218 lags newest peer 1791815626 by 4408 (threshold 3600); not acting [x5]
Oct 12 10:34:19 idmh1 check-named-alive[15892]: zone 73.10.in-addr.arpa: local SOA serial 1791811218 lags newest peer 1791815626 by 4408 (threshold 3600); not acting [x5]
Oct 12 10:34:19 idmh1 check-named-alive[15953]: zone 88.10.in-addr.arpa: local SOA serial 1791811218 lags newest peer 1791815626 by 4408 (threshold 3600); not acting [x5]
Oct 12 10:34:19 idmh1 check-named-alive[16014]: zone 125.8.128.in-addr.arpa: local SOA serial 1791811218 lags newest peer 1791815626 by 4408 (threshold 3600); not acting [x5]
Oct 12 10:34:20 idmh1 check-named-alive[16075]: zone 126.8.128.in-addr.arpa: local SOA serial 1791811218 lags newest peer 1791815626 by 4408 (threshold 3600); not acting [x5]
Oct 12 10:34:20 idmh1 check-named-alive[16136]: zone 127.8.128.in-addr.arpa: local SOA serial 1791811218 lags newest peer 1791815626 by 4408 (threshold 3600); not acting [x5]
Oct 12 10:34:20 idmh1 check-named-alive[16197]: zone 128.8.128.in-addr.arpa: local SOA serial 1791811218 lags newest peer 1791815626 by 4408 (threshold 3600); not acting [x5]
Oct 12 10:34:20 idmh1 check-named-alive[16258]: zone 129.8.128.in-addr.arpa: local SOA serial 1791811218 lags newest peer 1791815626 by 4408 (threshold 3600); not acting [x5]
Oct 12 10:34:20 idmh1 check-named-alive[16319]: zone 130.8.128.in-addr.arpa: local SOA serial 1791811218 lags newest peer 1791815626 by 4408 (threshold 3600); not acting [x5]
Oct 12 10:34:21 idmh1 check-named-alive[16380]: zone 131.8.128.in-addr.arpa: local SOA serial 1791811218 lags newest peer 1791815626 by 4408 (threshold 3600); not acting [x5]
Oct 12 11:04:20 idmh1 check-named-alive[22248]: zone cs.umd.edu: local SOA serial 1791811218 lags newest peer 1791817249 by 6031 (threshold 3600); not acting
Oct 12 11:04:20 idmh1 check-named-alive[22309]: zone csdlabs.umd.edu: local SOA serial 1791811218 lags newest peer 1791817250 by 6032 (threshold 3600); not acting
Oct 12 11:04:20 idmh1 check-named-alive[22370]: zone csic.umd.edu: local SOA serial 1791811218 lags newest peer 1791817250 by 6032 (threshold 3600); not acting
Oct 12 11:04:21 idmh1 check-named-alive[22431]: zone 72.10.in-addr.arpa: local SOA serial 1791811218 lags newest peer 1791817250 by 6032 (threshold 3600); not acting
Oct 12 11:04:21 idmh1 check-named-alive[22492]: zone 73.10.in-addr.arpa: local SOA serial 1791811218 lags newest peer 1791817250 by 6032 (threshold 3600); not acting
Oct 12 11:04:21 idmh1 check-named-alive[22553]: zone 88.10.in-addr.arpa: local SOA serial 1791811218 lags newest peer 1791817249 by 6031 (threshold 3600); not acting
Oct 12 11:04:21 idmh1 check-named-alive[22614]: zone 125.8.128.in-addr.arpa: local SOA serial 1791811218 lags newest peer 1791817249 by 6031 (threshold 3600); not acting
Oct 12 11:04:21 idmh1 check-named-alive[22675]: zone 126.8.128.in-addr.arpa: local SOA serial 1791811218 lags newest peer 1791817249 by 6031 (threshold 3600); not acting
Oct 12 11:04:22 idmh1 check-named-alive[22736]: zone 127.8.128.in-addr.arpa: local SOA serial 1791811218 lags newest peer 1791817249 by 6031 (threshold 3600); not acting
Oct 12 11:04:22 idmh1 check-named-alive[22797]: zone 128.8.128.in-addr.arpa: local SOA serial 1791811218 lags newest peer 1791817249 by 6031 (threshold 3600); not acting
Oct 12 11:04:22 idmh1 check-named-alive[22858]: zone 129.8.128.in-addr.arpa: local SOA serial 1791811218 lags newest peer 1791817249 by 6031 (threshold 3600); not acting
Oct 12 11:04:22 idmh1 check-named-alive[22919]: zone 130.8.128.in-addr.arpa: local SOA serial 1791811218 lags newest peer 1791817249 by 6031 (threshold 3600); not acting
Oct 12 11:04:22 idmh1 check-named-alive[22980]: zone 131.8.128.in-addr.arpa: local SOA serial 1791811218 lags newest peer 1791817249 by 6031 (threshold 3600); not acting
== idmp0 (60 distinct, 68 total) ==
Oct 12 10:31:22 idmp0 kernel: pci_bus 0000:ff: Unknown NUMA node; performance will be reduced
Oct 12 10:31:22 idmp0 kernel: pci_bus 0000:7f: Unknown NUMA node; performance will be reduced
Oct 12 10:31:22 idmp0 kernel: pci 0000:01:00.0: [Firmware Bug]: disabling VPD access (can't determine size of non-standard VPD format)
Oct 12 10:31:22 idmp0 kernel: ENERGY_PERF_BIAS: Set to 'normal', was 'performance'
Oct 12 10:31:22 idmp0 kernel: device-mapper: core: CONFIG_IMA_DISABLE_HTABLE is disabled. Duplicate IMA measurements will not be recorded in the IMA log.
Oct 12 10:31:34 idmp0 kernel: ipmi_si dmi-ipmi-si.0: The BMC does not support setting the recv irq bit, compensating, but the BMC needs to be fixed.
Oct 12 10:31:34 idmp0 lvm[916]: PV /dev/sda3 online, VG rhel_idmp0 is complete.
Oct 12 10:31:34 idmp0 kernel: dell_smbios: No SMBIOS backends available (wmi: -19, smm: -19)
Oct 12 10:31:36 idmp0 kernel: power_meter ACPI000D:00: Waiting for ACPI IPMI timeout
Oct 12 10:31:36 idmp0 kernel: ACPI Error: AE_NOT_EXIST, Returned by Handler for [IPMI] (20230331/evregion-301)
Oct 12 10:31:36 idmp0 kernel: ACPI Error: Region IPMI (ID=7) has no handler (20230331/exfldio-261)
Oct 12 10:31:36 idmp0 kernel: ACPI Error: Aborting method \_SB.PMI0._GHL due to previous error (AE_NOT_EXIST) (20230331/psparse-529)
Oct 12 10:31:36 idmp0 kernel: ACPI Error: Aborting method \_SB.PMI0._PMC due to previous error (AE_NOT_EXIST) (20230331/psparse-529)
Oct 12 10:31:36 idmp0 kernel: ACPI: \_SB_.PMI0: _PMC evaluation failed: AE_NOT_EXIST
Oct 12 10:31:38 idmp0 smartd[1027]: Device: /dev/bus/0 [megaraid_disk_00] [SAT], no ATA CHECK POWER STATUS support, ignoring -n Directive
Oct 12 10:31:38 idmp0 smartd[1027]: Device: /dev/bus/0 [megaraid_disk_01] [SAT], no ATA CHECK POWER STATUS support, ignoring -n Directive
Oct 12 10:31:44 idmp0 named[1183]: LDAP error: Can't contact LDAP server: bind to LDAP server failed [x2]
Oct 12 10:31:44 idmp0 named[1183]: ldap_sync_prepare() failed, retrying in 1 second: socket is not connected
Oct 12 10:31:45 idmp0 systemd[1]: resmon.service: Supervising process 1286 which is not our child. We'll most likely not notice when it exits.
Oct 12 10:31:48 idmp0 irqbalance[1025]: Cannot change IRQ 55 affinity: Operation not permitted
Oct 12 10:31:48 idmp0 irqbalance[1025]: IRQ 55 affinity is now unmanaged
Oct 12 10:31:48 idmp0 irqbalance[1025]: Cannot change IRQ 45 affinity: Operation not permitted
Oct 12 10:31:48 idmp0 irqbalance[1025]: IRQ 45 affinity is now unmanaged
Oct 12 10:31:48 idmp0 irqbalance[1025]: Cannot change IRQ 53 affinity: Operation not permitted
Oct 12 10:31:48 idmp0 irqbalance[1025]: IRQ 53 affinity is now unmanaged
Oct 12 10:31:48 idmp0 irqbalance[1025]: Cannot change IRQ 43 affinity: Operation not permitted
Oct 12 10:31:48 idmp0 irqbalance[1025]: IRQ 43 affinity is now unmanaged
Oct 12 10:31:48 idmp0 irqbalance[1025]: Cannot change IRQ 51 affinity: Operation not permitted
Oct 12 10:31:48 idmp0 irqbalance[1025]: IRQ 51 affinity is now unmanaged
Oct 12 10:31:48 idmp0 irqbalance[1025]: Cannot change IRQ 41 affinity: Operation not permitted
... 30 more distinct messages not shown
== idmv0 (52 distinct, 58 total) ==
Oct 12 10:14:14 idmv0 systemd-coredump[3936714]: Process 1016 (gssproxy) of user 0 dumped core.#012#012Stack trace of thread 1022:#012#0 0x00007fc40208be2c n/a (/usr/lib64/libc.so.6 (deleted) + 0x8be2c)#012ELF object binary architecture: AMD x86-64
Oct 12 10:14:14 idmv0 systemd[1]: gssproxy.service: Main process exited, code=dumped, status=6/ABRT
Oct 12 10:14:15 idmv0 setroubleshoot[3936713]: SELinux is preventing /usr/sbin/setfiles from relabelto access on the file softhsm_pin. For complete SELinux messages run: sealert -l 6c365324-7ed0-4e2f-af12-11f676d64036
Oct 12 10:15:24 idmv0 systemd-tmpfiles[3951364]: <stdin>:1: Path '2770' not absolute.
Oct 12 10:15:24 idmv0 systemd-tmpfiles[3951364]: <stdin>:2: Path '-' not absolute.
Oct 12 10:15:24 idmv0 systemd-tmpfiles[3951364]: <stdin>:3: Path '-' not absolute.
Oct 12 10:15:24 idmv0 systemd-tmpfiles[3951364]: <stdin>:4: Path '-' not absolute.
Oct 12 10:17:24 idmv0 ldap_child[3957503]: Failed to initialize credentials using keytab [MEMORY:/etc/krb5.keytab]: Cannot contact any KDC for realm 'CS.UMD.EDU'. Unable to create GSSAPI-encrypted LDAP connection. [x2]
Oct 12 10:17:24 idmv0 named[3958407]: checkhints: unable to get root NS rrset from cache: not found [x6]
Oct 12 10:17:39 idmv0 sssd_be[3958704]: `ldap_sudo_search_base` is not set. SSSD will search the entire directory tree (dc=cs,dc=umd,dc=edu) for sudoRole objects. This may allow any LDAP principal with write access to any subtree to inject sudo rules granting arbitrary privileges. Set `ldap_sudo_search_base` to restrict the search scope (e.g., 'ou=sudoers,dc=example,dc=com').
Oct 12 10:18:34 idmv0 microcode_ctl[3977954]: <4>After installation of a new version of microcode_ctl package,
Oct 12 10:18:34 idmv0 microcode_ctl[3977954]: initramfs hasn't been re-generated for all the installed kernel packages.
Oct 12 10:18:34 idmv0 microcode_ctl[3977954]: The following kernel packages have been skipped: kernel-core-5.14.0-503.19.1.el9_5.x86_64.
Oct 12 10:18:34 idmv0 microcode_ctl[3977954]: Please re-generate initramfs manually for these kernel packages with the
Oct 12 10:18:34 idmv0 microcode_ctl[3977954]: "dracut -f --kver KERNEL_VERSION" command in order to get the latest
Oct 12 10:18:34 idmv0 microcode_ctl[3977954]: Intel CPU microcode included into early initramfs image for it, if needed.
Oct 12 10:18:34 idmv0 journal: After installation of a new version of microcode_ctl package,
Oct 12 10:18:34 idmv0 journal: initramfs hasn't been re-generated for all the installed kernel packages.
Oct 12 10:18:34 idmv0 journal: The following kernel packages have been skipped: kernel-core-5.14.0-503.19.1.el9_5.x86_64.
Oct 12 10:18:34 idmv0 journal: Please re-generate initramfs manually for these kernel packages with the
Oct 12 10:18:34 idmv0 journal: "dracut -f --kver KERNEL_VERSION" command in order to get the latest
Oct 12 10:18:34 idmv0 journal: Intel CPU microcode included into early initramfs image for it, if needed.
Oct 12 10:18:47 idmv0 irqbalance[3978131]: Cannot change IRQ 35 affinity: Operation not permitted
Oct 12 10:18:47 idmv0 irqbalance[3978131]: IRQ 35 affinity is now unmanaged
Oct 12 10:18:47 idmv0 irqbalance[3978131]: Cannot change IRQ 33 affinity: Operation not permitted
Oct 12 10:18:47 idmv0 irqbalance[3978131]: IRQ 33 affinity is now unmanaged
Oct 12 10:18:47 idmv0 irqbalance[3978131]: Cannot change IRQ 41 affinity: Operation not permitted
Oct 12 10:18:47 idmv0 irqbalance[3978131]: IRQ 41 affinity is now unmanaged
Oct 12 10:18:47 idmv0 irqbalance[3978131]: Cannot change IRQ 31 affinity: Operation not permitted
Oct 12 10:18:47 idmv0 irqbalance[3978131]: IRQ 31 affinity is now unmanaged
... 22 more distinct messages not shown
== itmon02 (1 distinct, 3 total) ==
Oct 12 10:13:05 itmon02 sshd[805675]: error: beginning MaxStartups throttling [x3]
== jaws.cs.umd.edu (42 distinct, 246 total) ==
Oct 12 10:05:02 jaws.cs.umd.edu aardvark-dns[0]: 45977 dns request got empty response [x6]
Oct 12 10:05:02 jaws.cs.umd.edu aardvark-dns[0]: 19328 dns request got empty response [x6]
Oct 12 10:05:12 jaws.cs.umd.edu aardvark-dns[0]: 22277 dns request got empty response [x6]
Oct 12 10:05:12 jaws.cs.umd.edu aardvark-dns[0]: 53245 dns request got empty response [x6]
Oct 12 10:05:22 jaws.cs.umd.edu aardvark-dns[0]: 28132 dns request got empty response [x6]
Oct 12 10:05:22 jaws.cs.umd.edu aardvark-dns[0]: 4091 dns request got empty response [x6]
Oct 12 10:05:32 jaws.cs.umd.edu aardvark-dns[0]: 8836 dns request got empty response [x6]
Oct 12 10:05:32 jaws.cs.umd.edu aardvark-dns[0]: 4248 dns request got empty response [x6]
Oct 12 10:05:42 jaws.cs.umd.edu aardvark-dns[0]: 57868 dns request got empty response [x6]
Oct 12 10:05:42 jaws.cs.umd.edu aardvark-dns[0]: 35844 dns request got empty response [x6]
Oct 12 10:05:52 jaws.cs.umd.edu aardvark-dns[0]: 48828 dns request got empty response [x6]
Oct 12 10:05:52 jaws.cs.umd.edu aardvark-dns[0]: 29108 dns request got empty response [x6]
Oct 12 10:06:02 jaws.cs.umd.edu aardvark-dns[0]: 56429 dns request got empty response [x6]
Oct 12 10:06:02 jaws.cs.umd.edu aardvark-dns[0]: 24179 dns request got empty response [x6]
Oct 12 10:06:02 jaws.cs.umd.edu aardvark-dns[0]: 34578 dns request got empty response [x6]
Oct 12 10:06:02 jaws.cs.umd.edu aardvark-dns[0]: 24584 dns request got empty response [x6]
Oct 12 10:06:12 jaws.cs.umd.edu aardvark-dns[0]: 6678 dns request got empty response [x6]
Oct 12 10:06:12 jaws.cs.umd.edu aardvark-dns[0]: 6674 dns request got empty response [x6]
Oct 12 10:06:12 jaws.cs.umd.edu aardvark-dns[0]: 47980 dns request got empty response [x6]
Oct 12 10:06:12 jaws.cs.umd.edu aardvark-dns[0]: 62293 dns request got empty response [x6]
Oct 12 10:06:22 jaws.cs.umd.edu aardvark-dns[0]: 19806 dns request got empty response [x6]
Oct 12 10:06:22 jaws.cs.umd.edu aardvark-dns[0]: 63065 dns request got empty response [x6]
Oct 12 10:06:32 jaws.cs.umd.edu aardvark-dns[0]: 7595 dns request got empty response [x6]
Oct 12 10:06:32 jaws.cs.umd.edu aardvark-dns[0]: 55975 dns request got empty response [x6]
Oct 12 10:06:42 jaws.cs.umd.edu aardvark-dns[0]: 37744 dns request got empty response [x6]
Oct 12 10:06:42 jaws.cs.umd.edu aardvark-dns[0]: 7801 dns request got empty response [x6]
Oct 12 10:06:52 jaws.cs.umd.edu aardvark-dns[0]: 46018 dns request got empty response [x6]
Oct 12 10:06:52 jaws.cs.umd.edu aardvark-dns[0]: 60106 dns request got empty response [x6]
Oct 12 10:07:02 jaws.cs.umd.edu aardvark-dns[0]: 13442 dns request got empty response [x6]
Oct 12 10:07:02 jaws.cs.umd.edu aardvark-dns[0]: 5813 dns request got empty response [x6]
... 12 more distinct messages not shown
== newhonors2 (1 distinct, 24 total) ==
Oct 12 10:13:02 newhonors2 dhcpcd[3920267]: dhcpcd is not running [x24]
== ntop00 (97 distinct, 97 total) ==
Oct 12 10:05:01 ntop00 sfacctd[1075592]: INFO ( m1/mysql ): *** Purging cache - START (PID: 7546) ***
Oct 12 10:05:01 ntop00 nfacctd[1075699]: INFO ( m1/mysql ): *** Purging cache - START (PID: 7546) ***
Oct 12 10:05:01 ntop00 nfacctd[1075699]: INFO ( m1/mysql ): *** Purging cache - END (PID: 7546, QN: 85/85, ET: 0) ***
Oct 12 10:05:11 ntop00 sfacctd[1075592]: INFO ( m1/mysql ): *** Purging cache - END (PID: 7546, QN: 4810/4810, ET: 10) ***
Oct 12 10:08:01 ntop00 nfacctd[1075699]: INFO ( p1/print ): *** Purging cache - START (PID: 7547) ***
Oct 12 10:08:01 ntop00 nfacctd[1075699]: INFO ( p1/print ): *** Purging cache - END (PID: 7547, QN: 72/72, ET: 0) ***
Oct 12 10:08:01 ntop00 sfacctd[1075592]: INFO ( p1/print ): *** Purging cache - START (PID: 7547) ***
Oct 12 10:08:01 ntop00 sfacctd[1075592]: INFO ( p1/print ): *** Purging cache - END (PID: 7547, QN: 4020/4020, ET: 0) ***
Oct 12 10:10:01 ntop00 sfacctd[1075592]: INFO ( m1/mysql ): *** Purging cache - START (PID: 7548) ***
Oct 12 10:10:01 ntop00 nfacctd[1075699]: INFO ( m1/mysql ): *** Purging cache - START (PID: 7548) ***
Oct 12 10:10:01 ntop00 nfacctd[1075699]: INFO ( m1/mysql ): *** Purging cache - END (PID: 7548, QN: 60/60, ET: 0) ***
Oct 12 10:10:09 ntop00 sfacctd[1075592]: INFO ( m1/mysql ): *** Purging cache - END (PID: 7548, QN: 4214/4214, ET: 8) ***
Oct 12 10:13:01 ntop00 sfacctd[1075592]: INFO ( p1/print ): *** Purging cache - START (PID: 7549) ***
Oct 12 10:13:01 ntop00 sfacctd[1075592]: INFO ( p1/print ): *** Purging cache - END (PID: 7549, QN: 4127/4127, ET: 0) ***
Oct 12 10:13:01 ntop00 nfacctd[1075699]: INFO ( p1/print ): *** Purging cache - START (PID: 7549) ***
Oct 12 10:13:01 ntop00 nfacctd[1075699]: INFO ( p1/print ): *** Purging cache - END (PID: 7549, QN: 88/88, ET: 0) ***
Oct 12 10:15:01 ntop00 sfacctd[1075592]: INFO ( m1/mysql ): *** Purging cache - START (PID: 7550) ***
Oct 12 10:15:01 ntop00 nfacctd[1075699]: INFO ( m1/mysql ): *** Purging cache - START (PID: 7550) ***
Oct 12 10:15:01 ntop00 nfacctd[1075699]: INFO ( m1/mysql ): *** Purging cache - END (PID: 7550, QN: 85/85, ET: 0) ***
Oct 12 10:15:11 ntop00 sfacctd[1075592]: INFO ( m1/mysql ): *** Purging cache - END (PID: 7550, QN: 4427/4427, ET: 10) ***
Oct 12 10:18:01 ntop00 sfacctd[1075592]: INFO ( p1/print ): *** Purging cache - START (PID: 7551) ***
Oct 12 10:18:01 ntop00 sfacctd[1075592]: INFO ( p1/print ): *** Purging cache - END (PID: 7551, QN: 4476/4476, ET: 0) ***
Oct 12 10:18:01 ntop00 nfacctd[1075699]: INFO ( p1/print ): *** Purging cache - START (PID: 7551) ***
Oct 12 10:18:01 ntop00 nfacctd[1075699]: INFO ( p1/print ): *** Purging cache - END (PID: 7551, QN: 56/56, ET: 0) ***
Oct 12 10:20:01 ntop00 sfacctd[1075592]: INFO ( m1/mysql ): *** Purging cache - START (PID: 7552) ***
Oct 12 10:20:01 ntop00 nfacctd[1075699]: INFO ( m1/mysql ): *** Purging cache - START (PID: 7552) ***
Oct 12 10:20:01 ntop00 nfacctd[1075699]: INFO ( m1/mysql ): *** Purging cache - END (PID: 7552, QN: 63/63, ET: 0) ***
Oct 12 10:20:10 ntop00 sfacctd[1075592]: INFO ( m1/mysql ): *** Purging cache - END (PID: 7552, QN: 4348/4348, ET: 9) ***
Oct 12 10:23:01 ntop00 sfacctd[1075592]: INFO ( p1/print ): *** Purging cache - START (PID: 7553) ***
Oct 12 10:23:01 ntop00 sfacctd[1075592]: INFO ( p1/print ): *** Purging cache - END (PID: 7553, QN: 4438/4438, ET: 0) ***
... 67 more distinct messages not shown
== outbound00.cs.umd.edu (1 distinct, 6 total) ==
Oct 12 10:09:09 outbound00.cs.umd.edu python3[1918424]: ldapdb [x6]
== outbound01.cs.umd.edu (3 distinct, 8 total) ==
Oct 12 10:13:06 outbound01.cs.umd.edu python3[3400819]: ldapdb [x6]
Oct 12 10:23:24 outbound01.cs.umd.edu krb5_child[3402932]: Preauthentication failed
Oct 12 10:31:43 outbound01.cs.umd.edu krb5_child[3405398]: Client 'admin(a)UMD.EDU' not found in Kerberos database
== quiss (18 distinct, 24 total) ==
Oct 12 10:08:45 quiss gnome-software[191719]: failed to get featured apps: no apps to show
Oct 12 10:08:45 quiss gnome-software[191719]: Only 0 apps for curated list, hiding
Oct 12 10:08:45 quiss gnome-software[191719]: Only 0 apps for recent list, hiding
Oct 12 10:08:48 quiss gnome-software[191719]: failed to commit changes to dconf: GDBus.Error:org.gtk.GDBus.UnmappedGError.Quark._g_2dfile_2derror_2dquark.Code2: Failed to create file “/adminhomes/josephao/.config/dconf/user.MRY5W3”: Permission denied
Oct 12 10:08:48 quiss packagekitd[2738058]: Failed to get cache filename for gnome-control-center-filesystem [x3]
Oct 12 10:08:48 quiss packagekitd[2738058]: Failed to get cache filename for perl [x3]
Oct 12 10:08:48 quiss packagekitd[2738058]: Failed to get cache filename for kernel [x3]
Oct 12 10:12:50 quiss evolution-sourc[191974]: Failed to reap '/adminhomes/josephao/.local/share/evolution/memos/trash': Error opening directory '/adminhomes/josephao/.local/share/evolution/memos/trash': Permission denied
Oct 12 10:12:50 quiss evolution-sourc[191974]: Failed to reap '/adminhomes/josephao/.cache/evolution/sources/trash': Error opening directory '/adminhomes/josephao/.cache/evolution/sources/trash': Permission denied
Oct 12 10:12:50 quiss evolution-sourc[191974]: Failed to reap '/adminhomes/josephao/.cache/evolution/tasks/trash': Error opening directory '/adminhomes/josephao/.cache/evolution/tasks/trash': Permission denied
Oct 12 10:12:50 quiss evolution-sourc[191974]: Failed to reap '/adminhomes/josephao/.local/share/evolution/tasks/trash': Error opening directory '/adminhomes/josephao/.local/share/evolution/tasks/trash': Permission denied
Oct 12 10:12:50 quiss evolution-sourc[191974]: Failed to reap '/adminhomes/josephao/.cache/evolution/mail/trash': Error opening directory '/adminhomes/josephao/.cache/evolution/mail/trash': Permission denied
Oct 12 10:12:50 quiss evolution-sourc[191974]: Failed to reap '/adminhomes/josephao/.cache/evolution/calendar/trash': Error opening directory '/adminhomes/josephao/.cache/evolution/calendar/trash': Permission denied
Oct 12 10:12:50 quiss evolution-sourc[191974]: Failed to reap '/adminhomes/josephao/.local/share/evolution/addressbook/trash': Error opening directory '/adminhomes/josephao/.local/share/evolution/addressbook/trash': Permission denied
Oct 12 10:12:50 quiss evolution-sourc[191974]: Failed to reap '/adminhomes/josephao/.cache/evolution/addressbook/trash': Error opening directory '/adminhomes/josephao/.cache/evolution/addressbook/trash': Permission denied
Oct 12 10:12:50 quiss evolution-sourc[191974]: Failed to reap '/adminhomes/josephao/.local/share/evolution/mail/trash': Error opening directory '/adminhomes/josephao/.local/share/evolution/mail/trash': Permission denied
Oct 12 10:12:50 quiss evolution-sourc[191974]: Failed to reap '/adminhomes/josephao/.local/share/evolution/calendar/trash': Error opening directory '/adminhomes/josephao/.local/share/evolution/calendar/trash': Permission denied
Oct 12 10:12:50 quiss evolution-sourc[191974]: Failed to reap '/adminhomes/josephao/.cache/evolution/memos/trash': Error opening directory '/adminhomes/josephao/.cache/evolution/memos/trash': Permission denied
== strawberry (7 distinct, 38 total) ==
Oct 12 10:07:03 strawberry kernel: I/O error, dev sda, sector 206848 op 0x0:(READ) flags 0x80700 phys_seg 1 prio class 2 [x6]
Oct 12 10:07:03 strawberry kernel: I/O error, dev sda, sector 206848 op 0x0:(READ) flags 0x0 phys_seg 1 prio class 2 [x6]
Oct 12 10:07:03 strawberry kernel: Buffer I/O error on dev sda2, logical block 0, async page read [x6]
Oct 12 10:07:03 strawberry kernel: I/O error, dev sda, sector 2048 op 0x0:(READ) flags 0x80700 phys_seg 1 prio class 2 [x6]
Oct 12 10:07:03 strawberry kernel: I/O error, dev sda, sector 2048 op 0x0:(READ) flags 0x0 phys_seg 1 prio class 2 [x6]
Oct 12 10:07:03 strawberry kernel: Buffer I/O error on dev sda1, logical block 0, async page read [x6]
Oct 12 10:34:42 strawberry smartd[5314]: Device: /dev/sda [SAT], failed to read SMART Attribute Data [x2]
== submit26-b9-3 (6 distinct, 6 total) ==
Sep 14 19:27:02 submit26-b9-3 systemd[1]: user(a)1001.service: Main process exited, code=killed, status=9/KILL
Sep 14 19:27:04 submit26-b9-3 systemd-coredump[3120572]: Process 3120569 (public06) of user 1001 dumped core.#012#012Stack trace of thread 3120569:#012#0 0x00007fb6bcd6677d __strlen_avx2_rtm (libc.so.6 + 0x16677d)#012#1 0x00007fb6bcc79268 _IO_puts (libc.so.6 + 0x79268)#012#2 0x000000000040194a print_document (public06 + 0x194a)#012#3 0x000000000040156f main (public06 + 0x156f)#012#4 0x00007fb6bcc2a610 __libc_start_call_main (libc.so.6 + 0x2a610)#012#5 0x00007fb6bcc2a6c0 __libc_start_main@@GLIBC_2.34 (libc.so.6 + 0x2a6c0)#012#6 0x00000000004010b5 _start (public06 + 0x10b5)#012ELF object binary architecture: AMD x86-64
Sep 14 19:27:04 submit26-b9-3 systemd-coredump[3120580]: Process 3120577 (release01) of user 1001 dumped core.#012#012Stack trace of thread 3120577:#012#0 0x00007f0548b6677d __strlen_avx2_rtm (libc.so.6 + 0x16677d)#012#1 0x00007f0548a79268 _IO_puts (libc.so.6 + 0x79268)#012#2 0x0000000000401972 print_document (release01 + 0x1972)#012#3 0x000000000040156f main (release01 + 0x156f)#012#4 0x00007f0548a2a610 __libc_start_call_main (libc.so.6 + 0x2a610)#012#5 0x00007f0548a2a6c0 __libc_start_main@@GLIBC_2.34 (libc.so.6 + 0x2a6c0)#012#6 0x00000000004010b5 _start (release01 + 0x10b5)#012ELF object binary architecture: AMD x86-64
Sep 14 19:27:04 submit26-b9-3 systemd-coredump[3120589]: Process 3120586 (release02) of user 1001 dumped core.#012#012Stack trace of thread 3120586:#012#0 0x00007f4a8776677d __strlen_avx2_rtm (libc.so.6 + 0x16677d)#012#1 0x00007f4a87679268 _IO_puts (libc.so.6 + 0x79268)#012#2 0x000000000040196d print_document (release02 + 0x196d)#012#3 0x000000000040156f main (release02 + 0x156f)#012#4 0x00007f4a8762a610 __libc_start_call_main (libc.so.6 + 0x2a610)#012#5 0x00007f4a8762a6c0 __libc_start_main@@GLIBC_2.34 (libc.so.6 + 0x2a6c0)#012#6 0x00000000004010b5 _start (release02 + 0x10b5)#012ELF object binary architecture: AMD x86-64
Sep 14 19:27:04 submit26-b9-3 systemd-coredump[3120598]: Process 3120594 (release03) of user 1001 dumped core.#012#012Stack trace of thread 3120594:#012#0 0x00007fbd1f16677d __strlen_avx2_rtm (libc.so.6 + 0x16677d)#012#1 0x00007fbd1f079268 _IO_puts (libc.so.6 + 0x79268)#012#2 0x000000000040196d print_document (release03 + 0x196d)#012#3 0x000000000040156f main (release03 + 0x156f)#012#4 0x00007fbd1f02a610 __libc_start_call_main (libc.so.6 + 0x2a610)#012#5 0x00007fbd1f02a6c0 __libc_start_main@@GLIBC_2.34 (libc.so.6 + 0x2a6c0)#012#6 0x00000000004010b5 _start (release03 + 0x10b5)#012ELF object binary architecture: AMD x86-64
Sep 14 19:27:04 submit26-b9-3 systemd-coredump[3120608]: Process 3120605 (release05) of user 1001 dumped core.#012#012Stack trace of thread 3120605:#012#0 0x00007ff5f736677d __strlen_avx2_rtm (libc.so.6 + 0x16677d)#012#1 0x00007ff5f7279268 _IO_puts (libc.so.6 + 0x79268)#012#2 0x0000000000401925 print_document (release05 + 0x1925)#012#3 0x0000000000401527 main (release05 + 0x1527)#012#4 0x00007ff5f722a610 __libc_start_call_main (libc.so.6 + 0x2a610)#012#5 0x00007ff5f722a6c0 __libc_start_main@@GLIBC_2.34 (libc.so.6 + 0x2a6c0)#012#6 0x00000000004010b5 _start (release05 + 0x10b5)#012ELF object binary architecture: AMD x86-64
== submit26-b9-f1 (9 distinct, 9 total) ==
Oct 12 10:26:04 submit26-b9-f1 setroubleshoot[2447548]: SELinux is preventing /usr/bin/python3.9 from create access on the directory /(null). For complete SELinux messages run: sealert -l 3ef7d677-731f-46bf-9c34-c2c55fea665c
Oct 12 10:26:04 submit26-b9-f1 setroubleshoot[2447548]: SELinux is preventing /usr/bin/python3.9 from add_name access on the directory /(null). For complete SELinux messages run: sealert -l aa60e26f-72e1-45f1-bc12-aa8b3b669e36
Oct 12 10:26:04 submit26-b9-f1 setroubleshoot[2447548]: SELinux is preventing /usr/bin/python3.9 from create access on the file /(null). For complete SELinux messages run: sealert -l d088fb43-23ee-4ae8-ae6a-5d1c041ee2d6
Oct 12 10:26:04 submit26-b9-f1 setroubleshoot[2447548]: SELinux is preventing /usr/bin/python3.9 from open access on the file /tmp/libdnf.7KjirU/repodata/repomd.xml. For complete SELinux messages run: sealert -l 3b0d8c9a-6637-4d6e-a864-f1dd7c00377d
Oct 12 10:26:04 submit26-b9-f1 setroubleshoot[2447548]: SELinux is preventing /usr/bin/python3.9 from setattr access on the file repomd.xml. For complete SELinux messages run: sealert -l 0fd3339f-3ef2-45f3-9e58-65a58b42f3ee
Oct 12 10:26:04 submit26-b9-f1 setroubleshoot[2447548]: SELinux is preventing /usr/bin/python3.9 from read access on the directory libdnf.7KjirU. For complete SELinux messages run: sealert -l 0d661d88-dc9e-469d-986b-52e29b353aa8
Oct 12 10:26:04 submit26-b9-f1 setroubleshoot[2447548]: SELinux is preventing /usr/bin/python3.9 from remove_name access on the directory repomd.xml. For complete SELinux messages run: sealert -l 405a8556-cf9f-4ef4-8525-0dca18d4259d
Oct 12 10:26:04 submit26-b9-f1 setroubleshoot[2447548]: SELinux is preventing /usr/bin/python3.9 from unlink access on the file repomd.xml. For complete SELinux messages run: sealert -l 3c38e23e-3631-4cb5-81c7-992675c836d9
Oct 12 10:26:04 submit26-b9-f1 setroubleshoot[2447548]: SELinux is preventing /usr/bin/python3.9 from rmdir access on the directory repodata. For complete SELinux messages run: sealert -l a070e9b5-2867-47d6-b2e3-3b7d99725848
== submit26-b9-f4 (1 distinct, 1 total) ==
Oct 12 10:24:08 submit26-b9-f4 systemd[1]: user(a)1001.service: Main process exited, code=killed, status=9/KILL
== tumtum.cs.umd.edu (4 distinct, 5 total) ==
Oct 12 10:12:10 tumtum.cs.umd.edu systemd-coredump[3044909]: Process 3044901 (podman) of user 0 dumped core.#012#012Stack trace of thread 3044901:#012#0 0x00005609a6a5f46e internal/runtime/syscall/linux.Syscall6 (podman + 0x48c46e)#012#1 0x00005609a6b3f326 syscall.Syscall (podman + 0x56c326)#012#2 0x00005609a6b3fed0 syscall.Syscall.abi0 (podman + 0x56ced0)#012#3 0x00005609a6caa36e github.com/containers/podman/vendor/golang.org/x/sys/unix.OpenTree (podman + 0x6d736e)#012#4 0x00005609a730bd6b github.com/containers/podman/vendor/github.com/cyphar/filepath-securejoin/p… (podman + 0xd38d6b)#012#5 0x00005609a730bc74 github.com/containers/podman/vendor/github.com/cyphar/filepath-securejoin/p… (podman + 0xd38c74)#012#6 0x00005609a6af2f8c sync.(*Once).doSlow (podman + 0x51ff8c)#012#7 0x00005609a6af2eb9 sync.(*Once).Do (podman + 0x51feb9)#012#8 0x00005609a730bb
e5 github.com/containers/podman/vendor/github.com/cyphar/filepath-securejoin/p… (podman + 0xd38be5)#012#9 0x00005609a730d202 github.com/containers/podman/vendor/github.com/cyphar/filepath-securejoin/p… (podman + 0xd3a202)#012#10 0x00005609a730d613 github.com/containers/podman/vendor/github.com/cyphar/filepath-securejoin/p… (podman + 0xd3a613)#012#11 0x00005609a730c73c github.com/containers/podman/vendor/github.com/cyphar/filepath-securejoin/p… (podman + 0xd3973c)#012#12 0x00005609a730c178 github.com/containers/podman/vendor/github.com/cyphar/filepath-securejoin/p… (podman + 0xd39178)#012#13 0x00005609a6af2f8c sync.(*Once).doSlow (podman + 0x51ff8c)#012#14 0x00005609a6af2eb9 sync.(*Once).D
o (podman + 0x51feb9)#012#15 0x00005609a730c0e5 github.com/containers/podman/vendor/github.com/cyphar/filepath-securejoin/p… (podman + 0xd390e5)#012#16 0x00005609a730d5ba github.com/containers/podman/vendor/github.com/cyphar/filepath-securejoin/p… (podman + 0xd3a5ba)#012#17 0x00005609a731416e github.com/containers/podman/vendor/github.com/opencontainers/selinux/go-se… (podman + 0xd4116e)#012#18 0x00005609a7314658 github.com/containers/podman/vendor/github.com/opencontainers/selinux/go-se… (podman + 0xd41658)#012#19 0x00005609a73133ff github.com/containers/podman/vendor/github.com/opencontainers/selinux/go-se… (podman + 0xd403ff)#012#20 0x00005609a7313693 github.com/containers/podman/vendor/github.com/opencontainers/selinux/go-se… (podman + 0xd40693)#012#21 0x000
05609a750d6cb github.com/containers/podman/vendor/go.podman.io/common/pkg/config.defaultC… (podman + 0xf3a6cb)#012#22 0x00005609a75110b2 github.com/containers/podman/vendor/go.podman.io/common/pkg/config.newLocked (podman + 0xf3e0b2)#012#23 0x00005609a7510da5 github.com/containers/podman/vendor/go.podman.io/common/pkg/config.New (podman + 0xf3dda5)#012#24 0x00005609a7c8d753 github.com/containers/podman/cmd/podman/registry.newPodmanConfig (podman + 0x16ba753)#012#25 0x00005609a6af2f8c sync.(*Once).doSlow (podman + 0x51ff8c)#012#26 0x00005609a7cae4d0 github.com/containers/podman/cmd/podman/common.init (podman + 0x16db4d0)#012#27 0x00005609a6ab8af7 runtime.doInit1 (podman + 0x4e5af7)#012#28 0x00005609a6aa9030 runtime.main (podman + 0x4d6030)#012#29 0x00005609a6ae9061 runtime.goexit.abi0 (podman + 0x516061)#012ELF object binary architecture: AMD x86-64
Oct 12 10:12:10 tumtum.cs.umd.edu systemd-coredump[3044923]: Process 3044916 (podman) of user 0 dumped core.#012#012Stack trace of thread 3044916:#012#0 0x0000558f8c87646e internal/runtime/syscall/linux.Syscall6 (podman + 0x48c46e)#012#1 0x0000558f8c956326 syscall.Syscall (podman + 0x56c326)#012#2 0x0000558f8c956ed0 syscall.Syscall.abi0 (podman + 0x56ced0)#012#3 0x0000558f8cac136e github.com/containers/podman/vendor/golang.org/x/sys/unix.OpenTree (podman + 0x6d736e)#012#4 0x0000558f8d122d6b github.com/containers/podman/vendor/github.com/cyphar/filepath-securejoin/p… (podman + 0xd38d6b)#012#5 0x0000558f8d122c74 github.com/containers/podman/vendor/github.com/cyphar/filepath-securejoin/p… (podman + 0xd38c74)#012#6 0x0000558f8c909f8c sync.(*Once).doSlow (podman + 0x51ff8c)#012#7 0x0000558f8c909eb9 sync.(*Once).Do (podman + 0x51feb9)#012#8 0x0000558f8d122b
e5 github.com/containers/podman/vendor/github.com/cyphar/filepath-securejoin/p… (podman + 0xd38be5)#012#9 0x0000558f8d124202 github.com/containers/podman/vendor/github.com/cyphar/filepath-securejoin/p… (podman + 0xd3a202)#012#10 0x0000558f8d124613 github.com/containers/podman/vendor/github.com/cyphar/filepath-securejoin/p… (podman + 0xd3a613)#012#11 0x0000558f8d12373c github.com/containers/podman/vendor/github.com/cyphar/filepath-securejoin/p… (podman + 0xd3973c)#012#12 0x0000558f8d123178 github.com/containers/podman/vendor/github.com/cyphar/filepath-securejoin/p… (podman + 0xd39178)#012#13 0x0000558f8c909f8c sync.(*Once).doSlow (podman + 0x51ff8c)#012#14 0x0000558f8c909eb9 sync.(*Once).D
o (podman + 0x51feb9)#012#15 0x0000558f8d1230e5 github.com/containers/podman/vendor/github.com/cyphar/filepath-securejoin/p… (podman + 0xd390e5)#012#16 0x0000558f8d1245ba github.com/containers/podman/vendor/github.com/cyphar/filepath-securejoin/p… (podman + 0xd3a5ba)#012#17 0x0000558f8d12b16e github.com/containers/podman/vendor/github.com/opencontainers/selinux/go-se… (podman + 0xd4116e)#012#18 0x0000558f8d12b658 github.com/containers/podman/vendor/github.com/opencontainers/selinux/go-se… (podman + 0xd41658)#012#19 0x0000558f8d12a3ff github.com/containers/podman/vendor/github.com/opencontainers/selinux/go-se… (podman + 0xd403ff)#012#20 0x0000558f8d12a693 github.com/containers/podman/vendor/github.com/opencontainers/selinux/go-se… (podman + 0xd40693)#012#21 0x000
0558f8d3246cb github.com/containers/podman/vendor/go.podman.io/common/pkg/config.defaultC… (podman + 0xf3a6cb)#012#22 0x0000558f8d3280b2 github.com/containers/podman/vendor/go.podman.io/common/pkg/config.newLocked (podman + 0xf3e0b2)#012#23 0x0000558f8d327da5 github.com/containers/podman/vendor/go.podman.io/common/pkg/config.New (podman + 0xf3dda5)#012#24 0x0000558f8daa4753 github.com/containers/podman/cmd/podman/registry.newPodmanConfig (podman + 0x16ba753)#012#25 0x0000558f8c909f8c sync.(*Once).doSlow (podman + 0x51ff8c)#012#26 0x0000558f8dac54d0 github.com/containers/podman/cmd/podman/common.init (podman + 0x16db4d0)#012#27 0x0000558f8c8cfaf7 runtime.doInit1 (podman + 0x4e5af7)#012#28 0x0000558f8c8c0030 runtime.main (podman + 0x4d6030)#012#29 0x0000558f8c900061 runtime.goexit.abi0 (podman + 0x516061)#012ELF object binary architecture: AMD x86-64
Oct 12 10:12:11 tumtum.cs.umd.edu systemd-coredump[3044946]: Process 3044935 (podman) of user 0 dumped core.#012#012Stack trace of thread 3044935:#012#0 0x000055b80a9b846e internal/runtime/syscall/linux.Syscall6 (podman + 0x48c46e)#012#1 0x000055b80aa98326 syscall.Syscall (podman + 0x56c326)#012#2 0x000055b80aa98ed0 syscall.Syscall.abi0 (podman + 0x56ced0)#012#3 0x000055b80ac0336e github.com/containers/podman/vendor/golang.org/x/sys/unix.OpenTree (podman + 0x6d736e)#012#4 0x000055b80b264d6b github.com/containers/podman/vendor/github.com/cyphar/filepath-securejoin/p… (podman + 0xd38d6b)#012#5 0x000055b80b264c74 github.com/containers/podman/vendor/github.com/cyphar/filepath-securejoin/p… (podman + 0xd38c74)#012#6 0x000055b80aa4bf8c sync.(*Once).doSlow (podman + 0x51ff8c)#012#7 0x000055b80aa4beb9 sync.(*Once).Do (podman + 0x51feb9)#012#8 0x000055b80b264b
e5 github.com/containers/podman/vendor/github.com/cyphar/filepath-securejoin/p… (podman + 0xd38be5)#012#9 0x000055b80b266202 github.com/containers/podman/vendor/github.com/cyphar/filepath-securejoin/p… (podman + 0xd3a202)#012#10 0x000055b80b266613 github.com/containers/podman/vendor/github.com/cyphar/filepath-securejoin/p… (podman + 0xd3a613)#012#11 0x000055b80b26573c github.com/containers/podman/vendor/github.com/cyphar/filepath-securejoin/p… (podman + 0xd3973c)#012#12 0x000055b80b265178 github.com/containers/podman/vendor/github.com/cyphar/filepath-securejoin/p… (podman + 0xd39178)#012#13 0x000055b80aa4bf8c sync.(*Once).doSlow (podman + 0x51ff8c)#012#14 0x000055b80aa4beb9 sync.(*Once).D
o (podman + 0x51feb9)#012#15 0x000055b80b2650e5 github.com/containers/podman/vendor/github.com/cyphar/filepath-securejoin/p… (podman + 0xd390e5)#012#16 0x000055b80b2665ba github.com/containers/podman/vendor/github.com/cyphar/filepath-securejoin/p… (podman + 0xd3a5ba)#012#17 0x000055b80b26d16e github.com/containers/podman/vendor/github.com/opencontainers/selinux/go-se… (podman + 0xd4116e)#012#18 0x000055b80b26d658 github.com/containers/podman/vendor/github.com/opencontainers/selinux/go-se… (podman + 0xd41658)#012#19 0x000055b80b26c3ff github.com/containers/podman/vendor/github.com/opencontainers/selinux/go-se… (podman + 0xd403ff)#012#20 0x000055b80b26c693 github.com/containers/podman/vendor/github.com/opencontainers/selinux/go-se… (podman + 0xd40693)#012#21 0x000
055b80b4666cb github.com/containers/podman/vendor/go.podman.io/common/pkg/config.defaultC… (podman + 0xf3a6cb)#012#22 0x000055b80b46a0b2 github.com/containers/podman/vendor/go.podman.io/common/pkg/config.newLocked (podman + 0xf3e0b2)#012#23 0x000055b80b469da5 github.com/containers/podman/vendor/go.podman.io/common/pkg/config.New (podman + 0xf3dda5)#012#24 0x000055b80bbe6753 github.com/containers/podman/cmd/podman/registry.newPodmanConfig (podman + 0x16ba753)#012#25 0x000055b80aa4bf8c sync.(*Once).doSlow (podman + 0x51ff8c)#012#26 0x000055b80bc074d0 github.com/containers/podman/cmd/podman/common.init (podman + 0x16db4d0)#012#27 0x000055b80aa11af7 runtime.doInit1 (podman + 0x4e5af7)#012#28 0x000055b80aa02030 runtime.main (podman + 0x4d6030)#012#29 0x000055b80aa42061 runtime.goexit.abi0 (podman + 0x516061)#012ELF object binary architecture: AMD x86-64
Oct 12 10:12:11 tumtum.cs.umd.edu setroubleshoot[3044908]: SELinux is preventing /usr/bin/podman from using the nnp_transition access on a process. For complete SELinux messages run: sealert -l 25dc4c4f-7291-4531-9147-1664f3d26484 [x2]
1
0
Command: /usr/local/sbin/syslog-digest.py
Time : 0.0832s
Status : exited 0
Output :
Syslog digest — 2026-10-12 10:05 EDT
Processed 3,862 lines, filtered 2,997 (77%). 865 unknown (291 distinct) from 25 host(s).
== abuse (1 distinct, 346 total) ==
Oct 12 09:05:25 abuse rsyslogd[1033]: imjournal: open() failed for path: '/var/lib/rsyslog/imjournal.state.tmp': Input/output error [v8.2404.0 try https://www.rsyslog.com/e/2433 ] [x346]
== b0b02.cs.umd.edu (1 distinct, 1 total) ==
Oct 12 09:24:24 b0b02.cs.umd.edu rustdesk[3012786]: cannot open display:
== borogove.cs.umd.edu (13 distinct, 73 total) ==
Oct 12 09:59:01 borogove.cs.umd.edu aardvark-dns[0]: 13721 dns request got empty response [x6]
Oct 12 09:59:01 borogove.cs.umd.edu aardvark-dns[0]: 48790 dns request got empty response [x6]
Oct 12 09:59:11 borogove.cs.umd.edu aardvark-dns[0]: 10409 dns request got empty response [x6]
Oct 12 09:59:11 borogove.cs.umd.edu aardvark-dns[0]: 38827 dns request got empty response [x6]
Oct 12 09:59:21 borogove.cs.umd.edu aardvark-dns[0]: 6923 dns request got empty response [x6]
Oct 12 09:59:21 borogove.cs.umd.edu aardvark-dns[0]: 21005 dns request got empty response [x6]
Oct 12 09:59:31 borogove.cs.umd.edu aardvark-dns[0]: 5678 dns request got empty response [x6]
Oct 12 09:59:31 borogove.cs.umd.edu aardvark-dns[0]: 35360 dns request got empty response [x6]
Oct 12 09:59:41 borogove.cs.umd.edu aardvark-dns[0]: 59594 dns request got empty response [x6]
Oct 12 09:59:41 borogove.cs.umd.edu aardvark-dns[0]: 26318 dns request got empty response [x6]
Oct 12 09:59:51 borogove.cs.umd.edu aardvark-dns[0]: 27493 dns request got empty response [x6]
Oct 12 09:59:51 borogove.cs.umd.edu aardvark-dns[0]: 34658 dns request got empty response [x6]
Oct 12 10:00:11 borogove.cs.umd.edu sssd_be[3546]: Could not start TLS encryption.
== idm00 (38 distinct, 43 total) ==
Oct 12 09:39:22 idm00 named[3155984]: client @0x7f45a005e858 10.73.240.43#55598: update '73.10.in-addr.arpa/IN' denied
Oct 12 09:54:47 idm00 named[3155984]: client @0x7f459c08e0a8 10.73.240.42#52467: update '73.10.in-addr.arpa/IN' denied
Oct 12 09:56:48 idm00 setroubleshoot[3478042]: SELinux is preventing /usr/sbin/setfiles from relabelto access on the file softhsm_pin. For complete SELinux messages run: sealert -l 09fa72ff-24c8-4675-b2ff-123b24e08bd2
Oct 12 09:56:54 idm00 systemd-coredump[3478741]: Process 929 (gssproxy) of user 0 dumped core.#012#012Stack trace of thread 935:#012#0 0x00007f84e428be2c n/a (/usr/lib64/libc.so.6 (deleted) + 0x8be2c)#012ELF object binary architecture: AMD x86-64
Oct 12 09:56:54 idm00 systemd[1]: gssproxy.service: Main process exited, code=dumped, status=6/ABRT
Oct 12 09:57:20 idm00 systemd-tmpfiles[3484628]: <stdin>:1: Path '2770' not absolute.
Oct 12 09:57:20 idm00 systemd-tmpfiles[3484628]: <stdin>:2: Path '-' not absolute.
Oct 12 09:57:20 idm00 systemd-tmpfiles[3484628]: <stdin>:3: Path '-' not absolute.
Oct 12 09:57:20 idm00 systemd-tmpfiles[3484628]: <stdin>:4: Path '-' not absolute.
Oct 12 09:59:56 idm00 ldap_child[3502071]: Failed to initialize credentials using keytab [MEMORY:/etc/krb5.keytab]: Cannot contact any KDC for realm 'CS.UMD.EDU'. Unable to create GSSAPI-encrypted LDAP connection. [x2]
Oct 12 09:59:57 idm00 named[3502958]: checkhints: unable to get root NS rrset from cache: not found [x5]
Oct 12 10:00:12 idm00 sssd_be[3503336]: `ldap_sudo_search_base` is not set. SSSD will search the entire directory tree (dc=cs,dc=umd,dc=edu) for sudoRole objects. This may allow any LDAP principal with write access to any subtree to inject sudo rules granting arbitrary privileges. Set `ldap_sudo_search_base` to restrict the search scope (e.g., 'ou=sudoers,dc=example,dc=com').
Oct 12 10:01:14 idm00 microcode_ctl[3521618]: <4>After installation of a new version of microcode_ctl package,
Oct 12 10:01:14 idm00 microcode_ctl[3521618]: initramfs hasn't been re-generated for all the installed kernel packages.
Oct 12 10:01:14 idm00 microcode_ctl[3521618]: The following kernel packages have been skipped: kernel-core-5.14.0-503.21.1.el9_5.x86_64.
Oct 12 10:01:14 idm00 microcode_ctl[3521618]: Please re-generate initramfs manually for these kernel packages with the
Oct 12 10:01:14 idm00 microcode_ctl[3521618]: "dracut -f --kver KERNEL_VERSION" command in order to get the latest
Oct 12 10:01:14 idm00 microcode_ctl[3521618]: Intel CPU microcode included into early initramfs image for it, if needed.
Oct 12 10:01:14 idm00 journal: After installation of a new version of microcode_ctl package,
Oct 12 10:01:14 idm00 journal: initramfs hasn't been re-generated for all the installed kernel packages.
Oct 12 10:01:14 idm00 journal: The following kernel packages have been skipped: kernel-core-5.14.0-503.21.1.el9_5.x86_64.
Oct 12 10:01:14 idm00 journal: Please re-generate initramfs manually for these kernel packages with the
Oct 12 10:01:14 idm00 journal: "dracut -f --kver KERNEL_VERSION" command in order to get the latest
Oct 12 10:01:14 idm00 journal: Intel CPU microcode included into early initramfs image for it, if needed.
Oct 12 10:01:27 idm00 irqbalance[3521787]: Cannot change IRQ 28 affinity: Operation not permitted
Oct 12 10:01:27 idm00 irqbalance[3521787]: IRQ 28 affinity is now unmanaged
Oct 12 10:01:27 idm00 irqbalance[3521787]: Cannot change IRQ 29 affinity: Operation not permitted
Oct 12 10:01:27 idm00 irqbalance[3521787]: IRQ 29 affinity is now unmanaged
Oct 12 10:01:27 idm00 irqbalance[3521787]: Cannot change IRQ 27 affinity: Operation not permitted
Oct 12 10:01:27 idm00 irqbalance[3521787]: IRQ 27 affinity is now unmanaged
... 8 more distinct messages not shown
== idmh1 (58 distinct, 74 total) ==
Oct 12 09:16:58 idmh1 sssd_be[1364708]: `ldap_sudo_search_base` is not set. SSSD will search the entire directory tree (dc=cs,dc=umd,dc=edu) for sudoRole objects. This may allow any LDAP principal with write access to any subtree to inject sudo rules granting arbitrary privileges. Set `ldap_sudo_search_base` to restrict the search scope (e.g., 'ou=sudoers,dc=example,dc=com').
Oct 12 09:16:58 idmh1 ldap_child[1364715]: Failed to initialize credentials using keytab [MEMORY:/etc/krb5.keytab]: Cannot contact any KDC for realm 'CS.UMD.EDU'. Unable to create GSSAPI-encrypted LDAP connection. [x9]
Oct 12 09:20:24 idmh1 named[1212]: checkhints: unable to get root NS rrset from cache: not found
Oct 12 09:33:45 idmh1 puppet-agent[9345]: Red Hat Enterprise Linux 9 for x86_64 - AppStre 47 kB/s | 4.5 kB 00:00
Oct 12 09:33:45 idmh1 puppet-agent[9345]: Red Hat Enterprise Linux 9 for x86_64 - BaseOS 71 kB/s | 4.1 kB 00:00
Oct 12 09:33:45 idmh1 puppet-agent[9345]: Testing Zoom2 67 kB/s | 1.5 kB 00:00
Oct 12 09:33:45 idmh1 puppet-agent[9345]: Dependencies resolved.
Oct 12 09:33:45 idmh1 puppet-agent[9345]: ================================================================================ [x3]
Oct 12 09:33:45 idmh1 puppet-agent[9345]: Package Architecture Version Repository Size
Oct 12 09:33:45 idmh1 puppet-agent[9345]: Downgrading:
Oct 12 09:33:45 idmh1 puppet-agent[9345]: openvox-agent x86_64 8.29.0-1.el9 openvox8 21 M
Oct 12 09:33:45 idmh1 puppet-agent[9345]: [x3]
Oct 12 09:33:45 idmh1 puppet-agent[9345]: Transaction Summary
Oct 12 09:33:45 idmh1 puppet-agent[9345]: Downgrade 1 Package
Oct 12 09:33:45 idmh1 puppet-agent[9345]: Total download size: 21 M
Oct 12 09:33:45 idmh1 puppet-agent[9345]: Downloading Packages:
Oct 12 09:33:45 idmh1 puppet-agent[9345]: [FAILED] openvox-agent-8.29.0-1.el9.x86_64.rpm: No more mirrors to try - All mirrors were already tried without success
Oct 12 09:33:45 idmh1 puppet-agent[9345]: The downloaded packages were saved in cache until the next successful transaction.
Oct 12 09:33:45 idmh1 puppet-agent[9345]: Error: Error downloading packages:
Oct 12 09:33:45 idmh1 puppet-agent[9345]: openvox-agent-8.29.0-1.el9.x86_64: Cannot download, all mirrors were already tried without success
Oct 12 09:33:45 idmh1 puppet-agent[9345]: (/Stage[main]/Puppet::Agent::Install/Package[openvox-agent]/ensure) Red Hat Enterprise Linux 9 for x86_64 - AppStre 47 kB/s | 4.5 kB 00:00
Oct 12 09:33:45 idmh1 puppet-agent[9345]: (/Stage[main]/Puppet::Agent::Install/Package[openvox-agent]/ensure) Red Hat Enterprise Linux 9 for x86_64 - BaseOS 71 kB/s | 4.1 kB 00:00
Oct 12 09:33:45 idmh1 puppet-agent[9345]: (/Stage[main]/Puppet::Agent::Install/Package[openvox-agent]/ensure) Testing Zoom2 67 kB/s | 1.5 kB 00:00
Oct 12 09:33:45 idmh1 puppet-agent[9345]: (/Stage[main]/Puppet::Agent::Install/Package[openvox-agent]/ensure) Dependencies resolved.
Oct 12 09:33:45 idmh1 puppet-agent[9345]: (/Stage[main]/Puppet::Agent::Install/Package[openvox-agent]/ensure) ================================================================================ [x3]
Oct 12 09:33:45 idmh1 puppet-agent[9345]: (/Stage[main]/Puppet::Agent::Install/Package[openvox-agent]/ensure) Package Architecture Version Repository Size
Oct 12 09:33:45 idmh1 puppet-agent[9345]: (/Stage[main]/Puppet::Agent::Install/Package[openvox-agent]/ensure) Downgrading:
Oct 12 09:33:45 idmh1 puppet-agent[9345]: (/Stage[main]/Puppet::Agent::Install/Package[openvox-agent]/ensure) openvox-agent x86_64 8.29.0-1.el9 openvox8 21 M
Oct 12 09:33:45 idmh1 puppet-agent[9345]: (/Stage[main]/Puppet::Agent::Install/Package[openvox-agent]/ensure) [x3]
Oct 12 09:33:45 idmh1 puppet-agent[9345]: (/Stage[main]/Puppet::Agent::Install/Package[openvox-agent]/ensure) Transaction Summary
... 28 more distinct messages not shown
== idmp0 (8 distinct, 8 total) ==
Oct 12 09:15:50 idmp0 systemd-coredump[706355]: Process 1111 (gssproxy) of user 0 dumped core.#012#012Stack trace of thread 1113:#012#0 0x00007f92a348be2c n/a (/usr/lib64/libc.so.6 (deleted) + 0x8be2c)#012ELF object binary architecture: AMD x86-64
Oct 12 09:15:50 idmp0 systemd[1]: gssproxy.service: Main process exited, code=dumped, status=6/ABRT
Oct 12 09:16:13 idmp0 DISCLAIMER[711091]: Microcode update for Intel Broadwell-EP/EX (BDX-ML B/M/R0; family 6, model 79,
Oct 12 09:16:13 idmp0 DISCLAIMER[711091]: stepping 1; CPUID 0x406f1) CPUs is disabled as it may cause system instability.
Oct 12 09:16:13 idmp0 DISCLAIMER[711091]: Please refer to /usr/share/doc/microcode_ctl/caveats/06-4f-01_readme
Oct 12 09:16:13 idmp0 DISCLAIMER[711091]: and /usr/share/doc/microcode_ctl/README.caveats for details.
Oct 12 09:16:13 idmp0 journal: Microcode update for Intel Broadwell-EP/EX (BDX-ML B/M/R0; family 6, model 79,#012stepping 1; CPUID 0x406f1) CPUs is disabled as it may cause system instability.#012Please refer to /usr/share/doc/microcode_ctl/caveats/06-4f-01_readme#012and /usr/share/doc/microcode_ctl/README.caveats for details.
Oct 12 09:16:16 idmp0 check-httpd-alive[712621]: httpd not responding on /server-status; forcing SIGKILL + restart
== irb2156 (1 distinct, 1 total) ==
Oct 12 09:26:44 irb2156 systemd[1]: insights-client.service: Start request repeated too quickly.
== itmon02 (1 distinct, 5 total) ==
Oct 12 09:08:20 itmon02 sshd[805675]: error: beginning MaxStartups throttling [x5]
== jaws.cs.umd.edu (12 distinct, 68 total) ==
Oct 12 09:59:02 jaws.cs.umd.edu aardvark-dns[0]: 36839 dns request got empty response [x6]
Oct 12 09:59:02 jaws.cs.umd.edu aardvark-dns[0]: 20126 dns request got empty response [x6]
Oct 12 09:59:12 jaws.cs.umd.edu aardvark-dns[0]: 27395 dns request got empty response [x6]
Oct 12 09:59:12 jaws.cs.umd.edu aardvark-dns[0]: 34570 dns request got empty response [x6]
Oct 12 09:59:22 jaws.cs.umd.edu aardvark-dns[0]: 46432 dns request got empty response [x6]
Oct 12 09:59:22 jaws.cs.umd.edu aardvark-dns[0]: 858 dns request got empty response [x6]
Oct 12 09:59:32 jaws.cs.umd.edu aardvark-dns[0]: 60183 dns request got empty response [x6]
Oct 12 09:59:32 jaws.cs.umd.edu aardvark-dns[0]: 11283 dns request got empty response [x6]
Oct 12 09:59:42 jaws.cs.umd.edu aardvark-dns[0]: 19210 dns request got empty response [x6]
Oct 12 09:59:42 jaws.cs.umd.edu aardvark-dns[0]: 37901 dns request got empty response [x6]
Oct 12 09:59:52 jaws.cs.umd.edu aardvark-dns[0]: 399 dns request got empty response [x4]
Oct 12 09:59:52 jaws.cs.umd.edu aardvark-dns[0]: 20611 dns request got empty response [x4]
== jubjub.cs.umd.edu (19 distinct, 19 total) ==
Oct 12 09:05:03 jubjub.cs.umd.edu puppet-agent[2099875]: (/Stage[main]/Puppet::Agent::Config/Puppet::Config::Agent[classfile]/Puppet::Config::Entry[agent_classfile]/Concat::Fragment[puppet.conf_agent]/Concat_fragment[puppet.conf_agent]) Skipping because of failed dependencies
Oct 12 09:05:03 jubjub.cs.umd.edu puppet-agent[2099875]: (/Stage[main]/Puppet::Agent::Config/Puppet::Config::Agent[classfile]/Puppet::Config::Entry[agent_classfile]/Concat::Fragment[puppet.conf_agent_end]/Concat_fragment[puppet.conf_agent_end]) Skipping because of failed dependencies
Oct 12 09:05:03 jubjub.cs.umd.edu puppet-agent[2099875]: (/Stage[main]/Puppet::Agent::Config/Puppet::Config::Agent[classfile]/Puppet::Config::Entry[agent_classfile]/Concat::Fragment[puppet.conf_agent_classfile]/Concat_fragment[puppet.conf_agent_classfile]) Skipping because of failed dependencies
Oct 12 09:05:03 jubjub.cs.umd.edu puppet-agent[2099875]: (/Stage[main]/Puppet::Agent::Config/Puppet::Config::Agent[default_schedules]/Puppet::Config::Entry[agent_default_schedules]/Concat::Fragment[puppet.conf_agent_default_schedules]/Concat_fragment[puppet.conf_agent_default_schedules]) Skipping because of failed dependencies
Oct 12 09:05:03 jubjub.cs.umd.edu puppet-agent[2099875]: (/Stage[main]/Puppet::Agent::Config/Puppet::Config::Agent[report]/Puppet::Config::Entry[agent_report]/Concat::Fragment[puppet.conf_agent_report]/Concat_fragment[puppet.conf_agent_report]) Skipping because of failed dependencies
Oct 12 09:05:03 jubjub.cs.umd.edu puppet-agent[2099875]: (/Stage[main]/Puppet::Agent::Config/Puppet::Config::Agent[masterport]/Puppet::Config::Entry[agent_masterport]/Concat::Fragment[puppet.conf_agent_masterport]/Concat_fragment[puppet.conf_agent_masterport]) Skipping because of failed dependencies
Oct 12 09:05:03 jubjub.cs.umd.edu puppet-agent[2099875]: (/Stage[main]/Puppet::Agent::Config/Puppet::Config::Agent[splay]/Puppet::Config::Entry[agent_splay]/Concat::Fragment[puppet.conf_agent_splay]/Concat_fragment[puppet.conf_agent_splay]) Skipping because of failed dependencies
Oct 12 09:05:03 jubjub.cs.umd.edu puppet-agent[2099875]: (/Stage[main]/Puppet::Agent::Config/Puppet::Config::Agent[splaylimit]/Puppet::Config::Entry[agent_splaylimit]/Concat::Fragment[puppet.conf_agent_splaylimit]/Concat_fragment[puppet.conf_agent_splaylimit]) Skipping because of failed dependencies
Oct 12 09:05:03 jubjub.cs.umd.edu puppet-agent[2099875]: (/Stage[main]/Puppet::Agent::Config/Puppet::Config::Agent[runinterval]/Puppet::Config::Entry[agent_runinterval]/Concat::Fragment[puppet.conf_agent_runinterval]/Concat_fragment[puppet.conf_agent_runinterval]) Skipping because of failed dependencies
Oct 12 09:05:03 jubjub.cs.umd.edu puppet-agent[2099875]: (/Stage[main]/Puppet::Agent::Config/Puppet::Config::Agent[noop]/Puppet::Config::Entry[agent_noop]/Concat::Fragment[puppet.conf_agent_noop]/Concat_fragment[puppet.conf_agent_noop]) Skipping because of failed dependencies
Oct 12 09:05:03 jubjub.cs.umd.edu puppet-agent[2099875]: (/Stage[main]/Puppet::Agent::Config/Puppet::Config::Agent[usecacheonfailure]/Puppet::Config::Entry[agent_usecacheonfailure]/Concat::Fragment[puppet.conf_agent_usecacheonfailure]/Concat_fragment[puppet.conf_agent_usecacheonfailure]) Skipping because of failed dependencies
Oct 12 09:05:03 jubjub.cs.umd.edu puppet-agent[2099875]: (/Stage[main]/Puppet::Agent::Config/Puppet::Config::Agent[environment]/Puppet::Config::Entry[agent_environment]/Concat::Fragment[puppet.conf_agent_environment]/Concat_fragment[puppet.conf_agent_environment]) Skipping because of failed dependencies
Oct 12 09:05:03 jubjub.cs.umd.edu puppet-agent[2099875]: (/Stage[main]/Puppet::Agent::Service::Daemon/Service[puppet]) Skipping because of failed dependencies
Oct 12 09:05:03 jubjub.cs.umd.edu puppet-agent[2099875]: (/Stage[main]/Puppet::Agent::Service::Cron/Cron[puppet]) Skipping because of failed dependencies
Oct 12 09:05:03 jubjub.cs.umd.edu puppet-agent[2099875]: (/Stage[main]/Puppet::Agent::Service::Systemd/Systemd::Timer[puppet-run.timer]/Systemd::Unit_file[puppet-run.service]/File[/etc/systemd/system/puppet-run.service]) Skipping because of failed dependencies
Oct 12 09:05:03 jubjub.cs.umd.edu puppet-agent[2099875]: (/Stage[main]/Puppet::Agent::Service::Systemd/Systemd::Timer[puppet-run.timer]/Systemd::Unit_file[puppet-run.service]/Systemd::Daemon_reload[puppet-run.service]/Exec[systemd-puppet-run.service-systemctl-daemon-reload]) Skipping because of failed dependencies
Oct 12 09:05:03 jubjub.cs.umd.edu puppet-agent[2099875]: (/Stage[main]/Puppet::Agent::Service::Systemd/Systemd::Timer[puppet-run.timer]/Systemd::Unit_file[puppet-run.timer]/File[/etc/systemd/system/puppet-run.timer]) Skipping because of failed dependencies
Oct 12 09:05:03 jubjub.cs.umd.edu puppet-agent[2099875]: (/Stage[main]/Puppet::Agent::Service::Systemd/Systemd::Timer[puppet-run.timer]/Systemd::Unit_file[puppet-run.timer]/Systemd::Daemon_reload[puppet-run.timer]/Exec[systemd-puppet-run.timer-systemctl-daemon-reload]) Skipping because of failed dependencies
Oct 12 09:05:03 jubjub.cs.umd.edu puppet-agent[2099875]: (/Stage[main]/Puppet::Agent::Service::Systemd/Systemd::Timer[puppet-run.timer]/Systemd::Unit_file[puppet-run.timer]/Service[puppet-run.timer]) Skipping because of failed dependencies
== munin (2 distinct, 12 total) ==
Oct 12 09:28:36 munin sudo[3821222]: pam_systemd(sudo:session): Failed to stat() runtime directory '/run/user/0': No such file or directory [x6]
Oct 12 09:28:36 munin sudo[3821222]: pam_systemd(sudo:session): Not setting $XDG_RUNTIME_DIR, as the directory is not in order. [x6]
== netman.cs.umd.edu (1 distinct, 1 total) ==
Oct 12 09:20:32 netman.cs.umd.edu systemd[1]: insights-client.service: Start request repeated too quickly.
== newhonors2 (1 distinct, 24 total) ==
Oct 12 09:13:03 newhonors2 dhcpcd[3918428]: dhcpcd is not running [x24]
== ntop00 (93 distinct, 93 total) ==
Oct 12 09:05:12 ntop00 sfacctd[1075592]: INFO ( m1/mysql ): *** Purging cache - END (PID: 7522, QN: 5066/5066, ET: 11) ***
Oct 12 09:08:01 ntop00 sfacctd[1075592]: INFO ( p1/print ): *** Purging cache - START (PID: 7523) ***
Oct 12 09:08:01 ntop00 sfacctd[1075592]: INFO ( p1/print ): *** Purging cache - END (PID: 7523, QN: 4882/4882, ET: 0) ***
Oct 12 09:08:01 ntop00 nfacctd[1075699]: INFO ( p1/print ): *** Purging cache - START (PID: 7523) ***
Oct 12 09:08:01 ntop00 nfacctd[1075699]: INFO ( p1/print ): *** Purging cache - END (PID: 7523, QN: 62/62, ET: 0) ***
Oct 12 09:10:01 ntop00 nfacctd[1075699]: INFO ( m1/mysql ): *** Purging cache - START (PID: 7524) ***
Oct 12 09:10:01 ntop00 sfacctd[1075592]: INFO ( m1/mysql ): *** Purging cache - START (PID: 7524) ***
Oct 12 09:10:01 ntop00 nfacctd[1075699]: INFO ( m1/mysql ): *** Purging cache - END (PID: 7524, QN: 53/53, ET: 0) ***
Oct 12 09:10:10 ntop00 sfacctd[1075592]: INFO ( m1/mysql ): *** Purging cache - END (PID: 7524, QN: 4667/4667, ET: 9) ***
Oct 12 09:13:01 ntop00 sfacctd[1075592]: INFO ( p1/print ): *** Purging cache - START (PID: 7525) ***
Oct 12 09:13:01 ntop00 sfacctd[1075592]: INFO ( p1/print ): *** Purging cache - END (PID: 7525, QN: 4590/4590, ET: 0) ***
Oct 12 09:13:01 ntop00 nfacctd[1075699]: INFO ( p1/print ): *** Purging cache - START (PID: 7525) ***
Oct 12 09:13:01 ntop00 nfacctd[1075699]: INFO ( p1/print ): *** Purging cache - END (PID: 7525, QN: 57/57, ET: 0) ***
Oct 12 09:15:01 ntop00 sfacctd[1075592]: INFO ( m1/mysql ): *** Purging cache - START (PID: 7526) ***
Oct 12 09:15:01 ntop00 nfacctd[1075699]: INFO ( m1/mysql ): *** Purging cache - START (PID: 7526) ***
Oct 12 09:15:01 ntop00 nfacctd[1075699]: INFO ( m1/mysql ): *** Purging cache - END (PID: 7526, QN: 61/61, ET: 0) ***
Oct 12 09:15:11 ntop00 sfacctd[1075592]: INFO ( m1/mysql ): *** Purging cache - END (PID: 7526, QN: 4552/4552, ET: 10) ***
Oct 12 09:18:01 ntop00 sfacctd[1075592]: INFO ( p1/print ): *** Purging cache - START (PID: 7527) ***
Oct 12 09:18:01 ntop00 sfacctd[1075592]: INFO ( p1/print ): *** Purging cache - END (PID: 7527, QN: 4764/4764, ET: 0) ***
Oct 12 09:18:01 ntop00 nfacctd[1075699]: INFO ( p1/print ): *** Purging cache - START (PID: 7527) ***
Oct 12 09:18:01 ntop00 nfacctd[1075699]: INFO ( p1/print ): *** Purging cache - END (PID: 7527, QN: 56/56, ET: 0) ***
Oct 12 09:20:01 ntop00 sfacctd[1075592]: INFO ( m1/mysql ): *** Purging cache - START (PID: 7528) ***
Oct 12 09:20:01 ntop00 nfacctd[1075699]: INFO ( m1/mysql ): *** Purging cache - START (PID: 7528) ***
Oct 12 09:20:01 ntop00 nfacctd[1075699]: INFO ( m1/mysql ): *** Purging cache - END (PID: 7528, QN: 55/55, ET: 0) ***
Oct 12 09:20:12 ntop00 sfacctd[1075592]: INFO ( m1/mysql ): *** Purging cache - END (PID: 7528, QN: 4754/4754, ET: 11) ***
Oct 12 09:23:01 ntop00 sfacctd[1075592]: INFO ( p1/print ): *** Purging cache - START (PID: 7529) ***
Oct 12 09:23:01 ntop00 sfacctd[1075592]: INFO ( p1/print ): *** Purging cache - END (PID: 7529, QN: 5069/5069, ET: 0) ***
Oct 12 09:23:01 ntop00 nfacctd[1075699]: INFO ( p1/print ): *** Purging cache - START (PID: 7529) ***
Oct 12 09:23:01 ntop00 nfacctd[1075699]: INFO ( p1/print ): *** Purging cache - END (PID: 7529, QN: 76/76, ET: 0) ***
Oct 12 09:25:01 ntop00 sfacctd[1075592]: INFO ( m1/mysql ): *** Purging cache - START (PID: 7530) ***
... 63 more distinct messages not shown
== openvox08 (1 distinct, 2 total) ==
Oct 12 10:01:55 openvox08 sshd-session[2274621]: error: Certificate does not contain an authorized principal [x2]
== openvox08-cmp3 (1 distinct, 2 total) ==
Oct 12 10:01:55 openvox08-cmp3 sshd-session[28147]: error: Certificate does not contain an authorized principal [x2]
== outbound00.cs.umd.edu (1 distinct, 6 total) ==
Oct 12 09:09:09 outbound00.cs.umd.edu python3[1904694]: ldapdb [x6]
== outbound01.cs.umd.edu (1 distinct, 6 total) ==
Oct 12 09:13:06 outbound01.cs.umd.edu python3[3386764]: ldapdb [x6]
== quiss (8 distinct, 14 total) ==
Oct 12 09:08:37 quiss gnome-software[191719]: failed to commit changes to dconf: GDBus.Error:org.gtk.GDBus.UnmappedGError.Quark._g_2dfile_2derror_2dquark.Code2: Failed to create file “/adminhomes/josephao/.config/dconf/user.SUFTW3”: Permission denied
Oct 12 09:08:40 quiss gnome-software[191719]: failed to get featured apps: no apps to show
Oct 12 09:08:40 quiss gnome-software[191719]: Only 0 apps for curated list, hiding
Oct 12 09:08:40 quiss gnome-software[191719]: Only 0 apps for recent list, hiding
Oct 12 09:08:43 quiss packagekitd[2693076]: Failed to get cache filename for gnome-control-center-filesystem [x3]
Oct 12 09:08:43 quiss packagekitd[2693076]: Failed to get cache filename for perl [x3]
Oct 12 09:08:43 quiss packagekitd[2693076]: Failed to get cache filename for kernel [x3]
Oct 12 09:09:00 quiss gnome-software[191719]: failed to commit changes to dconf: GDBus.Error:org.gtk.GDBus.UnmappedGError.Quark._g_2dfile_2derror_2dquark.Code2: Failed to create file “/adminhomes/josephao/.config/dconf/user.Y1IMW3”: Permission denied
== strawberry (8 distinct, 39 total) ==
Oct 12 09:07:04 strawberry kernel: I/O error, dev sda, sector 206848 op 0x0:(READ) flags 0x80700 phys_seg 1 prio class 2 [x6]
Oct 12 09:07:04 strawberry kernel: I/O error, dev sda, sector 206848 op 0x0:(READ) flags 0x0 phys_seg 1 prio class 2 [x6]
Oct 12 09:07:04 strawberry kernel: Buffer I/O error on dev sda2, logical block 0, async page read [x6]
Oct 12 09:07:04 strawberry kernel: I/O error, dev sda, sector 2048 op 0x0:(READ) flags 0x80700 phys_seg 1 prio class 2 [x6]
Oct 12 09:07:04 strawberry kernel: I/O error, dev sda, sector 2048 op 0x0:(READ) flags 0x0 phys_seg 1 prio class 2 [x6]
Oct 12 09:07:04 strawberry kernel: Buffer I/O error on dev sda1, logical block 0, async page read [x6]
Oct 12 09:34:42 strawberry smartd[5314]: Device: /dev/sda [SAT], failed to read SMART Attribute Data [x2]
Oct 12 10:04:42 strawberry smartd[5314]: Device: /dev/sda [SAT], not capable of Offline or Self-Testing.
== submit26-b9-3 (1 distinct, 5 total) ==
Sep 14 17:46:20 submit26-b9-3 systemd[1]: user(a)1001.service: Main process exited, code=killed, status=9/KILL [x5]
== submit26-b9-f1 (1 distinct, 1 total) ==
Oct 12 09:58:06 submit26-b9-f1 systemd[1]: user(a)1001.service: Main process exited, code=killed, status=9/KILL
== submit26-b9-f2 (1 distinct, 1 total) ==
Oct 12 09:17:57 submit26-b9-f2 systemd[1]: user(a)1001.service: Main process exited, code=killed, status=9/KILL
== submit26-b9-f3 (10 distinct, 12 total) ==
Oct 12 09:06:51 submit26-b9-f3 setroubleshoot[2972861]: SELinux is preventing /usr/bin/python3.9 from create access on the directory /(null). For complete SELinux messages run: sealert -l a653b772-cbcd-438b-bae5-23c3dc69b31b
Oct 12 09:06:51 submit26-b9-f3 setroubleshoot[2972861]: SELinux is preventing /usr/bin/python3.9 from add_name access on the directory /(null). For complete SELinux messages run: sealert -l 3e904634-6caa-4202-8c92-f139db798859
Oct 12 09:06:51 submit26-b9-f3 setroubleshoot[2972861]: SELinux is preventing /usr/bin/python3.9 from create access on the file /(null). For complete SELinux messages run: sealert -l 580b20e4-ec2c-433d-905c-5bd417fba033
Oct 12 09:06:51 submit26-b9-f3 setroubleshoot[2972861]: SELinux is preventing /usr/bin/python3.9 from open access on the file /tmp/libdnf.HaYtlw/repodata/repomd.xml. For complete SELinux messages run: sealert -l 27f29d48-5e7c-4db7-b051-8ac055737d6f
Oct 12 09:06:51 submit26-b9-f3 setroubleshoot[2972861]: SELinux is preventing /usr/bin/python3.9 from setattr access on the file repomd.xml. For complete SELinux messages run: sealert -l bff72452-d40a-430b-9060-dd0a48f5b6ba
Oct 12 09:06:51 submit26-b9-f3 setroubleshoot[2972861]: SELinux is preventing /usr/bin/python3.9 from read access on the directory libdnf.HaYtlw. For complete SELinux messages run: sealert -l 9638d396-8ce5-4e6a-ae47-45cd3985e1cd
Oct 12 09:06:51 submit26-b9-f3 setroubleshoot[2972861]: SELinux is preventing /usr/bin/python3.9 from remove_name access on the directory repomd.xml. For complete SELinux messages run: sealert -l 6da64b94-7024-45a9-b8c2-3b9812517407
Oct 12 09:06:51 submit26-b9-f3 setroubleshoot[2972861]: SELinux is preventing /usr/bin/python3.9 from unlink access on the file repomd.xml. For complete SELinux messages run: sealert -l 64cbe179-abf1-4d5a-bade-bb164897ee65
Oct 12 09:06:51 submit26-b9-f3 setroubleshoot[2972861]: SELinux is preventing /usr/bin/python3.9 from rmdir access on the directory repodata. For complete SELinux messages run: sealert -l d2e35b1a-e27c-4f91-9217-2bb1204e1e68
Oct 12 09:38:06 submit26-b9-f3 systemd[1]: user(a)1001.service: Main process exited, code=killed, status=9/KILL [x3]
== submit26-b9-f4 (9 distinct, 9 total) ==
Oct 12 09:24:56 submit26-b9-f4 setroubleshoot[906490]: SELinux is preventing /usr/bin/python3.9 from create access on the directory /(null). For complete SELinux messages run: sealert -l ee160f23-b161-4f4a-9985-c4edfd3a5beb
Oct 12 09:24:56 submit26-b9-f4 setroubleshoot[906490]: SELinux is preventing /usr/bin/python3.9 from add_name access on the directory /(null). For complete SELinux messages run: sealert -l 89a83821-4b24-4081-9973-0a79ca6ed5b4
Oct 12 09:24:56 submit26-b9-f4 setroubleshoot[906490]: SELinux is preventing /usr/bin/python3.9 from create access on the file /(null). For complete SELinux messages run: sealert -l f73955d6-1416-45f9-bab6-ff1f3ea07e9d
Oct 12 09:24:56 submit26-b9-f4 setroubleshoot[906490]: SELinux is preventing /usr/bin/python3.9 from open access on the file /tmp/libdnf.X8cJQ1/repodata/repomd.xml. For complete SELinux messages run: sealert -l 9f8f24a0-8fb6-454d-a103-31a8f7a6efa0
Oct 12 09:24:56 submit26-b9-f4 setroubleshoot[906490]: SELinux is preventing /usr/bin/python3.9 from setattr access on the file repomd.xml. For complete SELinux messages run: sealert -l 20293136-86a3-40ba-a651-cff48d36059e
Oct 12 09:24:56 submit26-b9-f4 setroubleshoot[906490]: SELinux is preventing /usr/bin/python3.9 from read access on the directory libdnf.X8cJQ1. For complete SELinux messages run: sealert -l 25f86b49-4ee7-4f60-ad1c-73a70032560c
Oct 12 09:24:56 submit26-b9-f4 setroubleshoot[906490]: SELinux is preventing /usr/bin/python3.9 from remove_name access on the directory repomd.xml. For complete SELinux messages run: sealert -l eec250fb-073f-456d-93bc-f98776fd476d
Oct 12 09:24:56 submit26-b9-f4 setroubleshoot[906490]: SELinux is preventing /usr/bin/python3.9 from unlink access on the file repomd.xml. For complete SELinux messages run: sealert -l c9209e04-a349-43d5-8cb2-3e303e48df74
Oct 12 09:24:56 submit26-b9-f4 setroubleshoot[906490]: SELinux is preventing /usr/bin/python3.9 from rmdir access on the directory repodata. For complete SELinux messages run: sealert -l 3178d5f5-80e9-404b-92b7-9bef397a8915
1
0
Command: /usr/local/sbin/syslog-digest.py
Time : 0.0804s
Status : exited 0
Output :
Syslog digest — 2026-10-12 09:05 EDT
Processed 4,139 lines, filtered 3,423 (82%). 716 unknown (223 distinct) from 20 host(s).
== abuse (1 distinct, 346 total) ==
Oct 12 08:05:25 abuse rsyslogd[1033]: imjournal: open() failed for path: '/var/lib/rsyslog/imjournal.state.tmp': Input/output error [v8.2404.0 try https://www.rsyslog.com/e/2433 ] [x346]
== atif01.cs.umd.edu (2 distinct, 2 total) ==
Oct 12 08:17:11 atif01.cs.umd.edu kernel: net_ratelimit: 10 callbacks suppressed
Oct 12 08:17:11 atif01.cs.umd.edu kernel: nfsd: peername failed (err 107)!
== b0b02.cs.umd.edu (1 distinct, 1 total) ==
Oct 12 08:24:21 b0b02.cs.umd.edu rustdesk[2997678]: cannot open display:
== biggulp.cs.umd.edu (6 distinct, 12 total) ==
Oct 12 08:23:36 biggulp.cs.umd.edu sshd-session[1489024]: error: kex_protocol_error: type 20 seq 2 [preauth] [x2]
Oct 12 08:23:36 biggulp.cs.umd.edu sshd-session[1489024]: error: kex_protocol_error: type 30 seq 3 [preauth] [x2]
Oct 12 08:23:36 biggulp.cs.umd.edu sshd-session[1489024]: error: kex_protocol_error: type 20 seq 4 [preauth] [x2]
Oct 12 08:23:36 biggulp.cs.umd.edu sshd-session[1489024]: error: kex_protocol_error: type 30 seq 5 [preauth] [x2]
Oct 12 08:23:38 biggulp.cs.umd.edu sshd-session[1489024]: error: kex_protocol_error: type 20 seq 6 [preauth] [x2]
Oct 12 08:23:38 biggulp.cs.umd.edu sshd-session[1489024]: error: kex_protocol_error: type 30 seq 7 [preauth] [x2]
== emaar (1 distinct, 1 total) ==
Oct 12 08:43:19 emaar puppet-agent[1075800]: (Facter) invalid or malformed lldp data: MalformedDataError: no lldp interface data found
== idm00 (1 distinct, 1 total) ==
Oct 12 08:54:47 idm00 named[3155984]: client @0x7f45a5392088 10.73.240.42#65440: update '73.10.in-addr.arpa/IN' denied
== idmh1 (36 distinct, 80 total) ==
Oct 12 08:56:57 idmh1 kernel: I/O error, dev sr0, sector 2169712 op 0x0:(READ) flags 0x80700 phys_seg 1 prio class 0 [x2]
Oct 12 08:56:57 idmh1 kernel: I/O error, dev sr0, sector 2169712 op 0x0:(READ) flags 0x0 phys_seg 1 prio class 0 [x2]
Oct 12 08:56:57 idmh1 kernel: Buffer I/O error on dev sr0, logical block 271214, async page read [x2]
Oct 12 08:56:57 idmh1 kernel: I/O error, dev sr0, sector 0 op 0x0:(READ) flags 0x80700 phys_seg 1 prio class 0 [x2]
Oct 12 08:56:57 idmh1 kernel: I/O error, dev sr0, sector 0 op 0x0:(READ) flags 0x0 phys_seg 1 prio class 0 [x14]
Oct 12 08:56:57 idmh1 kernel: Buffer I/O error on dev sr0, logical block 0, async page read [x18]
Oct 12 08:57:02 idmh1 systemd[1]: check-ldap-alive.service: Watchdog timeout (limit 5s)! [x3]
Oct 12 08:57:02 idmh1 systemd-coredump[1248354]: Process 1248350 (systemctl) of user 0 dumped core.#012#012Stack trace of thread 1248350:#012#0 0x00007fca4b70355f ppoll (libc.so.6 + 0x10355f)#012#1 0x00007fca4bbc510e ppoll_usec (libsystemd-shared-252.so + 0x1c510e)#012#2 0x00007fca4bc2f189 bus_poll (libsystemd-shared-252.so + 0x22f189)#012#3 0x00007fca4bc2f35d sd_bus_wait (libsystemd-shared-252.so + 0x22f35d)#012#4 0x00007fca4bab6ce1 bus_wait_for_jobs (libsystemd-shared-252.so + 0xb6ce1)#012#5 0x00005647a4b05bb5 verb_start (systemctl + 0x30bb5)#012#6 0x00005647a4ae5d35 main (systemctl + 0x10d35)#012#7 0x00007fca4b62a610 __libc_start_call_main (libc.so.6 + 0x2a610)#012#8 0x00007fca4b62a6c0 __libc_start_main@@GLIBC_2.34 (libc.so.6 + 0x2a6c0)#012#9 0x00005647a4ae7435 _start (systemctl + 0x12435)#012ELF object binary architecture: AMD x86-64
Oct 12 08:57:07 idmh1 systemd[1]: check-ldap-alive.service: State 'stop-watchdog' timed out. Killing. [x2]
Oct 12 08:57:07 idmh1 systemd[1]: check-ldap-alive.service: Main process exited, code=killed, status=9/KILL [x2]
Oct 12 08:58:42 idmh1 setroubleshoot[1249583]: SELinux is preventing /usr/sbin/setfiles from relabelto access on the file softhsm_pin. For complete SELinux messages run: sealert -l 92307473-7258-4609-96ef-c2e1732f9b61
Oct 12 08:59:05 idmh1 systemd-coredump[1250279]: Process 1122 (gssproxy) of user 0 dumped core.#012#012Stack trace of thread 1135:#012#0 0x00007f998088be2c n/a (/usr/lib64/libc.so.6 (deleted) + 0x8be2c)#012ELF object binary architecture: AMD x86-64
Oct 12 08:59:05 idmh1 systemd[1]: gssproxy.service: Main process exited, code=dumped, status=6/ABRT
Oct 12 08:59:57 idmh1 kernel: scsi_io_completion_action: 252 callbacks suppressed
Oct 12 08:59:57 idmh1 kernel: blk_print_req_error: 252 callbacks suppressed
Oct 12 08:59:57 idmh1 kernel: buffer_io_error: 234 callbacks suppressed
Oct 12 09:01:08 idmh1 gssproxy[1250315]: Problem with /proc; program name matching won't work: 2 (No such file or directory) [x3]
Oct 12 09:02:36 idmh1 systemd-coredump[1287081]: Process 1287042 (systemctl) of user 0 dumped core.#012#012Stack trace of thread 1287042:#012#0 0x00007fcc7a10355f ppoll (libc.so.6 + 0x10355f)#012#1 0x00007fcc7a5c510e ppoll_usec (libsystemd-shared-252.so + 0x1c510e)#012#2 0x00007fcc7a62f189 bus_poll (libsystemd-shared-252.so + 0x22f189)#012#3 0x00007fcc7a62f35d sd_bus_wait (libsystemd-shared-252.so + 0x22f35d)#012#4 0x00007fcc7a4b6ce1 bus_wait_for_jobs (libsystemd-shared-252.so + 0xb6ce1)#012#5 0x00005618574fabb5 verb_start (systemctl + 0x30bb5)#012#6 0x00005618574dad35 main (systemctl + 0x10d35)#012#7 0x00007fcc7a02a610 __libc_start_call_main (libc.so.6 + 0x2a610)#012#8 0x00007fcc7a02a6c0 __libc_start_main@@GLIBC_2.34 (libc.so.6 + 0x2a6c0)#012#9 0x00005618574dc435 _start (systemctl + 0x12435)#012ELF object binary architecture: AMD x86-64
Oct 12 09:02:39 idmh1 systemd-coredump[1287195]: Process 1248403 (check-ldap-aliv) of user 0 dumped core.#012#012Stack trace of thread 1248403:#012#0 0x00007f7a5c23fd6b kill (libc.so.6 + 0x3fd6b)#012#1 0x000055dd425bc930 termsig_handler.part.0 (bash + 0x88930)#012#2 0x000055dd4263594b waitchld.constprop.0 (bash + 0x10194b)#012#3 0x000055dd42599a7a wait_for (bash + 0x65a7a)#012#4 0x000055dd42581ee8 execute_command_internal (bash + 0x4dee8)#012#5 0x000055dd425813cb execute_command_internal (bash + 0x4d3cb)#012#6 0x000055dd42582748 execute_command (bash + 0x4e748)#012#7 0x000055dd42580cdf execute_command_internal (bash + 0x4ccdf)#012#8 0x000055dd425813cb execute_command_internal (bash + 0x4d3cb)#012#9 0x000055dd42582748 execute_command (bash + 0x4e748)#012#10 0x000055dd4258138e execute_command_internal (bash + 0x4d38e)#012#11 0x000055dd42582748 execute_command (bash + 0x4e748)#012#12 0x000055dd4258138e execute_command_internal (bash + 0x4d38e)#012#13 0x000055dd42582748 execute
_command (bash + 0x4e748)#012#14 0x000055dd425828f0 execute_while_or_until (bash + 0x4e8f0)#012#15 0x000055dd425801c0 execute_command_internal (bash + 0x4c1c0)#012#16 0x000055dd42582748 execute_command (bash + 0x4e748)#012#17 0x000055dd42574109 reader_loop (bash + 0x40109)#012#18 0x000055dd4256597e main (bash + 0x3197e)#012#19 0x00007f7a5c22a610 __libc_start_call_main (libc.so.6 + 0x2a610)#012#20 0x00007f7a5c22a6c0 __libc_start_main@@GLIBC_2.34 (libc.so.6 + 0x2a6c0)#012#21 0x000055dd42565d75 _start (bash + 0x31d75)#012ELF object binary architecture: AMD x86-64
Oct 12 09:02:39 idmh1 systemd[1]: check-ldap-alive.service: Main process exited, code=dumped, status=6/ABRT
Oct 12 09:02:40 idmh1 systemctl[1287213]: Job for dirsrv(a)CS-UMD-EDU.service canceled.
Oct 12 09:02:40 idmh1 systemd[1]: check-ldap-alive.service: Got notification message from PID 1287213, but reception only permitted for main PID 1287208
Oct 12 09:02:45 idmh1 systemd-coredump[1287299]: Process 1287221 (systemctl) of user 0 dumped core.#012#012Stack trace of thread 1287221:#012#0 0x00007fb8a6b0355f ppoll (libc.so.6 + 0x10355f)#012#1 0x00007fb8a6fc510e ppoll_usec (libsystemd-shared-252.so + 0x1c510e)#012#2 0x00007fb8a702f189 bus_poll (libsystemd-shared-252.so + 0x22f189)#012#3 0x00007fb8a702f35d sd_bus_wait (libsystemd-shared-252.so + 0x22f35d)#012#4 0x00007fb8a6eb6ce1 bus_wait_for_jobs (libsystemd-shared-252.so + 0xb6ce1)#012#5 0x0000564f79410bb5 verb_start (systemctl + 0x30bb5)#012#6 0x0000564f793f0d35 main (systemctl + 0x10d35)#012#7 0x00007fb8a6a2a610 __libc_start_call_main (libc.so.6 + 0x2a610)#012#8 0x00007fb8a6a2a6c0 __libc_start_main@@GLIBC_2.34 (libc.so.6 + 0x2a6c0)#012#9 0x0000564f793f2435 _start (systemctl + 0x12435)#012ELF object binary architecture: AMD x86-64
Oct 12 09:03:12 idmh1 ldap_child[1288238]: Failed to initialize credentials using keytab [MEMORY:/etc/krb5.keytab]: Cannot contact any KDC for realm 'CS.UMD.EDU'. Unable to create GSSAPI-encrypted LDAP connection. [x5]
Oct 12 09:04:40 idmh1 microcode_ctl[1316365]: <4>After installation of a new version of microcode_ctl package,
Oct 12 09:04:40 idmh1 microcode_ctl[1316365]: initramfs hasn't been re-generated for all the installed kernel packages.
Oct 12 09:04:40 idmh1 microcode_ctl[1316365]: The following kernel packages have been skipped: kernel-core-5.14.0-503.19.1.el9_5.x86_64.
Oct 12 09:04:40 idmh1 microcode_ctl[1316365]: Please re-generate initramfs manually for these kernel packages with the
Oct 12 09:04:40 idmh1 microcode_ctl[1316365]: "dracut -f --kver KERNEL_VERSION" command in order to get the latest
Oct 12 09:04:40 idmh1 microcode_ctl[1316365]: Intel CPU microcode included into early initramfs image for it, if needed.
... 6 more distinct messages not shown
== idmp0 (1 distinct, 1 total) ==
Oct 12 08:39:22 idmp0 named[412677]: client @0x7fb338005288 10.73.240.43#53224: update '73.10.in-addr.arpa/IN' denied
== itmon02 (1 distinct, 2 total) ==
Oct 12 08:18:22 itmon02 sshd[805675]: error: beginning MaxStartups throttling [x2]
== jubjub.cs.umd.edu (44 distinct, 64 total) ==
Oct 12 09:03:52 jubjub.cs.umd.edu puppet-agent[2099875]: : transaction-actions, product-id, search-disabled-repos,
Oct 12 09:03:52 jubjub.cs.umd.edu puppet-agent[2099875]: : subscription-manager, versionlock
Oct 12 09:03:52 jubjub.cs.umd.edu puppet-agent[2099875]: [x11]
Oct 12 09:03:52 jubjub.cs.umd.edu puppet-agent[2099875]: Could not retrieve mirrorlist http://cdn.remirepo.net/enterprise/7/php84/mirror error was
Oct 12 09:03:52 jubjub.cs.umd.edu puppet-agent[2099875]: 14: HTTP Error 403 - Forbidden
Oct 12 09:03:52 jubjub.cs.umd.edu puppet-agent[2099875]: One of the configured repositories failed (Unknown),
Oct 12 09:03:52 jubjub.cs.umd.edu puppet-agent[2099875]: 1. Contact the upstream for the repository and get them to fix the problem.
Oct 12 09:03:52 jubjub.cs.umd.edu puppet-agent[2099875]: 2. Reconfigure the baseurl/etc. for the repository, to point to a working
Oct 12 09:03:52 jubjub.cs.umd.edu puppet-agent[2099875]: upstream. This is most often useful if you are using a newer
Oct 12 09:03:52 jubjub.cs.umd.edu puppet-agent[2099875]: distribution release than is supported by the repository (and the
Oct 12 09:03:52 jubjub.cs.umd.edu puppet-agent[2099875]: packages for the previous distribution release still work).
Oct 12 09:03:52 jubjub.cs.umd.edu puppet-agent[2099875]: 3. Run the command with the repository temporarily disabled
Oct 12 09:03:52 jubjub.cs.umd.edu puppet-agent[2099875]: will then just ignore the repository until you permanently enable it
Oct 12 09:03:52 jubjub.cs.umd.edu puppet-agent[2099875]: again or use --enablerepo for temporary usage:
Oct 12 09:03:52 jubjub.cs.umd.edu puppet-agent[2099875]: or
Oct 12 09:03:52 jubjub.cs.umd.edu puppet-agent[2099875]: subscription-manager repos --disable=<repoid>
Oct 12 09:03:52 jubjub.cs.umd.edu puppet-agent[2099875]: 5. Configure the failing repository to be skipped, if it is unavailable.
Oct 12 09:03:52 jubjub.cs.umd.edu puppet-agent[2099875]: slower). If it is a very temporary problem though, this is often a nice
Oct 12 09:03:52 jubjub.cs.umd.edu puppet-agent[2099875]: compromise:
Oct 12 09:03:52 jubjub.cs.umd.edu puppet-agent[2099875]: Cannot find a valid baseurl for repo: remi-php84
Oct 12 09:03:52 jubjub.cs.umd.edu puppet-agent[2099875]: Uploading Enabled Repositories Report
Oct 12 09:03:52 jubjub.cs.umd.edu puppet-agent[2099875]: Unable to upload Enabled Repositories Report
Oct 12 09:03:52 jubjub.cs.umd.edu puppet-agent[2099875]: (/Stage[main]/Puppet::Agent::Install/Package[openvox-agent]/ensure) : transaction-actions, product-id, search-disabled-repos,
Oct 12 09:03:52 jubjub.cs.umd.edu puppet-agent[2099875]: (/Stage[main]/Puppet::Agent::Install/Package[openvox-agent]/ensure) : subscription-manager, versionlock
Oct 12 09:03:52 jubjub.cs.umd.edu puppet-agent[2099875]: (/Stage[main]/Puppet::Agent::Install/Package[openvox-agent]/ensure) [x11]
Oct 12 09:03:52 jubjub.cs.umd.edu puppet-agent[2099875]: (/Stage[main]/Puppet::Agent::Install/Package[openvox-agent]/ensure) Could not retrieve mirrorlist http://cdn.remirepo.net/enterprise/7/php84/mirror error was
Oct 12 09:03:52 jubjub.cs.umd.edu puppet-agent[2099875]: (/Stage[main]/Puppet::Agent::Install/Package[openvox-agent]/ensure) 14: HTTP Error 403 - Forbidden
Oct 12 09:03:52 jubjub.cs.umd.edu puppet-agent[2099875]: (/Stage[main]/Puppet::Agent::Install/Package[openvox-agent]/ensure) One of the configured repositories failed (Unknown),
Oct 12 09:03:52 jubjub.cs.umd.edu puppet-agent[2099875]: (/Stage[main]/Puppet::Agent::Install/Package[openvox-agent]/ensure) 1. Contact the upstream for the repository and get them to fix the problem.
Oct 12 09:03:52 jubjub.cs.umd.edu puppet-agent[2099875]: (/Stage[main]/Puppet::Agent::Install/Package[openvox-agent]/ensure) 2. Reconfigure the baseurl/etc. for the repository, to point to a working
... 14 more distinct messages not shown
== matrix (3 distinct, 5 total) ==
Oct 12 08:05:13 matrix krb5_child[392330]: Client 'admin(a)UMD.EDU' not found in Kerberos database [x2]
Oct 12 08:05:15 matrix sshd[392226]: error: PAM: Authentication failure for admin from 193.24.211.219
Oct 12 08:29:52 matrix sshd[405851]: error: PAM: Authentication failure for root from 193.24.211.219 [x2]
== munin (2 distinct, 10 total) ==
Oct 12 08:08:33 munin sudo[3790702]: pam_systemd(sudo:session): Failed to stat() runtime directory '/run/user/0': No such file or directory [x5]
Oct 12 08:08:33 munin sudo[3790702]: pam_systemd(sudo:session): Not setting $XDG_RUNTIME_DIR, as the directory is not in order. [x5]
== newhonors2 (1 distinct, 24 total) ==
Oct 12 08:13:03 newhonors2 dhcpcd[3915988]: dhcpcd is not running [x24]
== ntop00 (97 distinct, 97 total) ==
Oct 12 08:05:01 ntop00 nfacctd[1075699]: INFO ( m1/mysql ): *** Purging cache - END (PID: 7498, QN: 84/84, ET: 0) ***
Oct 12 08:05:12 ntop00 sfacctd[1075592]: INFO ( m1/mysql ): *** Purging cache - END (PID: 7498, QN: 5408/5408, ET: 11) ***
Oct 12 08:08:01 ntop00 sfacctd[1075592]: INFO ( p1/print ): *** Purging cache - START (PID: 7499) ***
Oct 12 08:08:01 ntop00 sfacctd[1075592]: INFO ( p1/print ): *** Purging cache - END (PID: 7499, QN: 5499/5499, ET: 0) ***
Oct 12 08:08:01 ntop00 nfacctd[1075699]: INFO ( p1/print ): *** Purging cache - START (PID: 7499) ***
Oct 12 08:08:01 ntop00 nfacctd[1075699]: INFO ( p1/print ): *** Purging cache - END (PID: 7499, QN: 89/89, ET: 0) ***
Oct 12 08:10:01 ntop00 sfacctd[1075592]: INFO ( m1/mysql ): *** Purging cache - START (PID: 7500) ***
Oct 12 08:10:01 ntop00 nfacctd[1075699]: INFO ( m1/mysql ): *** Purging cache - START (PID: 7500) ***
Oct 12 08:10:01 ntop00 nfacctd[1075699]: INFO ( m1/mysql ): *** Purging cache - END (PID: 7500, QN: 80/80, ET: 0) ***
Oct 12 08:10:12 ntop00 sfacctd[1075592]: INFO ( m1/mysql ): *** Purging cache - END (PID: 7500, QN: 5606/5606, ET: 11) ***
Oct 12 08:13:01 ntop00 sfacctd[1075592]: INFO ( p1/print ): *** Purging cache - START (PID: 7501) ***
Oct 12 08:13:01 ntop00 sfacctd[1075592]: INFO ( p1/print ): *** Purging cache - END (PID: 7501, QN: 5401/5401, ET: 0) ***
Oct 12 08:13:01 ntop00 nfacctd[1075699]: INFO ( p1/print ): *** Purging cache - START (PID: 7501) ***
Oct 12 08:13:01 ntop00 nfacctd[1075699]: INFO ( p1/print ): *** Purging cache - END (PID: 7501, QN: 79/79, ET: 0) ***
Oct 12 08:15:01 ntop00 sfacctd[1075592]: INFO ( m1/mysql ): *** Purging cache - START (PID: 7502) ***
Oct 12 08:15:01 ntop00 nfacctd[1075699]: INFO ( m1/mysql ): *** Purging cache - START (PID: 7502) ***
Oct 12 08:15:01 ntop00 nfacctd[1075699]: INFO ( m1/mysql ): *** Purging cache - END (PID: 7502, QN: 90/90, ET: 0) ***
Oct 12 08:15:14 ntop00 sfacctd[1075592]: INFO ( m1/mysql ): *** Purging cache - END (PID: 7502, QN: 5590/5590, ET: 13) ***
Oct 12 08:18:01 ntop00 sfacctd[1075592]: INFO ( p1/print ): *** Purging cache - START (PID: 7503) ***
Oct 12 08:18:01 ntop00 sfacctd[1075592]: INFO ( p1/print ): *** Purging cache - END (PID: 7503, QN: 5765/5765, ET: 0) ***
Oct 12 08:18:01 ntop00 nfacctd[1075699]: INFO ( p1/print ): *** Purging cache - START (PID: 7503) ***
Oct 12 08:18:01 ntop00 nfacctd[1075699]: INFO ( p1/print ): *** Purging cache - END (PID: 7503, QN: 87/87, ET: 0) ***
Oct 12 08:20:01 ntop00 sfacctd[1075592]: INFO ( m1/mysql ): *** Purging cache - START (PID: 7504) ***
Oct 12 08:20:01 ntop00 nfacctd[1075699]: INFO ( m1/mysql ): *** Purging cache - START (PID: 7504) ***
Oct 12 08:20:01 ntop00 nfacctd[1075699]: INFO ( m1/mysql ): *** Purging cache - END (PID: 7504, QN: 81/81, ET: 0) ***
Oct 12 08:20:12 ntop00 sfacctd[1075592]: INFO ( m1/mysql ): *** Purging cache - END (PID: 7504, QN: 5459/5459, ET: 11) ***
Oct 12 08:23:01 ntop00 sfacctd[1075592]: INFO ( p1/print ): *** Purging cache - START (PID: 7505) ***
Oct 12 08:23:01 ntop00 sfacctd[1075592]: INFO ( p1/print ): *** Purging cache - END (PID: 7505, QN: 5411/5411, ET: 0) ***
Oct 12 08:23:01 ntop00 nfacctd[1075699]: INFO ( p1/print ): *** Purging cache - START (PID: 7505) ***
Oct 12 08:23:01 ntop00 nfacctd[1075699]: INFO ( p1/print ): *** Purging cache - END (PID: 7505, QN: 83/83, ET: 0) ***
... 67 more distinct messages not shown
== outbound00.cs.umd.edu (1 distinct, 6 total) ==
Oct 12 08:09:09 outbound00.cs.umd.edu python3[1890864]: ldapdb [x6]
== outbound01.cs.umd.edu (1 distinct, 6 total) ==
Oct 12 08:13:06 outbound01.cs.umd.edu python3[3372262]: ldapdb [x6]
== quiss (7 distinct, 10 total) ==
Oct 12 08:08:40 quiss gnome-software[191719]: failed to get featured apps: no apps to show
Oct 12 08:08:40 quiss gnome-software[191719]: Only 0 apps for curated list, hiding
Oct 12 08:08:40 quiss gnome-software[191719]: Only 0 apps for recent list, hiding
Oct 12 08:08:40 quiss gnome-software[191719]: failed to commit changes to dconf: GDBus.Error:org.gtk.GDBus.UnmappedGError.Quark._g_2dfile_2derror_2dquark.Code2: Failed to create file “/adminhomes/josephao/.config/dconf/user.4JP0W3”: Permission denied
Oct 12 08:08:41 quiss packagekitd[2607190]: Failed to get cache filename for gnome-control-center-filesystem [x2]
Oct 12 08:08:41 quiss packagekitd[2607190]: Failed to get cache filename for perl [x2]
Oct 12 08:08:41 quiss packagekitd[2607190]: Failed to get cache filename for kernel [x2]
== smokeping-slave (1 distinct, 1 total) ==
Oct 12 08:58:18 smokeping-slave nologin[301359]: Attempted login by UNKNOWN (UID: 65534) on UNKNOWN
== strawberry (7 distinct, 38 total) ==
Oct 12 08:07:04 strawberry kernel: I/O error, dev sda, sector 206848 op 0x0:(READ) flags 0x80700 phys_seg 1 prio class 2 [x6]
Oct 12 08:07:04 strawberry kernel: I/O error, dev sda, sector 206848 op 0x0:(READ) flags 0x0 phys_seg 1 prio class 2 [x6]
Oct 12 08:07:04 strawberry kernel: Buffer I/O error on dev sda2, logical block 0, async page read [x6]
Oct 12 08:07:04 strawberry kernel: I/O error, dev sda, sector 2048 op 0x0:(READ) flags 0x80700 phys_seg 1 prio class 2 [x6]
Oct 12 08:07:04 strawberry kernel: I/O error, dev sda, sector 2048 op 0x0:(READ) flags 0x0 phys_seg 1 prio class 2 [x6]
Oct 12 08:07:04 strawberry kernel: Buffer I/O error on dev sda1, logical block 0, async page read [x6]
Oct 12 08:34:42 strawberry smartd[5314]: Device: /dev/sda [SAT], failed to read SMART Attribute Data [x2]
== submit26-b9-fclone (9 distinct, 9 total) ==
Oct 12 08:22:06 submit26-b9-fclone setroubleshoot[1453735]: SELinux is preventing /usr/bin/python3.9 from create access on the directory /(null). For complete SELinux messages run: sealert -l 9355d9d9-a311-48d2-bd37-6c0f6947dfff
Oct 12 08:22:06 submit26-b9-fclone setroubleshoot[1453735]: SELinux is preventing /usr/bin/python3.9 from add_name access on the directory /(null). For complete SELinux messages run: sealert -l cc4658d7-9db1-405d-9eee-de0ccee5857f
Oct 12 08:22:06 submit26-b9-fclone setroubleshoot[1453735]: SELinux is preventing /usr/bin/python3.9 from create access on the file /(null). For complete SELinux messages run: sealert -l 568a2429-0b1b-49df-af41-49b5cd298ae8
Oct 12 08:22:06 submit26-b9-fclone setroubleshoot[1453735]: SELinux is preventing /usr/bin/python3.9 from open access on the file /tmp/libdnf.mlnow9/repodata/repomd.xml. For complete SELinux messages run: sealert -l 03e2f521-0e7c-481f-8e92-0602c6adeedc
Oct 12 08:22:06 submit26-b9-fclone setroubleshoot[1453735]: SELinux is preventing /usr/bin/python3.9 from setattr access on the file repomd.xml. For complete SELinux messages run: sealert -l 0d6b7b1f-ebe3-4beb-915a-b06b63bf2566
Oct 12 08:22:06 submit26-b9-fclone setroubleshoot[1453735]: SELinux is preventing /usr/bin/python3.9 from read access on the directory libdnf.mlnow9. For complete SELinux messages run: sealert -l 887adbf9-2bb9-4009-b800-36ddf9ba0db5
Oct 12 08:22:06 submit26-b9-fclone setroubleshoot[1453735]: SELinux is preventing /usr/bin/python3.9 from remove_name access on the directory repomd.xml. For complete SELinux messages run: sealert -l 092e0644-8373-4017-b77f-1afa6c6da4ac
Oct 12 08:22:06 submit26-b9-fclone setroubleshoot[1453735]: SELinux is preventing /usr/bin/python3.9 from unlink access on the file repomd.xml. For complete SELinux messages run: sealert -l ce429a92-56de-4de1-b859-cbfb69ae123c
Oct 12 08:22:06 submit26-b9-fclone setroubleshoot[1453735]: SELinux is preventing /usr/bin/python3.9 from rmdir access on the directory repodata. For complete SELinux messages run: sealert -l 99b886eb-497b-406d-8206-afe76a1086b4
1
0
Command: /usr/local/sbin/syslog-digest.py
Time : 0.0755s
Status : exited 0
Output :
Syslog digest — 2026-10-12 08:05 EDT
Processed 4,169 lines, filtered 3,556 (85%). 613 unknown (140 distinct) from 17 host(s).
== abuse (1 distinct, 346 total) ==
Oct 12 07:05:25 abuse rsyslogd[1033]: imjournal: open() failed for path: '/var/lib/rsyslog/imjournal.state.tmp': Input/output error [v8.2404.0 try https://www.rsyslog.com/e/2433 ] [x346]
== atif01.cs.umd.edu (3 distinct, 3 total) ==
Oct 12 07:34:27 atif01.cs.umd.edu kernel: net_ratelimit: 10 callbacks suppressed
Oct 12 07:34:27 atif01.cs.umd.edu kernel: nfsd: peername failed (err 107)!
Oct 12 07:37:26 atif01.cs.umd.edu kernel: net_ratelimit: 3 callbacks suppressed
== b0b02.cs.umd.edu (1 distinct, 1 total) ==
Oct 12 07:24:17 b0b02.cs.umd.edu rustdesk[2982421]: cannot open display:
== emaar (1 distinct, 1 total) ==
Oct 12 07:31:19 emaar systemd[1]: insights-client.service: Start request repeated too quickly.
== hackerman (1 distinct, 1 total) ==
Oct 12 07:18:47 hackerman systemd[1]: insights-client.service: Start request repeated too quickly.
== hazfs.cs.umd.edu (11 distinct, 66 total) ==
Oct 12 07:35:14 hazfs.cs.umd.edu snmpd[1431]: send response: Failure in sendto [x6]
Oct 12 07:35:14 hazfs.cs.umd.edu snmpd[1431]: -- NET-SNMP-EXTEND-MIB::nsExtendStatus."userweb" [x6]
Oct 12 07:35:14 hazfs.cs.umd.edu snmpd[1431]: -- NET-SNMP-EXTEND-MIB::nsExtendStatus."zfslist" [x6]
Oct 12 07:35:14 hazfs.cs.umd.edu snmpd[1431]: -- NET-SNMP-EXTEND-MIB::nsExtendStatus."userhome" [x6]
Oct 12 07:35:14 hazfs.cs.umd.edu snmpd[1431]: -- NET-SNMP-EXTEND-MIB::nsExtendOutput1Line."userweb" [x6]
Oct 12 07:35:14 hazfs.cs.umd.edu snmpd[1431]: -- NET-SNMP-EXTEND-MIB::nsExtendOutput1Line."zfslist" [x6]
Oct 12 07:35:14 hazfs.cs.umd.edu snmpd[1431]: -- NET-SNMP-EXTEND-MIB::nsExtendOutput1Line."userhome" [x6]
Oct 12 07:35:14 hazfs.cs.umd.edu snmpd[1431]: -- NET-SNMP-EXTEND-MIB::nsExtendOutputFull."userweb" [x6]
Oct 12 07:35:14 hazfs.cs.umd.edu snmpd[1431]: -- NET-SNMP-EXTEND-MIB::nsExtendOutputFull."zfslist" [x6]
Oct 12 07:35:14 hazfs.cs.umd.edu snmpd[1431]: -- NET-SNMP-EXTEND-MIB::nsExtendOutputFull."userhome" [x6]
Oct 12 07:35:14 hazfs.cs.umd.edu snmpd[1431]: -- NET-SNMP-EXTEND-MIB::nsExtendOutNumLines."userweb" [x6]
== idm00 (1 distinct, 1 total) ==
Oct 12 07:54:47 idm00 named[3155984]: client @0x7f45a53e5f98 10.73.240.42#57214: update '73.10.in-addr.arpa/IN' denied
== idmp0 (1 distinct, 1 total) ==
Oct 12 07:39:22 idmp0 named[412677]: client @0x7fb32c007ab8 10.73.240.43#60631: update '73.10.in-addr.arpa/IN' denied
== itmon02 (1 distinct, 2 total) ==
Oct 12 07:13:05 itmon02 sshd[805675]: error: beginning MaxStartups throttling [x2]
== munin (2 distinct, 6 total) ==
Oct 12 07:43:13 munin sudo[3782392]: pam_systemd(sudo:session): Failed to stat() runtime directory '/run/user/0': No such file or directory [x3]
Oct 12 07:43:13 munin sudo[3782392]: pam_systemd(sudo:session): Not setting $XDG_RUNTIME_DIR, as the directory is not in order. [x3]
== newhonors2 (1 distinct, 24 total) ==
Oct 12 07:13:03 newhonors2 dhcpcd[3914144]: dhcpcd is not running [x24]
== ntop00 (97 distinct, 97 total) ==
Oct 12 07:05:01 ntop00 nfacctd[1075699]: INFO ( m1/mysql ): *** Purging cache - START (PID: 7474) ***
Oct 12 07:05:01 ntop00 nfacctd[1075699]: INFO ( m1/mysql ): *** Purging cache - END (PID: 7474, QN: 113/113, ET: 0) ***
Oct 12 07:05:11 ntop00 sfacctd[1075592]: INFO ( m1/mysql ): *** Purging cache - END (PID: 7474, QN: 5118/5118, ET: 10) ***
Oct 12 07:08:01 ntop00 nfacctd[1075699]: INFO ( p1/print ): *** Purging cache - START (PID: 7475) ***
Oct 12 07:08:01 ntop00 nfacctd[1075699]: INFO ( p1/print ): *** Purging cache - END (PID: 7475, QN: 121/121, ET: 0) ***
Oct 12 07:08:01 ntop00 sfacctd[1075592]: INFO ( p1/print ): *** Purging cache - START (PID: 7475) ***
Oct 12 07:08:01 ntop00 sfacctd[1075592]: INFO ( p1/print ): *** Purging cache - END (PID: 7475, QN: 5333/5333, ET: 0) ***
Oct 12 07:10:01 ntop00 sfacctd[1075592]: INFO ( m1/mysql ): *** Purging cache - START (PID: 7476) ***
Oct 12 07:10:01 ntop00 nfacctd[1075699]: INFO ( m1/mysql ): *** Purging cache - START (PID: 7476) ***
Oct 12 07:10:01 ntop00 nfacctd[1075699]: INFO ( m1/mysql ): *** Purging cache - END (PID: 7476, QN: 96/96, ET: 0) ***
Oct 12 07:10:11 ntop00 sfacctd[1075592]: INFO ( m1/mysql ): *** Purging cache - END (PID: 7476, QN: 5237/5237, ET: 10) ***
Oct 12 07:13:01 ntop00 sfacctd[1075592]: INFO ( p1/print ): *** Purging cache - START (PID: 7477) ***
Oct 12 07:13:01 ntop00 sfacctd[1075592]: INFO ( p1/print ): *** Purging cache - END (PID: 7477, QN: 4945/4945, ET: 0) ***
Oct 12 07:13:01 ntop00 nfacctd[1075699]: INFO ( p1/print ): *** Purging cache - START (PID: 7477) ***
Oct 12 07:13:01 ntop00 nfacctd[1075699]: INFO ( p1/print ): *** Purging cache - END (PID: 7477, QN: 79/79, ET: 0) ***
Oct 12 07:15:01 ntop00 sfacctd[1075592]: INFO ( m1/mysql ): *** Purging cache - START (PID: 7478) ***
Oct 12 07:15:01 ntop00 nfacctd[1075699]: INFO ( m1/mysql ): *** Purging cache - START (PID: 7478) ***
Oct 12 07:15:01 ntop00 nfacctd[1075699]: INFO ( m1/mysql ): *** Purging cache - END (PID: 7478, QN: 85/85, ET: 0) ***
Oct 12 07:15:11 ntop00 sfacctd[1075592]: INFO ( m1/mysql ): *** Purging cache - END (PID: 7478, QN: 5049/5049, ET: 10) ***
Oct 12 07:18:01 ntop00 sfacctd[1075592]: INFO ( p1/print ): *** Purging cache - START (PID: 7479) ***
Oct 12 07:18:01 ntop00 sfacctd[1075592]: INFO ( p1/print ): *** Purging cache - END (PID: 7479, QN: 5035/5035, ET: 0) ***
Oct 12 07:18:01 ntop00 nfacctd[1075699]: INFO ( p1/print ): *** Purging cache - START (PID: 7479) ***
Oct 12 07:18:01 ntop00 nfacctd[1075699]: INFO ( p1/print ): *** Purging cache - END (PID: 7479, QN: 80/80, ET: 0) ***
Oct 12 07:20:01 ntop00 sfacctd[1075592]: INFO ( m1/mysql ): *** Purging cache - START (PID: 7480) ***
Oct 12 07:20:01 ntop00 nfacctd[1075699]: INFO ( m1/mysql ): *** Purging cache - START (PID: 7480) ***
Oct 12 07:20:01 ntop00 nfacctd[1075699]: INFO ( m1/mysql ): *** Purging cache - END (PID: 7480, QN: 73/73, ET: 0) ***
Oct 12 07:20:12 ntop00 sfacctd[1075592]: INFO ( m1/mysql ): *** Purging cache - END (PID: 7480, QN: 5168/5168, ET: 11) ***
Oct 12 07:23:01 ntop00 sfacctd[1075592]: INFO ( p1/print ): *** Purging cache - START (PID: 7481) ***
Oct 12 07:23:01 ntop00 sfacctd[1075592]: INFO ( p1/print ): *** Purging cache - END (PID: 7481, QN: 5249/5249, ET: 0) ***
Oct 12 07:23:01 ntop00 nfacctd[1075699]: INFO ( p1/print ): *** Purging cache - START (PID: 7481) ***
... 67 more distinct messages not shown
== outbound00.cs.umd.edu (2 distinct, 7 total) ==
Oct 12 07:09:09 outbound00.cs.umd.edu python3[1875932]: ldapdb [x6]
Oct 12 07:14:36 outbound00.cs.umd.edu cockpit-ws[1877119]: /usr/share/cockpit/static/login.js/favicon.ico: Failed to open file “/usr/share/cockpit/static/login.js/favicon.ico”: open() failed: Not a directory
== outbound01.cs.umd.edu (2 distinct, 8 total) ==
Oct 12 07:13:06 outbound01.cs.umd.edu python3[3357437]: ldapdb [x6]
Oct 12 07:14:32 outbound01.cs.umd.edu cockpit-ws[3357660]: /usr/share/cockpit/static/login.js/favicon.ico: Failed to open file “/usr/share/cockpit/static/login.js/favicon.ico”: open() failed: Not a directory [x2]
== quiss (7 distinct, 10 total) ==
Oct 12 07:08:37 quiss gnome-software[191719]: failed to commit changes to dconf: GDBus.Error:org.gtk.GDBus.UnmappedGError.Quark._g_2dfile_2derror_2dquark.Code2: Failed to create file “/adminhomes/josephao/.config/dconf/user.Y3ZSW3”: Permission denied
Oct 12 07:08:40 quiss gnome-software[191719]: failed to get featured apps: no apps to show
Oct 12 07:08:40 quiss gnome-software[191719]: Only 0 apps for curated list, hiding
Oct 12 07:08:40 quiss gnome-software[191719]: Only 0 apps for recent list, hiding
Oct 12 07:08:43 quiss packagekitd[2523550]: Failed to get cache filename for gnome-control-center-filesystem [x2]
Oct 12 07:08:43 quiss packagekitd[2523550]: Failed to get cache filename for perl [x2]
Oct 12 07:08:43 quiss packagekitd[2523550]: Failed to get cache filename for kernel [x2]
== strawberry (7 distinct, 38 total) ==
Oct 12 07:07:03 strawberry kernel: I/O error, dev sda, sector 206848 op 0x0:(READ) flags 0x80700 phys_seg 1 prio class 2 [x6]
Oct 12 07:07:03 strawberry kernel: I/O error, dev sda, sector 206848 op 0x0:(READ) flags 0x0 phys_seg 1 prio class 2 [x6]
Oct 12 07:07:03 strawberry kernel: Buffer I/O error on dev sda2, logical block 0, async page read [x6]
Oct 12 07:07:03 strawberry kernel: I/O error, dev sda, sector 2048 op 0x0:(READ) flags 0x80700 phys_seg 1 prio class 2 [x6]
Oct 12 07:07:03 strawberry kernel: I/O error, dev sda, sector 2048 op 0x0:(READ) flags 0x0 phys_seg 1 prio class 2 [x6]
Oct 12 07:07:03 strawberry kernel: Buffer I/O error on dev sda1, logical block 0, async page read [x6]
Oct 12 07:34:42 strawberry smartd[5314]: Device: /dev/sda [SAT], failed to read SMART Attribute Data [x2]
== teaching-awards (1 distinct, 1 total) ==
Oct 12 07:46:36 teaching-awards krb5_child[429751]: Client 'admin(a)UMD.EDU' not found in Kerberos database
1
0
Command: /usr/local/sbin/syslog-digest.py
Time : 0.1297s
Status : exited 0
Output :
Syslog digest — 2026-10-12 07:05 EDT
Processed 5,872 lines, filtered 3,088 (52%). 2,784 unknown (401 distinct) from 28 host(s).
== abadi-computer (2 distinct, 2 total) ==
Oct 12 06:15:00 abadi-computer nologin[601586]: Attempted login by UNKNOWN (UID: 65534) on UNKNOWN
Oct 12 06:15:00 abadi-computer pipewire[601584]: mod.jackdbus-detect: Failed to receive jackdbus reply: org.freedesktop.DBus.Error.ServiceUnknown: The name org.jackaudio.service was not provided by any .service files
== abuse (1 distinct, 346 total) ==
Oct 12 06:05:25 abuse rsyslogd[1033]: imjournal: open() failed for path: '/var/lib/rsyslog/imjournal.state.tmp': Input/output error [v8.2404.0 try https://www.rsyslog.com/e/2433 ] [x346]
== atif01.cs.umd.edu (1 distinct, 1 total) ==
Oct 12 06:58:23 atif01.cs.umd.edu kernel: net_ratelimit: 10 callbacks suppressed
== b0b02.cs.umd.edu (2 distinct, 2 total) ==
Oct 12 06:15:34 b0b02.cs.umd.edu systemd[1]: insights-client.service: Start request repeated too quickly.
Oct 12 06:24:13 b0b02.cs.umd.edu rustdesk[2966332]: cannot open display:
== cheezit.cs.umd.edu (1 distinct, 1 total) ==
Oct 12 06:29:17 cheezit.cs.umd.edu systemd[1]: insights-client.service: Start request repeated too quickly.
== galahad.cs.umd.edu (16 distinct, 28 total) ==
Oct 12 06:25:11 galahad.cs.umd.edu gnome-software[461298]: Only 0 apps for recent list, hiding
Oct 12 06:25:49 galahad.cs.umd.edu packagekitd[1344728]: Failed to get cache filename for cups-filesystem [x3]
Oct 12 06:25:49 galahad.cs.umd.edu packagekitd[1344728]: Failed to get cache filename for libreoffice [x3]
Oct 12 06:25:49 galahad.cs.umd.edu packagekitd[1344728]: Failed to get cache filename for gnome-control-center-filesystem [x3]
Oct 12 06:25:49 galahad.cs.umd.edu packagekitd[1344728]: Failed to get cache filename for perl [x3]
Oct 12 06:25:49 galahad.cs.umd.edu packagekitd[1344728]: Failed to get cache filename for emacs
Oct 12 06:25:49 galahad.cs.umd.edu packagekitd[1344728]: Failed to get cache filename for emacs-common
Oct 12 06:25:49 galahad.cs.umd.edu packagekitd[1344728]: Failed to get cache filename for emacs-filesystem [x3]
Oct 12 06:25:49 galahad.cs.umd.edu packagekitd[1344728]: Failed to get cache filename for flatpak
Oct 12 06:25:49 galahad.cs.umd.edu packagekitd[1344728]: Failed to get cache filename for flatpak-libs
Oct 12 06:25:49 galahad.cs.umd.edu packagekitd[1344728]: Failed to get cache filename for flatpak-selinux
Oct 12 06:25:49 galahad.cs.umd.edu packagekitd[1344728]: Failed to get cache filename for flatpak-session-helper
Oct 12 06:25:49 galahad.cs.umd.edu packagekitd[1344728]: Failed to get cache filename for curl
Oct 12 06:25:49 galahad.cs.umd.edu packagekitd[1344728]: Failed to get cache filename for libcurl
Oct 12 06:25:49 galahad.cs.umd.edu packagekitd[1344728]: Failed to get cache filename for kernel [x3]
Oct 12 06:25:55 galahad.cs.umd.edu packagekitd[1344728]: failed to parse public key for /etc/pki/rpm-gpg/RPM-GPG-KEY-PQC-redhat-release
== galax (1 distinct, 1 total) ==
Oct 12 06:45:55 galax kernel: workqueue: dm_irq_work_func [amdgpu] hogged CPU for >10000us 131075 times, consider switching to WQ_UNBOUND
== idm00 (1 distinct, 1 total) ==
Oct 12 06:54:47 idm00 named[3155984]: client @0x7f459c0a1648 10.73.240.42#62351: update '73.10.in-addr.arpa/IN' denied
== idmp0 (1 distinct, 1 total) ==
Oct 12 06:39:22 idmp0 named[412677]: client @0x7fb32400ef78 10.73.240.43#56622: update '73.10.in-addr.arpa/IN' denied
== inbound00.cs.umd.edu (2 distinct, 7 total) ==
Oct 12 06:07:53 inbound00.cs.umd.edu systemd[1]: Configuration file /usr/lib/systemd/system/authentication_milter.service is marked executable. Please remove executable permission bits. Proceeding anyway.
Oct 12 06:11:26 inbound00.cs.umd.edu cockpit-ws[1272459]: /usr/share/cockpit/static/login.js/favicon.ico: Failed to open file “/usr/share/cockpit/static/login.js/favicon.ico”: open() failed: Not a directory [x6]
== inbound01.cs.umd.edu (2 distinct, 5 total) ==
Oct 12 06:11:31 inbound01.cs.umd.edu cockpit-ws[3476605]: /usr/share/cockpit/static/login.js/favicon.ico: Failed to open file “/usr/share/cockpit/static/login.js/favicon.ico”: open() failed: Not a directory [x4]
Oct 12 06:17:59 inbound01.cs.umd.edu systemd[1]: Configuration file /usr/lib/systemd/system/authentication_milter.service is marked executable. Please remove executable permission bits. Proceeding anyway.
== irb2156 (32 distinct, 32 total) ==
Oct 12 07:03:09 irb2156 packagekitd[582018]: Failed to get cache filename for cosmic-app-library
Oct 12 07:03:09 irb2156 packagekitd[582018]: Failed to get cache filename for cosmic-applets
Oct 12 07:03:09 irb2156 packagekitd[582018]: Failed to get cache filename for cosmic-ext-applet-classic-menu
Oct 12 07:03:09 irb2156 packagekitd[582018]: Failed to get cache filename for cosmic-ext-applet-package-updater
Oct 12 07:03:09 irb2156 packagekitd[582018]: Failed to get cache filename for cosmic-initial-setup
Oct 12 07:03:09 irb2156 packagekitd[582018]: Failed to get cache filename for cosmic-launcher
Oct 12 07:03:09 irb2156 packagekitd[582018]: Failed to get cache filename for cosmic-monitor
Oct 12 07:03:09 irb2156 packagekitd[582018]: Failed to get cache filename for cosmic-notifications
Oct 12 07:03:09 irb2156 packagekitd[582018]: Failed to get cache filename for cosmic-osd
Oct 12 07:03:09 irb2156 packagekitd[582018]: Failed to get cache filename for cosmic-osk
Oct 12 07:03:09 irb2156 packagekitd[582018]: Failed to get cache filename for cosmic-panel
Oct 12 07:03:09 irb2156 packagekitd[582018]: Failed to get cache filename for cosmic-randr
Oct 12 07:03:09 irb2156 packagekitd[582018]: Failed to get cache filename for cosmic-screenshot
Oct 12 07:03:09 irb2156 packagekitd[582018]: Failed to get cache filename for cosmic-session
Oct 12 07:03:09 irb2156 packagekitd[582018]: Failed to get cache filename for cosmic-settings
Oct 12 07:03:09 irb2156 packagekitd[582018]: Failed to get cache filename for cosmic-settings-daemon
Oct 12 07:03:09 irb2156 packagekitd[582018]: Failed to get cache filename for cosmic-term
Oct 12 07:03:09 irb2156 packagekitd[582018]: Failed to get cache filename for cosmic-viewer
Oct 12 07:03:09 irb2156 packagekitd[582018]: Failed to get cache filename for cosmic-workspaces
Oct 12 07:03:09 irb2156 packagekitd[582018]: Failed to get cache filename for xdg-desktop-portal-cosmic
Oct 12 07:03:09 irb2156 packagekitd[582018]: Failed to get cache filename for gnome-control-center-filesystem
Oct 12 07:03:09 irb2156 packagekitd[582018]: Failed to get cache filename for flatpak
Oct 12 07:03:09 irb2156 packagekitd[582018]: Failed to get cache filename for flatpak-libs
Oct 12 07:03:09 irb2156 packagekitd[582018]: Failed to get cache filename for flatpak-selinux
Oct 12 07:03:09 irb2156 packagekitd[582018]: Failed to get cache filename for flatpak-session-helper
Oct 12 07:03:09 irb2156 packagekitd[582018]: Failed to get cache filename for libcurl-devel
Oct 12 07:03:09 irb2156 packagekitd[582018]: Failed to get cache filename for curl
Oct 12 07:03:09 irb2156 packagekitd[582018]: Failed to get cache filename for libcurl
Oct 12 07:03:09 irb2156 packagekitd[582018]: Failed to get cache filename for libheif
Oct 12 07:03:09 irb2156 packagekitd[582018]: Failed to get cache filename for libheif-ffmpeg
... 2 more distinct messages not shown
== itmon02 (1 distinct, 5 total) ==
Oct 12 06:12:57 itmon02 sshd[805675]: error: beginning MaxStartups throttling [x5]
== kadath.cs.umd.edu (1 distinct, 1 total) ==
Oct 12 06:50:13 kadath.cs.umd.edu gnome-software[175274]: Only 0 apps for recent list, hiding
== librenms (1 distinct, 1 total) ==
Oct 12 06:48:15 librenms puppet-agent[147469]: The directory '/opt/librenms/rrd' contains 16538 entries, which exceeds the default soft limit 1000 and may cause excessive resource consumption and degraded performance. To remove this warning set a value for `max_files` parameter or consider using an alternate method to manage large directory trees
== mashie (185 distinct, 2066 total) ==
Oct 12 06:43:20 mashie kernel: EXT4-fs error (device vda1): ext4_journal_check_start:83: comm find: Detected aborted journal [x930]
Oct 12 06:43:20 mashie kernel: EXT4-fs (vda1): Remounting filesystem read-only [x940]
Oct 12 06:43:25 mashie kernel: EXT4-fs error: 1472 callbacks suppressed
Oct 12 06:43:25 mashie kernel: EXT4-fs: 1472 callbacks suppressed
Oct 12 06:43:30 mashie kernel: EXT4-fs error: 2273 callbacks suppressed
Oct 12 06:43:30 mashie kernel: EXT4-fs: 2273 callbacks suppressed
Oct 12 06:43:35 mashie kernel: EXT4-fs error: 2121 callbacks suppressed
Oct 12 06:43:35 mashie kernel: EXT4-fs: 2121 callbacks suppressed
Oct 12 06:43:40 mashie kernel: EXT4-fs: 2312 callbacks suppressed
Oct 12 06:43:40 mashie kernel: EXT4-fs error: 2313 callbacks suppressed
Oct 12 06:43:45 mashie kernel: EXT4-fs: 2141 callbacks suppressed
Oct 12 06:43:45 mashie kernel: EXT4-fs error: 2141 callbacks suppressed
Oct 12 06:43:50 mashie kernel: EXT4-fs: 2742 callbacks suppressed
Oct 12 06:43:50 mashie kernel: EXT4-fs error: 2742 callbacks suppressed
Oct 12 06:43:55 mashie kernel: EXT4-fs: 2753 callbacks suppressed
Oct 12 06:43:55 mashie kernel: EXT4-fs error: 2753 callbacks suppressed
Oct 12 06:44:00 mashie kernel: EXT4-fs error: 1641 callbacks suppressed
Oct 12 06:44:00 mashie kernel: EXT4-fs: 1642 callbacks suppressed
Oct 12 06:44:05 mashie kernel: EXT4-fs error: 927 callbacks suppressed
Oct 12 06:44:05 mashie kernel: EXT4-fs: 927 callbacks suppressed
Oct 12 06:44:10 mashie kernel: EXT4-fs error: 821 callbacks suppressed
Oct 12 06:44:10 mashie kernel: EXT4-fs: 821 callbacks suppressed
Oct 12 06:44:15 mashie kernel: EXT4-fs error: 792 callbacks suppressed
Oct 12 06:44:15 mashie kernel: EXT4-fs: 792 callbacks suppressed
Oct 12 06:44:20 mashie kernel: EXT4-fs error: 736 callbacks suppressed
Oct 12 06:44:20 mashie kernel: EXT4-fs: 736 callbacks suppressed
Oct 12 06:44:25 mashie kernel: EXT4-fs error: 1528 callbacks suppressed
Oct 12 06:44:25 mashie kernel: EXT4-fs: 1528 callbacks suppressed
Oct 12 06:44:30 mashie kernel: EXT4-fs error: 2437 callbacks suppressed
Oct 12 06:44:30 mashie kernel: EXT4-fs: 2437 callbacks suppressed
... 155 more distinct messages not shown
== munin (2 distinct, 52 total) ==
Oct 12 06:08:16 munin sudo[3747906]: pam_systemd(sudo:session): Failed to stat() runtime directory '/run/user/0': No such file or directory [x26]
Oct 12 06:08:16 munin sudo[3747906]: pam_systemd(sudo:session): Not setting $XDG_RUNTIME_DIR, as the directory is not in order. [x26]
== neodontcare.cs.umd.edu (4 distinct, 5 total) ==
Oct 12 06:14:49 neodontcare.cs.umd.edu gnome-software[10171]: Only 0 apps for recent list, hiding
Oct 12 06:14:58 neodontcare.cs.umd.edu packagekitd[3481757]: Failed to get cache filename for gnu-free-mono-fonts
Oct 12 06:14:58 neodontcare.cs.umd.edu packagekitd[3481757]: Failed to get cache filename for gnu-free-serif-fonts
Oct 12 06:15:01 neodontcare.cs.umd.edu packagekitd[3481757]: failed to parse public key for /etc/pki/rpm-gpg/RPM-GPG-KEY-PQC-redhat-release [x2]
== newhonors2 (1 distinct, 24 total) ==
Oct 12 06:13:02 newhonors2 dhcpcd[3912166]: dhcpcd is not running [x24]
== ntop00 (94 distinct, 94 total) ==
Oct 12 06:05:12 ntop00 sfacctd[1075592]: INFO ( m1/mysql ): *** Purging cache - END (PID: 7450, QN: 4988/4988, ET: 11) ***
Oct 12 06:08:01 ntop00 sfacctd[1075592]: INFO ( p1/print ): *** Purging cache - START (PID: 7451) ***
Oct 12 06:08:01 ntop00 sfacctd[1075592]: INFO ( p1/print ): *** Purging cache - END (PID: 7451, QN: 5094/5094, ET: 0) ***
Oct 12 06:08:01 ntop00 nfacctd[1075699]: INFO ( p1/print ): *** Purging cache - START (PID: 7451) ***
Oct 12 06:08:01 ntop00 nfacctd[1075699]: INFO ( p1/print ): *** Purging cache - END (PID: 7451, QN: 70/70, ET: 0) ***
Oct 12 06:10:01 ntop00 sfacctd[1075592]: INFO ( m1/mysql ): *** Purging cache - START (PID: 7452) ***
Oct 12 06:10:01 ntop00 nfacctd[1075699]: INFO ( m1/mysql ): *** Purging cache - START (PID: 7452) ***
Oct 12 06:10:01 ntop00 nfacctd[1075699]: INFO ( m1/mysql ): *** Purging cache - END (PID: 7452, QN: 64/64, ET: 0) ***
Oct 12 06:10:12 ntop00 sfacctd[1075592]: INFO ( m1/mysql ): *** Purging cache - END (PID: 7452, QN: 5261/5261, ET: 11) ***
Oct 12 06:13:01 ntop00 sfacctd[1075592]: INFO ( p1/print ): *** Purging cache - START (PID: 7453) ***
Oct 12 06:13:01 ntop00 sfacctd[1075592]: INFO ( p1/print ): *** Purging cache - END (PID: 7453, QN: 5120/5120, ET: 0) ***
Oct 12 06:13:01 ntop00 nfacctd[1075699]: INFO ( p1/print ): *** Purging cache - START (PID: 7453) ***
Oct 12 06:13:01 ntop00 nfacctd[1075699]: INFO ( p1/print ): *** Purging cache - END (PID: 7453, QN: 89/89, ET: 0) ***
Oct 12 06:15:01 ntop00 sfacctd[1075592]: INFO ( m1/mysql ): *** Purging cache - START (PID: 7454) ***
Oct 12 06:15:01 ntop00 nfacctd[1075699]: INFO ( m1/mysql ): *** Purging cache - START (PID: 7454) ***
Oct 12 06:15:01 ntop00 nfacctd[1075699]: INFO ( m1/mysql ): *** Purging cache - END (PID: 7454, QN: 101/101, ET: 0) ***
Oct 12 06:15:11 ntop00 sfacctd[1075592]: INFO ( m1/mysql ): *** Purging cache - END (PID: 7454, QN: 4996/4996, ET: 10) ***
Oct 12 06:18:01 ntop00 sfacctd[1075592]: INFO ( p1/print ): *** Purging cache - START (PID: 7455) ***
Oct 12 06:18:01 ntop00 sfacctd[1075592]: INFO ( p1/print ): *** Purging cache - END (PID: 7455, QN: 5097/5097, ET: 0) ***
Oct 12 06:18:01 ntop00 nfacctd[1075699]: INFO ( p1/print ): *** Purging cache - START (PID: 7455) ***
Oct 12 06:18:01 ntop00 nfacctd[1075699]: INFO ( p1/print ): *** Purging cache - END (PID: 7455, QN: 87/87, ET: 0) ***
Oct 12 06:20:01 ntop00 sfacctd[1075592]: INFO ( m1/mysql ): *** Purging cache - START (PID: 7456) ***
Oct 12 06:20:01 ntop00 nfacctd[1075699]: INFO ( m1/mysql ): *** Purging cache - START (PID: 7456) ***
Oct 12 06:20:01 ntop00 nfacctd[1075699]: INFO ( m1/mysql ): *** Purging cache - END (PID: 7456, QN: 77/77, ET: 0) ***
Oct 12 06:20:12 ntop00 sfacctd[1075592]: INFO ( m1/mysql ): *** Purging cache - END (PID: 7456, QN: 5146/5146, ET: 11) ***
Oct 12 06:23:01 ntop00 sfacctd[1075592]: INFO ( p1/print ): *** Purging cache - START (PID: 7457) ***
Oct 12 06:23:01 ntop00 sfacctd[1075592]: INFO ( p1/print ): *** Purging cache - END (PID: 7457, QN: 5095/5095, ET: 0) ***
Oct 12 06:23:01 ntop00 nfacctd[1075699]: INFO ( p1/print ): *** Purging cache - START (PID: 7457) ***
Oct 12 06:23:01 ntop00 nfacctd[1075699]: INFO ( p1/print ): *** Purging cache - END (PID: 7457, QN: 80/80, ET: 0) ***
Oct 12 06:25:01 ntop00 sfacctd[1075592]: INFO ( m1/mysql ): *** Purging cache - START (PID: 7458) ***
... 64 more distinct messages not shown
== orchids (5 distinct, 6 total) ==
Oct 12 06:11:31 orchids gnome-software[1516991]: Only 0 apps for recent list, hiding
Oct 12 06:11:38 orchids packagekitd[3585834]: Failed to get cache filename for libreoffice
Oct 12 06:11:38 orchids packagekitd[3585834]: Failed to get cache filename for cups-filesystem
Oct 12 06:11:38 orchids packagekitd[3585834]: Failed to get cache filename for kernel
Oct 12 06:11:41 orchids packagekitd[3585834]: failed to parse public key for /etc/pki/rpm-gpg/RPM-GPG-KEY-PQC-redhat-release [x2]
== outbound00.cs.umd.edu (2 distinct, 10 total) ==
Oct 12 06:08:07 outbound00.cs.umd.edu cockpit-ws[1861305]: /usr/share/cockpit/static/login.js/favicon.ico: Failed to open file “/usr/share/cockpit/static/login.js/favicon.ico”: open() failed: Not a directory [x4]
Oct 12 06:09:09 outbound00.cs.umd.edu python3[1861817]: ldapdb [x6]
== outbound01.cs.umd.edu (2 distinct, 9 total) ==
Oct 12 06:08:11 outbound01.cs.umd.edu cockpit-ws[3342132]: /usr/share/cockpit/static/login.js/favicon.ico: Failed to open file “/usr/share/cockpit/static/login.js/favicon.ico”: open() failed: Not a directory [x3]
Oct 12 06:13:06 outbound01.cs.umd.edu python3[3343279]: ldapdb [x6]
== quiss (13 distinct, 16 total) ==
Oct 12 06:08:40 quiss gnome-software[191719]: failed to get featured apps: no apps to show
Oct 12 06:08:40 quiss gnome-software[191719]: Only 0 apps for curated list, hiding
Oct 12 06:08:40 quiss gnome-software[191719]: Only 0 apps for recent list, hiding
Oct 12 06:08:48 quiss packagekitd[2438583]: Failed to get cache filename for gnome-control-center-filesystem [x2]
Oct 12 06:08:48 quiss packagekitd[2438583]: Failed to get cache filename for perl [x2]
Oct 12 06:08:48 quiss packagekitd[2438583]: Failed to get cache filename for flatpak
Oct 12 06:08:48 quiss packagekitd[2438583]: Failed to get cache filename for flatpak-libs
Oct 12 06:08:48 quiss packagekitd[2438583]: Failed to get cache filename for flatpak-selinux
Oct 12 06:08:48 quiss packagekitd[2438583]: Failed to get cache filename for flatpak-session-helper
Oct 12 06:08:48 quiss packagekitd[2438583]: Failed to get cache filename for curl
Oct 12 06:08:48 quiss packagekitd[2438583]: Failed to get cache filename for libcurl
Oct 12 06:08:48 quiss packagekitd[2438583]: Failed to get cache filename for kernel [x2]
Oct 12 06:08:49 quiss gnome-software[191719]: failed to commit changes to dconf: GDBus.Error:org.gtk.GDBus.UnmappedGError.Quark._g_2dfile_2derror_2dquark.Code2: Failed to create file “/adminhomes/josephao/.config/dconf/user.TXC0W3”: Permission denied
== strawberry (9 distinct, 46 total) ==
Oct 12 06:07:03 strawberry kernel: I/O error, dev sda, sector 206848 op 0x0:(READ) flags 0x80700 phys_seg 1 prio class 2 [x7]
Oct 12 06:07:03 strawberry kernel: I/O error, dev sda, sector 206848 op 0x0:(READ) flags 0x0 phys_seg 1 prio class 2 [x7]
Oct 12 06:07:03 strawberry kernel: Buffer I/O error on dev sda2, logical block 0, async page read [x7]
Oct 12 06:07:03 strawberry kernel: I/O error, dev sda, sector 2048 op 0x0:(READ) flags 0x80700 phys_seg 1 prio class 2 [x7]
Oct 12 06:07:03 strawberry kernel: I/O error, dev sda, sector 2048 op 0x0:(READ) flags 0x0 phys_seg 1 prio class 2 [x7]
Oct 12 06:07:03 strawberry kernel: Buffer I/O error on dev sda1, logical block 0, async page read [x7]
Oct 12 06:31:02 strawberry nologin[691570]: Attempted login by UNKNOWN (UID: 65534) on UNKNOWN
Oct 12 06:31:02 strawberry pipewire[691569]: mod.jackdbus-detect: Failed to receive jackdbus reply: org.freedesktop.DBus.Error.ServiceUnknown: The name org.jackaudio.service was not provided by any .service files
Oct 12 06:34:42 strawberry smartd[5314]: Device: /dev/sda [SAT], failed to read SMART Attribute Data [x2]
== submit26-b9-f1 (9 distinct, 12 total) ==
Oct 12 06:26:04 submit26-b9-f1 setroubleshoot[2437640]: SELinux is preventing /usr/bin/python3.9 from create access on the directory /(null). For complete SELinux messages run: sealert -l 3ef7d677-731f-46bf-9c34-c2c55fea665c
Oct 12 06:26:04 submit26-b9-f1 setroubleshoot[2437640]: SELinux is preventing /usr/bin/python3.9 from add_name access on the directory /(null). For complete SELinux messages run: sealert -l aa60e26f-72e1-45f1-bc12-aa8b3b669e36
Oct 12 06:26:04 submit26-b9-f1 setroubleshoot[2437640]: SELinux is preventing /usr/bin/python3.9 from create access on the file /(null). For complete SELinux messages run: sealert -l d088fb43-23ee-4ae8-ae6a-5d1c041ee2d6 [x2]
Oct 12 06:26:04 submit26-b9-f1 setroubleshoot[2437640]: SELinux is preventing /usr/bin/python3.9 from open access on the file /tmp/libdnf.BPjTbw/repodata/repomd.xml. For complete SELinux messages run: sealert -l 3b0d8c9a-6637-4d6e-a864-f1dd7c00377d [x2]
Oct 12 06:26:04 submit26-b9-f1 setroubleshoot[2437640]: SELinux is preventing /usr/bin/python3.9 from setattr access on the file repomd.xml. For complete SELinux messages run: sealert -l 0fd3339f-3ef2-45f3-9e58-65a58b42f3ee [x2]
Oct 12 06:26:04 submit26-b9-f1 setroubleshoot[2437640]: SELinux is preventing /usr/bin/python3.9 from read access on the directory libdnf.BPjTbw. For complete SELinux messages run: sealert -l 0d661d88-dc9e-469d-986b-52e29b353aa8
Oct 12 06:26:04 submit26-b9-f1 setroubleshoot[2437640]: SELinux is preventing /usr/bin/python3.9 from remove_name access on the directory repomd.xml. For complete SELinux messages run: sealert -l 405a8556-cf9f-4ef4-8525-0dca18d4259d
Oct 12 06:26:04 submit26-b9-f1 setroubleshoot[2437640]: SELinux is preventing /usr/bin/python3.9 from unlink access on the file repomd.xml. For complete SELinux messages run: sealert -l 3c38e23e-3631-4cb5-81c7-992675c836d9
Oct 12 06:26:04 submit26-b9-f1 setroubleshoot[2437640]: SELinux is preventing /usr/bin/python3.9 from rmdir access on the directory repodata. For complete SELinux messages run: sealert -l a070e9b5-2867-47d6-b2e3-3b7d99725848
== submit26-b9-f2 (9 distinct, 9 total) ==
Oct 12 06:06:57 submit26-b9-f2 setroubleshoot[1530857]: SELinux is preventing /usr/bin/python3.9 from create access on the directory /(null). For complete SELinux messages run: sealert -l 0659d546-3107-4f75-b00f-008c85f41dc6
Oct 12 06:06:57 submit26-b9-f2 setroubleshoot[1530857]: SELinux is preventing /usr/bin/python3.9 from add_name access on the directory /(null). For complete SELinux messages run: sealert -l 156d9270-3466-4356-b86f-1a128825961a
Oct 12 06:06:57 submit26-b9-f2 setroubleshoot[1530857]: SELinux is preventing /usr/bin/python3.9 from create access on the file /(null). For complete SELinux messages run: sealert -l c8a40bf5-2fc4-46b3-b813-8592b3523339
Oct 12 06:06:57 submit26-b9-f2 setroubleshoot[1530857]: SELinux is preventing /usr/bin/python3.9 from open access on the file /tmp/libdnf.aK0Yr7/repodata/repomd.xml. For complete SELinux messages run: sealert -l 7f4c3a8e-0f99-47c4-9baf-e1336fe24876
Oct 12 06:06:57 submit26-b9-f2 setroubleshoot[1530857]: SELinux is preventing /usr/bin/python3.9 from setattr access on the file repomd.xml. For complete SELinux messages run: sealert -l 988123da-b724-4e6a-900c-33a2723fdaf1
Oct 12 06:06:57 submit26-b9-f2 setroubleshoot[1530857]: SELinux is preventing /usr/bin/python3.9 from read access on the directory libdnf.aK0Yr7. For complete SELinux messages run: sealert -l ca585e2b-d50f-4264-8127-6b3fa04070c8
Oct 12 06:06:57 submit26-b9-f2 setroubleshoot[1530857]: SELinux is preventing /usr/bin/python3.9 from remove_name access on the directory repomd.xml. For complete SELinux messages run: sealert -l 3a749560-1cec-40ca-a4dc-596841be3885
Oct 12 06:06:57 submit26-b9-f2 setroubleshoot[1530857]: SELinux is preventing /usr/bin/python3.9 from unlink access on the file repomd.xml. For complete SELinux messages run: sealert -l 0aa52f08-94f8-474e-96d8-e818846941af
Oct 12 06:06:57 submit26-b9-f2 setroubleshoot[1530857]: SELinux is preventing /usr/bin/python3.9 from rmdir access on the directory repodata. For complete SELinux messages run: sealert -l de019dc4-408f-439c-902a-676d18dfe8e7
== tlsrpt (1 distinct, 1 total) ==
Oct 12 06:38:02 tlsrpt (httpd)[4000702]: httpd.service: Referenced but unset environment variable evaluates to an empty string: OPTIONS
1
0
Command: /usr/local/sbin/syslog-digest.py
Time : 0.0779s
Status : exited 0
Output :
Syslog digest — 2026-10-12 06:05 EDT
Processed 4,212 lines, filtered 3,601 (85%). 611 unknown (135 distinct) from 15 host(s).
== abuse (1 distinct, 346 total) ==
Oct 12 05:05:25 abuse rsyslogd[1033]: imjournal: open() failed for path: '/var/lib/rsyslog/imjournal.state.tmp': Input/output error [v8.2404.0 try https://www.rsyslog.com/e/2433 ] [x346]
== b0b02.cs.umd.edu (1 distinct, 1 total) ==
Oct 12 05:24:10 b0b02.cs.umd.edu rustdesk[2951181]: cannot open display:
== grades01.cs.umd.edu (1 distinct, 1 total) ==
Oct 12 05:48:19 grades01.cs.umd.edu puppet-agent[26907]: The directory '/srv/grades' contains 2471 entries, which exceeds the default soft limit 1000 and may cause excessive resource consumption and degraded performance. To remove this warning set a value for `max_files` parameter or consider using an alternate method to manage large directory trees
== idm00 (1 distinct, 1 total) ==
Oct 12 05:54:46 idm00 named[3155984]: client @0x7f45a535fb28 10.73.240.42#54742: update '73.10.in-addr.arpa/IN' denied
== idmp0 (1 distinct, 1 total) ==
Oct 12 05:39:22 idmp0 named[412677]: client @0x7fb32400ef78 10.73.240.43#53204: update '73.10.in-addr.arpa/IN' denied
== itmon02 (1 distinct, 1 total) ==
Oct 12 05:52:57 itmon02 sshd[805675]: error: beginning MaxStartups throttling
== munin (2 distinct, 68 total) ==
Oct 12 05:13:21 munin sudo[3728358]: pam_systemd(sudo:session): Failed to stat() runtime directory '/run/user/0': No such file or directory [x34]
Oct 12 05:13:21 munin sudo[3728358]: pam_systemd(sudo:session): Not setting $XDG_RUNTIME_DIR, as the directory is not in order. [x34]
== newhonors2 (1 distinct, 24 total) ==
Oct 12 05:13:03 newhonors2 dhcpcd[3910342]: dhcpcd is not running [x24]
== ntop00 (97 distinct, 97 total) ==
Oct 12 05:05:01 ntop00 nfacctd[1075699]: INFO ( m1/mysql ): *** Purging cache - END (PID: 7426, QN: 76/76, ET: 0) ***
Oct 12 05:05:12 ntop00 sfacctd[1075592]: INFO ( m1/mysql ): *** Purging cache - END (PID: 7426, QN: 4908/4908, ET: 11) ***
Oct 12 05:08:01 ntop00 sfacctd[1075592]: INFO ( p1/print ): *** Purging cache - START (PID: 7427) ***
Oct 12 05:08:01 ntop00 sfacctd[1075592]: INFO ( p1/print ): *** Purging cache - END (PID: 7427, QN: 4973/4973, ET: 0) ***
Oct 12 05:08:01 ntop00 nfacctd[1075699]: INFO ( p1/print ): *** Purging cache - START (PID: 7427) ***
Oct 12 05:08:01 ntop00 nfacctd[1075699]: INFO ( p1/print ): *** Purging cache - END (PID: 7427, QN: 72/72, ET: 0) ***
Oct 12 05:10:01 ntop00 sfacctd[1075592]: INFO ( m1/mysql ): *** Purging cache - START (PID: 7428) ***
Oct 12 05:10:01 ntop00 nfacctd[1075699]: INFO ( m1/mysql ): *** Purging cache - START (PID: 7428) ***
Oct 12 05:10:01 ntop00 nfacctd[1075699]: INFO ( m1/mysql ): *** Purging cache - END (PID: 7428, QN: 76/76, ET: 0) ***
Oct 12 05:10:11 ntop00 sfacctd[1075592]: INFO ( m1/mysql ): *** Purging cache - END (PID: 7428, QN: 4918/4918, ET: 10) ***
Oct 12 05:13:01 ntop00 sfacctd[1075592]: INFO ( p1/print ): *** Purging cache - START (PID: 7429) ***
Oct 12 05:13:01 ntop00 sfacctd[1075592]: INFO ( p1/print ): *** Purging cache - END (PID: 7429, QN: 4795/4795, ET: 0) ***
Oct 12 05:13:01 ntop00 nfacctd[1075699]: INFO ( p1/print ): *** Purging cache - START (PID: 7429) ***
Oct 12 05:13:01 ntop00 nfacctd[1075699]: INFO ( p1/print ): *** Purging cache - END (PID: 7429, QN: 83/83, ET: 0) ***
Oct 12 05:15:01 ntop00 sfacctd[1075592]: INFO ( m1/mysql ): *** Purging cache - START (PID: 7430) ***
Oct 12 05:15:01 ntop00 nfacctd[1075699]: INFO ( m1/mysql ): *** Purging cache - START (PID: 7430) ***
Oct 12 05:15:01 ntop00 nfacctd[1075699]: INFO ( m1/mysql ): *** Purging cache - END (PID: 7430, QN: 83/83, ET: 0) ***
Oct 12 05:15:10 ntop00 sfacctd[1075592]: INFO ( m1/mysql ): *** Purging cache - END (PID: 7430, QN: 4767/4767, ET: 9) ***
Oct 12 05:18:01 ntop00 sfacctd[1075592]: INFO ( p1/print ): *** Purging cache - START (PID: 7431) ***
Oct 12 05:18:01 ntop00 sfacctd[1075592]: INFO ( p1/print ): *** Purging cache - END (PID: 7431, QN: 5060/5060, ET: 0) ***
Oct 12 05:18:01 ntop00 nfacctd[1075699]: INFO ( p1/print ): *** Purging cache - START (PID: 7431) ***
Oct 12 05:18:01 ntop00 nfacctd[1075699]: INFO ( p1/print ): *** Purging cache - END (PID: 7431, QN: 83/83, ET: 0) ***
Oct 12 05:20:01 ntop00 sfacctd[1075592]: INFO ( m1/mysql ): *** Purging cache - START (PID: 7432) ***
Oct 12 05:20:01 ntop00 nfacctd[1075699]: INFO ( m1/mysql ): *** Purging cache - START (PID: 7432) ***
Oct 12 05:20:01 ntop00 nfacctd[1075699]: INFO ( m1/mysql ): *** Purging cache - END (PID: 7432, QN: 87/87, ET: 0) ***
Oct 12 05:20:13 ntop00 sfacctd[1075592]: INFO ( m1/mysql ): *** Purging cache - END (PID: 7432, QN: 5234/5234, ET: 12) ***
Oct 12 05:23:01 ntop00 sfacctd[1075592]: INFO ( p1/print ): *** Purging cache - START (PID: 7433) ***
Oct 12 05:23:01 ntop00 sfacctd[1075592]: INFO ( p1/print ): *** Purging cache - END (PID: 7433, QN: 5210/5210, ET: 0) ***
Oct 12 05:23:01 ntop00 nfacctd[1075699]: INFO ( p1/print ): *** Purging cache - START (PID: 7433) ***
Oct 12 05:23:01 ntop00 nfacctd[1075699]: INFO ( p1/print ): *** Purging cache - END (PID: 7433, QN: 75/75, ET: 0) ***
... 67 more distinct messages not shown
== outbound00.cs.umd.edu (1 distinct, 6 total) ==
Oct 12 05:09:09 outbound00.cs.umd.edu python3[1847880]: ldapdb [x6]
== outbound01.cs.umd.edu (2 distinct, 8 total) ==
Oct 12 05:08:26 outbound01.cs.umd.edu python3[3327452]: ldapdb [x7]
Oct 12 05:10:36 outbound01.cs.umd.edu systemd[1]: Configuration file /usr/lib/systemd/system/authentication_milter.service is marked executable. Please remove executable permission bits. Proceeding anyway.
== sebatinsky.cs.umd.edu (1 distinct, 1 total) ==
Oct 12 05:17:38 sebatinsky.cs.umd.edu kernel: hpet1: lost 1 rtc interrupts
== strawberry (7 distinct, 38 total) ==
Oct 12 05:07:03 strawberry kernel: I/O error, dev sda, sector 206848 op 0x0:(READ) flags 0x80700 phys_seg 1 prio class 2 [x6]
Oct 12 05:07:03 strawberry kernel: I/O error, dev sda, sector 206848 op 0x0:(READ) flags 0x0 phys_seg 1 prio class 2 [x6]
Oct 12 05:07:03 strawberry kernel: Buffer I/O error on dev sda2, logical block 0, async page read [x6]
Oct 12 05:07:03 strawberry kernel: I/O error, dev sda, sector 2048 op 0x0:(READ) flags 0x80700 phys_seg 1 prio class 2 [x6]
Oct 12 05:07:03 strawberry kernel: I/O error, dev sda, sector 2048 op 0x0:(READ) flags 0x0 phys_seg 1 prio class 2 [x6]
Oct 12 05:07:03 strawberry kernel: Buffer I/O error on dev sda1, logical block 0, async page read [x6]
Oct 12 05:34:42 strawberry smartd[5314]: Device: /dev/sda [SAT], failed to read SMART Attribute Data [x2]
== submit26-b9-f3 (9 distinct, 9 total) ==
Oct 12 05:06:50 submit26-b9-f3 setroubleshoot[2963079]: SELinux is preventing /usr/bin/python3.9 from create access on the directory /(null). For complete SELinux messages run: sealert -l a653b772-cbcd-438b-bae5-23c3dc69b31b
Oct 12 05:06:51 submit26-b9-f3 setroubleshoot[2963079]: SELinux is preventing /usr/bin/python3.9 from add_name access on the directory /(null). For complete SELinux messages run: sealert -l 3e904634-6caa-4202-8c92-f139db798859
Oct 12 05:06:51 submit26-b9-f3 setroubleshoot[2963079]: SELinux is preventing /usr/bin/python3.9 from create access on the file /(null). For complete SELinux messages run: sealert -l 580b20e4-ec2c-433d-905c-5bd417fba033
Oct 12 05:06:51 submit26-b9-f3 setroubleshoot[2963079]: SELinux is preventing /usr/bin/python3.9 from open access on the file /tmp/libdnf.aHNYdr/repodata/repomd.xml. For complete SELinux messages run: sealert -l 27f29d48-5e7c-4db7-b051-8ac055737d6f
Oct 12 05:06:51 submit26-b9-f3 setroubleshoot[2963079]: SELinux is preventing /usr/bin/python3.9 from setattr access on the file repomd.xml. For complete SELinux messages run: sealert -l bff72452-d40a-430b-9060-dd0a48f5b6ba
Oct 12 05:06:51 submit26-b9-f3 setroubleshoot[2963079]: SELinux is preventing /usr/bin/python3.9 from read access on the directory libdnf.aHNYdr. For complete SELinux messages run: sealert -l 9638d396-8ce5-4e6a-ae47-45cd3985e1cd
Oct 12 05:06:51 submit26-b9-f3 setroubleshoot[2963079]: SELinux is preventing /usr/bin/python3.9 from remove_name access on the directory repomd.xml. For complete SELinux messages run: sealert -l 6da64b94-7024-45a9-b8c2-3b9812517407
Oct 12 05:06:51 submit26-b9-f3 setroubleshoot[2963079]: SELinux is preventing /usr/bin/python3.9 from unlink access on the file repomd.xml. For complete SELinux messages run: sealert -l 64cbe179-abf1-4d5a-bade-bb164897ee65
Oct 12 05:06:51 submit26-b9-f3 setroubleshoot[2963079]: SELinux is preventing /usr/bin/python3.9 from rmdir access on the directory repodata. For complete SELinux messages run: sealert -l d2e35b1a-e27c-4f91-9217-2bb1204e1e68
== submit26-b9-f4 (9 distinct, 9 total) ==
Oct 12 05:24:54 submit26-b9-f4 setroubleshoot[897060]: SELinux is preventing /usr/bin/python3.9 from create access on the directory /(null). For complete SELinux messages run: sealert -l ee160f23-b161-4f4a-9985-c4edfd3a5beb
Oct 12 05:24:54 submit26-b9-f4 setroubleshoot[897060]: SELinux is preventing /usr/bin/python3.9 from add_name access on the directory /(null). For complete SELinux messages run: sealert -l 89a83821-4b24-4081-9973-0a79ca6ed5b4
Oct 12 05:24:54 submit26-b9-f4 setroubleshoot[897060]: SELinux is preventing /usr/bin/python3.9 from create access on the file /(null). For complete SELinux messages run: sealert -l f73955d6-1416-45f9-bab6-ff1f3ea07e9d
Oct 12 05:24:54 submit26-b9-f4 setroubleshoot[897060]: SELinux is preventing /usr/bin/python3.9 from open access on the file /tmp/libdnf.rqqk11/repodata/repomd.xml. For complete SELinux messages run: sealert -l 9f8f24a0-8fb6-454d-a103-31a8f7a6efa0
Oct 12 05:24:54 submit26-b9-f4 setroubleshoot[897060]: SELinux is preventing /usr/bin/python3.9 from setattr access on the file repomd.xml. For complete SELinux messages run: sealert -l 20293136-86a3-40ba-a651-cff48d36059e
Oct 12 05:24:54 submit26-b9-f4 setroubleshoot[897060]: SELinux is preventing /usr/bin/python3.9 from read access on the directory libdnf.rqqk11. For complete SELinux messages run: sealert -l 25f86b49-4ee7-4f60-ad1c-73a70032560c
Oct 12 05:24:55 submit26-b9-f4 setroubleshoot[897060]: SELinux is preventing /usr/bin/python3.9 from remove_name access on the directory repomd.xml. For complete SELinux messages run: sealert -l eec250fb-073f-456d-93bc-f98776fd476d
Oct 12 05:24:55 submit26-b9-f4 setroubleshoot[897060]: SELinux is preventing /usr/bin/python3.9 from unlink access on the file repomd.xml. For complete SELinux messages run: sealert -l c9209e04-a349-43d5-8cb2-3e303e48df74
Oct 12 05:24:55 submit26-b9-f4 setroubleshoot[897060]: SELinux is preventing /usr/bin/python3.9 from rmdir access on the directory repodata. For complete SELinux messages run: sealert -l 3178d5f5-80e9-404b-92b7-9bef397a8915
1
0
Command: /usr/local/sbin/syslog-digest.py
Time : 0.0780s
Status : exited 0
Output :
Syslog digest — 2026-10-12 05:05 EDT
Processed 3,805 lines, filtered 3,191 (83%). 614 unknown (173 distinct) from 17 host(s).
== abuse (1 distinct, 347 total) ==
Oct 12 04:05:25 abuse rsyslogd[1033]: imjournal: open() failed for path: '/var/lib/rsyslog/imjournal.state.tmp': Input/output error [v8.2404.0 try https://www.rsyslog.com/e/2433 ] [x347]
== b0b02.cs.umd.edu (1 distinct, 1 total) ==
Oct 12 04:24:06 b0b02.cs.umd.edu rustdesk[2936088]: cannot open display:
== florence-ruohan (7 distinct, 12 total) ==
Oct 12 04:15:02 florence-ruohan nologin[409712]: Attempted login by UNKNOWN (UID: 65534) on UNKNOWN
Oct 12 04:15:02 florence-ruohan pipewire[409708]: mod.rt: RTKit error: org.freedesktop.DBus.Error.AccessDenied [x2]
Oct 12 04:15:02 florence-ruohan pipewire[409708]: mod.rt: could not set nice-level to -11: Permission denied
Oct 12 04:15:02 florence-ruohan pipewire-media-session[409709]: mod.rt: RTKit error: org.freedesktop.DBus.Error.AccessDenied
Oct 12 04:15:02 florence-ruohan pipewire-media-session[409709]: mod.rt: could not make thread 409732 realtime using RTKit: Permission denied
Oct 12 04:15:02 florence-ruohan pipewire[409708]: mod.rt: could not make thread 409751 realtime using RTKit: Permission denied
Oct 12 04:15:02 florence-ruohan pulseaudio[409710]: Failed to create secure directory (/nonexistent/.config/pulse): No such file or directory [x5]
== forge00 (1 distinct, 1 total) ==
Oct 12 04:09:03 forge00 (httpd)[3550255]: httpd.service: Referenced but unset environment variable evaluates to an empty string: OPTIONS
== galax (31 distinct, 31 total) ==
Oct 12 04:21:24 galax puppet-agent[689061]: Could not update: Execution of '/usr/bin/apt-get -q -y -o DPkg::Options::=--force-confold --force-yes install choria=0.29.4+resolute' returned 100: W: --force-yes is deprecated, use one of the options starting with --allow instead.
Oct 12 04:21:24 galax puppet-agent[689061]: E: dpkg was interrupted, you must manually run 'dpkg --configure -a' to correct the problem.
Oct 12 04:21:24 galax puppet-agent[689061]: (/Stage[main]/Choria::Install/Package[choria]/ensure) change from 'absent' to '0.29.4+resolute' failed: Could not update: Execution of '/usr/bin/apt-get -q -y -o DPkg::Options::=--force-confold --force-yes install choria=0.29.4+resolute' returned 100: W: --force-yes is deprecated, use one of the options starting with --allow instead.
Oct 12 04:21:24 galax puppet-agent[689061]: (/Stage[main]/Choria::Install/Package[choria]/ensure) E: dpkg was interrupted, you must manually run 'dpkg --configure -a' to correct the problem. (corrective)
Oct 12 04:21:24 galax puppet-agent[689061]: (/Stage[main]/Choria::Config/File[/etc/choria]) Skipping because of failed dependencies
Oct 12 04:21:24 galax puppet-agent[689061]: (/Stage[main]/Choria::Config/File[/etc/choria/policies]) Skipping because of failed dependencies
Oct 12 04:21:24 galax puppet-agent[689061]: (/Stage[main]/Choria::Config/File[/etc/choria/policies/rego]) Skipping because of failed dependencies
Oct 12 04:21:24 galax puppet-agent[689061]: (/Stage[main]/Choria::Config/File[/etc/choria/plugin.d]) Skipping because of failed dependencies
Oct 12 04:21:24 galax puppet-agent[689061]: (/Stage[main]/Choria::Config/File[/etc/choria/overrides.json]) Skipping because of failed dependencies
Oct 12 04:21:24 galax puppet-agent[689061]: (/Stage[main]/Choria::Config/File[/etc/choria/machine]) Skipping because of failed dependencies
Oct 12 04:21:24 galax puppet-agent[689061]: (/Stage[main]/Choria::Config/File[/usr/bin/choria_mcollective_agent_compat.rb]) Skipping because of failed dependencies
Oct 12 04:21:24 galax puppet-agent[689061]: (/Stage[main]/Choria::Config/File[/etc/choria/server.conf]) Skipping because of failed dependencies
Oct 12 04:21:24 galax puppet-agent[689061]: (/Stage[main]/Mcollective::Config/File[/etc/choria/server.cfg]) Skipping because of failed dependencies
Oct 12 04:21:24 galax puppet-agent[689061]: (/Stage[main]/Mcollective::Config/File[/etc/choria/client.cfg]) Skipping because of failed dependencies
Oct 12 04:21:24 galax puppet-agent[689061]: (/Stage[main]/Mcollective::Config/File[/etc/choria/policies/choria_util.policy]) Skipping because of failed dependencies
Oct 12 04:21:24 galax puppet-agent[689061]: (/Stage[main]/Mcollective::Config/File[/etc/choria/policies/rpcutil.policy]) Skipping because of failed dependencies
Oct 12 04:21:24 galax puppet-agent[689061]: (/Stage[main]/Mcollective::Config/File[/etc/choria/policies/scout.policy]) Skipping because of failed dependencies
Oct 12 04:21:24 galax puppet-agent[689061]: (/Stage[main]/Mcollective::Config/File[/etc/choria/policies/rego/default.rego]) Skipping because of failed dependencies
Oct 12 04:21:25 galax puppet-agent[689061]: (/Stage[main]/Choria::Config/Concat[/etc/choria/policies/groups]/Concat_file[/etc/choria/policies/groups]) Skipping because of failed dependencies
Oct 12 04:21:25 galax puppet-agent[689061]: (/Stage[main]/Choria::Config/Concat[/etc/choria/policies/groups]/File[/etc/choria/policies/groups]) Skipping because of failed dependencies
Oct 12 04:21:25 galax puppet-agent[689061]: (/Stage[main]/Mcollective::Config/Mcollective::Config_file[/etc/choria/client.conf]/File[/etc/choria/client.conf]) Skipping because of failed dependencies
Oct 12 04:21:25 galax puppet-agent[689061]: (/Stage[main]/Mcollective::Config/Mcollective::Config_file[/etc/choria/choria-shim.cfg]/File[/etc/choria/choria-shim.cfg]) Skipping because of failed dependencies
Oct 12 04:21:25 galax puppet-agent[689061]: (/Stage[main]/Mcollective::Facts/Exec[mcollective_facts_yaml_refresh]) Skipping because of failed dependencies
Oct 12 04:21:26 galax puppet-agent[689061]: (/Stage[main]/Mcollective_agent_puppet/Mcollective::Module_plugin[mcollective_agent_puppet]/File[/etc/choria/policies/puppet.policy]) Skipping because of failed dependencies
Oct 12 04:21:26 galax puppet-agent[689061]: (/Stage[main]/Mcollective_agent_service/Mcollective::Module_plugin[mcollective_agent_service]/File[/etc/choria/policies/service.policy]) Skipping because of failed dependencies
Oct 12 04:21:26 galax puppet-agent[689061]: (/Stage[main]/Mcollective_agent_package/Mcollective::Module_plugin[mcollective_agent_package]/File[/etc/choria/policies/package.policy]) Skipping because of failed dependencies
Oct 12 04:21:26 galax puppet-agent[689061]: (/Stage[main]/Mcollective_agent_filemgr/Mcollective::Module_plugin[mcollective_agent_filemgr]/File[/etc/choria/policies/filemgr.policy]) Skipping because of failed dependencies
Oct 12 04:21:26 galax puppet-agent[689061]: (/Stage[main]/Mcollective_choria/Mcollective::Module_plugin[mcollective_choria]/Mcollective::Config_file[/etc/choria/plugin.d/choria.cfg]/File[/etc/choria/plugin.d/choria.cfg]) Skipping because of failed dependencies
Oct 12 04:21:26 galax puppet-agent[689061]: (/Stage[main]/Mcollective_agent_puppet/Mcollective::Module_plugin[mcollective_agent_puppet]/Mcollective::Config_file[/etc/choria/plugin.d/puppet.cfg]/File[/etc/choria/plugin.d/puppet.cfg]) Skipping because of failed dependencies
Oct 12 04:21:26 galax puppet-agent[689061]: (/Stage[main]/Mcollective_util_actionpolicy/Mcollective::Module_plugin[mcollective_util_actionpolicy]/Mcollective::Config_file[/etc/choria/plugin.d/actionpolicy.cfg]/File[/etc/choria/plugin.d/actionpolicy.cfg]) Skipping because of failed dependencies
... 1 more distinct messages not shown
== idm00 (1 distinct, 1 total) ==
Oct 12 04:54:46 idm00 named[3155984]: client @0x7f45a00104c8 10.73.240.42#55899: update '73.10.in-addr.arpa/IN' denied
== idmp0 (1 distinct, 1 total) ==
Oct 12 04:39:22 idmp0 named[412677]: client @0x7fb32400ef78 10.73.240.43#58505: update '73.10.in-addr.arpa/IN' denied
== irb2156 (2 distinct, 2 total) ==
Oct 12 04:58:34 irb2156 falcon-sensor-bpf[3902]: CrowdStrike(4): Could not retrieve DisableProxy value: c0000225
Oct 12 04:58:34 irb2156 falcon-sensor-bpf[3902]: CrowdStrike(4): ConnectWithProxy: Unable to get application proxy host from CsConfig: c0000225
== itmon02 (1 distinct, 3 total) ==
Oct 12 04:13:26 itmon02 sshd[805675]: error: beginning MaxStartups throttling [x3]
== matrix (10 distinct, 11 total) ==
Oct 12 04:19:38 matrix systemd[1]: networkd-dispatcher.service: Got notification message from PID 260423, but reception only permitted for main PID 720
Oct 12 04:19:45 matrix systemd[1]: networkd-dispatcher.service: Got notification message from PID 260502, but reception only permitted for main PID 720
Oct 12 04:19:45 matrix systemd[1]: networkd-dispatcher.service: Got notification message from PID 260508, but reception only permitted for main PID 720
Oct 12 04:19:45 matrix networkctl[260518]: Interface "veth5d54575" not found.
Oct 12 04:19:45 matrix systemd[1]: networkd-dispatcher.service: Got notification message from PID 260602, but reception only permitted for main PID 720
Oct 12 04:19:45 matrix systemd[1]: networkd-dispatcher.service: Got notification message from PID 260613, but reception only permitted for main PID 720
Oct 12 04:23:06 matrix systemd[1]: networkd-dispatcher.service: Got notification message from PID 263371, but reception only permitted for main PID 720
Oct 12 04:23:06 matrix systemd[1]: networkd-dispatcher.service: Got notification message from PID 263376, but reception only permitted for main PID 720
Oct 12 04:23:06 matrix networkctl[263387]: Interface "vethb4dd0e8" not found.
Oct 12 04:23:06 matrix systemd[1]: networkd-dispatcher.service: Got notification message from PID 263387, but reception only permitted for main PID 720 [x2]
== munin (2 distinct, 22 total) ==
Oct 12 04:08:11 munin sudo[3703808]: pam_systemd(sudo:session): Failed to stat() runtime directory '/run/user/0': No such file or directory [x11]
Oct 12 04:08:11 munin sudo[3703808]: pam_systemd(sudo:session): Not setting $XDG_RUNTIME_DIR, as the directory is not in order. [x11]
== newhonors2 (1 distinct, 24 total) ==
Oct 12 04:13:03 newhonors2 dhcpcd[3908482]: dhcpcd is not running [x24]
== ntop00 (95 distinct, 95 total) ==
Oct 12 04:05:12 ntop00 sfacctd[1075592]: INFO ( m1/mysql ): *** Purging cache - END (PID: 7402, QN: 5346/5346, ET: 11) ***
Oct 12 04:08:01 ntop00 sfacctd[1075592]: INFO ( p1/print ): *** Purging cache - START (PID: 7403) ***
Oct 12 04:08:01 ntop00 sfacctd[1075592]: INFO ( p1/print ): *** Purging cache - END (PID: 7403, QN: 5058/5058, ET: 0) ***
Oct 12 04:08:01 ntop00 nfacctd[1075699]: INFO ( p1/print ): *** Purging cache - START (PID: 7403) ***
Oct 12 04:08:01 ntop00 nfacctd[1075699]: INFO ( p1/print ): *** Purging cache - END (PID: 7403, QN: 75/75, ET: 0) ***
Oct 12 04:10:01 ntop00 sfacctd[1075592]: INFO ( m1/mysql ): *** Purging cache - START (PID: 7404) ***
Oct 12 04:10:02 ntop00 nfacctd[1075699]: INFO ( m1/mysql ): *** Purging cache - START (PID: 7404) ***
Oct 12 04:10:02 ntop00 nfacctd[1075699]: INFO ( m1/mysql ): *** Purging cache - END (PID: 7404, QN: 77/77, ET: 0) ***
Oct 12 04:10:11 ntop00 sfacctd[1075592]: INFO ( m1/mysql ): *** Purging cache - END (PID: 7404, QN: 5157/5157, ET: 10) ***
Oct 12 04:13:01 ntop00 sfacctd[1075592]: INFO ( p1/print ): *** Purging cache - START (PID: 7405) ***
Oct 12 04:13:01 ntop00 sfacctd[1075592]: INFO ( p1/print ): *** Purging cache - END (PID: 7405, QN: 5064/5064, ET: 0) ***
Oct 12 04:13:01 ntop00 nfacctd[1075699]: INFO ( p1/print ): *** Purging cache - START (PID: 7405) ***
Oct 12 04:13:01 ntop00 nfacctd[1075699]: INFO ( p1/print ): *** Purging cache - END (PID: 7405, QN: 67/67, ET: 0) ***
Oct 12 04:15:01 ntop00 sfacctd[1075592]: INFO ( m1/mysql ): *** Purging cache - START (PID: 7406) ***
Oct 12 04:15:01 ntop00 nfacctd[1075699]: INFO ( m1/mysql ): *** Purging cache - START (PID: 7406) ***
Oct 12 04:15:02 ntop00 nfacctd[1075699]: INFO ( m1/mysql ): *** Purging cache - END (PID: 7406, QN: 67/67, ET: 1) ***
Oct 12 04:15:11 ntop00 sfacctd[1075592]: INFO ( m1/mysql ): *** Purging cache - END (PID: 7406, QN: 5049/5049, ET: 10) ***
Oct 12 04:18:01 ntop00 sfacctd[1075592]: INFO ( p1/print ): *** Purging cache - START (PID: 7407) ***
Oct 12 04:18:01 ntop00 sfacctd[1075592]: INFO ( p1/print ): *** Purging cache - END (PID: 7407, QN: 5156/5156, ET: 0) ***
Oct 12 04:18:01 ntop00 nfacctd[1075699]: INFO ( p1/print ): *** Purging cache - START (PID: 7407) ***
Oct 12 04:18:01 ntop00 nfacctd[1075699]: INFO ( p1/print ): *** Purging cache - END (PID: 7407, QN: 78/78, ET: 0) ***
Oct 12 04:20:01 ntop00 sfacctd[1075592]: INFO ( m1/mysql ): *** Purging cache - START (PID: 7408) ***
Oct 12 04:20:01 ntop00 nfacctd[1075699]: INFO ( m1/mysql ): *** Purging cache - START (PID: 7408) ***
Oct 12 04:20:01 ntop00 nfacctd[1075699]: INFO ( m1/mysql ): *** Purging cache - END (PID: 7408, QN: 62/62, ET: 0) ***
Oct 12 04:20:12 ntop00 sfacctd[1075592]: INFO ( m1/mysql ): *** Purging cache - END (PID: 7408, QN: 5209/5209, ET: 11) ***
Oct 12 04:23:01 ntop00 sfacctd[1075592]: INFO ( p1/print ): *** Purging cache - START (PID: 7409) ***
Oct 12 04:23:01 ntop00 sfacctd[1075592]: INFO ( p1/print ): *** Purging cache - END (PID: 7409, QN: 5476/5476, ET: 0) ***
Oct 12 04:23:01 ntop00 nfacctd[1075699]: INFO ( p1/print ): *** Purging cache - START (PID: 7409) ***
Oct 12 04:23:01 ntop00 nfacctd[1075699]: INFO ( p1/print ): *** Purging cache - END (PID: 7409, QN: 56/56, ET: 0) ***
Oct 12 04:25:01 ntop00 sfacctd[1075592]: INFO ( m1/mysql ): *** Purging cache - START (PID: 7410) ***
... 65 more distinct messages not shown
== outbound00.cs.umd.edu (1 distinct, 6 total) ==
Oct 12 04:09:09 outbound00.cs.umd.edu python3[1834210]: ldapdb [x6]
== outbound01.cs.umd.edu (1 distinct, 6 total) ==
Oct 12 04:13:06 outbound01.cs.umd.edu python3[3314467]: ldapdb [x6]
== strawberry (7 distinct, 38 total) ==
Oct 12 04:07:03 strawberry kernel: I/O error, dev sda, sector 206848 op 0x0:(READ) flags 0x80700 phys_seg 1 prio class 2 [x6]
Oct 12 04:07:03 strawberry kernel: I/O error, dev sda, sector 206848 op 0x0:(READ) flags 0x0 phys_seg 1 prio class 2 [x6]
Oct 12 04:07:03 strawberry kernel: Buffer I/O error on dev sda2, logical block 0, async page read [x6]
Oct 12 04:07:03 strawberry kernel: I/O error, dev sda, sector 2048 op 0x0:(READ) flags 0x80700 phys_seg 1 prio class 2 [x6]
Oct 12 04:07:03 strawberry kernel: I/O error, dev sda, sector 2048 op 0x0:(READ) flags 0x0 phys_seg 1 prio class 2 [x6]
Oct 12 04:07:03 strawberry kernel: Buffer I/O error on dev sda1, logical block 0, async page read [x6]
Oct 12 04:34:42 strawberry smartd[5314]: Device: /dev/sda [SAT], failed to read SMART Attribute Data [x2]
== submit26-b9-fclone (10 distinct, 13 total) ==
Oct 12 04:22:05 submit26-b9-fclone setroubleshoot[1444026]: SELinux is preventing /usr/bin/python3.9 from create access on the directory /(null). For complete SELinux messages run: sealert -l 9355d9d9-a311-48d2-bd37-6c0f6947dfff
Oct 12 04:22:05 submit26-b9-fclone setroubleshoot[1444026]: SELinux is preventing /usr/bin/python3.9 from add_name access on the directory /(null). For complete SELinux messages run: sealert -l cc4658d7-9db1-405d-9eee-de0ccee5857f
Oct 12 04:22:05 submit26-b9-fclone setroubleshoot[1444026]: SELinux is preventing /usr/bin/python3.9 from create access on the file /(null). For complete SELinux messages run: sealert -l 568a2429-0b1b-49df-af41-49b5cd298ae8 [x2]
Oct 12 04:22:05 submit26-b9-fclone setroubleshoot[1444026]: SELinux is preventing /usr/bin/python3.9 from open access on the file /tmp/libdnf.qcs6sK/repodata/repomd.xml. For complete SELinux messages run: sealert -l 03e2f521-0e7c-481f-8e92-0602c6adeedc
Oct 12 04:22:05 submit26-b9-fclone setroubleshoot[1444026]: SELinux is preventing /usr/bin/python3.9 from setattr access on the file repomd.xml. For complete SELinux messages run: sealert -l 0d6b7b1f-ebe3-4beb-915a-b06b63bf2566 [x2]
Oct 12 04:22:05 submit26-b9-fclone setroubleshoot[1444026]: SELinux is preventing /usr/bin/python3.9 from read access on the directory libdnf.qcs6sK. For complete SELinux messages run: sealert -l 887adbf9-2bb9-4009-b800-36ddf9ba0db5
Oct 12 04:22:05 submit26-b9-fclone setroubleshoot[1444026]: SELinux is preventing /usr/bin/python3.9 from remove_name access on the directory repomd.xml. For complete SELinux messages run: sealert -l 092e0644-8373-4017-b77f-1afa6c6da4ac
Oct 12 04:22:05 submit26-b9-fclone setroubleshoot[1444026]: SELinux is preventing /usr/bin/python3.9 from unlink access on the file repomd.xml. For complete SELinux messages run: sealert -l ce429a92-56de-4de1-b859-cbfb69ae123c [x2]
Oct 12 04:22:05 submit26-b9-fclone setroubleshoot[1444026]: SELinux is preventing /usr/bin/python3.9 from rmdir access on the directory repodata. For complete SELinux messages run: sealert -l 99b886eb-497b-406d-8206-afe76a1086b4
Oct 12 04:22:05 submit26-b9-fclone setroubleshoot[1444026]: SELinux is preventing /usr/bin/python3.9 from open access on the file /tmp/libdnf.08uNrL/repodata/repomd.xml. For complete SELinux messages run: sealert -l 03e2f521-0e7c-481f-8e92-0602c6adeedc
1
0
Command: /usr/local/sbin/syslog-digest.py
Time : 0.0704s
Status : exited 0
Output :
Syslog digest — 2026-10-12 04:05 EDT
Processed 3,272 lines, filtered 2,724 (83%). 548 unknown (118 distinct) from 14 host(s).
== abuse (1 distinct, 346 total) ==
Oct 12 03:05:25 abuse rsyslogd[1033]: imjournal: open() failed for path: '/var/lib/rsyslog/imjournal.state.tmp': Input/output error [v8.2404.0 try https://www.rsyslog.com/e/2433 ] [x346]
== b0b02.cs.umd.edu (1 distinct, 1 total) ==
Oct 12 03:24:02 b0b02.cs.umd.edu rustdesk[2920811]: cannot open display:
== idm00 (1 distinct, 1 total) ==
Oct 12 03:54:46 idm00 named[3155984]: client @0x7f4594069828 10.73.240.42#54347: update '73.10.in-addr.arpa/IN' denied
== idmp0 (1 distinct, 1 total) ==
Oct 12 03:39:22 idmp0 named[412677]: client @0x7fb34802bb68 10.73.240.43#52063: update '73.10.in-addr.arpa/IN' denied
== itmon02 (2 distinct, 6 total) ==
Oct 12 03:13:41 itmon02 sshd[805675]: error: beginning MaxStartups throttling [x5]
Oct 12 03:15:03 itmon02 (httpd)[2797655]: httpd.service: Referenced but unset environment variable evaluates to an empty string: OPTIONS
== kadath.cs.umd.edu (1 distinct, 1 total) ==
Oct 12 03:47:10 kadath.cs.umd.edu puppet-agent[1361483]: (Facter) invalid or malformed lldp data: MalformedDataError: no lldp interface data found
== librenms (1 distinct, 1 total) ==
Oct 12 03:47:01 librenms (httpd)[4184853]: httpd.service: Referenced but unset environment variable evaluates to an empty string: OPTIONS
== munin (2 distinct, 18 total) ==
Oct 12 03:08:44 munin sudo[3681804]: pam_systemd(sudo:session): Failed to stat() runtime directory '/run/user/0': No such file or directory [x9]
Oct 12 03:08:44 munin sudo[3681804]: pam_systemd(sudo:session): Not setting $XDG_RUNTIME_DIR, as the directory is not in order. [x9]
== netbox (1 distinct, 1 total) ==
Oct 12 03:08:02 netbox (httpd)[2935979]: httpd.service: Referenced but unset environment variable evaluates to an empty string: OPTIONS
== newhonors2 (1 distinct, 24 total) ==
Oct 12 03:13:03 newhonors2 dhcpcd[3906639]: dhcpcd is not running [x24]
== ntop00 (96 distinct, 96 total) ==
Oct 12 03:05:10 ntop00 sfacctd[1075592]: INFO ( m1/mysql ): *** Purging cache - END (PID: 7378, QN: 4817/4817, ET: 9) ***
Oct 12 03:08:01 ntop00 sfacctd[1075592]: INFO ( p1/print ): *** Purging cache - START (PID: 7379) ***
Oct 12 03:08:01 ntop00 sfacctd[1075592]: INFO ( p1/print ): *** Purging cache - END (PID: 7379, QN: 4705/4705, ET: 0) ***
Oct 12 03:08:01 ntop00 nfacctd[1075699]: INFO ( p1/print ): *** Purging cache - START (PID: 7379) ***
Oct 12 03:08:01 ntop00 nfacctd[1075699]: INFO ( p1/print ): *** Purging cache - END (PID: 7379, QN: 60/60, ET: 0) ***
Oct 12 03:10:01 ntop00 sfacctd[1075592]: INFO ( m1/mysql ): *** Purging cache - START (PID: 7380) ***
Oct 12 03:10:01 ntop00 nfacctd[1075699]: INFO ( m1/mysql ): *** Purging cache - START (PID: 7380) ***
Oct 12 03:10:01 ntop00 nfacctd[1075699]: INFO ( m1/mysql ): *** Purging cache - END (PID: 7380, QN: 66/66, ET: 0) ***
Oct 12 03:10:11 ntop00 sfacctd[1075592]: INFO ( m1/mysql ): *** Purging cache - END (PID: 7380, QN: 4753/4753, ET: 10) ***
Oct 12 03:13:01 ntop00 sfacctd[1075592]: INFO ( p1/print ): *** Purging cache - START (PID: 7381) ***
Oct 12 03:13:01 ntop00 sfacctd[1075592]: INFO ( p1/print ): *** Purging cache - END (PID: 7381, QN: 4843/4843, ET: 0) ***
Oct 12 03:13:01 ntop00 nfacctd[1075699]: INFO ( p1/print ): *** Purging cache - START (PID: 7381) ***
Oct 12 03:13:01 ntop00 nfacctd[1075699]: INFO ( p1/print ): *** Purging cache - END (PID: 7381, QN: 73/73, ET: 0) ***
Oct 12 03:15:01 ntop00 sfacctd[1075592]: INFO ( m1/mysql ): *** Purging cache - START (PID: 7382) ***
Oct 12 03:15:01 ntop00 nfacctd[1075699]: INFO ( m1/mysql ): *** Purging cache - START (PID: 7382) ***
Oct 12 03:15:01 ntop00 nfacctd[1075699]: INFO ( m1/mysql ): *** Purging cache - END (PID: 7382, QN: 63/63, ET: 0) ***
Oct 12 03:15:11 ntop00 sfacctd[1075592]: INFO ( m1/mysql ): *** Purging cache - END (PID: 7382, QN: 4956/4956, ET: 10) ***
Oct 12 03:18:01 ntop00 sfacctd[1075592]: INFO ( p1/print ): *** Purging cache - START (PID: 7383) ***
Oct 12 03:18:01 ntop00 sfacctd[1075592]: INFO ( p1/print ): *** Purging cache - END (PID: 7383, QN: 4881/4881, ET: 0) ***
Oct 12 03:18:01 ntop00 nfacctd[1075699]: INFO ( p1/print ): *** Purging cache - START (PID: 7383) ***
Oct 12 03:18:01 ntop00 nfacctd[1075699]: INFO ( p1/print ): *** Purging cache - END (PID: 7383, QN: 55/55, ET: 0) ***
Oct 12 03:20:01 ntop00 sfacctd[1075592]: INFO ( m1/mysql ): *** Purging cache - START (PID: 7384) ***
Oct 12 03:20:01 ntop00 nfacctd[1075699]: INFO ( m1/mysql ): *** Purging cache - START (PID: 7384) ***
Oct 12 03:20:01 ntop00 nfacctd[1075699]: INFO ( m1/mysql ): *** Purging cache - END (PID: 7384, QN: 62/62, ET: 0) ***
Oct 12 03:20:11 ntop00 sfacctd[1075592]: INFO ( m1/mysql ): *** Purging cache - END (PID: 7384, QN: 4742/4742, ET: 10) ***
Oct 12 03:23:01 ntop00 sfacctd[1075592]: INFO ( p1/print ): *** Purging cache - START (PID: 7385) ***
Oct 12 03:23:01 ntop00 sfacctd[1075592]: INFO ( p1/print ): *** Purging cache - END (PID: 7385, QN: 4773/4773, ET: 0) ***
Oct 12 03:23:01 ntop00 nfacctd[1075699]: INFO ( p1/print ): *** Purging cache - START (PID: 7385) ***
Oct 12 03:23:01 ntop00 nfacctd[1075699]: INFO ( p1/print ): *** Purging cache - END (PID: 7385, QN: 58/58, ET: 0) ***
Oct 12 03:25:01 ntop00 sfacctd[1075592]: INFO ( m1/mysql ): *** Purging cache - START (PID: 7386) ***
... 66 more distinct messages not shown
== outbound00.cs.umd.edu (2 distinct, 8 total) ==
Oct 12 03:09:08 outbound00.cs.umd.edu python3[1819683]: ldapdb [x7]
Oct 12 03:24:31 outbound00.cs.umd.edu systemd[1]: Configuration file /usr/lib/systemd/system/authentication_milter.service is marked executable. Please remove executable permission bits. Proceeding anyway.
== outbound01.cs.umd.edu (1 distinct, 6 total) ==
Oct 12 03:13:07 outbound01.cs.umd.edu python3[3300610]: ldapdb [x6]
== strawberry (7 distinct, 38 total) ==
Oct 12 03:07:04 strawberry kernel: I/O error, dev sda, sector 206848 op 0x0:(READ) flags 0x80700 phys_seg 1 prio class 2 [x6]
Oct 12 03:07:04 strawberry kernel: I/O error, dev sda, sector 206848 op 0x0:(READ) flags 0x0 phys_seg 1 prio class 2 [x6]
Oct 12 03:07:04 strawberry kernel: Buffer I/O error on dev sda2, logical block 0, async page read [x6]
Oct 12 03:07:04 strawberry kernel: I/O error, dev sda, sector 2048 op 0x0:(READ) flags 0x80700 phys_seg 1 prio class 2 [x6]
Oct 12 03:07:04 strawberry kernel: I/O error, dev sda, sector 2048 op 0x0:(READ) flags 0x0 phys_seg 1 prio class 2 [x6]
Oct 12 03:07:04 strawberry kernel: Buffer I/O error on dev sda1, logical block 0, async page read [x6]
Oct 12 03:34:42 strawberry smartd[5314]: Device: /dev/sda [SAT], failed to read SMART Attribute Data [x2]
1
0
Command: /usr/local/sbin/syslog-digest.py
Time : 0.0744s
Status : exited 0
Output :
Syslog digest — 2026-10-12 03:05 EDT
Processed 3,718 lines, filtered 3,143 (84%). 575 unknown (146 distinct) from 17 host(s).
== abuse (1 distinct, 348 total) ==
Oct 12 02:05:10 abuse rsyslogd[1033]: imjournal: open() failed for path: '/var/lib/rsyslog/imjournal.state.tmp': Input/output error [v8.2404.0 try https://www.rsyslog.com/e/2433 ] [x348]
== b0b02.cs.umd.edu (1 distinct, 1 total) ==
Oct 12 02:23:58 b0b02.cs.umd.edu rustdesk[2905651]: cannot open display:
== florence-ruohan (8 distinct, 14 total) ==
Oct 12 03:04:07 florence-ruohan nologin[406701]: Attempted login by UNKNOWN (UID: 65534) on UNKNOWN
Oct 12 03:04:07 florence-ruohan pipewire[406697]: mod.rt: RTKit error: org.freedesktop.DBus.Error.AccessDenied [x2]
Oct 12 03:04:07 florence-ruohan pipewire[406697]: mod.rt: could not set nice-level to -11: Permission denied
Oct 12 03:04:07 florence-ruohan pipewire-media-session[406698]: mod.rt: RTKit error: org.freedesktop.DBus.Error.AccessDenied
Oct 12 03:04:07 florence-ruohan pipewire-media-session[406698]: mod.rt: could not make thread 406755 realtime using RTKit: Permission denied
Oct 12 03:04:07 florence-ruohan pipewire[406697]: mod.rt: could not make thread 406756 realtime using RTKit: Permission denied
Oct 12 03:04:07 florence-ruohan pulseaudio[406699]: Failed to create secure directory (/nonexistent/.config/pulse): No such file or directory [x5]
Oct 12 03:04:08 florence-ruohan puppet-agent[406707]: Certificate 'CN=florence-ruohan.cs.umd.edu' is revoked [x2]
== gle-dind04 (2 distinct, 2 total) ==
Oct 12 03:04:07 gle-dind04 falcon-sensor-bpf[1017]: CrowdStrike(4): Could not retrieve DisableProxy value: c0000225
Oct 12 03:04:07 gle-dind04 falcon-sensor-bpf[1017]: CrowdStrike(4): ConnectWithProxy: Unable to get application proxy host from CsConfig: c0000225
== idm00 (1 distinct, 1 total) ==
Oct 12 02:54:46 idm00 named[3155984]: client @0x7f45a53b98e8 10.73.240.42#58386: update '73.10.in-addr.arpa/IN' denied
== idmp0 (1 distinct, 1 total) ==
Oct 12 02:39:22 idmp0 named[412677]: client @0x7fb32c02e728 10.73.240.43#51587: update '73.10.in-addr.arpa/IN' denied
== itmon02 (1 distinct, 3 total) ==
Oct 12 02:08:54 itmon02 sshd[805675]: error: beginning MaxStartups throttling [x3]
== munin (2 distinct, 12 total) ==
Oct 12 02:18:21 munin sudo[3663732]: pam_systemd(sudo:session): Failed to stat() runtime directory '/run/user/0': No such file or directory [x6]
Oct 12 02:18:21 munin sudo[3663732]: pam_systemd(sudo:session): Not setting $XDG_RUNTIME_DIR, as the directory is not in order. [x6]
== newhonors2 (1 distinct, 24 total) ==
Oct 12 02:13:02 newhonors2 dhcpcd[3904776]: dhcpcd is not running [x24]
== ntop00 (97 distinct, 97 total) ==
Oct 12 02:05:01 ntop00 nfacctd[1075699]: INFO ( m1/mysql ): *** Purging cache - END (PID: 7354, QN: 65/65, ET: 0) ***
Oct 12 02:05:11 ntop00 sfacctd[1075592]: INFO ( m1/mysql ): *** Purging cache - END (PID: 7354, QN: 4969/4969, ET: 10) ***
Oct 12 02:08:01 ntop00 sfacctd[1075592]: INFO ( p1/print ): *** Purging cache - START (PID: 7355) ***
Oct 12 02:08:01 ntop00 sfacctd[1075592]: INFO ( p1/print ): *** Purging cache - END (PID: 7355, QN: 4791/4791, ET: 0) ***
Oct 12 02:08:01 ntop00 nfacctd[1075699]: INFO ( p1/print ): *** Purging cache - START (PID: 7355) ***
Oct 12 02:08:01 ntop00 nfacctd[1075699]: INFO ( p1/print ): *** Purging cache - END (PID: 7355, QN: 65/65, ET: 0) ***
Oct 12 02:10:01 ntop00 sfacctd[1075592]: INFO ( m1/mysql ): *** Purging cache - START (PID: 7356) ***
Oct 12 02:10:01 ntop00 nfacctd[1075699]: INFO ( m1/mysql ): *** Purging cache - START (PID: 7356) ***
Oct 12 02:10:01 ntop00 nfacctd[1075699]: INFO ( m1/mysql ): *** Purging cache - END (PID: 7356, QN: 71/71, ET: 0) ***
Oct 12 02:10:11 ntop00 sfacctd[1075592]: INFO ( m1/mysql ): *** Purging cache - END (PID: 7356, QN: 4840/4840, ET: 10) ***
Oct 12 02:13:01 ntop00 sfacctd[1075592]: INFO ( p1/print ): *** Purging cache - START (PID: 7357) ***
Oct 12 02:13:01 ntop00 sfacctd[1075592]: INFO ( p1/print ): *** Purging cache - END (PID: 7357, QN: 4857/4857, ET: 0) ***
Oct 12 02:13:01 ntop00 nfacctd[1075699]: INFO ( p1/print ): *** Purging cache - START (PID: 7357) ***
Oct 12 02:13:01 ntop00 nfacctd[1075699]: INFO ( p1/print ): *** Purging cache - END (PID: 7357, QN: 75/75, ET: 0) ***
Oct 12 02:15:01 ntop00 sfacctd[1075592]: INFO ( m1/mysql ): *** Purging cache - START (PID: 7358) ***
Oct 12 02:15:01 ntop00 nfacctd[1075699]: INFO ( m1/mysql ): *** Purging cache - START (PID: 7358) ***
Oct 12 02:15:01 ntop00 nfacctd[1075699]: INFO ( m1/mysql ): *** Purging cache - END (PID: 7358, QN: 79/79, ET: 0) ***
Oct 12 02:15:11 ntop00 sfacctd[1075592]: INFO ( m1/mysql ): *** Purging cache - END (PID: 7358, QN: 5022/5022, ET: 10) ***
Oct 12 02:18:01 ntop00 sfacctd[1075592]: INFO ( p1/print ): *** Purging cache - START (PID: 7359) ***
Oct 12 02:18:01 ntop00 sfacctd[1075592]: INFO ( p1/print ): *** Purging cache - END (PID: 7359, QN: 5208/5208, ET: 0) ***
Oct 12 02:18:01 ntop00 nfacctd[1075699]: INFO ( p1/print ): *** Purging cache - START (PID: 7359) ***
Oct 12 02:18:01 ntop00 nfacctd[1075699]: INFO ( p1/print ): *** Purging cache - END (PID: 7359, QN: 84/84, ET: 0) ***
Oct 12 02:20:01 ntop00 sfacctd[1075592]: INFO ( m1/mysql ): *** Purging cache - START (PID: 7360) ***
Oct 12 02:20:01 ntop00 nfacctd[1075699]: INFO ( m1/mysql ): *** Purging cache - START (PID: 7360) ***
Oct 12 02:20:01 ntop00 nfacctd[1075699]: INFO ( m1/mysql ): *** Purging cache - END (PID: 7360, QN: 77/77, ET: 0) ***
Oct 12 02:20:12 ntop00 sfacctd[1075592]: INFO ( m1/mysql ): *** Purging cache - END (PID: 7360, QN: 5208/5208, ET: 11) ***
Oct 12 02:23:01 ntop00 sfacctd[1075592]: INFO ( p1/print ): *** Purging cache - START (PID: 7361) ***
Oct 12 02:23:01 ntop00 sfacctd[1075592]: INFO ( p1/print ): *** Purging cache - END (PID: 7361, QN: 4974/4974, ET: 0) ***
Oct 12 02:23:01 ntop00 nfacctd[1075699]: INFO ( p1/print ): *** Purging cache - START (PID: 7361) ***
Oct 12 02:23:01 ntop00 nfacctd[1075699]: INFO ( p1/print ): *** Purging cache - END (PID: 7361, QN: 65/65, ET: 0) ***
... 67 more distinct messages not shown
== outbound00.cs.umd.edu (1 distinct, 6 total) ==
Oct 12 02:09:09 outbound00.cs.umd.edu python3[1805827]: ldapdb [x6]
== outbound01.cs.umd.edu (1 distinct, 6 total) ==
Oct 12 02:13:06 outbound01.cs.umd.edu python3[3286710]: ldapdb [x6]
== strawberry (7 distinct, 38 total) ==
Oct 12 02:07:04 strawberry kernel: I/O error, dev sda, sector 206848 op 0x0:(READ) flags 0x80700 phys_seg 1 prio class 2 [x6]
Oct 12 02:07:04 strawberry kernel: I/O error, dev sda, sector 206848 op 0x0:(READ) flags 0x0 phys_seg 1 prio class 2 [x6]
Oct 12 02:07:04 strawberry kernel: Buffer I/O error on dev sda2, logical block 0, async page read [x6]
Oct 12 02:07:04 strawberry kernel: I/O error, dev sda, sector 2048 op 0x0:(READ) flags 0x80700 phys_seg 1 prio class 2 [x6]
Oct 12 02:07:04 strawberry kernel: I/O error, dev sda, sector 2048 op 0x0:(READ) flags 0x0 phys_seg 1 prio class 2 [x6]
Oct 12 02:07:04 strawberry kernel: Buffer I/O error on dev sda1, logical block 0, async page read [x6]
Oct 12 02:34:42 strawberry smartd[5314]: Device: /dev/sda [SAT], failed to read SMART Attribute Data [x2]
== submit26-b9-f1 (9 distinct, 9 total) ==
Oct 12 02:26:04 submit26-b9-f1 setroubleshoot[2427784]: SELinux is preventing /usr/bin/python3.9 from create access on the directory /(null). For complete SELinux messages run: sealert -l 3ef7d677-731f-46bf-9c34-c2c55fea665c
Oct 12 02:26:04 submit26-b9-f1 setroubleshoot[2427784]: SELinux is preventing /usr/bin/python3.9 from add_name access on the directory /(null). For complete SELinux messages run: sealert -l aa60e26f-72e1-45f1-bc12-aa8b3b669e36
Oct 12 02:26:04 submit26-b9-f1 setroubleshoot[2427784]: SELinux is preventing /usr/bin/python3.9 from create access on the file /(null). For complete SELinux messages run: sealert -l d088fb43-23ee-4ae8-ae6a-5d1c041ee2d6
Oct 12 02:26:04 submit26-b9-f1 setroubleshoot[2427784]: SELinux is preventing /usr/bin/python3.9 from open access on the file /tmp/libdnf.FAj5Z3/repodata/repomd.xml. For complete SELinux messages run: sealert -l 3b0d8c9a-6637-4d6e-a864-f1dd7c00377d
Oct 12 02:26:04 submit26-b9-f1 setroubleshoot[2427784]: SELinux is preventing /usr/bin/python3.9 from setattr access on the file repomd.xml. For complete SELinux messages run: sealert -l 0fd3339f-3ef2-45f3-9e58-65a58b42f3ee
Oct 12 02:26:04 submit26-b9-f1 setroubleshoot[2427784]: SELinux is preventing /usr/bin/python3.9 from read access on the directory libdnf.FAj5Z3. For complete SELinux messages run: sealert -l 0d661d88-dc9e-469d-986b-52e29b353aa8
Oct 12 02:26:04 submit26-b9-f1 setroubleshoot[2427784]: SELinux is preventing /usr/bin/python3.9 from remove_name access on the directory repomd.xml. For complete SELinux messages run: sealert -l 405a8556-cf9f-4ef4-8525-0dca18d4259d
Oct 12 02:26:04 submit26-b9-f1 setroubleshoot[2427784]: SELinux is preventing /usr/bin/python3.9 from unlink access on the file repomd.xml. For complete SELinux messages run: sealert -l 3c38e23e-3631-4cb5-81c7-992675c836d9
Oct 12 02:26:04 submit26-b9-f1 setroubleshoot[2427784]: SELinux is preventing /usr/bin/python3.9 from rmdir access on the directory repodata. For complete SELinux messages run: sealert -l a070e9b5-2867-47d6-b2e3-3b7d99725848
== submit26-b9-f2 (9 distinct, 9 total) ==
Oct 12 02:06:57 submit26-b9-f2 setroubleshoot[1520316]: SELinux is preventing /usr/bin/python3.9 from create access on the directory /(null). For complete SELinux messages run: sealert -l 0659d546-3107-4f75-b00f-008c85f41dc6
Oct 12 02:06:57 submit26-b9-f2 setroubleshoot[1520316]: SELinux is preventing /usr/bin/python3.9 from add_name access on the directory /(null). For complete SELinux messages run: sealert -l 156d9270-3466-4356-b86f-1a128825961a
Oct 12 02:06:57 submit26-b9-f2 setroubleshoot[1520316]: SELinux is preventing /usr/bin/python3.9 from create access on the file /(null). For complete SELinux messages run: sealert -l c8a40bf5-2fc4-46b3-b813-8592b3523339
Oct 12 02:06:57 submit26-b9-f2 setroubleshoot[1520316]: SELinux is preventing /usr/bin/python3.9 from open access on the file /tmp/libdnf.v7x00M/repodata/repomd.xml. For complete SELinux messages run: sealert -l 7f4c3a8e-0f99-47c4-9baf-e1336fe24876
Oct 12 02:06:57 submit26-b9-f2 setroubleshoot[1520316]: SELinux is preventing /usr/bin/python3.9 from setattr access on the file repomd.xml. For complete SELinux messages run: sealert -l 988123da-b724-4e6a-900c-33a2723fdaf1
Oct 12 02:06:57 submit26-b9-f2 setroubleshoot[1520316]: SELinux is preventing /usr/bin/python3.9 from read access on the directory libdnf.v7x00M. For complete SELinux messages run: sealert -l ca585e2b-d50f-4264-8127-6b3fa04070c8
Oct 12 02:06:57 submit26-b9-f2 setroubleshoot[1520316]: SELinux is preventing /usr/bin/python3.9 from remove_name access on the directory repomd.xml. For complete SELinux messages run: sealert -l 3a749560-1cec-40ca-a4dc-596841be3885
Oct 12 02:06:57 submit26-b9-f2 setroubleshoot[1520316]: SELinux is preventing /usr/bin/python3.9 from unlink access on the file repomd.xml. For complete SELinux messages run: sealert -l 0aa52f08-94f8-474e-96d8-e818846941af
Oct 12 02:06:57 submit26-b9-f2 setroubleshoot[1520316]: SELinux is preventing /usr/bin/python3.9 from rmdir access on the directory repodata. For complete SELinux messages run: sealert -l de019dc4-408f-439c-902a-676d18dfe8e7
== submit26-b9-f3 (1 distinct, 1 total) ==
Oct 12 02:10:06 submit26-b9-f3 systemd[1]: user(a)1001.service: Main process exited, code=killed, status=9/KILL
== wraith (3 distinct, 3 total) ==
Oct 12 02:07:33 wraith kernel: nvme 10000:e1:00.0: PCIe Bus Error: severity=Correctable, type=Physical Layer, (Receiver ID)
Oct 12 02:07:33 wraith kernel: nvme 10000:e1:00.0: device [15b7:5015] error status/mask=00000001/0000e000
Oct 12 02:07:33 wraith kernel: nvme 10000:e1:00.0: [ 0] RxErr (First)
1
0
Command: /usr/local/sbin/syslog-digest.py
Time : 0.0738s
Status : exited 0
Output :
Syslog digest — 2026-10-12 02:05 EDT
Processed 3,398 lines, filtered 2,752 (80%). 646 unknown (165 distinct) from 23 host(s).
== abuse (1 distinct, 346 total) ==
Oct 12 01:05:25 abuse rsyslogd[1033]: imjournal: open() failed for path: '/var/lib/rsyslog/imjournal.state.tmp': Input/output error [v8.2404.0 try https://www.rsyslog.com/e/2433 ] [x346]
== b0b02.cs.umd.edu (1 distinct, 1 total) ==
Oct 12 01:23:54 b0b02.cs.umd.edu rustdesk[2890537]: cannot open display:
== cheezit.cs.umd.edu (4 distinct, 4 total) ==
Oct 12 01:19:55 cheezit.cs.umd.edu sshd-session[1829346]: pam_access(sshd:auth): access denied for user `admin' from `104.199.86.173'
Oct 12 01:19:55 cheezit.cs.umd.edu krb5_child[1829348]: Client 'admin(a)UMD.EDU' not found in Kerberos database
Oct 12 01:19:55 cheezit.cs.umd.edu sshd-session[1829344]: error: PAM: System error for admin from 104.199.86.173
Oct 12 01:21:27 cheezit.cs.umd.edu sshd-session[1830120]: error: Protocol major versions differ: 2 vs. 1
== hazfs.cs.umd.edu (11 distinct, 66 total) ==
Oct 12 01:32:41 hazfs.cs.umd.edu snmpd[1431]: send response: Failure in sendto [x6]
Oct 12 01:32:41 hazfs.cs.umd.edu snmpd[1431]: -- NET-SNMP-EXTEND-MIB::nsExtendStatus."userweb" [x6]
Oct 12 01:32:41 hazfs.cs.umd.edu snmpd[1431]: -- NET-SNMP-EXTEND-MIB::nsExtendStatus."zfslist" [x6]
Oct 12 01:32:41 hazfs.cs.umd.edu snmpd[1431]: -- NET-SNMP-EXTEND-MIB::nsExtendStatus."userhome" [x6]
Oct 12 01:32:41 hazfs.cs.umd.edu snmpd[1431]: -- NET-SNMP-EXTEND-MIB::nsExtendOutput1Line."userweb" [x6]
Oct 12 01:32:41 hazfs.cs.umd.edu snmpd[1431]: -- NET-SNMP-EXTEND-MIB::nsExtendOutput1Line."zfslist" [x6]
Oct 12 01:32:41 hazfs.cs.umd.edu snmpd[1431]: -- NET-SNMP-EXTEND-MIB::nsExtendOutput1Line."userhome" [x6]
Oct 12 01:32:41 hazfs.cs.umd.edu snmpd[1431]: -- NET-SNMP-EXTEND-MIB::nsExtendOutputFull."userweb" [x6]
Oct 12 01:32:41 hazfs.cs.umd.edu snmpd[1431]: -- NET-SNMP-EXTEND-MIB::nsExtendOutputFull."zfslist" [x6]
Oct 12 01:32:41 hazfs.cs.umd.edu snmpd[1431]: -- NET-SNMP-EXTEND-MIB::nsExtendOutputFull."userhome" [x6]
Oct 12 01:32:41 hazfs.cs.umd.edu snmpd[1431]: -- NET-SNMP-EXTEND-MIB::nsExtendOutNumLines."userweb" [x6]
== idm00 (1 distinct, 1 total) ==
Oct 12 01:54:46 idm00 named[3155984]: client @0x7f459c086b28 10.73.240.42#56966: update '73.10.in-addr.arpa/IN' denied
== idmp0 (1 distinct, 1 total) ==
Oct 12 01:39:22 idmp0 named[412677]: client @0x7fb32c007ab8 10.73.240.43#61285: update '73.10.in-addr.arpa/IN' denied
== inbound00.cs.umd.edu (1 distinct, 1 total) ==
Oct 12 02:03:04 inbound00.cs.umd.edu krb5_child[1213971]: Client 'admin(a)UMD.EDU' not found in Kerberos database
== itmon02 (1 distinct, 3 total) ==
Oct 12 01:08:03 itmon02 sshd[805675]: error: beginning MaxStartups throttling [x3]
== krispykreme.cs.umd.edu (4 distinct, 4 total) ==
Oct 12 01:21:32 krispykreme.cs.umd.edu sshd-session[680988]: pam_access(sshd:auth): access denied for user `admin' from `207.175.66.120'
Oct 12 01:21:32 krispykreme.cs.umd.edu krb5_child[680990]: Client 'admin(a)UMD.EDU' not found in Kerberos database
Oct 12 01:21:32 krispykreme.cs.umd.edu sshd-session[680986]: error: PAM: System error for admin from 207.175.66.120
Oct 12 01:22:02 krispykreme.cs.umd.edu sshd-session[681057]: error: Protocol major versions differ: 2 vs. 1
== mcstic (3 distinct, 6 total) ==
Oct 12 01:43:17 mcstic krb5_child[1876396]: Client 'admin(a)UMD.EDU' not found in Kerberos database [x4]
Oct 12 01:43:23 mcstic sshd[1876391]: error: PAM: Authentication failure for admin from 35.205.235.226
Oct 12 01:45:59 mcstic sshd[1876648]: error: Protocol major versions differ: 2 vs. 1
== munin (2 distinct, 8 total) ==
Oct 12 01:18:35 munin sudo[3643413]: pam_systemd(sudo:session): Failed to stat() runtime directory '/run/user/0': No such file or directory [x4]
Oct 12 01:18:35 munin sudo[3643413]: pam_systemd(sudo:session): Not setting $XDG_RUNTIME_DIR, as the directory is not in order. [x4]
== netman.cs.umd.edu (2 distinct, 5 total) ==
Oct 12 01:53:08 netman.cs.umd.edu krb5_child[2173248]: Client 'admin(a)UMD.EDU' not found in Kerberos database [x4]
Oct 12 01:53:15 netman.cs.umd.edu sshd[2173245]: error: PAM: Authentication failure for admin from 34.53.138.9
== newhonors2 (1 distinct, 24 total) ==
Oct 12 01:13:03 newhonors2 dhcpcd[3902929]: dhcpcd is not running [x24]
== ntop00 (97 distinct, 97 total) ==
Oct 12 01:05:01 ntop00 nfacctd[1075699]: INFO ( m1/mysql ): *** Purging cache - START (PID: 7330) ***
Oct 12 01:05:01 ntop00 nfacctd[1075699]: INFO ( m1/mysql ): *** Purging cache - END (PID: 7330, QN: 79/79, ET: 0) ***
Oct 12 01:05:14 ntop00 sfacctd[1075592]: INFO ( m1/mysql ): *** Purging cache - END (PID: 7330, QN: 5822/5822, ET: 13) ***
Oct 12 01:08:01 ntop00 sfacctd[1075592]: INFO ( p1/print ): *** Purging cache - START (PID: 7331) ***
Oct 12 01:08:01 ntop00 nfacctd[1075699]: INFO ( p1/print ): *** Purging cache - START (PID: 7331) ***
Oct 12 01:08:01 ntop00 nfacctd[1075699]: INFO ( p1/print ): *** Purging cache - END (PID: 7331, QN: 99/99, ET: 0) ***
Oct 12 01:08:01 ntop00 sfacctd[1075592]: INFO ( p1/print ): *** Purging cache - END (PID: 7331, QN: 5070/5070, ET: 0) ***
Oct 12 01:10:01 ntop00 sfacctd[1075592]: INFO ( m1/mysql ): *** Purging cache - START (PID: 7332) ***
Oct 12 01:10:01 ntop00 nfacctd[1075699]: INFO ( m1/mysql ): *** Purging cache - START (PID: 7332) ***
Oct 12 01:10:01 ntop00 nfacctd[1075699]: INFO ( m1/mysql ): *** Purging cache - END (PID: 7332, QN: 87/87, ET: 0) ***
Oct 12 01:10:13 ntop00 sfacctd[1075592]: INFO ( m1/mysql ): *** Purging cache - END (PID: 7332, QN: 4977/4977, ET: 12) ***
Oct 12 01:13:01 ntop00 sfacctd[1075592]: INFO ( p1/print ): *** Purging cache - START (PID: 7333) ***
Oct 12 01:13:01 ntop00 sfacctd[1075592]: INFO ( p1/print ): *** Purging cache - END (PID: 7333, QN: 4760/4760, ET: 0) ***
Oct 12 01:13:01 ntop00 nfacctd[1075699]: INFO ( p1/print ): *** Purging cache - START (PID: 7333) ***
Oct 12 01:13:01 ntop00 nfacctd[1075699]: INFO ( p1/print ): *** Purging cache - END (PID: 7333, QN: 58/58, ET: 0) ***
Oct 12 01:15:01 ntop00 sfacctd[1075592]: INFO ( m1/mysql ): *** Purging cache - START (PID: 7334) ***
Oct 12 01:15:01 ntop00 nfacctd[1075699]: INFO ( m1/mysql ): *** Purging cache - START (PID: 7334) ***
Oct 12 01:15:01 ntop00 nfacctd[1075699]: INFO ( m1/mysql ): *** Purging cache - END (PID: 7334, QN: 51/51, ET: 0) ***
Oct 12 01:15:12 ntop00 sfacctd[1075592]: INFO ( m1/mysql ): *** Purging cache - END (PID: 7334, QN: 4653/4653, ET: 11) ***
Oct 12 01:18:01 ntop00 sfacctd[1075592]: INFO ( p1/print ): *** Purging cache - START (PID: 7335) ***
Oct 12 01:18:01 ntop00 sfacctd[1075592]: INFO ( p1/print ): *** Purging cache - END (PID: 7335, QN: 4835/4835, ET: 0) ***
Oct 12 01:18:01 ntop00 nfacctd[1075699]: INFO ( p1/print ): *** Purging cache - START (PID: 7335) ***
Oct 12 01:18:01 ntop00 nfacctd[1075699]: INFO ( p1/print ): *** Purging cache - END (PID: 7335, QN: 61/61, ET: 0) ***
Oct 12 01:20:01 ntop00 sfacctd[1075592]: INFO ( m1/mysql ): *** Purging cache - START (PID: 7336) ***
Oct 12 01:20:01 ntop00 nfacctd[1075699]: INFO ( m1/mysql ): *** Purging cache - START (PID: 7336) ***
Oct 12 01:20:01 ntop00 nfacctd[1075699]: INFO ( m1/mysql ): *** Purging cache - END (PID: 7336, QN: 74/74, ET: 0) ***
Oct 12 01:20:11 ntop00 sfacctd[1075592]: INFO ( m1/mysql ): *** Purging cache - END (PID: 7336, QN: 4891/4891, ET: 10) ***
Oct 12 01:23:01 ntop00 sfacctd[1075592]: INFO ( p1/print ): *** Purging cache - START (PID: 7337) ***
Oct 12 01:23:01 ntop00 sfacctd[1075592]: INFO ( p1/print ): *** Purging cache - END (PID: 7337, QN: 4929/4929, ET: 0) ***
Oct 12 01:23:01 ntop00 nfacctd[1075699]: INFO ( p1/print ): *** Purging cache - START (PID: 7337) ***
... 67 more distinct messages not shown
== outbound00.cs.umd.edu (3 distinct, 8 total) ==
Oct 12 01:09:09 outbound00.cs.umd.edu python3[1792122]: ldapdb [x6]
Oct 12 01:55:19 outbound00.cs.umd.edu krb5_child[1802480]: Client 'admin(a)UMD.EDU' not found in Kerberos database
Oct 12 01:55:46 outbound00.cs.umd.edu sshd-session[1803105]: error: Protocol major versions differ: 2 vs. 1
== outbound01.cs.umd.edu (1 distinct, 6 total) ==
Oct 12 01:13:06 outbound01.cs.umd.edu python3[3272690]: ldapdb [x6]
== soul (1 distinct, 1 total) ==
Oct 12 01:50:13 soul krb5_child[342151]: Client 'admin(a)UMD.EDU' not found in Kerberos database
== strawberry (7 distinct, 38 total) ==
Oct 12 01:07:03 strawberry kernel: I/O error, dev sda, sector 206848 op 0x0:(READ) flags 0x80700 phys_seg 1 prio class 2 [x6]
Oct 12 01:07:03 strawberry kernel: I/O error, dev sda, sector 206848 op 0x0:(READ) flags 0x0 phys_seg 1 prio class 2 [x6]
Oct 12 01:07:03 strawberry kernel: Buffer I/O error on dev sda2, logical block 0, async page read [x6]
Oct 12 01:07:03 strawberry kernel: I/O error, dev sda, sector 2048 op 0x0:(READ) flags 0x80700 phys_seg 1 prio class 2 [x6]
Oct 12 01:07:03 strawberry kernel: I/O error, dev sda, sector 2048 op 0x0:(READ) flags 0x0 phys_seg 1 prio class 2 [x6]
Oct 12 01:07:03 strawberry kernel: Buffer I/O error on dev sda1, logical block 0, async page read [x6]
Oct 12 01:34:42 strawberry smartd[5314]: Device: /dev/sda [SAT], failed to read SMART Attribute Data [x2]
== submit26-b9-3 (1 distinct, 1 total) ==
Sep 14 09:10:06 submit26-b9-3 systemd[1]: user(a)1001.service: Main process exited, code=killed, status=9/KILL
== submit26-b9-f1 (1 distinct, 3 total) ==
Oct 12 01:38:07 submit26-b9-f1 systemd[1]: user(a)1001.service: Main process exited, code=killed, status=9/KILL [x3]
== submit26-b9-f2 (1 distinct, 2 total) ==
Oct 12 01:08:08 submit26-b9-f2 systemd[1]: user(a)1001.service: Main process exited, code=killed, status=9/KILL [x2]
== submit26-b9-f3 (10 distinct, 10 total) ==
Oct 12 01:06:51 submit26-b9-f3 setroubleshoot[2950708]: SELinux is preventing /usr/bin/python3.9 from create access on the directory /(null). For complete SELinux messages run: sealert -l a653b772-cbcd-438b-bae5-23c3dc69b31b
Oct 12 01:06:51 submit26-b9-f3 setroubleshoot[2950708]: SELinux is preventing /usr/bin/python3.9 from add_name access on the directory /(null). For complete SELinux messages run: sealert -l 3e904634-6caa-4202-8c92-f139db798859
Oct 12 01:06:51 submit26-b9-f3 setroubleshoot[2950708]: SELinux is preventing /usr/bin/python3.9 from create access on the file /(null). For complete SELinux messages run: sealert -l 580b20e4-ec2c-433d-905c-5bd417fba033
Oct 12 01:06:51 submit26-b9-f3 setroubleshoot[2950708]: SELinux is preventing /usr/bin/python3.9 from open access on the file /tmp/libdnf.P7lcmu/repodata/repomd.xml. For complete SELinux messages run: sealert -l 27f29d48-5e7c-4db7-b051-8ac055737d6f
Oct 12 01:06:51 submit26-b9-f3 setroubleshoot[2950708]: SELinux is preventing /usr/bin/python3.9 from setattr access on the file repomd.xml. For complete SELinux messages run: sealert -l bff72452-d40a-430b-9060-dd0a48f5b6ba
Oct 12 01:06:51 submit26-b9-f3 setroubleshoot[2950708]: SELinux is preventing /usr/bin/python3.9 from read access on the directory libdnf.P7lcmu. For complete SELinux messages run: sealert -l 9638d396-8ce5-4e6a-ae47-45cd3985e1cd
Oct 12 01:06:51 submit26-b9-f3 setroubleshoot[2950708]: SELinux is preventing /usr/bin/python3.9 from remove_name access on the directory repomd.xml. For complete SELinux messages run: sealert -l 6da64b94-7024-45a9-b8c2-3b9812517407
Oct 12 01:06:51 submit26-b9-f3 setroubleshoot[2950708]: SELinux is preventing /usr/bin/python3.9 from unlink access on the file repomd.xml. For complete SELinux messages run: sealert -l 64cbe179-abf1-4d5a-bade-bb164897ee65
Oct 12 01:06:51 submit26-b9-f3 setroubleshoot[2950708]: SELinux is preventing /usr/bin/python3.9 from rmdir access on the directory repodata. For complete SELinux messages run: sealert -l d2e35b1a-e27c-4f91-9217-2bb1204e1e68
Oct 12 01:16:39 submit26-b9-f3 systemd[1]: user(a)1001.service: Main process exited, code=killed, status=9/KILL
== submit26-b9-f4 (10 distinct, 10 total) ==
Oct 12 01:24:55 submit26-b9-f4 setroubleshoot[887369]: SELinux is preventing /usr/bin/python3.9 from create access on the directory /(null). For complete SELinux messages run: sealert -l ee160f23-b161-4f4a-9985-c4edfd3a5beb
Oct 12 01:24:55 submit26-b9-f4 setroubleshoot[887369]: SELinux is preventing /usr/bin/python3.9 from add_name access on the directory /(null). For complete SELinux messages run: sealert -l 89a83821-4b24-4081-9973-0a79ca6ed5b4
Oct 12 01:24:55 submit26-b9-f4 setroubleshoot[887369]: SELinux is preventing /usr/bin/python3.9 from create access on the file /(null). For complete SELinux messages run: sealert -l f73955d6-1416-45f9-bab6-ff1f3ea07e9d
Oct 12 01:24:55 submit26-b9-f4 setroubleshoot[887369]: SELinux is preventing /usr/bin/python3.9 from open access on the file /tmp/libdnf.thrI6Y/repodata/repomd.xml. For complete SELinux messages run: sealert -l 9f8f24a0-8fb6-454d-a103-31a8f7a6efa0
Oct 12 01:24:55 submit26-b9-f4 setroubleshoot[887369]: SELinux is preventing /usr/bin/python3.9 from setattr access on the file repomd.xml. For complete SELinux messages run: sealert -l 20293136-86a3-40ba-a651-cff48d36059e
Oct 12 01:24:55 submit26-b9-f4 setroubleshoot[887369]: SELinux is preventing /usr/bin/python3.9 from read access on the directory libdnf.thrI6Y. For complete SELinux messages run: sealert -l 25f86b49-4ee7-4f60-ad1c-73a70032560c
Oct 12 01:24:56 submit26-b9-f4 setroubleshoot[887369]: SELinux is preventing /usr/bin/python3.9 from remove_name access on the directory repomd.xml. For complete SELinux messages run: sealert -l eec250fb-073f-456d-93bc-f98776fd476d
Oct 12 01:24:56 submit26-b9-f4 setroubleshoot[887369]: SELinux is preventing /usr/bin/python3.9 from unlink access on the file repomd.xml. For complete SELinux messages run: sealert -l c9209e04-a349-43d5-8cb2-3e303e48df74
Oct 12 01:24:56 submit26-b9-f4 setroubleshoot[887369]: SELinux is preventing /usr/bin/python3.9 from rmdir access on the directory repodata. For complete SELinux messages run: sealert -l 3178d5f5-80e9-404b-92b7-9bef397a8915
Oct 12 01:28:11 submit26-b9-f4 systemd[1]: user(a)1001.service: Main process exited, code=killed, status=9/KILL
1
0