Command: /usr/local/sbin/syslog-digest.py
Time : 1.0434s
Status : exited 0
Output :
Syslog digest — 2026-08-09 09:05 EDT
Processed 7,653 lines, filtered 4,755 (62%). 2,898 unknown (295 distinct) from 24 host(s).
== abuse (3 distinct, 2258 total) ==
Aug 9 08:05:05 abuse systemd[1]: Failed to load environment files: Input/output error [x687]
Aug 9 08:05:05 abuse systemd[1]: choria-server.service failed to run 'start' task: Input/output error [x687]
Aug 9 08:05:10 abuse rsyslogd[21745]: imjournal: open() failed for path: '/var/lib/rsyslog/imjournal.state.tmp': Input/output error [v8.2404.0 try https://www.rsyslog.com/e/2433 ] [x884]
== b0b02.cs.umd.edu (2 distinct, 2 total) ==
Aug 9 08:22:43 b0b02.cs.umd.edu systemd[1]: insights-client.service: Start request repeated too quickly.
Aug 9 08:51:30 b0b02.cs.umd.edu rustdesk[429440]: cannot open display:
== contest (1 distinct, 34 total) ==
Aug 9 08:05:32 contest goferd[1007]: [ERROR][worker-0] gofer.messaging.adapter.connect:33 - connect: proton+amqps://satellite8.cs.umd.edu:5647, failed: Connection amqps://satellite8.cs.umd.edu:5647 disconnected: Condition('proton.pythonio', 'Connection refused to all addresses') [x34]
== csfw00a (1 distinct, 214 total) ==
Aug 9 08:04:20 csfw00a kernel: bnxt_en 0000:09:00.0 eth3: NIC Link is Down [x214]
== emaar (1 distinct, 1 total) ==
Aug 9 08:43:14 emaar puppet-agent[1947504]: (Facter) invalid or malformed lldp data: MalformedDataError: no lldp interface data found
== gle-dind00.cs.umd.edu (205 distinct, 205 total) ==
Aug 9 08:46:08 gle-dind00.cs.umd.edu puppet-agent[785128]: (/Stage[main]/Mcollective::Plugin_dirs/File[/opt/puppetlabs/mcollective/plugins]) Could not evaluate: Could not retrieve information from environment gitlab_19_2_1_upgrade source(s) puppet:///modules/mcollective/empty
Aug 9 08:46:08 gle-dind00.cs.umd.edu puppet-agent[785128]: (/Stage[main]/Mcollective::Plugin_dirs/File[/opt/puppetlabs/mcollective/plugins/mcollective]) Skipping because of failed dependencies
Aug 9 08:46:08 gle-dind00.cs.umd.edu puppet-agent[785128]: (/Stage[main]/Mcollective::Plugin_dirs/File[/opt/puppetlabs/mcollective/plugins/mcollective/agent]) Skipping because of failed dependencies
Aug 9 08:46:08 gle-dind00.cs.umd.edu puppet-agent[785128]: (/Stage[main]/Mcollective::Plugin_dirs/File[/opt/puppetlabs/mcollective/plugins/mcollective/aggregate]) Skipping because of failed dependencies
Aug 9 08:46:08 gle-dind00.cs.umd.edu puppet-agent[785128]: (/Stage[main]/Mcollective::Plugin_dirs/File[/opt/puppetlabs/mcollective/plugins/mcollective/application]) Skipping because of failed dependencies
Aug 9 08:46:08 gle-dind00.cs.umd.edu puppet-agent[785128]: (/Stage[main]/Mcollective::Plugin_dirs/File[/opt/puppetlabs/mcollective/plugins/mcollective/connector]) Skipping because of failed dependencies
Aug 9 08:46:08 gle-dind00.cs.umd.edu puppet-agent[785128]: (/Stage[main]/Mcollective::Plugin_dirs/File[/opt/puppetlabs/mcollective/plugins/mcollective/data]) Skipping because of failed dependencies
Aug 9 08:46:08 gle-dind00.cs.umd.edu puppet-agent[785128]: (/Stage[main]/Mcollective::Plugin_dirs/File[/opt/puppetlabs/mcollective/plugins/mcollective/discovery]) Skipping because of failed dependencies
Aug 9 08:46:08 gle-dind00.cs.umd.edu puppet-agent[785128]: (/Stage[main]/Mcollective::Plugin_dirs/File[/opt/puppetlabs/mcollective/plugins/mcollective/registration]) Skipping because of failed dependencies
Aug 9 08:46:08 gle-dind00.cs.umd.edu puppet-agent[785128]: (/Stage[main]/Mcollective::Plugin_dirs/File[/opt/puppetlabs/mcollective/plugins/mcollective/security]) Skipping because of failed dependencies
Aug 9 08:46:09 gle-dind00.cs.umd.edu puppet-agent[785128]: (/Stage[main]/Mcollective::Plugin_dirs/File[/opt/puppetlabs/mcollective/plugins/mcollective/util]) Skipping because of failed dependencies
Aug 9 08:46:09 gle-dind00.cs.umd.edu puppet-agent[785128]: (/Stage[main]/Mcollective::Plugin_dirs/File[/opt/puppetlabs/mcollective/plugins/mcollective/validator]) Skipping because of failed dependencies
Aug 9 08:46:09 gle-dind00.cs.umd.edu puppet-agent[785128]: (/Stage[main]/Mcollective::Plugin_dirs/File[/opt/puppetlabs/mcollective/plugins/mcollective/pluginpackager]) Skipping because of failed dependencies
Aug 9 08:46:09 gle-dind00.cs.umd.edu puppet-agent[785128]: (/Stage[main]/Mcollective::Facts/File[/opt/puppetlabs/mcollective/plugins/mcollective/refresh_facts.rb]) Skipping because of failed dependencies
Aug 9 08:46:09 gle-dind00.cs.umd.edu puppet-agent[785128]: (/Stage[main]/Profile::Base/File[/usr/local/bin/accounts]) Could not evaluate: Could not retrieve information from environment gitlab_19_2_1_upgrade source(s) puppet:///modules/profile/base/accounts
Aug 9 08:46:09 gle-dind00.cs.umd.edu puppet-agent[785128]: (/Stage[main]/Profile::Ssl_roots/File[/opt/umd/ssl/DigiCertCA.crt]) Could not evaluate: Could not retrieve information from environment gitlab_19_2_1_upgrade source(s) puppet:///modules/profile/ssl/DigiCertCA.crt
Aug 9 08:46:09 gle-dind00.cs.umd.edu puppet-agent[785128]: (/Stage[main]/Profile::Ssl_roots/File[/opt/umd/ssl/InCommonCA.crt]) Could not evaluate: Could not retrieve information from environment gitlab_19_2_1_upgrade source(s) puppet:///modules/profile/ssl/InCommonCA.crt
Aug 9 08:46:09 gle-dind00.cs.umd.edu puppet-agent[785128]: (/Stage[main]/Profile::Csquota::Client/File[/usr/local/bin/csquota]) Could not evaluate: Could not retrieve information from environment gitlab_19_2_1_upgrade source(s) puppet:///modules/profile/base/csquota
Aug 9 08:46:09 gle-dind00.cs.umd.edu puppet-agent[785128]: (/Stage[main]/Profile::Csquota::Client/File[/etc/profile.d/csd_quota.sh]) Could not evaluate: Could not retrieve information from environment gitlab_19_2_1_upgrade source(s) puppet:///modules/profile/base/csd_quota_sh
Aug 9 08:46:09 gle-dind00.cs.umd.edu puppet-agent[785128]: (/Stage[main]/Profile::Csquota::Client/File[/etc/profile.d/csd_quota.csh]) Could not evaluate: Could not retrieve information from environment gitlab_19_2_1_upgrade source(s) puppet:///modules/profile/base/csd_quota_csh
Aug 9 08:46:09 gle-dind00.cs.umd.edu puppet-agent[785128]: (/Stage[main]/Profile::Ssh_server/File[/etc/ssh/ca.pub]) Could not evaluate: Could not retrieve information from environment gitlab_19_2_1_upgrade source(s) puppet:///modules/profile/ssh_server/ssh_ca.pub
Aug 9 08:46:09 gle-dind00.cs.umd.edu puppet-agent[785128]: (/Stage[main]/Profile::Ssh_server/File[/etc/ssh/revoked.list]) Could not evaluate: Could not retrieve information from environment gitlab_19_2_1_upgrade source(s) puppet:///modules/profile/ssh_server/revoked_list
Aug 9 08:46:09 gle-dind00.cs.umd.edu puppet-agent[785128]: (/Stage[main]/Profile::Ssh_server/Service[sshd]) Skipping because of failed dependencies
Aug 9 08:46:09 gle-dind00.cs.umd.edu puppet-agent[785128]: (/Stage[main]/Profile::Ssh_server/File[/etc/ssh/auth_principals/root]) Could not evaluate: Could not retrieve information from environment gitlab_19_2_1_upgrade source(s) puppet:///modules/profile/ssh_server/ssh_auth_principals
Aug 9 08:46:09 gle-dind00.cs.umd.edu puppet-agent[785128]: (/Stage[main]/Profile::Updated_host/File[/usr/local/bin/csupdates]) Could not evaluate: Could not retrieve information from environment gitlab_19_2_1_upgrade source(s) puppet:///modules/profile/base/csupdates
Aug 9 08:46:09 gle-dind00.cs.umd.edu puppet-agent[785128]: (/Stage[main]/Mcollective_agent_puppet/Mcollective::Module_plugin[mcollective_agent_puppet]/File[/opt/puppetlabs/mcollective/plugins/mcollective/util/puppet_agent_mgr]) Skipping because of failed dependencies
Aug 9 08:46:09 gle-dind00.cs.umd.edu puppet-agent[785128]: (/Stage[main]/Mcollective_agent_puppet/Mcollective::Module_plugin[mcollective_agent_puppet]/File[/opt/puppetlabs/mcollective/plugins/mcollective/data/puppet_data.rb]) Skipping because of failed dependencies
Aug 9 08:46:09 gle-dind00.cs.umd.edu puppet-agent[785128]: (/Stage[main]/Mcollective_agent_puppet/Mcollective::Module_plugin[mcollective_agent_puppet]/File[/opt/puppetlabs/mcollective/plugins/mcollective/data/resource_data.rb]) Skipping because of failed dependencies
Aug 9 08:46:09 gle-dind00.cs.umd.edu puppet-agent[785128]: (/Stage[main]/Mcollective_agent_puppet/Mcollective::Module_plugin[mcollective_agent_puppet]/File[/opt/puppetlabs/mcollective/plugins/mcollective/data/puppet_data.ddl]) Skipping because of failed dependencies
Aug 9 08:46:09 gle-dind00.cs.umd.edu puppet-agent[785128]: (/Stage[main]/Mcollective_agent_puppet/Mcollective::Module_plugin[mcollective_agent_puppet]/File[/opt/puppetlabs/mcollective/plugins/mcollective/data/resource_data.ddl]) Skipping because of failed dependencies
... 175 more distinct messages not shown
== hackerman (6 distinct, 11 total) ==
Aug 9 08:20:04 hackerman gnome-software[2060381]: can't reliably fixup error code 4 in domain g-io-error-quark: Not a directory [x4]
Aug 9 08:20:12 hackerman gnome-software[2060381]: Only 0 apps for recent list, hiding
Aug 9 08:20:28 hackerman gnome-software[2060381]: failed to commit changes to dconf: GDBus.Error:org.gtk.GDBus.UnmappedGError.Quark._g_2dfile_2derror_2dquark.Code2: Failed to create file “/adminhomes/sajith/.config/dconf/user.N32XT3”: Permission denied
Aug 9 08:20:28 hackerman packagekitd[1199479]: Failed to get cache filename for libreoffice [x2]
Aug 9 08:20:28 hackerman packagekitd[1199479]: Failed to get cache filename for kernel [x2]
Aug 9 08:20:38 hackerman packagekitd[1199479]: failed to parse public key for /etc/pki/rpm-gpg/RPM-GPG-KEY-PQC-redhat-release
== idm00 (1 distinct, 1 total) ==
Aug 9 08:51:22 idm00 named[243294]: client @0x7f5f1939f028 10.73.240.42#54960: update '73.10.in-addr.arpa/IN' denied
== idmp0 (1 distinct, 1 total) ==
Aug 9 08:36:01 idmp0 named[1540302]: client @0x7ff7e0049ed8 10.73.240.43#63731: update '73.10.in-addr.arpa/IN' denied
== irb2156 (2 distinct, 6 total) ==
Aug 9 08:25:09 irb2156 gcr-prompter[1638586]: cannot open display: [x3]
Aug 9 08:25:09 irb2156 gnome-keyring-d[16342]: couldn't create system prompt: GDBus.Error:org.freedesktop.DBus.Error.NameHasNoOwner: Could not activate remote peer 'org.gnome.keyring.SystemPrompter': unit failed [x3]
== itmon02 (1 distinct, 44 total) ==
Aug 9 08:08:09 itmon02 sshd[1750555]: error: beginning MaxStartups throttling [x44]
== jubjub.cs.umd.edu (1 distinct, 1 total) ==
Aug 9 08:05:29 jubjub.cs.umd.edu sshd[3338828]: error: key_cert_check_authority: invalid certificate
== netman.cs.umd.edu (3 distinct, 6 total) ==
Aug 9 08:30:02 netman.cs.umd.edu setroubleshoot[2781113]: SELinux is preventing /usr/bin/gpg from read access on the file gpg.conf. For complete SELinux messages run: sealert -l 019ad1da-a874-4814-8037-3b3e5f413ad2 [x2]
Aug 9 08:30:02 netman.cs.umd.edu setroubleshoot[2781113]: SELinux is preventing /usr/bin/gpg from open access on the file /root/.gnupg/gpg.conf. For complete SELinux messages run: sealert -l cb54177e-d44c-46a1-b246-5c0bbb8343be [x2]
Aug 9 08:30:02 netman.cs.umd.edu setroubleshoot[2781113]: SELinux is preventing /usr/bin/gpg from getattr access on the file /root/.gnupg/gpg.conf. For complete SELinux messages run: sealert -l fbba2e30-b7ab-491c-9ec6-f553e9ef72af [x2]
== newhonors2 (1 distinct, 24 total) ==
Aug 9 08:13:02 newhonors2 dhcpcd[954818]: dhcpcd is not running [x24]
== orchids (8 distinct, 14 total) ==
Aug 9 08:10:04 orchids gnome-software[1516991]: failed to commit changes to dconf: GDBus.Error:org.gtk.GDBus.UnmappedGError.Quark._g_2dfile_2derror_2dquark.Code2: Failed to create file “/adminhomes/jworden/.config/dconf/user.6W5MT3”: Permission denied
Aug 9 08:11:25 orchids gnome-software[1516991]: can't reliably fixup error code 4 in domain g-io-error-quark: Not a directory [x4]
Aug 9 08:11:32 orchids gnome-software[1516991]: Only 0 apps for recent list, hiding
Aug 9 08:11:35 orchids packagekitd[1976418]: Failed to get cache filename for libreoffice [x2]
Aug 9 08:11:35 orchids packagekitd[1976418]: Failed to get cache filename for cups-filesystem [x2]
Aug 9 08:11:35 orchids packagekitd[1976418]: Failed to get cache filename for kernel [x2]
Aug 9 08:11:36 orchids gnome-software[1516991]: failed to commit changes to dconf: GDBus.Error:org.gtk.GDBus.UnmappedGError.Quark._g_2dfile_2derror_2dquark.Code2: Failed to create file “/adminhomes/jworden/.config/dconf/user.7FBUT3”: Permission denied
Aug 9 08:11:36 orchids packagekitd[1976418]: failed to parse public key for /etc/pki/rpm-gpg/RPM-GPG-KEY-PQC-redhat-release
== outbound00.cs.umd.edu (1 distinct, 6 total) ==
Aug 9 08:09:09 outbound00.cs.umd.edu python3[282874]: ldapdb [x6]
== outbound01.cs.umd.edu (1 distinct, 6 total) ==
Aug 9 08:13:06 outbound01.cs.umd.edu python3[2514950]: ldapdb [x6]
== peach.cs.umd.edu (2 distinct, 4 total) ==
Aug 9 08:22:08 peach.cs.umd.edu setroubleshoot[3489686]: SELinux is preventing /usr/bin/qemu-ga from search access on the directory /var/lib/containers/storage/overlay. For complete SELinux messages run: sealert -l ba415951-a2c6-424e-b17d-305c5300b9f3 [x2]
Aug 9 08:22:08 peach.cs.umd.edu setroubleshoot[3489686]: SELinux is preventing /usr/bin/qemu-ga from search access on the directory /var/lib/containers/storage/overlay. For complete SELinux messages run: sealert -l 6aeb0956-fcf2-462a-ae4d-439b912c16d0 [x2]
== sentry-docker00.cs.umd.edu (40 distinct, 40 total) ==
Aug 9 08:18:36 sentry-docker00.cs.umd.edu systemd-udevd[830655]: link_config: could not get ethtool features for veth6a10280
Aug 9 08:18:36 sentry-docker00.cs.umd.edu systemd-udevd[830655]: Could not set offload features of veth6a10280: No such device
Aug 9 08:18:36 sentry-docker00.cs.umd.edu systemd-udevd[830728]: Could not generate persistent MAC address for veth220efec: No such file or directory
Aug 9 08:18:36 sentry-docker00.cs.umd.edu systemd-udevd[830729]: Could not generate persistent MAC address for vethafb0ab5: No such file or directory
Aug 9 08:18:36 sentry-docker00.cs.umd.edu systemd-udevd[830732]: Could not generate persistent MAC address for veth1817091: No such file or directory
Aug 9 08:18:36 sentry-docker00.cs.umd.edu systemd-udevd[830733]: Could not generate persistent MAC address for vethec554d0: No such file or directory
Aug 9 08:18:36 sentry-docker00.cs.umd.edu systemd-udevd[830756]: Could not generate persistent MAC address for veth24fb71a: No such file or directory
Aug 9 08:18:36 sentry-docker00.cs.umd.edu systemd-udevd[830757]: Could not generate persistent MAC address for veth928f5db: No such file or directory
Aug 9 08:18:36 sentry-docker00.cs.umd.edu systemd-udevd[830775]: Could not generate persistent MAC address for vethc59f76b: No such file or directory
Aug 9 08:18:36 sentry-docker00.cs.umd.edu systemd-udevd[830767]: Could not generate persistent MAC address for vethe2fc52c: No such file or directory
Aug 9 08:18:36 sentry-docker00.cs.umd.edu systemd-udevd[830811]: Could not generate persistent MAC address for vethf9d2b98: No such file or directory
Aug 9 08:18:36 sentry-docker00.cs.umd.edu systemd-udevd[830823]: Could not generate persistent MAC address for veth53159b5: No such file or directory
Aug 9 08:38:44 sentry-docker00.cs.umd.edu systemd-udevd[840042]: link_config: could not set ethtool features for vethe2fc52c
Aug 9 08:38:44 sentry-docker00.cs.umd.edu systemd-udevd[840042]: Could not set offload features of vethe2fc52c: Operation not permitted
Aug 9 08:38:44 sentry-docker00.cs.umd.edu systemd-udevd[840127]: link_config: could not set ethtool features for veth1817091
Aug 9 08:38:44 sentry-docker00.cs.umd.edu systemd-udevd[840127]: Could not set offload features of veth1817091: Operation not permitted
Aug 9 08:38:44 sentry-docker00.cs.umd.edu systemd-udevd[840155]: Could not generate persistent MAC address for vethed4e5a9: No such file or directory
Aug 9 08:38:44 sentry-docker00.cs.umd.edu systemd-udevd[840156]: Could not generate persistent MAC address for veth63bbf94: No such file or directory
Aug 9 08:38:44 sentry-docker00.cs.umd.edu systemd-udevd[840164]: Could not generate persistent MAC address for veth97e52ac: No such file or directory
Aug 9 08:38:44 sentry-docker00.cs.umd.edu systemd-udevd[840174]: Could not generate persistent MAC address for veth9b3bcb4: No such file or directory
Aug 9 08:38:44 sentry-docker00.cs.umd.edu systemd-udevd[840183]: Could not generate persistent MAC address for veth38c1a6b: No such file or directory
Aug 9 08:38:44 sentry-docker00.cs.umd.edu systemd-udevd[840184]: Could not generate persistent MAC address for veth694a322: No such file or directory
Aug 9 08:38:44 sentry-docker00.cs.umd.edu systemd-udevd[840209]: Could not generate persistent MAC address for veth0247d19: No such file or directory
Aug 9 08:38:44 sentry-docker00.cs.umd.edu systemd-udevd[840211]: Could not generate persistent MAC address for vethaeefe3b: No such file or directory
Aug 9 08:38:44 sentry-docker00.cs.umd.edu systemd-udevd[840285]: Could not generate persistent MAC address for veth77b187d: No such file or directory
Aug 9 08:38:44 sentry-docker00.cs.umd.edu systemd-udevd[840266]: Could not generate persistent MAC address for veth36cc3e6: No such file or directory
Aug 9 08:58:52 sentry-docker00.cs.umd.edu systemd-udevd[851000]: link_config: could not get ethtool features for vethed4e5a9
Aug 9 08:58:52 sentry-docker00.cs.umd.edu systemd-udevd[851000]: Could not set offload features of vethed4e5a9: No such device
Aug 9 08:58:52 sentry-docker00.cs.umd.edu systemd-udevd[851095]: link_config: could not get ethtool features for veth9b3bcb4
Aug 9 08:58:52 sentry-docker00.cs.umd.edu systemd-udevd[851095]: Could not set offload features of veth9b3bcb4: No such device
... 10 more distinct messages not shown
== smokeping-slave (1 distinct, 1 total) ==
Aug 9 08:58:17 smokeping-slave nologin[1342652]: Attempted login by UNKNOWN (UID: 65534) on UNKNOWN
== strawberry (2 distinct, 8 total) ==
Aug 9 08:09:44 strawberry udisksd[1067]: Error performing housekeeping for drive /org/freedesktop/UDisks2/drives/ST2000DM001_1CH164_W1E8J5KJ: Error updating SMART data: Error sending ATA command CHECK POWER MODE: Unexpected sense data returned:#0120000: 00 00 00 00 00 00 00 00 00 00 00 00 00 00 00 00 ................#0120010: 00 00 00 00 00 00 00 00 00 00 00 00 00 00 00 00 ................#012 (g-io-error-quark, 0) [x6]
Aug 9 08:34:42 strawberry smartd[5314]: Device: /dev/sda [SAT], failed to read SMART Attribute Data [x2]
== submit26-b9-4 (9 distinct, 9 total) ==
Aug 9 08:15:31 submit26-b9-4 setroubleshoot[1427688]: SELinux is preventing /usr/bin/python3.9 from create access on the directory /(null). For complete SELinux messages run: sealert -l a4e66030-8621-4da9-bd27-5988bb1bf8ad
Aug 9 08:15:31 submit26-b9-4 setroubleshoot[1427688]: SELinux is preventing /usr/bin/python3.9 from add_name access on the directory /(null). For complete SELinux messages run: sealert -l c055e37d-bbf5-4800-9083-d606f792c8c1
Aug 9 08:15:31 submit26-b9-4 setroubleshoot[1427688]: SELinux is preventing /usr/bin/python3.9 from create access on the file /(null). For complete SELinux messages run: sealert -l e5bc3a56-6d6f-4776-954f-ddde1579648f
Aug 9 08:15:31 submit26-b9-4 setroubleshoot[1427688]: SELinux is preventing /usr/bin/python3.9 from open access on the file /tmp/libdnf.iir4fr/repodata/repomd.xml. For complete SELinux messages run: sealert -l a8ec5e1b-49f9-4fbc-a8ae-22e800f7abf2
Aug 9 08:15:31 submit26-b9-4 setroubleshoot[1427688]: SELinux is preventing /usr/bin/python3.9 from setattr access on the file repomd.xml. For complete SELinux messages run: sealert -l 945db714-d0c0-4402-911e-932978b8b036
Aug 9 08:15:31 submit26-b9-4 setroubleshoot[1427688]: SELinux is preventing /usr/bin/python3.9 from read access on the directory libdnf.iir4fr. For complete SELinux messages run: sealert -l 463998a0-fb0d-463c-82b1-471135710a14
Aug 9 08:15:31 submit26-b9-4 setroubleshoot[1427688]: SELinux is preventing /usr/bin/python3.9 from remove_name access on the directory repomd.xml. For complete SELinux messages run: sealert -l 473d2e21-15d8-407a-a9ee-2b842607fa00
Aug 9 08:15:31 submit26-b9-4 setroubleshoot[1427688]: SELinux is preventing /usr/bin/python3.9 from unlink access on the file repomd.xml. For complete SELinux messages run: sealert -l 80c54d4f-bf4b-4501-addb-1627383587d0
Aug 9 08:15:31 submit26-b9-4 setroubleshoot[1427688]: SELinux is preventing /usr/bin/python3.9 from rmdir access on the directory repodata. For complete SELinux messages run: sealert -l c63d3890-151e-49a0-83f0-3dfb69d051e5
== uffish.cs.umd.edu (1 distinct, 1 total) ==
Aug 9 08:05:25 uffish.cs.umd.edu sshd[2580224]: error: key_cert_check_authority: invalid certificate
== whiffle.cs.umd.edu (1 distinct, 1 total) ==
Aug 9 08:05:26 whiffle.cs.umd.edu sshd[2345855]: error: key_cert_check_authority: invalid certificate
1
0
Command: /usr/local/sbin/syslog-digest.py
Time : 0.9980s
Status : exited 0
Output :
Syslog digest — 2026-08-09 08:05 EDT
Processed 7,860 lines, filtered 5,049 (64%). 2,811 unknown (138 distinct) from 24 host(s).
== abuse (3 distinct, 2254 total) ==
Aug 9 07:05:02 abuse systemd[1]: Failed to load environment files: Input/output error [x688]
Aug 9 07:05:02 abuse systemd[1]: choria-server.service failed to run 'start' task: Input/output error [x688]
Aug 9 07:05:02 abuse rsyslogd[21745]: imjournal: open() failed for path: '/var/lib/rsyslog/imjournal.state.tmp': Input/output error [v8.2404.0 try https://www.rsyslog.com/e/2433 ] [x878]
== b0b02.cs.umd.edu (4 distinct, 4 total) ==
Aug 9 07:22:44 b0b02.cs.umd.edu setroubleshoot[406782]: SELinux is preventing /usr/bin/python3.9 from getattr access on the file /etc/authselect/nsswitch.conf. For complete SELinux messages run: sealert -l 9a1e2952-3fde-4937-a8ab-f7f59791a458
Aug 9 07:22:47 b0b02.cs.umd.edu setroubleshoot[406782]: SELinux is preventing /usr/bin/python3.9 from read access on the file /etc/authselect/nsswitch.conf. For complete SELinux messages run: sealert -l 97d74423-e027-4cd6-8810-ad80944900b5
Aug 9 07:22:50 b0b02.cs.umd.edu setroubleshoot[406782]: SELinux is preventing /usr/bin/python3.9 from open access on the file /etc/authselect/nsswitch.conf. For complete SELinux messages run: sealert -l 4f253f6a-62d6-46dd-8eaf-0b4d29df41c6
Aug 9 07:51:27 b0b02.cs.umd.edu rustdesk[414203]: cannot open display:
== cheezit.cs.umd.edu (1 distinct, 1 total) ==
Aug 9 07:51:54 cheezit.cs.umd.edu sshd[1813730]: error: beginning MaxStartups throttling
== contest (1 distinct, 33 total) ==
Aug 9 07:06:38 contest goferd[1007]: [ERROR][worker-0] gofer.messaging.adapter.connect:33 - connect: proton+amqps://satellite8.cs.umd.edu:5647, failed: Connection amqps://satellite8.cs.umd.edu:5647 disconnected: Condition('proton.pythonio', 'Connection refused to all addresses') [x33]
== csfw00a (1 distinct, 244 total) ==
Aug 9 07:06:17 csfw00a kernel: bnxt_en 0000:09:00.0 eth3: NIC Link is Down [x244]
== dojo (2 distinct, 2 total) ==
Aug 9 07:38:24 dojo nologin[1509926]: Attempted login by UNKNOWN (UID: 65534) on UNKNOWN
Aug 9 07:38:35 dojo puppet-agent[1509927]: The current total number of fact values: 17097 exceeds the fact values limit: 10240
== emaar (1 distinct, 1 total) ==
Aug 9 07:55:26 emaar systemd[1]: insights-client.service: Start request repeated too quickly.
== gle-omnibus00.cs.umd.edu (11 distinct, 15 total) ==
Aug 9 07:08:04 gle-omnibus00.cs.umd.edu falcon-sensor-bpf[974]: CrowdStrike(4): Could not retrieve DisableProxy value: c0000225 [x3]
Aug 9 07:08:04 gle-omnibus00.cs.umd.edu falcon-sensor-bpf[974]: CrowdStrike(4): ConnectWithProxy: Unable to get application proxy host from CsConfig: c0000225 [x3]
Aug 9 07:48:20 gle-omnibus00.cs.umd.edu puppet-agent[3281295]: Last metadata expiration check: 2:45:05 ago on Sun Aug 9 05:03:14 2026.
Aug 9 07:48:20 gle-omnibus00.cs.umd.edu puppet-agent[3281295]: No package gitlab-ee-19.0.1-ee.0.el9 available.
Aug 9 07:48:20 gle-omnibus00.cs.umd.edu puppet-agent[3281295]: Error: No packages marked for downgrade.
Aug 9 07:48:20 gle-omnibus00.cs.umd.edu puppet-agent[3281295]: (/Stage[main]/Gitlab::Install/Package[gitlab-omnibus]/ensure) Last metadata expiration check: 2:45:05 ago on Sun Aug 9 05:03:14 2026.
Aug 9 07:48:20 gle-omnibus00.cs.umd.edu puppet-agent[3281295]: (/Stage[main]/Gitlab::Install/Package[gitlab-omnibus]/ensure) No package gitlab-ee-19.0.1-ee.0.el9 available.
Aug 9 07:48:20 gle-omnibus00.cs.umd.edu puppet-agent[3281295]: (/Stage[main]/Gitlab::Install/Package[gitlab-omnibus]/ensure) Error: No packages marked for downgrade. (corrective)
Aug 9 07:48:20 gle-omnibus00.cs.umd.edu puppet-agent[3281295]: (/Stage[main]/Gitlab::Service/Exec[gitlab_reconfigure]) Skipping because of failed dependencies
Aug 9 07:48:20 gle-omnibus00.cs.umd.edu puppet-agent[3281295]: (/Stage[main]/Profile::Gitlab_enterprise::Server_omnibus/Exec[gitlab-sshd-setcap]) Skipping because of failed dependencies
Aug 9 07:48:20 gle-omnibus00.cs.umd.edu puppet-agent[3281295]: (/Stage[main]/Profile::Gitlab_enterprise::Server_omnibus/Exec[gitlab-sshd-restart]) Skipping because of failed dependencies
== hackerman (7 distinct, 12 total) ==
Aug 9 07:19:00 hackerman gnome-software[2060381]: failed to commit changes to dconf: GDBus.Error:org.gtk.GDBus.UnmappedGError.Quark._g_2dfile_2derror_2dquark.Code2: Failed to create file “/adminhomes/sajith/.config/dconf/user.XD1KT3”: Permission denied
Aug 9 07:20:04 hackerman gnome-software[2060381]: can't reliably fixup error code 4 in domain g-io-error-quark: Not a directory [x4]
Aug 9 07:20:12 hackerman gnome-software[2060381]: Only 0 apps for recent list, hiding
Aug 9 07:20:28 hackerman gnome-software[2060381]: failed to commit changes to dconf: GDBus.Error:org.gtk.GDBus.UnmappedGError.Quark._g_2dfile_2derror_2dquark.Code2: Failed to create file “/adminhomes/sajith/.config/dconf/user.LH3LT3”: Permission denied
Aug 9 07:20:29 hackerman packagekitd[1185164]: Failed to get cache filename for libreoffice [x2]
Aug 9 07:20:29 hackerman packagekitd[1185164]: Failed to get cache filename for kernel [x2]
Aug 9 07:20:39 hackerman packagekitd[1185164]: failed to parse public key for /etc/pki/rpm-gpg/RPM-GPG-KEY-PQC-redhat-release
== hazfs.cs.umd.edu (11 distinct, 66 total) ==
Aug 9 07:52:14 hazfs.cs.umd.edu snmpd[1431]: send response: Failure in sendto [x6]
Aug 9 07:52:14 hazfs.cs.umd.edu snmpd[1431]: -- NET-SNMP-EXTEND-MIB::nsExtendStatus."userweb" [x6]
Aug 9 07:52:14 hazfs.cs.umd.edu snmpd[1431]: -- NET-SNMP-EXTEND-MIB::nsExtendStatus."zfslist" [x6]
Aug 9 07:52:14 hazfs.cs.umd.edu snmpd[1431]: -- NET-SNMP-EXTEND-MIB::nsExtendStatus."userhome" [x6]
Aug 9 07:52:14 hazfs.cs.umd.edu snmpd[1431]: -- NET-SNMP-EXTEND-MIB::nsExtendOutput1Line."userweb" [x6]
Aug 9 07:52:14 hazfs.cs.umd.edu snmpd[1431]: -- NET-SNMP-EXTEND-MIB::nsExtendOutput1Line."zfslist" [x6]
Aug 9 07:52:14 hazfs.cs.umd.edu snmpd[1431]: -- NET-SNMP-EXTEND-MIB::nsExtendOutput1Line."userhome" [x6]
Aug 9 07:52:14 hazfs.cs.umd.edu snmpd[1431]: -- NET-SNMP-EXTEND-MIB::nsExtendOutputFull."userweb" [x6]
Aug 9 07:52:14 hazfs.cs.umd.edu snmpd[1431]: -- NET-SNMP-EXTEND-MIB::nsExtendOutputFull."zfslist" [x6]
Aug 9 07:52:14 hazfs.cs.umd.edu snmpd[1431]: -- NET-SNMP-EXTEND-MIB::nsExtendOutputFull."userhome" [x6]
Aug 9 07:52:14 hazfs.cs.umd.edu snmpd[1431]: -- NET-SNMP-EXTEND-MIB::nsExtendOutNumLines."userweb" [x6]
== idm00 (1 distinct, 1 total) ==
Aug 9 07:51:22 idm00 named[243294]: client @0x7f5f18c847b8 10.73.240.42#53420: update '73.10.in-addr.arpa/IN' denied
== idmp0 (1 distinct, 1 total) ==
Aug 9 07:36:01 idmp0 named[1540302]: client @0x7ff7c0000cc8 10.73.240.43#53263: update '73.10.in-addr.arpa/IN' denied
== irb2156 (1 distinct, 1 total) ==
Aug 9 07:29:07 irb2156 systemd-resolved[3398]: Using degraded feature set TCP instead of UDP for DNS server 128.8.76.3.
== itmon02 (1 distinct, 40 total) ==
Aug 9 07:12:48 itmon02 sshd[1750555]: error: beginning MaxStartups throttling [x40]
== newhonors2 (1 distinct, 24 total) ==
Aug 9 07:13:03 newhonors2 dhcpcd[952993]: dhcpcd is not running [x24]
== orchids (7 distinct, 9 total) ==
Aug 9 07:11:25 orchids gnome-software[1516991]: can't reliably fixup error code 4 in domain g-io-error-quark: Not a directory [x3]
Aug 9 07:11:32 orchids gnome-software[1516991]: Only 0 apps for recent list, hiding
Aug 9 07:11:36 orchids packagekitd[1847005]: Failed to get cache filename for libreoffice
Aug 9 07:11:36 orchids packagekitd[1847005]: Failed to get cache filename for cups-filesystem
Aug 9 07:11:36 orchids packagekitd[1847005]: Failed to get cache filename for kernel
Aug 9 07:11:36 orchids gnome-software[1516991]: failed to commit changes to dconf: GDBus.Error:org.gtk.GDBus.UnmappedGError.Quark._g_2dfile_2derror_2dquark.Code2: Failed to create file “/adminhomes/jworden/.config/dconf/user.XLFWT3”: Permission denied
Aug 9 07:11:37 orchids packagekitd[1847005]: failed to parse public key for /etc/pki/rpm-gpg/RPM-GPG-KEY-PQC-redhat-release
== outbound00.cs.umd.edu (1 distinct, 6 total) ==
Aug 9 07:09:09 outbound00.cs.umd.edu python3[269056]: ldapdb [x6]
== outbound01.cs.umd.edu (1 distinct, 6 total) ==
Aug 9 07:13:06 outbound01.cs.umd.edu python3[2501038]: ldapdb [x6]
== peach.cs.umd.edu (2 distinct, 4 total) ==
Aug 9 07:22:08 peach.cs.umd.edu setroubleshoot[3483528]: SELinux is preventing /usr/bin/qemu-ga from search access on the directory /var/lib/containers/storage/overlay. For complete SELinux messages run: sealert -l ba415951-a2c6-424e-b17d-305c5300b9f3 [x2]
Aug 9 07:22:08 peach.cs.umd.edu setroubleshoot[3483528]: SELinux is preventing /usr/bin/qemu-ga from search access on the directory /var/lib/containers/storage/overlay. For complete SELinux messages run: sealert -l 6aeb0956-fcf2-462a-ae4d-439b912c16d0 [x2]
== quiss (1 distinct, 1 total) ==
Aug 9 07:46:34 quiss gnome-software[879803]: failed to commit changes to dconf: GDBus.Error:org.gtk.GDBus.UnmappedGError.Quark._g_2dfile_2derror_2dquark.Code2: Failed to create file “/adminhomes/josephao/.config/dconf/user.Y6JHT3”: Permission denied
== sentry-docker00.cs.umd.edu (36 distinct, 36 total) ==
Aug 9 07:18:11 sentry-docker00.cs.umd.edu systemd-udevd[802331]: link_config: could not get ethtool features for vethedca3b2
Aug 9 07:18:11 sentry-docker00.cs.umd.edu systemd-udevd[802331]: Could not set offload features of vethedca3b2: No such device
Aug 9 07:18:11 sentry-docker00.cs.umd.edu systemd-udevd[802366]: Could not generate persistent MAC address for veth1ef3b85: No such file or directory
Aug 9 07:18:11 sentry-docker00.cs.umd.edu systemd-udevd[802367]: Could not generate persistent MAC address for veth632f2fd: No such file or directory
Aug 9 07:18:11 sentry-docker00.cs.umd.edu systemd-udevd[802383]: Could not generate persistent MAC address for vetha53f009: No such file or directory
Aug 9 07:18:11 sentry-docker00.cs.umd.edu systemd-udevd[802370]: Could not generate persistent MAC address for veth13cd43c: No such file or directory
Aug 9 07:18:11 sentry-docker00.cs.umd.edu systemd-udevd[802394]: Could not generate persistent MAC address for veth35b72d2: No such file or directory
Aug 9 07:18:11 sentry-docker00.cs.umd.edu systemd-udevd[802395]: Could not generate persistent MAC address for veth0f5a28d: No such file or directory
Aug 9 07:18:11 sentry-docker00.cs.umd.edu systemd-udevd[802414]: Could not generate persistent MAC address for vethc56f6ce: No such file or directory
Aug 9 07:18:11 sentry-docker00.cs.umd.edu systemd-udevd[802406]: Could not generate persistent MAC address for veth05d4ed0: No such file or directory
Aug 9 07:18:11 sentry-docker00.cs.umd.edu systemd-udevd[802416]: Could not generate persistent MAC address for veth971ea6a: No such file or directory
Aug 9 07:18:11 sentry-docker00.cs.umd.edu systemd-udevd[802407]: Could not generate persistent MAC address for veth71cf3e2: No such file or directory
Aug 9 07:38:19 sentry-docker00.cs.umd.edu systemd-udevd[811798]: link_config: could not get ethtool features for veth71cf3e2
Aug 9 07:38:19 sentry-docker00.cs.umd.edu systemd-udevd[811798]: Could not set offload features of veth71cf3e2: No such device
Aug 9 07:38:19 sentry-docker00.cs.umd.edu systemd-udevd[811840]: Could not generate persistent MAC address for veth5405c5a: No such file or directory
Aug 9 07:38:19 sentry-docker00.cs.umd.edu systemd-udevd[811841]: Could not generate persistent MAC address for veth817ac36: No such file or directory
Aug 9 07:38:19 sentry-docker00.cs.umd.edu systemd-udevd[811844]: Could not generate persistent MAC address for veth52d6934: No such file or directory
Aug 9 07:38:19 sentry-docker00.cs.umd.edu systemd-udevd[811845]: Could not generate persistent MAC address for veth210977d: No such file or directory
Aug 9 07:38:19 sentry-docker00.cs.umd.edu systemd-udevd[811868]: Could not generate persistent MAC address for veth336e748: No such file or directory
Aug 9 07:38:19 sentry-docker00.cs.umd.edu systemd-udevd[811869]: Could not generate persistent MAC address for veth5dcc4b1: No such file or directory
Aug 9 07:38:19 sentry-docker00.cs.umd.edu systemd-udevd[811887]: Could not generate persistent MAC address for veth8617a7f: No such file or directory
Aug 9 07:38:19 sentry-docker00.cs.umd.edu systemd-udevd[811879]: Could not generate persistent MAC address for veth03a953a: No such file or directory
Aug 9 07:38:19 sentry-docker00.cs.umd.edu systemd-udevd[811897]: Could not generate persistent MAC address for veth9bca647: No such file or directory
Aug 9 07:38:19 sentry-docker00.cs.umd.edu systemd-udevd[811898]: Could not generate persistent MAC address for vethbde8048: No such file or directory
Aug 9 07:58:27 sentry-docker00.cs.umd.edu systemd-udevd[821178]: link_config: could not get ethtool features for veth336e748
Aug 9 07:58:27 sentry-docker00.cs.umd.edu systemd-udevd[821178]: Could not set offload features of veth336e748: No such device
Aug 9 07:58:27 sentry-docker00.cs.umd.edu systemd-udevd[821294]: Could not generate persistent MAC address for veth6a10280: No such file or directory
Aug 9 07:58:27 sentry-docker00.cs.umd.edu systemd-udevd[821295]: Could not generate persistent MAC address for vethc1370b0: No such file or directory
Aug 9 07:58:27 sentry-docker00.cs.umd.edu systemd-udevd[821322]: Could not generate persistent MAC address for vethca2e8ec: No such file or directory
Aug 9 07:58:27 sentry-docker00.cs.umd.edu systemd-udevd[821323]: Could not generate persistent MAC address for vethc16eb8e: No such file or directory
... 6 more distinct messages not shown
== strawberry (2 distinct, 8 total) ==
Aug 9 07:09:44 strawberry udisksd[1067]: Error performing housekeeping for drive /org/freedesktop/UDisks2/drives/ST2000DM001_1CH164_W1E8J5KJ: Error updating SMART data: Error sending ATA command CHECK POWER MODE: Unexpected sense data returned:#0120000: 00 00 00 00 00 00 00 00 00 00 00 00 00 00 00 00 ................#0120010: 00 00 00 00 00 00 00 00 00 00 00 00 00 00 00 00 ................#012 (g-io-error-quark, 0) [x6]
Aug 9 07:34:42 strawberry smartd[5314]: Device: /dev/sda [SAT], failed to read SMART Attribute Data [x2]
== submit10-cln25 (1 distinct, 1 total) ==
Aug 9 07:37:00 submit10-cln25 systemd: Failed at step EXEC spawning /usr/local/bin/cronjob: No such file or directory
== uffish.cs.umd.edu (40 distinct, 41 total) ==
Aug 9 07:36:24 uffish.cs.umd.edu puppet-agent[2572073]: (/Stage[main]/Csweb::Sites::Dbadmin_cs_umd_edu/Vcsrepo[/var/www/sites/dbadmin.cs.umd.edu/pma/]) Could not evaluate: Execution of 'git fetch origin' returned 128: ssh_exchange_identification: Connection closed by remote host
Aug 9 07:36:24 uffish.cs.umd.edu puppet-agent[2572073]: (/Stage[main]/Csweb::Sites::Dbadmin_cs_umd_edu/Vcsrepo[/var/www/sites/dbadmin.cs.umd.edu/pma/]) fatal: Could not read from remote repository.
Aug 9 07:36:24 uffish.cs.umd.edu puppet-agent[2572073]: (/Stage[main]/Csweb::Sites::Dbadmin_cs_umd_edu/Vcsrepo[/var/www/sites/dbadmin.cs.umd.edu/pma/])
Aug 9 07:36:24 uffish.cs.umd.edu puppet-agent[2572073]: (/Stage[main]/Csweb::Sites::Dbadmin_cs_umd_edu/Vcsrepo[/var/www/sites/dbadmin.cs.umd.edu/pma/]) Please make sure you have the correct access rights
Aug 9 07:36:24 uffish.cs.umd.edu puppet-agent[2572073]: (/Stage[main]/Csweb::Sites::Dbadmin_cs_umd_edu/Vcsrepo[/var/www/sites/dbadmin.cs.umd.edu/pma/]) and the repository exists.
Aug 9 07:36:24 uffish.cs.umd.edu puppet-agent[2572073]: (/Stage[main]/Csweb::Sites::Dbadmin_cs_umd_edu/File[/var/www/sites/dbadmin.cs.umd.edu/pma/config.inc.php]) Skipping because of failed dependencies
Aug 9 07:36:24 uffish.cs.umd.edu puppet-agent[2572073]: (/Stage[main]/Csweb::Sites::Dbadmin_cs_umd_edu/File[/var/www/sites/dbadmin.cs.umd.edu/pma/tmp/]) Skipping because of failed dependencies
Aug 9 07:36:24 uffish.cs.umd.edu puppet-agent[2572073]: (/Stage[main]/Csweb::Sites::Dbadmin_cs_umd_edu/Vcsrepo[/var/www/sites/dbadmin.cs.umd.edu/pma_autologin/]) Could not evaluate: Execution of 'git fetch origin' returned 128: ssh_exchange_identification: Connection closed by remote host
Aug 9 07:36:24 uffish.cs.umd.edu puppet-agent[2572073]: (/Stage[main]/Csweb::Sites::Dbadmin_cs_umd_edu/Vcsrepo[/var/www/sites/dbadmin.cs.umd.edu/pma_autologin/]) fatal: Could not read from remote repository.
Aug 9 07:36:24 uffish.cs.umd.edu puppet-agent[2572073]: (/Stage[main]/Csweb::Sites::Dbadmin_cs_umd_edu/Vcsrepo[/var/www/sites/dbadmin.cs.umd.edu/pma_autologin/])
Aug 9 07:36:24 uffish.cs.umd.edu puppet-agent[2572073]: (/Stage[main]/Csweb::Sites::Dbadmin_cs_umd_edu/Vcsrepo[/var/www/sites/dbadmin.cs.umd.edu/pma_autologin/]) Please make sure you have the correct access rights
Aug 9 07:36:24 uffish.cs.umd.edu puppet-agent[2572073]: (/Stage[main]/Csweb::Sites::Dbadmin_cs_umd_edu/Vcsrepo[/var/www/sites/dbadmin.cs.umd.edu/pma_autologin/]) and the repository exists.
Aug 9 07:36:24 uffish.cs.umd.edu puppet-agent[2572073]: (/Stage[main]/Csweb::Sites::Dbadmin_cs_umd_edu/File[/var/www/sites/dbadmin.cs.umd.edu/pma_autologin/config.inc.php]) Skipping because of failed dependencies
Aug 9 07:36:24 uffish.cs.umd.edu puppet-agent[2572073]: (/Stage[main]/Csweb::Sites::Dbadmin_cs_umd_edu/File[/var/www/sites/dbadmin.cs.umd.edu/pma_autologin/tmp/]) Skipping because of failed dependencies
Aug 9 07:36:27 uffish.cs.umd.edu puppet-agent[2572073]: (/Stage[main]/Csweb::Sites::Hotcrp_cs_umd_edu/Vcsrepo[/var/www/sites/hotcrp.cs.umd.edu/config-override/]) Could not evaluate: Execution of 'git fetch origin' returned 128: ssh_exchange_identification: Connection closed by remote host
Aug 9 07:36:27 uffish.cs.umd.edu puppet-agent[2572073]: (/Stage[main]/Csweb::Sites::Hotcrp_cs_umd_edu/Vcsrepo[/var/www/sites/hotcrp.cs.umd.edu/config-override/]) fatal: Could not read from remote repository.
Aug 9 07:36:27 uffish.cs.umd.edu puppet-agent[2572073]: (/Stage[main]/Csweb::Sites::Hotcrp_cs_umd_edu/Vcsrepo[/var/www/sites/hotcrp.cs.umd.edu/config-override/])
Aug 9 07:36:27 uffish.cs.umd.edu puppet-agent[2572073]: (/Stage[main]/Csweb::Sites::Hotcrp_cs_umd_edu/Vcsrepo[/var/www/sites/hotcrp.cs.umd.edu/config-override/]) Please make sure you have the correct access rights
Aug 9 07:36:27 uffish.cs.umd.edu puppet-agent[2572073]: (/Stage[main]/Csweb::Sites::Hotcrp_cs_umd_edu/Vcsrepo[/var/www/sites/hotcrp.cs.umd.edu/config-override/]) and the repository exists.
Aug 9 07:36:27 uffish.cs.umd.edu puppet-agent[2572073]: (/Stage[main]/Csweb::Sites::Safari_cs_umd_edu/Vcsrepo[/var/www/sites/safari.cs.umd.edu]) Could not evaluate: Execution of 'git fetch origin' returned 128: ssh_exchange_identification: Connection closed by remote host
Aug 9 07:36:27 uffish.cs.umd.edu puppet-agent[2572073]: (/Stage[main]/Csweb::Sites::Safari_cs_umd_edu/Vcsrepo[/var/www/sites/safari.cs.umd.edu]) fatal: Could not read from remote repository.
Aug 9 07:36:27 uffish.cs.umd.edu puppet-agent[2572073]: (/Stage[main]/Csweb::Sites::Safari_cs_umd_edu/Vcsrepo[/var/www/sites/safari.cs.umd.edu])
Aug 9 07:36:27 uffish.cs.umd.edu puppet-agent[2572073]: (/Stage[main]/Csweb::Sites::Safari_cs_umd_edu/Vcsrepo[/var/www/sites/safari.cs.umd.edu]) Please make sure you have the correct access rights
Aug 9 07:36:27 uffish.cs.umd.edu puppet-agent[2572073]: (/Stage[main]/Csweb::Sites::Safari_cs_umd_edu/Vcsrepo[/var/www/sites/safari.cs.umd.edu]) and the repository exists.
Aug 9 07:36:27 uffish.cs.umd.edu puppet-agent[2572073]: (/Stage[main]/Csweb::Sites::Safari_cs_umd_edu/File[/var/www/sites/safari.cs.umd.edu/.env]) Skipping because of failed dependencies
Aug 9 07:36:27 uffish.cs.umd.edu puppet-agent[2572073]: (/Stage[main]/Csweb::Sites::Safari_cs_umd_edu/File[/var/www/sites/safari.cs.umd.edu/bootstrap/cache]) Skipping because of failed dependencies
Aug 9 07:36:27 uffish.cs.umd.edu puppet-agent[2572073]: (/Stage[main]/Csweb::Sites::Safari_cs_umd_edu/File[/var/www/sites/safari.cs.umd.edu/storage]) Skipping because of failed dependencies
Aug 9 07:36:27 uffish.cs.umd.edu puppet-agent[2572073]: (/Stage[main]/Csweb::Sites::Safari_cs_umd_edu/File[/var/www/sites/safari.cs.umd.edu/public/uploads]) Skipping because of failed dependencies
Aug 9 07:36:28 uffish.cs.umd.edu puppet-agent[2572073]: (/Stage[main]/Csweb::Sites::Secure_cs_umd_edu/Vcsrepo[/var/www/sites/secure.cs.umd.edu/calf]) Could not evaluate: Execution of 'git fetch origin' returned 128: ssh_exchange_identification: Connection closed by remote host
Aug 9 07:36:28 uffish.cs.umd.edu puppet-agent[2572073]: (/Stage[main]/Csweb::Sites::Secure_cs_umd_edu/Vcsrepo[/var/www/sites/secure.cs.umd.edu/calf]) fatal: Could not read from remote repository.
... 10 more distinct messages not shown
1
0
Command: /usr/local/sbin/syslog-digest.py
Time : 0.9674s
Status : exited 0
Output :
Syslog digest — 2026-08-09 07:05 EDT
Processed 7,552 lines, filtered 4,787 (63%). 2,765 unknown (126 distinct) from 22 host(s).
== abadi-computer (2 distinct, 2 total) ==
Aug 9 06:15:00 abadi-computer nologin[2507654]: Attempted login by UNKNOWN (UID: 65534) on UNKNOWN
Aug 9 06:15:00 abadi-computer pipewire[2507653]: mod.jackdbus-detect: Failed to receive jackdbus reply: org.freedesktop.DBus.Error.ServiceUnknown: The name org.jackaudio.service was not provided by any .service files
== abuse (3 distinct, 2247 total) ==
Aug 9 06:05:05 abuse systemd[1]: Failed to load environment files: Input/output error [x687]
Aug 9 06:05:05 abuse rsyslogd[21745]: imjournal: open() failed for path: '/var/lib/rsyslog/imjournal.state.tmp': Input/output error [v8.2404.0 try https://www.rsyslog.com/e/2433 ] [x873]
Aug 9 06:05:05 abuse systemd[1]: choria-server.service failed to run 'start' task: Input/output error [x687]
== b0b02.cs.umd.edu (4 distinct, 4 total) ==
Aug 9 06:22:40 b0b02.cs.umd.edu setroubleshoot[390705]: SELinux is preventing /usr/bin/python3.9 from getattr access on the file /etc/authselect/nsswitch.conf. For complete SELinux messages run: sealert -l 9a1e2952-3fde-4937-a8ab-f7f59791a458
Aug 9 06:22:42 b0b02.cs.umd.edu setroubleshoot[390705]: SELinux is preventing /usr/bin/python3.9 from read access on the file /etc/authselect/nsswitch.conf. For complete SELinux messages run: sealert -l 97d74423-e027-4cd6-8810-ad80944900b5
Aug 9 06:22:45 b0b02.cs.umd.edu setroubleshoot[390705]: SELinux is preventing /usr/bin/python3.9 from open access on the file /etc/authselect/nsswitch.conf. For complete SELinux messages run: sealert -l 4f253f6a-62d6-46dd-8eaf-0b4d29df41c6
Aug 9 06:51:22 b0b02.cs.umd.edu rustdesk[398169]: cannot open display:
== contest (1 distinct, 34 total) ==
Aug 9 06:05:56 contest goferd[1007]: [ERROR][worker-0] gofer.messaging.adapter.connect:33 - connect: proton+amqps://satellite8.cs.umd.edu:5647, failed: Connection amqps://satellite8.cs.umd.edu:5647 disconnected: Condition('proton.pythonio', 'Connection refused to all addresses') [x34]
== csfw00a (1 distinct, 260 total) ==
Aug 9 06:04:29 csfw00a kernel: bnxt_en 0000:09:00.0 eth3: NIC Link is Down [x260]
== hackerman (6 distinct, 11 total) ==
Aug 9 06:20:04 hackerman gnome-software[2060381]: can't reliably fixup error code 4 in domain g-io-error-quark: Not a directory [x4]
Aug 9 06:20:12 hackerman gnome-software[2060381]: Only 0 apps for recent list, hiding
Aug 9 06:20:32 hackerman packagekitd[1170855]: Failed to get cache filename for libreoffice [x2]
Aug 9 06:20:32 hackerman packagekitd[1170855]: Failed to get cache filename for kernel [x2]
Aug 9 06:20:38 hackerman gnome-software[2060381]: failed to commit changes to dconf: GDBus.Error:org.gtk.GDBus.UnmappedGError.Quark._g_2dfile_2derror_2dquark.Code2: Failed to create file “/adminhomes/sajith/.config/dconf/user.G02UT3”: Permission denied
Aug 9 06:20:40 hackerman packagekitd[1170855]: failed to parse public key for /etc/pki/rpm-gpg/RPM-GPG-KEY-PQC-redhat-release
== idm00 (1 distinct, 1 total) ==
Aug 9 06:51:22 idm00 named[243294]: client @0x7f5f10018de8 10.73.240.42#59128: update '73.10.in-addr.arpa/IN' denied
== idmp0 (1 distinct, 1 total) ==
Aug 9 06:36:01 idmp0 named[1540302]: client @0x7ff7e4001b68 10.73.240.43#62052: update '73.10.in-addr.arpa/IN' denied
== inbound00.cs.umd.edu (1 distinct, 1 total) ==
Aug 9 06:07:05 inbound00.cs.umd.edu systemd[1]: Configuration file /usr/lib/systemd/system/authentication_milter.service is marked executable. Please remove executable permission bits. Proceeding anyway.
== inbound01.cs.umd.edu (1 distinct, 1 total) ==
Aug 9 06:17:56 inbound01.cs.umd.edu systemd[1]: Configuration file /usr/lib/systemd/system/authentication_milter.service is marked executable. Please remove executable permission bits. Proceeding anyway.
== irb2156 (2 distinct, 4 total) ==
Aug 9 06:55:10 irb2156 gcr-prompter[1620268]: cannot open display: [x2]
Aug 9 06:55:10 irb2156 gnome-keyring-d[16342]: couldn't create system prompt: GDBus.Error:org.freedesktop.DBus.Error.NameHasNoOwner: Could not activate remote peer 'org.gnome.keyring.SystemPrompter': unit failed [x2]
== itmon02 (1 distinct, 44 total) ==
Aug 9 06:07:50 itmon02 sshd[1750555]: error: beginning MaxStartups throttling [x44]
== neodontcare.cs.umd.edu (7 distinct, 10 total) ==
Aug 9 06:13:30 neodontcare.cs.umd.edu gnome-software[7556]: Only 0 apps for recent list, hiding
Aug 9 06:13:34 neodontcare.cs.umd.edu packagekitd[3812149]: Failed to get cache filename for gnu-free-mono-fonts
Aug 9 06:13:34 neodontcare.cs.umd.edu packagekitd[3812149]: Failed to get cache filename for gnu-free-serif-fonts
Aug 9 06:13:35 neodontcare.cs.umd.edu packagekitd[3812149]: Failed to get cache filename for libreoffice [x2]
Aug 9 06:13:35 neodontcare.cs.umd.edu packagekitd[3812149]: Failed to get cache filename for cups-filesystem [x2]
Aug 9 06:13:35 neodontcare.cs.umd.edu packagekitd[3812149]: Failed to get cache filename for kernel [x2]
Aug 9 06:13:38 neodontcare.cs.umd.edu packagekitd[3812149]: failed to parse public key for /etc/pki/rpm-gpg/RPM-GPG-KEY-PQC-redhat-release
== newhonors2 (38 distinct, 65 total) ==
Aug 9 06:13:03 newhonors2 dhcpcd[950658]: dhcpcd is not running [x28]
Aug 9 06:48:07 newhonors2 puppet-agent[951913]: Could not update: Execution of '/usr/bin/apt-get -q -y -o DPkg::Options::=--force-confold --force-yes install openvox-agent=8.27.0-1+ubuntu24.04' returned 100: Reading package lists...
Aug 9 06:48:07 newhonors2 puppet-agent[951913]: Building dependency tree...
Aug 9 06:48:07 newhonors2 puppet-agent[951913]: Reading state information...
Aug 9 06:48:07 newhonors2 puppet-agent[951913]: Package openvox-agent is not available, but is referred to by another package.
Aug 9 06:48:07 newhonors2 puppet-agent[951913]: This may mean that the package is missing, has been obsoleted, or
Aug 9 06:48:07 newhonors2 puppet-agent[951913]: is only available from another source
Aug 9 06:48:07 newhonors2 puppet-agent[951913]:
Aug 9 06:48:07 newhonors2 puppet-agent[951913]: W: --force-yes is deprecated, use one of the options starting with --allow instead.
Aug 9 06:48:07 newhonors2 puppet-agent[951913]: E: Version '8.27.0-1+ubuntu24.04' for 'openvox-agent' was not found
Aug 9 06:48:07 newhonors2 puppet-agent[951913]: (/Stage[main]/Puppet::Agent::Install/Package[openvox-agent]/ensure) change from '7.37.2-1+ubuntu24.04' to '8.27.0-1+ubuntu24.04' failed: Could not update: Execution of '/usr/bin/apt-get -q -y -o DPkg::Options::=--force-confold --force-yes install openvox-agent=8.27.0-1+ubuntu24.04' returned 100: Reading package lists...
Aug 9 06:48:07 newhonors2 puppet-agent[951913]: (/Stage[main]/Puppet::Agent::Install/Package[openvox-agent]/ensure) Building dependency tree...
Aug 9 06:48:07 newhonors2 puppet-agent[951913]: (/Stage[main]/Puppet::Agent::Install/Package[openvox-agent]/ensure) Reading state information...
Aug 9 06:48:07 newhonors2 puppet-agent[951913]: (/Stage[main]/Puppet::Agent::Install/Package[openvox-agent]/ensure) Package openvox-agent is not available, but is referred to by another package.
Aug 9 06:48:07 newhonors2 puppet-agent[951913]: (/Stage[main]/Puppet::Agent::Install/Package[openvox-agent]/ensure) This may mean that the package is missing, has been obsoleted, or
Aug 9 06:48:07 newhonors2 puppet-agent[951913]: (/Stage[main]/Puppet::Agent::Install/Package[openvox-agent]/ensure) is only available from another source
Aug 9 06:48:07 newhonors2 puppet-agent[951913]: (/Stage[main]/Puppet::Agent::Install/Package[openvox-agent]/ensure)
Aug 9 06:48:07 newhonors2 puppet-agent[951913]: (/Stage[main]/Puppet::Agent::Install/Package[openvox-agent]/ensure) W: --force-yes is deprecated, use one of the options starting with --allow instead.
Aug 9 06:48:07 newhonors2 puppet-agent[951913]: (/Stage[main]/Puppet::Agent::Install/Package[openvox-agent]/ensure) E: Version '8.27.0-1+ubuntu24.04' for 'openvox-agent' was not found
Aug 9 06:48:32 newhonors2 puppet-agent[951913]: (/Stage[main]/Puppet::Agent::Config/Puppet::Config::Agent[classfile]/Puppet::Config::Entry[agent_classfile]/Concat::Fragment[puppet.conf_agent]/Concat_fragment[puppet.conf_agent]) Skipping because of failed dependencies
Aug 9 06:48:32 newhonors2 puppet-agent[951913]: (/Stage[main]/Puppet::Agent::Config/Puppet::Config::Agent[classfile]/Puppet::Config::Entry[agent_classfile]/Concat::Fragment[puppet.conf_agent_end]/Concat_fragment[puppet.conf_agent_end]) Skipping because of failed dependencies
Aug 9 06:48:32 newhonors2 puppet-agent[951913]: (/Stage[main]/Puppet::Agent::Config/Puppet::Config::Agent[classfile]/Puppet::Config::Entry[agent_classfile]/Concat::Fragment[puppet.conf_agent_classfile]/Concat_fragment[puppet.conf_agent_classfile]) Skipping because of failed dependencies
Aug 9 06:48:32 newhonors2 puppet-agent[951913]: (/Stage[main]/Puppet::Agent::Config/Puppet::Config::Agent[default_schedules]/Puppet::Config::Entry[agent_default_schedules]/Concat::Fragment[puppet.conf_agent_default_schedules]/Concat_fragment[puppet.conf_agent_default_schedules]) Skipping because of failed dependencies
Aug 9 06:48:32 newhonors2 puppet-agent[951913]: (/Stage[main]/Puppet::Agent::Config/Puppet::Config::Agent[report]/Puppet::Config::Entry[agent_report]/Concat::Fragment[puppet.conf_agent_report]/Concat_fragment[puppet.conf_agent_report]) Skipping because of failed dependencies
Aug 9 06:48:32 newhonors2 puppet-agent[951913]: (/Stage[main]/Puppet::Agent::Config/Puppet::Config::Agent[masterport]/Puppet::Config::Entry[agent_masterport]/Concat::Fragment[puppet.conf_agent_masterport]/Concat_fragment[puppet.conf_agent_masterport]) Skipping because of failed dependencies
Aug 9 06:48:32 newhonors2 puppet-agent[951913]: (/Stage[main]/Puppet::Agent::Config/Puppet::Config::Agent[splay]/Puppet::Config::Entry[agent_splay]/Concat::Fragment[puppet.conf_agent_splay]/Concat_fragment[puppet.conf_agent_splay]) Skipping because of failed dependencies
Aug 9 06:48:32 newhonors2 puppet-agent[951913]: (/Stage[main]/Puppet::Agent::Config/Puppet::Config::Agent[splaylimit]/Puppet::Config::Entry[agent_splaylimit]/Concat::Fragment[puppet.conf_agent_splaylimit]/Concat_fragment[puppet.conf_agent_splaylimit]) Skipping because of failed dependencies
Aug 9 06:48:32 newhonors2 puppet-agent[951913]: (/Stage[main]/Puppet::Agent::Config/Puppet::Config::Agent[runinterval]/Puppet::Config::Entry[agent_runinterval]/Concat::Fragment[puppet.conf_agent_runinterval]/Concat_fragment[puppet.conf_agent_runinterval]) Skipping because of failed dependencies
Aug 9 06:48:32 newhonors2 puppet-agent[951913]: (/Stage[main]/Puppet::Agent::Config/Puppet::Config::Agent[noop]/Puppet::Config::Entry[agent_noop]/Concat::Fragment[puppet.conf_agent_noop]/Concat_fragment[puppet.conf_agent_noop]) Skipping because of failed dependencies
Aug 9 06:48:32 newhonors2 puppet-agent[951913]: (/Stage[main]/Puppet::Agent::Config/Puppet::Config::Agent[usecacheonfailure]/Puppet::Config::Entry[agent_usecacheonfailure]/Concat::Fragment[puppet.conf_agent_usecacheonfailure]/Concat_fragment[puppet.conf_agent_usecacheonfailure]) Skipping because of failed dependencies
... 8 more distinct messages not shown
== orchids (8 distinct, 10 total) ==
Aug 9 06:10:04 orchids gnome-software[1516991]: failed to commit changes to dconf: GDBus.Error:org.gtk.GDBus.UnmappedGError.Quark._g_2dfile_2derror_2dquark.Code2: Failed to create file “/adminhomes/jworden/.config/dconf/user.PGUNT3”: Permission denied
Aug 9 06:11:25 orchids gnome-software[1516991]: can't reliably fixup error code 4 in domain g-io-error-quark: Not a directory [x3]
Aug 9 06:11:31 orchids gnome-software[1516991]: Only 0 apps for recent list, hiding
Aug 9 06:11:39 orchids packagekitd[1715347]: Failed to get cache filename for libreoffice
Aug 9 06:11:39 orchids packagekitd[1715347]: Failed to get cache filename for cups-filesystem
Aug 9 06:11:39 orchids packagekitd[1715347]: Failed to get cache filename for kernel
Aug 9 06:11:40 orchids gnome-software[1516991]: failed to commit changes to dconf: GDBus.Error:org.gtk.GDBus.UnmappedGError.Quark._g_2dfile_2derror_2dquark.Code2: Failed to create file “/adminhomes/jworden/.config/dconf/user.C2BXT3”: Permission denied
Aug 9 06:11:41 orchids packagekitd[1715347]: failed to parse public key for /etc/pki/rpm-gpg/RPM-GPG-KEY-PQC-redhat-release
== outbound00.cs.umd.edu (1 distinct, 6 total) ==
Aug 9 06:09:09 outbound00.cs.umd.edu python3[255050]: ldapdb [x6]
== outbound01.cs.umd.edu (1 distinct, 6 total) ==
Aug 9 06:13:06 outbound01.cs.umd.edu python3[2487174]: ldapdb [x6]
== quiss (7 distinct, 12 total) ==
Aug 9 06:47:43 quiss gnome-software[879803]: can't reliably fixup error code 4 in domain g-io-error-quark: Not a directory [x4]
Aug 9 06:47:49 quiss gnome-software[879803]: failed to commit changes to dconf: GDBus.Error:org.gtk.GDBus.UnmappedGError.Quark._g_2dfile_2derror_2dquark.Code2: Failed to create file “/adminhomes/josephao/.config/dconf/user.URBJT3”: Permission denied
Aug 9 06:48:56 quiss gnome-software[879803]: Only 3 apps for recent list, hiding
Aug 9 06:49:09 quiss gnome-software[879803]: failed to get featured apps: no apps to show
Aug 9 06:49:09 quiss packagekitd[2906469]: Failed to get cache filename for cups-filesystem [x2]
Aug 9 06:49:09 quiss packagekitd[2906469]: Failed to get cache filename for kernel [x2]
Aug 9 06:52:19 quiss gnome-software[879803]: Only 0 apps for curated list, hiding
== sentry-docker00.cs.umd.edu (34 distinct, 34 total) ==
Aug 9 06:17:46 sentry-docker00.cs.umd.edu systemd-udevd[773153]: Could not generate persistent MAC address for vetha0a5098: No such file or directory
Aug 9 06:17:46 sentry-docker00.cs.umd.edu systemd-udevd[773152]: Could not generate persistent MAC address for veth847ccd6: No such file or directory
Aug 9 06:17:46 sentry-docker00.cs.umd.edu systemd-udevd[773156]: Could not generate persistent MAC address for veth9e10c72: No such file or directory
Aug 9 06:17:46 sentry-docker00.cs.umd.edu systemd-udevd[773157]: Could not generate persistent MAC address for vethd30d2d3: No such file or directory
Aug 9 06:17:46 sentry-docker00.cs.umd.edu systemd-udevd[773180]: Could not generate persistent MAC address for veth3adf829: No such file or directory
Aug 9 06:17:46 sentry-docker00.cs.umd.edu systemd-udevd[773181]: Could not generate persistent MAC address for veth1a16ddb: No such file or directory
Aug 9 06:17:46 sentry-docker00.cs.umd.edu systemd-udevd[773199]: Could not generate persistent MAC address for veth359d0a9: No such file or directory
Aug 9 06:17:46 sentry-docker00.cs.umd.edu systemd-udevd[773204]: Could not generate persistent MAC address for vethe597039: No such file or directory
Aug 9 06:17:46 sentry-docker00.cs.umd.edu systemd-udevd[773180]: Could not generate persistent MAC address for vethc8a6952: No such file or directory
Aug 9 06:17:46 sentry-docker00.cs.umd.edu systemd-udevd[773196]: Could not generate persistent MAC address for veth9a42cbc: No such file or directory
Aug 9 06:37:54 sentry-docker00.cs.umd.edu systemd-udevd[782548]: link_config: could not get ethtool features for veth847ccd6
Aug 9 06:37:54 sentry-docker00.cs.umd.edu systemd-udevd[782548]: Could not set offload features of veth847ccd6: No such device
Aug 9 06:37:54 sentry-docker00.cs.umd.edu systemd-udevd[782585]: Could not generate persistent MAC address for veth6f4c1fb: No such file or directory
Aug 9 06:37:54 sentry-docker00.cs.umd.edu systemd-udevd[782586]: Could not generate persistent MAC address for veth4ba44c8: No such file or directory
Aug 9 06:37:54 sentry-docker00.cs.umd.edu systemd-udevd[782604]: Could not generate persistent MAC address for veth6a14a69: No such file or directory
Aug 9 06:37:54 sentry-docker00.cs.umd.edu systemd-udevd[782591]: Could not generate persistent MAC address for veth4383248: No such file or directory
Aug 9 06:37:54 sentry-docker00.cs.umd.edu systemd-udevd[782596]: Could not generate persistent MAC address for veth997bd31: No such file or directory
Aug 9 06:37:54 sentry-docker00.cs.umd.edu systemd-udevd[782597]: Could not generate persistent MAC address for veth508518a: No such file or directory
Aug 9 06:37:54 sentry-docker00.cs.umd.edu systemd-udevd[782596]: Could not generate persistent MAC address for vethfbc4c79: No such file or directory
Aug 9 06:37:54 sentry-docker00.cs.umd.edu systemd-udevd[782600]: Could not generate persistent MAC address for vetha892af4: No such file or directory
Aug 9 06:37:54 sentry-docker00.cs.umd.edu systemd-udevd[782683]: Could not generate persistent MAC address for veth90ffaaf: No such file or directory
Aug 9 06:37:54 sentry-docker00.cs.umd.edu systemd-udevd[782684]: Could not generate persistent MAC address for vethdf42c0e: No such file or directory
Aug 9 06:58:02 sentry-docker00.cs.umd.edu systemd-udevd[791962]: link_config: could not get ethtool features for veth6a14a69
Aug 9 06:58:02 sentry-docker00.cs.umd.edu systemd-udevd[791962]: Could not set offload features of veth6a14a69: No such device
Aug 9 06:58:03 sentry-docker00.cs.umd.edu systemd-udevd[791997]: Could not generate persistent MAC address for veth517878d: No such file or directory
Aug 9 06:58:03 sentry-docker00.cs.umd.edu systemd-udevd[791998]: Could not generate persistent MAC address for veth4c73c06: No such file or directory
Aug 9 06:58:03 sentry-docker00.cs.umd.edu systemd-udevd[792012]: Could not generate persistent MAC address for vethdad5b07: No such file or directory
Aug 9 06:58:03 sentry-docker00.cs.umd.edu systemd-udevd[792016]: Could not generate persistent MAC address for veth45f3929: No such file or directory
Aug 9 06:58:03 sentry-docker00.cs.umd.edu systemd-udevd[792023]: Could not generate persistent MAC address for veth9446728: No such file or directory
Aug 9 06:58:03 sentry-docker00.cs.umd.edu systemd-udevd[791997]: Could not generate persistent MAC address for veth2ad152c: No such file or directory
... 4 more distinct messages not shown
== strawberry (4 distinct, 10 total) ==
Aug 9 06:09:44 strawberry udisksd[1067]: Error performing housekeeping for drive /org/freedesktop/UDisks2/drives/ST2000DM001_1CH164_W1E8J5KJ: Error updating SMART data: Error sending ATA command CHECK POWER MODE: Unexpected sense data returned:#0120000: 00 00 00 00 00 00 00 00 00 00 00 00 00 00 00 00 ................#0120010: 00 00 00 00 00 00 00 00 00 00 00 00 00 00 00 00 ................#012 (g-io-error-quark, 0) [x6]
Aug 9 06:31:04 strawberry nologin[3928395]: Attempted login by UNKNOWN (UID: 65534) on UNKNOWN
Aug 9 06:31:04 strawberry pipewire[3928394]: mod.jackdbus-detect: Failed to receive jackdbus reply: org.freedesktop.DBus.Error.ServiceUnknown: The name org.jackaudio.service was not provided by any .service files
Aug 9 06:34:42 strawberry smartd[5314]: Device: /dev/sda [SAT], failed to read SMART Attribute Data [x2]
== tlsrpt (1 distinct, 1 total) ==
Aug 9 06:38:04 tlsrpt (httpd)[895751]: httpd.service: Referenced but unset environment variable evaluates to an empty string: OPTIONS
== wraith (1 distinct, 1 total) ==
Aug 9 07:02:45 wraith kernel: workqueue: output_poll_execute hogged CPU for >10000us 8195 times, consider switching to WQ_UNBOUND
1
0
Command: /usr/local/sbin/syslog-digest.py
Time : 0.9772s
Status : exited 0
Output :
Syslog digest — 2026-08-09 06:05 EDT
Processed 7,611 lines, filtered 4,845 (63%). 2,766 unknown (108 distinct) from 23 host(s).
== abuse (3 distinct, 2243 total) ==
Aug 9 05:05:06 abuse systemd[1]: Failed to load environment files: Input/output error [x687]
Aug 9 05:05:06 abuse systemd[1]: choria-server.service failed to run 'start' task: Input/output error [x687]
Aug 9 05:05:11 abuse rsyslogd[21745]: imjournal: open() failed for path: '/var/lib/rsyslog/imjournal.state.tmp': Input/output error [v8.2404.0 try https://www.rsyslog.com/e/2433 ] [x869]
== b0b02.cs.umd.edu (4 distinct, 4 total) ==
Aug 9 05:22:35 b0b02.cs.umd.edu setroubleshoot[375632]: SELinux is preventing /usr/bin/python3.9 from getattr access on the file /etc/authselect/nsswitch.conf. For complete SELinux messages run: sealert -l 9a1e2952-3fde-4937-a8ab-f7f59791a458
Aug 9 05:22:37 b0b02.cs.umd.edu setroubleshoot[375632]: SELinux is preventing /usr/bin/python3.9 from read access on the file /etc/authselect/nsswitch.conf. For complete SELinux messages run: sealert -l 97d74423-e027-4cd6-8810-ad80944900b5
Aug 9 05:22:40 b0b02.cs.umd.edu setroubleshoot[375632]: SELinux is preventing /usr/bin/python3.9 from open access on the file /etc/authselect/nsswitch.conf. For complete SELinux messages run: sealert -l 4f253f6a-62d6-46dd-8eaf-0b4d29df41c6
Aug 9 05:51:19 b0b02.cs.umd.edu rustdesk[383046]: cannot open display:
== cheezit.cs.umd.edu (1 distinct, 1 total) ==
Aug 9 05:53:06 cheezit.cs.umd.edu sshd[1813730]: error: beginning MaxStartups throttling
== contest (9 distinct, 45 total) ==
Aug 9 05:05:14 contest goferd[1007]: [ERROR][worker-0] gofer.messaging.adapter.connect:33 - connect: proton+amqps://satellite8.cs.umd.edu:5647, failed: Connection amqps://satellite8.cs.umd.edu:5647 disconnected: Condition('proton.pythonio', 'Connection refused to all addresses') [x34]
Aug 9 05:48:20 contest setroubleshoot[877337]: SELinux is preventing /usr/libexec/platform-python3.6 from create access on the directory libdnf.eqKC9z. For complete SELinux messages run: sealert -l cb6b25c6-4765-4cf2-88a0-9b3b508e94e9
Aug 9 05:48:20 contest setroubleshoot[877337]: SELinux is preventing /usr/bin/gpgconf from add_name access on the directory repodata. For complete SELinux messages run: sealert -l 41cf7b1b-0f34-4609-98f2-b66e7825fef7
Aug 9 05:48:20 contest setroubleshoot[877337]: SELinux is preventing /usr/libexec/platform-python3.6 from create access on the file mirrorlist. For complete SELinux messages run: sealert -l fc20ff92-ea83-4f38-a24b-ddfd737a3141
Aug 9 05:48:20 contest setroubleshoot[877337]: SELinux is preventing /usr/libexec/platform-python3.6 from setattr access on the file repomd.xml. For complete SELinux messages run: sealert -l ac675631-fa35-4e93-adc9-b692b18e53e5
Aug 9 05:48:20 contest setroubleshoot[877337]: SELinux is preventing /usr/libexec/platform-python3.6 from read access on the directory libdnf.eqKC9z. For complete SELinux messages run: sealert -l 45d103b6-0810-4890-a705-990118577ce8
Aug 9 05:48:20 contest setroubleshoot[877337]: SELinux is preventing /usr/libexec/platform-python3.6 from remove_name access on the directory repomd.xml. For complete SELinux messages run: sealert -l 7e499113-2fd7-4f67-bec6-3521efbe3637 [x3]
Aug 9 05:48:20 contest setroubleshoot[877337]: SELinux is preventing /usr/libexec/platform-python3.6 from rmdir access on the directory repodata. For complete SELinux messages run: sealert -l 3928930b-a1ed-448d-950b-0665ac2adef8 [x2]
Aug 9 05:48:22 contest setroubleshoot[877337]: SELinux is preventing /usr/libexec/platform-python3.6 from read access on the directory libdnf.NtAPPm. For complete SELinux messages run: sealert -l 45d103b6-0810-4890-a705-990118577ce8
== csfw00a (2 distinct, 298 total) ==
Aug 9 05:04:58 csfw00a kernel: bnxt_en 0000:09:00.0 eth3: NIC Link is Down [x294]
Aug 9 05:40:43 csfw00a ospf6d[1477]: [EC 100663307] Could not send entire message [x4]
== grades01.cs.umd.edu (1 distinct, 1 total) ==
Aug 9 05:48:33 grades01.cs.umd.edu puppet-agent[30045]: The directory '/srv/grades' contains 2471 entries, which exceeds the default soft limit 1000 and may cause excessive resource consumption and degraded performance. To remove this warning set a value for `max_files` parameter or consider using an alternate method to manage large directory trees
== hackerman (1 distinct, 1 total) ==
Aug 9 05:19:01 hackerman gnome-software[2060381]: failed to commit changes to dconf: GDBus.Error:org.gtk.GDBus.UnmappedGError.Quark._g_2dfile_2derror_2dquark.Code2: Failed to create file “/adminhomes/sajith/.config/dconf/user.5J3NT3”: Permission denied
== idm00 (1 distinct, 1 total) ==
Aug 9 05:51:22 idm00 named[243294]: client @0x7f5f140180f8 10.73.240.42#65361: update '73.10.in-addr.arpa/IN' denied
== idmp0 (1 distinct, 1 total) ==
Aug 9 05:36:01 idmp0 named[1540302]: client @0x7ff7e4001b68 10.73.240.43#49659: update '73.10.in-addr.arpa/IN' denied
== itmon02 (1 distinct, 36 total) ==
Aug 9 05:08:13 itmon02 sshd[1750555]: error: beginning MaxStartups throttling [x36]
== matrix (9 distinct, 11 total) ==
Aug 9 05:44:59 matrix systemd[1]: networkd-dispatcher.service: Got notification message from PID 1606719, but reception only permitted for main PID 720
Aug 9 05:45:07 matrix systemd[1]: networkd-dispatcher.service: Got notification message from PID 1606844, but reception only permitted for main PID 720
Aug 9 05:45:07 matrix systemd[1]: networkd-dispatcher.service: Got notification message from PID 1606850, but reception only permitted for main PID 720
Aug 9 05:45:08 matrix networkctl[1606861]: Interface "veth4d6e858" not found.
Aug 9 05:45:08 matrix systemd[1]: networkd-dispatcher.service: Got notification message from PID 1606861, but reception only permitted for main PID 720 [x2]
Aug 9 05:45:08 matrix systemd[1]: networkd-dispatcher.service: Got notification message from PID 1606924, but reception only permitted for main PID 720
Aug 9 05:45:18 matrix systemd[1]: networkd-dispatcher.service: Got notification message from PID 1607036, but reception only permitted for main PID 720
Aug 9 05:45:18 matrix networkctl[1607054]: Interface "veth0638158" not found.
Aug 9 05:45:18 matrix systemd[1]: networkd-dispatcher.service: Got notification message from PID 1607054, but reception only permitted for main PID 720 [x2]
== newhonors2 (1 distinct, 24 total) ==
Aug 9 05:13:03 newhonors2 dhcpcd[948759]: dhcpcd is not running [x24]
== outbound00.cs.umd.edu (1 distinct, 6 total) ==
Aug 9 05:09:09 outbound00.cs.umd.edu python3[241238]: ldapdb [x6]
== outbound01.cs.umd.edu (2 distinct, 8 total) ==
Aug 9 05:08:13 outbound01.cs.umd.edu python3[2471437]: ldapdb [x7]
Aug 9 05:09:21 outbound01.cs.umd.edu systemd[1]: Configuration file /usr/lib/systemd/system/authentication_milter.service is marked executable. Please remove executable permission bits. Proceeding anyway.
== peach.cs.umd.edu (2 distinct, 4 total) ==
Aug 9 05:12:09 peach.cs.umd.edu setroubleshoot[3468964]: SELinux is preventing /usr/bin/qemu-ga from search access on the directory /var/lib/containers/storage/overlay. For complete SELinux messages run: sealert -l ba415951-a2c6-424e-b17d-305c5300b9f3 [x2]
Aug 9 05:12:09 peach.cs.umd.edu setroubleshoot[3468964]: SELinux is preventing /usr/bin/qemu-ga from search access on the directory /var/lib/containers/storage/overlay. For complete SELinux messages run: sealert -l 6aeb0956-fcf2-462a-ae4d-439b912c16d0 [x2]
== quiss (1 distinct, 1 total) ==
Aug 9 05:46:34 quiss gnome-software[879803]: failed to commit changes to dconf: GDBus.Error:org.gtk.GDBus.UnmappedGError.Quark._g_2dfile_2derror_2dquark.Code2: Failed to create file “/adminhomes/josephao/.config/dconf/user.8GLHT3”: Permission denied
== sentry-docker00.cs.umd.edu (34 distinct, 34 total) ==
Aug 9 05:17:21 sentry-docker00.cs.umd.edu systemd-udevd[744580]: link_config: could not get ethtool features for veth045a794
Aug 9 05:17:21 sentry-docker00.cs.umd.edu systemd-udevd[744580]: Could not set offload features of veth045a794: No such device
Aug 9 05:17:21 sentry-docker00.cs.umd.edu systemd-udevd[744627]: Could not generate persistent MAC address for veth940dd68: No such file or directory
Aug 9 05:17:21 sentry-docker00.cs.umd.edu systemd-udevd[744628]: Could not generate persistent MAC address for vethff9cb9c: No such file or directory
Aug 9 05:17:21 sentry-docker00.cs.umd.edu systemd-udevd[744646]: Could not generate persistent MAC address for veth5d57185: No such file or directory
Aug 9 05:17:21 sentry-docker00.cs.umd.edu systemd-udevd[744651]: Could not generate persistent MAC address for veth4d7b96a: No such file or directory
Aug 9 05:17:21 sentry-docker00.cs.umd.edu systemd-udevd[744655]: Could not generate persistent MAC address for veth92727f5: No such file or directory
Aug 9 05:17:21 sentry-docker00.cs.umd.edu systemd-udevd[744656]: Could not generate persistent MAC address for veth5ab8cc2: No such file or directory
Aug 9 05:17:21 sentry-docker00.cs.umd.edu systemd-udevd[744709]: Could not generate persistent MAC address for veth0491bc3: No such file or directory
Aug 9 05:17:21 sentry-docker00.cs.umd.edu systemd-udevd[744711]: Could not generate persistent MAC address for veth9dc0ac1: No such file or directory
Aug 9 05:17:21 sentry-docker00.cs.umd.edu systemd-udevd[744799]: Could not generate persistent MAC address for veth1a74953: No such file or directory
Aug 9 05:17:21 sentry-docker00.cs.umd.edu systemd-udevd[744802]: Could not generate persistent MAC address for vetha1d738e: No such file or directory
Aug 9 05:37:29 sentry-docker00.cs.umd.edu systemd-udevd[754276]: link_config: could not get ethtool features for veth0491bc3
Aug 9 05:37:29 sentry-docker00.cs.umd.edu systemd-udevd[754276]: Could not set offload features of veth0491bc3: No such device
Aug 9 05:37:29 sentry-docker00.cs.umd.edu systemd-udevd[754310]: Could not generate persistent MAC address for veth4fed72a: No such file or directory
Aug 9 05:37:29 sentry-docker00.cs.umd.edu systemd-udevd[754311]: Could not generate persistent MAC address for veth991acfb: No such file or directory
Aug 9 05:37:29 sentry-docker00.cs.umd.edu systemd-udevd[754315]: Could not generate persistent MAC address for veth79ddc51: No such file or directory
Aug 9 05:37:29 sentry-docker00.cs.umd.edu systemd-udevd[754314]: Could not generate persistent MAC address for vethbb07f9f: No such file or directory
Aug 9 05:37:29 sentry-docker00.cs.umd.edu systemd-udevd[754336]: Could not generate persistent MAC address for vethd023d2a: No such file or directory
Aug 9 05:37:29 sentry-docker00.cs.umd.edu systemd-udevd[754325]: Could not generate persistent MAC address for veth006f50a: No such file or directory
Aug 9 05:37:29 sentry-docker00.cs.umd.edu systemd-udevd[754367]: Could not generate persistent MAC address for veth71bcbfb: No such file or directory
Aug 9 05:37:29 sentry-docker00.cs.umd.edu systemd-udevd[754368]: Could not generate persistent MAC address for veth6a15ab3: No such file or directory
Aug 9 05:37:29 sentry-docker00.cs.umd.edu systemd-udevd[754393]: Could not generate persistent MAC address for veth49ad523: No such file or directory
Aug 9 05:37:29 sentry-docker00.cs.umd.edu systemd-udevd[754399]: Could not generate persistent MAC address for veth901f519: No such file or directory
Aug 9 05:57:38 sentry-docker00.cs.umd.edu systemd-udevd[763714]: Could not generate persistent MAC address for veth1887af6: No such file or directory
Aug 9 05:57:38 sentry-docker00.cs.umd.edu systemd-udevd[763715]: Could not generate persistent MAC address for vethebc6795: No such file or directory
Aug 9 05:57:38 sentry-docker00.cs.umd.edu systemd-udevd[763718]: Could not generate persistent MAC address for veth7301066: No such file or directory
Aug 9 05:57:38 sentry-docker00.cs.umd.edu systemd-udevd[763719]: Could not generate persistent MAC address for vethfe80514: No such file or directory
Aug 9 05:57:38 sentry-docker00.cs.umd.edu systemd-udevd[763718]: Could not generate persistent MAC address for veth88078b5: No such file or directory
Aug 9 05:57:38 sentry-docker00.cs.umd.edu systemd-udevd[763730]: Could not generate persistent MAC address for veth53b050e: No such file or directory
... 4 more distinct messages not shown
== strawberry (2 distinct, 8 total) ==
Aug 9 05:09:44 strawberry udisksd[1067]: Error performing housekeeping for drive /org/freedesktop/UDisks2/drives/ST2000DM001_1CH164_W1E8J5KJ: Error updating SMART data: Error sending ATA command CHECK POWER MODE: Unexpected sense data returned:#0120000: 00 00 00 00 00 00 00 00 00 00 00 00 00 00 00 00 ................#0120010: 00 00 00 00 00 00 00 00 00 00 00 00 00 00 00 00 ................#012 (g-io-error-quark, 0) [x6]
Aug 9 05:34:42 strawberry smartd[5314]: Device: /dev/sda [SAT], failed to read SMART Attribute Data [x2]
== submit26-b9-2 (9 distinct, 11 total) ==
Aug 9 05:12:54 submit26-b9-2 setroubleshoot[1432118]: SELinux is preventing /usr/bin/python3.9 from create access on the directory /(null). For complete SELinux messages run: sealert -l d506243c-d61e-48f3-b42a-4592c913deb0 [x2]
Aug 9 05:12:54 submit26-b9-2 setroubleshoot[1432118]: SELinux is preventing /usr/bin/python3.9 from add_name access on the directory /(null). For complete SELinux messages run: sealert -l 3b4752ac-1b9a-4af9-a05b-32e4c2eb13ab [x2]
Aug 9 05:12:54 submit26-b9-2 setroubleshoot[1432118]: SELinux is preventing /usr/bin/python3.9 from create access on the file /(null). For complete SELinux messages run: sealert -l 29e5adbd-4381-4467-b40d-a2219101e096
Aug 9 05:12:54 submit26-b9-2 setroubleshoot[1432118]: SELinux is preventing /usr/bin/python3.9 from open access on the file /tmp/libdnf.WWarT2/repodata/repomd.xml. For complete SELinux messages run: sealert -l 1b38f2ec-01ce-4343-8059-ba7494ecc5c4
Aug 9 05:12:54 submit26-b9-2 setroubleshoot[1432118]: SELinux is preventing /usr/bin/python3.9 from setattr access on the file repomd.xml. For complete SELinux messages run: sealert -l e5f9af40-1f63-4924-b012-27ab2a7b2266
Aug 9 05:12:54 submit26-b9-2 setroubleshoot[1432118]: SELinux is preventing /usr/bin/python3.9 from read access on the directory libdnf.WWarT2. For complete SELinux messages run: sealert -l 5c54db87-54a3-4a7c-97b4-b5c48d6c3543
Aug 9 05:12:54 submit26-b9-2 setroubleshoot[1432118]: SELinux is preventing /usr/bin/python3.9 from remove_name access on the directory repomd.xml. For complete SELinux messages run: sealert -l 63cd60e1-1e61-4276-afea-dd8526ffe8b2
Aug 9 05:12:54 submit26-b9-2 setroubleshoot[1432118]: SELinux is preventing /usr/bin/python3.9 from unlink access on the file repomd.xml. For complete SELinux messages run: sealert -l 81c7e9ec-e023-4c6d-b1ad-c02a242e655e
Aug 9 05:12:54 submit26-b9-2 setroubleshoot[1432118]: SELinux is preventing /usr/bin/python3.9 from rmdir access on the directory repodata. For complete SELinux messages run: sealert -l 6ae9a597-e123-4d74-8eec-a8ebe0f5e4d0
== submit26-b9-3 (9 distinct, 9 total) ==
Aug 9 05:20:40 submit26-b9-3 setroubleshoot[945728]: SELinux is preventing /usr/bin/python3.9 from create access on the directory /(null). For complete SELinux messages run: sealert -l 5b912a44-22fd-4560-b201-2a4e289b73f5
Aug 9 05:20:40 submit26-b9-3 setroubleshoot[945728]: SELinux is preventing /usr/bin/python3.9 from add_name access on the directory /(null). For complete SELinux messages run: sealert -l 7f1df1e4-725e-4953-98eb-1079f908f543
Aug 9 05:20:40 submit26-b9-3 setroubleshoot[945728]: SELinux is preventing /usr/bin/python3.9 from create access on the file /(null). For complete SELinux messages run: sealert -l 40b8852a-f77b-44b4-affe-5f11fa33de43
Aug 9 05:20:40 submit26-b9-3 setroubleshoot[945728]: SELinux is preventing /usr/bin/python3.9 from open access on the file /tmp/libdnf.s9EzDo/repodata/repomd.xml. For complete SELinux messages run: sealert -l 45a8019e-f6b5-4baa-92c1-862594b40d46
Aug 9 05:20:40 submit26-b9-3 setroubleshoot[945728]: SELinux is preventing /usr/bin/python3.9 from setattr access on the file repomd.xml. For complete SELinux messages run: sealert -l e9f0bfff-7784-4126-baa4-2bb06da56591
Aug 9 05:20:40 submit26-b9-3 setroubleshoot[945728]: SELinux is preventing /usr/bin/python3.9 from read access on the directory libdnf.s9EzDo. For complete SELinux messages run: sealert -l 0b17cc3d-cdc6-4fe2-a11f-3892e7c41dc7
Aug 9 05:20:40 submit26-b9-3 setroubleshoot[945728]: SELinux is preventing /usr/bin/python3.9 from remove_name access on the directory repomd.xml. For complete SELinux messages run: sealert -l 10e38c64-b65f-4cdd-901e-4375652d9a42
Aug 9 05:20:40 submit26-b9-3 setroubleshoot[945728]: SELinux is preventing /usr/bin/python3.9 from unlink access on the file repomd.xml. For complete SELinux messages run: sealert -l 7fd9cf72-ef38-48e1-b6aa-b571b26a7b22
Aug 9 05:20:40 submit26-b9-3 setroubleshoot[945728]: SELinux is preventing /usr/bin/python3.9 from rmdir access on the directory repodata. For complete SELinux messages run: sealert -l b9b11116-89bd-4a3c-980c-1d422c5dcee4
== submit26-clnb9 (10 distinct, 14 total) ==
Aug 9 05:32:00 submit26-clnb9 setroubleshoot[2014943]: SELinux is preventing /usr/bin/python3.9 from create access on the directory /(null). For complete SELinux messages run: sealert -l 6783ed2b-5ae4-42b5-975a-4bf50eec4658 [x2]
Aug 9 05:32:00 submit26-clnb9 setroubleshoot[2014943]: SELinux is preventing /usr/bin/python3.9 from add_name access on the directory /(null). For complete SELinux messages run: sealert -l 9e7fa955-cc30-4804-ac8c-e1779e85946c [x2]
Aug 9 05:32:00 submit26-clnb9 setroubleshoot[2014943]: SELinux is preventing /usr/bin/python3.9 from create access on the file /(null). For complete SELinux messages run: sealert -l 69bfa6e3-089c-40ff-9563-fd30787d0774
Aug 9 05:32:00 submit26-clnb9 setroubleshoot[2014943]: SELinux is preventing /usr/bin/python3.9 from open access on the file /tmp/libdnf.nlB33q/repodata/repomd.xml. For complete SELinux messages run: sealert -l 001acdb5-31ef-4e52-b10b-90f467a89ddc
Aug 9 05:32:00 submit26-clnb9 setroubleshoot[2014943]: SELinux is preventing /usr/bin/python3.9 from setattr access on the file repomd.xml. For complete SELinux messages run: sealert -l edacddcf-16ed-4dc3-8d82-7c597d5dee23
Aug 9 05:32:00 submit26-clnb9 setroubleshoot[2014943]: SELinux is preventing /usr/bin/python3.9 from read access on the directory libdnf.nlB33q. For complete SELinux messages run: sealert -l 62b3782e-4730-4488-8178-94dafe9b552c
Aug 9 05:32:00 submit26-clnb9 setroubleshoot[2014943]: SELinux is preventing /usr/bin/python3.9 from remove_name access on the directory repomd.xml. For complete SELinux messages run: sealert -l 81cb3698-78f8-440a-8e3c-e5d1041e6b78 [x2]
Aug 9 05:32:00 submit26-clnb9 setroubleshoot[2014943]: SELinux is preventing /usr/bin/python3.9 from unlink access on the file repomd.xml. For complete SELinux messages run: sealert -l 792b472a-115c-4799-9805-fc7436f916b9
Aug 9 05:32:00 submit26-clnb9 setroubleshoot[2014943]: SELinux is preventing /usr/bin/python3.9 from rmdir access on the directory repodata. For complete SELinux messages run: sealert -l 15c83a86-837b-41e2-b662-b39cd4e361cb [x2]
Aug 9 05:32:00 submit26-clnb9 setroubleshoot[2014943]: SELinux is preventing /usr/bin/python3.9 from read access on the directory libdnf.sNSKvc. For complete SELinux messages run: sealert -l 62b3782e-4730-4488-8178-94dafe9b552c
== talkhosts9 (1 distinct, 2 total) ==
Aug 9 05:11:31 talkhosts9 setroubleshoot[2266858]: SELinux is preventing /usr/bin/lsof from getattr access on the unix_stream_socket unix_stream_socket. For complete SELinux messages run: sealert -l a6df89b3-c497-469c-8232-c4fde0508abf [x2]
== updates00.cs.umd.edu (3 distinct, 3 total) ==
Aug 9 05:18:35 updates00.cs.umd.edu puppet-agent[23128]: Could not retrieve catalog from remote server: Error 500 on SERVER: Server Error: Function lookup() did not find a value for the name 'vault::kerberos' on node updates00.cs.umd.edu
Aug 9 05:18:35 updates00.cs.umd.edu puppet-agent[23128]: Not using cache on failed catalog
Aug 9 05:18:35 updates00.cs.umd.edu puppet-agent[23128]: Could not retrieve catalog; skipping run
1
0
Command: /usr/local/sbin/syslog-digest.py
Time : 0.9736s
Status : exited 0
Output :
Syslog digest — 2026-08-09 05:05 EDT
Processed 7,965 lines, filtered 5,238 (65%). 2,727 unknown (78 distinct) from 21 host(s).
== abadi-computer (2 distinct, 2 total) ==
Aug 9 04:15:00 abadi-computer nologin[2492629]: Attempted login by UNKNOWN (UID: 65534) on UNKNOWN
Aug 9 04:15:00 abadi-computer pipewire[2492627]: mod.jackdbus-detect: Failed to receive jackdbus reply: org.freedesktop.DBus.Error.ServiceUnknown: The name org.jackaudio.service was not provided by any .service files
== abuse (3 distinct, 2249 total) ==
Aug 9 04:05:03 abuse systemd[1]: Failed to load environment files: Input/output error [x688]
Aug 9 04:05:03 abuse systemd[1]: choria-server.service failed to run 'start' task: Input/output error [x688]
Aug 9 04:05:03 abuse rsyslogd[21745]: imjournal: open() failed for path: '/var/lib/rsyslog/imjournal.state.tmp': Input/output error [v8.2404.0 try https://www.rsyslog.com/e/2433 ] [x873]
== b0b02.cs.umd.edu (4 distinct, 5 total) ==
Aug 9 04:22:30 b0b02.cs.umd.edu setroubleshoot[360539]: SELinux is preventing /usr/bin/python3.9 from getattr access on the file /etc/authselect/nsswitch.conf. For complete SELinux messages run: sealert -l 9a1e2952-3fde-4937-a8ab-f7f59791a458 [x2]
Aug 9 04:22:33 b0b02.cs.umd.edu setroubleshoot[360539]: SELinux is preventing /usr/bin/python3.9 from read access on the file /etc/authselect/nsswitch.conf. For complete SELinux messages run: sealert -l 97d74423-e027-4cd6-8810-ad80944900b5
Aug 9 04:22:36 b0b02.cs.umd.edu setroubleshoot[360539]: SELinux is preventing /usr/bin/python3.9 from open access on the file /etc/authselect/nsswitch.conf. For complete SELinux messages run: sealert -l 4f253f6a-62d6-46dd-8eaf-0b4d29df41c6
Aug 9 04:51:16 b0b02.cs.umd.edu rustdesk[367966]: cannot open display:
== biggulp.cs.umd.edu (1 distinct, 1 total) ==
Aug 9 04:44:44 biggulp.cs.umd.edu sshd[3420116]: error: beginning MaxStartups throttling
== contest (1 distinct, 33 total) ==
Aug 9 04:06:19 contest goferd[1007]: [ERROR][worker-0] gofer.messaging.adapter.connect:33 - connect: proton+amqps://satellite8.cs.umd.edu:5647, failed: Connection amqps://satellite8.cs.umd.edu:5647 disconnected: Condition('proton.pythonio', 'Connection refused to all addresses') [x33]
== csfw00a (2 distinct, 276 total) ==
Aug 9 04:04:36 csfw00a kernel: bnxt_en 0000:09:00.0 eth3: NIC Link is Down [x268]
Aug 9 04:45:21 csfw00a ospf6d[1477]: [EC 100663307] Could not send entire message [x8]
== dojo (1 distinct, 1 total) ==
Aug 9 04:15:24 dojo nologin[1498551]: Attempted login by UNKNOWN (UID: 65534) on UNKNOWN
== forge00 (1 distinct, 1 total) ==
Aug 9 04:09:02 forge00 (httpd)[2469987]: httpd.service: Referenced but unset environment variable evaluates to an empty string: OPTIONS
== idm00 (1 distinct, 1 total) ==
Aug 9 04:51:22 idm00 named[243294]: client @0x7f5f18c83a58 10.73.240.42#56118: update '73.10.in-addr.arpa/IN' denied
== idmp0 (1 distinct, 1 total) ==
Aug 9 04:36:01 idmp0 named[1540302]: client @0x7ff7c4029018 10.73.240.43#54652: update '73.10.in-addr.arpa/IN' denied
== itmon02 (1 distinct, 52 total) ==
Aug 9 04:07:48 itmon02 sshd[1750555]: error: beginning MaxStartups throttling [x52]
== netman.cs.umd.edu (3 distinct, 3 total) ==
Aug 9 04:30:02 netman.cs.umd.edu setroubleshoot[2715149]: SELinux is preventing /usr/bin/gpg from read access on the file gpg.conf. For complete SELinux messages run: sealert -l 019ad1da-a874-4814-8037-3b3e5f413ad2
Aug 9 04:30:02 netman.cs.umd.edu setroubleshoot[2715149]: SELinux is preventing /usr/bin/gpg from open access on the file /root/.gnupg/gpg.conf. For complete SELinux messages run: sealert -l cb54177e-d44c-46a1-b246-5c0bbb8343be
Aug 9 04:30:03 netman.cs.umd.edu setroubleshoot[2715149]: SELinux is preventing /usr/bin/gpg from getattr access on the file /root/.gnupg/gpg.conf. For complete SELinux messages run: sealert -l fbba2e30-b7ab-491c-9ec6-f553e9ef72af
== newhonors2 (1 distinct, 24 total) ==
Aug 9 04:13:02 newhonors2 dhcpcd[946895]: dhcpcd is not running [x24]
== orchids (1 distinct, 1 total) ==
Aug 9 04:10:04 orchids gnome-software[1516991]: failed to commit changes to dconf: GDBus.Error:org.gtk.GDBus.UnmappedGError.Quark._g_2dfile_2derror_2dquark.Code2: Failed to create file “/adminhomes/jworden/.config/dconf/user.IBSNT3”: Permission denied
== outbound00.cs.umd.edu (1 distinct, 6 total) ==
Aug 9 04:09:09 outbound00.cs.umd.edu python3[227333]: ldapdb [x6]
== outbound01.cs.umd.edu (1 distinct, 6 total) ==
Aug 9 04:13:06 outbound01.cs.umd.edu python3[2458373]: ldapdb [x6]
== peach.cs.umd.edu (2 distinct, 4 total) ==
Aug 9 04:12:08 peach.cs.umd.edu setroubleshoot[3462699]: SELinux is preventing /usr/bin/qemu-ga from search access on the directory /var/lib/containers/storage/overlay. For complete SELinux messages run: sealert -l ba415951-a2c6-424e-b17d-305c5300b9f3 [x2]
Aug 9 04:12:08 peach.cs.umd.edu setroubleshoot[3462699]: SELinux is preventing /usr/bin/qemu-ga from search access on the directory /var/lib/containers/storage/overlay. For complete SELinux messages run: sealert -l 6aeb0956-fcf2-462a-ae4d-439b912c16d0 [x2]
== sentry-docker00.cs.umd.edu (36 distinct, 36 total) ==
Aug 9 04:16:56 sentry-docker00.cs.umd.edu systemd-udevd[716280]: Could not generate persistent MAC address for veth021a491: No such file or directory
Aug 9 04:16:56 sentry-docker00.cs.umd.edu systemd-udevd[716281]: Could not generate persistent MAC address for vethc4482bd: No such file or directory
Aug 9 04:16:56 sentry-docker00.cs.umd.edu systemd-udevd[716284]: Could not generate persistent MAC address for veth662cd9e: No such file or directory
Aug 9 04:16:56 sentry-docker00.cs.umd.edu systemd-udevd[716285]: Could not generate persistent MAC address for vethae8bbcf: No such file or directory
Aug 9 04:16:56 sentry-docker00.cs.umd.edu systemd-udevd[716285]: Could not generate persistent MAC address for veth03be15d: No such file or directory
Aug 9 04:16:56 sentry-docker00.cs.umd.edu systemd-udevd[716307]: Could not generate persistent MAC address for veth0d8d59a: No such file or directory
Aug 9 04:16:56 sentry-docker00.cs.umd.edu systemd-udevd[716285]: Could not generate persistent MAC address for veth73b0b4e: No such file or directory
Aug 9 04:16:56 sentry-docker00.cs.umd.edu systemd-udevd[716301]: Could not generate persistent MAC address for veth77ead17: No such file or directory
Aug 9 04:16:56 sentry-docker00.cs.umd.edu systemd-udevd[716330]: Could not generate persistent MAC address for vethb9c2c5e: No such file or directory
Aug 9 04:16:56 sentry-docker00.cs.umd.edu systemd-udevd[716339]: Could not generate persistent MAC address for vethfd6c492: No such file or directory
Aug 9 04:37:04 sentry-docker00.cs.umd.edu systemd-udevd[725641]: link_config: could not get ethtool features for veth03be15d
Aug 9 04:37:04 sentry-docker00.cs.umd.edu systemd-udevd[725641]: Could not set offload features of veth03be15d: No such device
Aug 9 04:37:04 sentry-docker00.cs.umd.edu systemd-udevd[725680]: Could not generate persistent MAC address for vethcb56007: No such file or directory
Aug 9 04:37:04 sentry-docker00.cs.umd.edu systemd-udevd[725681]: Could not generate persistent MAC address for vethf9c8ed0: No such file or directory
Aug 9 04:37:04 sentry-docker00.cs.umd.edu systemd-udevd[725699]: Could not generate persistent MAC address for vethaa97065: No such file or directory
Aug 9 04:37:04 sentry-docker00.cs.umd.edu systemd-udevd[725681]: Could not generate persistent MAC address for vethd207219: No such file or directory
Aug 9 04:37:04 sentry-docker00.cs.umd.edu systemd-udevd[725708]: Could not generate persistent MAC address for vetha68ee44: No such file or directory
Aug 9 04:37:04 sentry-docker00.cs.umd.edu systemd-udevd[725709]: Could not generate persistent MAC address for veth96d5a1f: No such file or directory
Aug 9 04:37:04 sentry-docker00.cs.umd.edu systemd-udevd[725741]: Could not generate persistent MAC address for vethb979892: No such file or directory
Aug 9 04:37:04 sentry-docker00.cs.umd.edu systemd-udevd[725743]: Could not generate persistent MAC address for vethfe3b72c: No such file or directory
Aug 9 04:37:04 sentry-docker00.cs.umd.edu systemd-udevd[725808]: Could not generate persistent MAC address for veth2781d27: No such file or directory
Aug 9 04:37:04 sentry-docker00.cs.umd.edu systemd-udevd[725809]: Could not generate persistent MAC address for veth46b08d0: No such file or directory
Aug 9 04:57:12 sentry-docker00.cs.umd.edu systemd-udevd[735032]: link_config: could not get ethtool features for vethb979892
Aug 9 04:57:12 sentry-docker00.cs.umd.edu systemd-udevd[735032]: Could not set offload features of vethb979892: No such device
Aug 9 04:57:12 sentry-docker00.cs.umd.edu systemd-udevd[735071]: link_config: could not get ethtool features for vetha68ee44
Aug 9 04:57:12 sentry-docker00.cs.umd.edu systemd-udevd[735071]: Could not set offload features of vetha68ee44: No such device
Aug 9 04:57:12 sentry-docker00.cs.umd.edu systemd-udevd[735132]: Could not generate persistent MAC address for veth1ea9775: No such file or directory
Aug 9 04:57:12 sentry-docker00.cs.umd.edu systemd-udevd[735131]: Could not generate persistent MAC address for veth5c79242: No such file or directory
Aug 9 04:57:13 sentry-docker00.cs.umd.edu systemd-udevd[735135]: Could not generate persistent MAC address for veth045a794: No such file or directory
Aug 9 04:57:13 sentry-docker00.cs.umd.edu systemd-udevd[735136]: Could not generate persistent MAC address for vetha7d7b1b: No such file or directory
... 6 more distinct messages not shown
== smokeping-slave (1 distinct, 1 total) ==
Aug 9 04:15:18 smokeping-slave nologin[1319843]: Attempted login by UNKNOWN (UID: 65534) on UNKNOWN
== strawberry (4 distinct, 10 total) ==
Aug 9 04:09:44 strawberry udisksd[1067]: Error performing housekeeping for drive /org/freedesktop/UDisks2/drives/ST2000DM001_1CH164_W1E8J5KJ: Error updating SMART data: Error sending ATA command CHECK POWER MODE: Unexpected sense data returned:#0120000: 00 00 00 00 00 00 00 00 00 00 00 00 00 00 00 00 ................#0120010: 00 00 00 00 00 00 00 00 00 00 00 00 00 00 00 00 ................#012 (g-io-error-quark, 0) [x6]
Aug 9 04:15:04 strawberry nologin[3920543]: Attempted login by UNKNOWN (UID: 65534) on UNKNOWN
Aug 9 04:15:04 strawberry pipewire[3920542]: mod.jackdbus-detect: Failed to receive jackdbus reply: org.freedesktop.DBus.Error.ServiceUnknown: The name org.jackaudio.service was not provided by any .service files
Aug 9 04:34:42 strawberry smartd[5314]: Device: /dev/sda [SAT], failed to read SMART Attribute Data [x2]
== submit26-b9-4 (10 distinct, 14 total) ==
Aug 9 04:16:11 submit26-b9-4 setroubleshoot[1418000]: SELinux is preventing /usr/bin/python3.9 from create access on the directory /(null). For complete SELinux messages run: sealert -l a4e66030-8621-4da9-bd27-5988bb1bf8ad [x2]
Aug 9 04:16:11 submit26-b9-4 setroubleshoot[1418000]: SELinux is preventing /usr/bin/python3.9 from add_name access on the directory /(null). For complete SELinux messages run: sealert -l c055e37d-bbf5-4800-9083-d606f792c8c1 [x2]
Aug 9 04:16:11 submit26-b9-4 setroubleshoot[1418000]: SELinux is preventing /usr/bin/python3.9 from create access on the file /(null). For complete SELinux messages run: sealert -l e5bc3a56-6d6f-4776-954f-ddde1579648f
Aug 9 04:16:11 submit26-b9-4 setroubleshoot[1418000]: SELinux is preventing /usr/bin/python3.9 from open access on the file /tmp/libdnf.ZfrVs3/repodata/repomd.xml. For complete SELinux messages run: sealert -l a8ec5e1b-49f9-4fbc-a8ae-22e800f7abf2
Aug 9 04:16:11 submit26-b9-4 setroubleshoot[1418000]: SELinux is preventing /usr/bin/python3.9 from setattr access on the file repomd.xml. For complete SELinux messages run: sealert -l 945db714-d0c0-4402-911e-932978b8b036
Aug 9 04:16:11 submit26-b9-4 setroubleshoot[1418000]: SELinux is preventing /usr/bin/python3.9 from read access on the directory libdnf.ZfrVs3. For complete SELinux messages run: sealert -l 463998a0-fb0d-463c-82b1-471135710a14
Aug 9 04:16:11 submit26-b9-4 setroubleshoot[1418000]: SELinux is preventing /usr/bin/python3.9 from remove_name access on the directory repomd.xml. For complete SELinux messages run: sealert -l 473d2e21-15d8-407a-a9ee-2b842607fa00 [x2]
Aug 9 04:16:11 submit26-b9-4 setroubleshoot[1418000]: SELinux is preventing /usr/bin/python3.9 from unlink access on the file repomd.xml. For complete SELinux messages run: sealert -l 80c54d4f-bf4b-4501-addb-1627383587d0
Aug 9 04:16:11 submit26-b9-4 setroubleshoot[1418000]: SELinux is preventing /usr/bin/python3.9 from rmdir access on the directory repodata. For complete SELinux messages run: sealert -l c63d3890-151e-49a0-83f0-3dfb69d051e5 [x2]
Aug 9 04:16:12 submit26-b9-4 setroubleshoot[1418000]: SELinux is preventing /usr/bin/python3.9 from read access on the directory libdnf.D57Ii0. For complete SELinux messages run: sealert -l 463998a0-fb0d-463c-82b1-471135710a14
1
0
Command: /usr/local/sbin/syslog-digest.py
Time : 0.9868s
Status : exited 0
Output :
Syslog digest — 2026-08-09 04:05 EDT
Processed 8,796 lines, filtered 6,128 (69%). 2,668 unknown (78 distinct) from 19 host(s).
== abuse (3 distinct, 2261 total) ==
Aug 9 03:05:06 abuse systemd[1]: Failed to load environment files: Input/output error [x687]
Aug 9 03:05:06 abuse systemd[1]: choria-server.service failed to run 'start' task: Input/output error [x687]
Aug 9 03:05:06 abuse rsyslogd[21745]: imjournal: open() failed for path: '/var/lib/rsyslog/imjournal.state.tmp': Input/output error [v8.2404.0 try https://www.rsyslog.com/e/2433 ] [x887]
== b0b02.cs.umd.edu (4 distinct, 4 total) ==
Aug 9 03:22:26 b0b02.cs.umd.edu setroubleshoot[345185]: SELinux is preventing /usr/bin/python3.9 from getattr access on the file /etc/authselect/nsswitch.conf. For complete SELinux messages run: sealert -l 9a1e2952-3fde-4937-a8ab-f7f59791a458
Aug 9 03:22:29 b0b02.cs.umd.edu setroubleshoot[345185]: SELinux is preventing /usr/bin/python3.9 from read access on the file /etc/authselect/nsswitch.conf. For complete SELinux messages run: sealert -l 97d74423-e027-4cd6-8810-ad80944900b5
Aug 9 03:22:32 b0b02.cs.umd.edu setroubleshoot[345185]: SELinux is preventing /usr/bin/python3.9 from open access on the file /etc/authselect/nsswitch.conf. For complete SELinux messages run: sealert -l 4f253f6a-62d6-46dd-8eaf-0b4d29df41c6
Aug 9 03:51:12 b0b02.cs.umd.edu rustdesk[352616]: cannot open display:
== cheezit.cs.umd.edu (11 distinct, 14 total) ==
Aug 9 03:41:20 cheezit.cs.umd.edu setroubleshoot[2686089]: failed to retrieve rpm info for path '/var/log/falconctl.log':
Aug 9 03:41:21 cheezit.cs.umd.edu setroubleshoot[2686089]: SELinux is preventing /opt/CrowdStrike/falconctl18708 from append access on the file /var/log/falconctl.log. For complete SELinux messages run: sealert -l 63f66d53-fcfc-44da-a79e-c789b1ce2ce8
Aug 9 03:41:23 cheezit.cs.umd.edu setroubleshoot[2686089]: SELinux is preventing /opt/CrowdStrike/falconctl18708 from write access on the file falconstore. For complete SELinux messages run: sealert -l 386506af-597f-4357-89de-bc382f369a6e [x2]
Aug 9 03:41:34 cheezit.cs.umd.edu setroubleshoot[2686089]: failed to retrieve rpm info for path '/var/lib/sss/pipes/nss': [x2]
Aug 9 03:41:35 cheezit.cs.umd.edu setroubleshoot[2686089]: SELinux is preventing /usr/bin/lsof from write access on the sock_file /var/lib/sss/pipes/nss. For complete SELinux messages run: sealert -l f570494d-54d2-4dac-97e2-28395659abf1 [x2]
Aug 9 03:41:35 cheezit.cs.umd.edu setroubleshoot[2686089]: SELinux is preventing /usr/bin/lsof from write access on the sock_file socket. For complete SELinux messages run: sealert -l 9ff2383b-9e1d-44ff-b8ae-af91637450ae
Aug 9 03:42:16 cheezit.cs.umd.edu setroubleshoot[2686912]: SELinux is preventing /usr/bin/python3.9 from read access on the file /etc/selinux/targeted/contexts/files/file_contexts.subs_dist. For complete SELinux messages run: sealert -l 679eb260-cf5d-4783-99f4-ce308edb3295
Aug 9 03:42:16 cheezit.cs.umd.edu setroubleshoot[2686912]: SELinux is preventing /usr/bin/python3.9 from open access on the file /etc/selinux/targeted/contexts/files/file_contexts.subs_dist. For complete SELinux messages run: sealert -l 77caba8a-5cd0-4e18-b188-6e35c461772d
Aug 9 03:42:16 cheezit.cs.umd.edu setroubleshoot[2686912]: SELinux is preventing /usr/bin/python3.9 from read access on the file /etc/selinux/targeted/contexts/files/file_contexts.subs. For complete SELinux messages run: sealert -l d9c6dd0d-0a34-4430-a5ff-e985c55cb064
Aug 9 03:42:16 cheezit.cs.umd.edu setroubleshoot[2686912]: SELinux is preventing /usr/bin/python3.9 from open access on the file /etc/selinux/targeted/contexts/files/file_contexts.subs. For complete SELinux messages run: sealert -l 8edbce57-8212-4ac8-af50-3fe403231eda
Aug 9 03:42:16 cheezit.cs.umd.edu setroubleshoot[2686912]: SELinux is preventing /usr/bin/python3.9 from map access on the file /etc/selinux/targeted/contexts/files/file_contexts.bin. For complete SELinux messages run: sealert -l 4a0cbe3b-6f49-4c7e-95c6-380f7aef806e
== contest (1 distinct, 34 total) ==
Aug 9 03:05:37 contest goferd[1007]: [ERROR][worker-0] gofer.messaging.adapter.connect:33 - connect: proton+amqps://satellite8.cs.umd.edu:5647, failed: Connection amqps://satellite8.cs.umd.edu:5647 disconnected: Condition('proton.pythonio', 'Connection refused to all addresses') [x34]
== csfw00a (1 distinct, 220 total) ==
Aug 9 03:04:35 csfw00a kernel: bnxt_en 0000:09:00.0 eth3: NIC Link is Down [x220]
== hackerman (1 distinct, 1 total) ==
Aug 9 03:19:01 hackerman gnome-software[2060381]: failed to commit changes to dconf: GDBus.Error:org.gtk.GDBus.UnmappedGError.Quark._g_2dfile_2derror_2dquark.Code2: Failed to create file “/adminhomes/sajith/.config/dconf/user.8QTMT3”: Permission denied
== idm00 (1 distinct, 1 total) ==
Aug 9 03:51:22 idm00 named[243294]: client @0x7f5f1935efe8 10.73.240.42#57121: update '73.10.in-addr.arpa/IN' denied
== idmp0 (1 distinct, 1 total) ==
Aug 9 03:36:01 idmp0 named[1540302]: client @0x7ff7e0049ed8 10.73.240.43#59628: update '73.10.in-addr.arpa/IN' denied
== itmon02 (2 distinct, 39 total) ==
Aug 9 03:07:48 itmon02 sshd[1750555]: error: beginning MaxStartups throttling [x38]
Aug 9 03:15:03 itmon02 (httpd)[2187100]: httpd.service: Referenced but unset environment variable evaluates to an empty string: OPTIONS
== kadath.cs.umd.edu (1 distinct, 1 total) ==
Aug 9 03:47:30 kadath.cs.umd.edu puppet-agent[3213944]: (Facter) invalid or malformed lldp data: MalformedDataError: no lldp interface data found
== netbox (1 distinct, 1 total) ==
Aug 9 03:08:03 netbox (httpd)[2304943]: httpd.service: Referenced but unset environment variable evaluates to an empty string: OPTIONS
== newhonors2 (1 distinct, 24 total) ==
Aug 9 03:13:03 newhonors2 dhcpcd[945063]: dhcpcd is not running [x24]
== outbound00.cs.umd.edu (2 distinct, 8 total) ==
Aug 9 03:09:09 outbound00.cs.umd.edu python3[212674]: ldapdb [x7]
Aug 9 03:24:14 outbound00.cs.umd.edu systemd[1]: Configuration file /usr/lib/systemd/system/authentication_milter.service is marked executable. Please remove executable permission bits. Proceeding anyway.
== outbound01.cs.umd.edu (1 distinct, 6 total) ==
Aug 9 03:13:06 outbound01.cs.umd.edu python3[2444455]: ldapdb [x6]
== quiss (1 distinct, 1 total) ==
Aug 9 03:46:34 quiss gnome-software[879803]: failed to commit changes to dconf: GDBus.Error:org.gtk.GDBus.UnmappedGError.Quark._g_2dfile_2derror_2dquark.Code2: Failed to create file “/adminhomes/josephao/.config/dconf/user.HONIT3”: Permission denied
== sebatinsky.cs.umd.edu (1 distinct, 1 total) ==
Aug 9 03:46:59 sebatinsky.cs.umd.edu kernel: hpet1: lost 1 rtc interrupts
== sentry-docker00.cs.umd.edu (42 distinct, 42 total) ==
Aug 9 03:16:31 sentry-docker00.cs.umd.edu systemd-udevd[687747]: link_config: could not get ethtool features for vethdfaedff
Aug 9 03:16:31 sentry-docker00.cs.umd.edu systemd-udevd[687747]: Could not set offload features of vethdfaedff: No such device
Aug 9 03:16:31 sentry-docker00.cs.umd.edu systemd-udevd[687768]: link_config: could not get ethtool features for vethfede0a2
Aug 9 03:16:31 sentry-docker00.cs.umd.edu systemd-udevd[687768]: Could not set offload features of vethfede0a2: No such device
Aug 9 03:16:31 sentry-docker00.cs.umd.edu systemd-udevd[687803]: Could not generate persistent MAC address for veth4010084: No such file or directory
Aug 9 03:16:31 sentry-docker00.cs.umd.edu systemd-udevd[687804]: Could not generate persistent MAC address for veth751d53e: No such file or directory
Aug 9 03:16:31 sentry-docker00.cs.umd.edu systemd-udevd[687808]: Could not generate persistent MAC address for vetha219b8b: No such file or directory
Aug 9 03:16:31 sentry-docker00.cs.umd.edu systemd-udevd[687807]: Could not generate persistent MAC address for vethee8bf29: No such file or directory
Aug 9 03:16:31 sentry-docker00.cs.umd.edu systemd-udevd[687831]: Could not generate persistent MAC address for veth5d73eca: No such file or directory
Aug 9 03:16:31 sentry-docker00.cs.umd.edu systemd-udevd[687832]: Could not generate persistent MAC address for veth474bca7: No such file or directory
Aug 9 03:16:31 sentry-docker00.cs.umd.edu systemd-udevd[687835]: Could not generate persistent MAC address for vethfa9589f: No such file or directory
Aug 9 03:16:31 sentry-docker00.cs.umd.edu systemd-udevd[687856]: Could not generate persistent MAC address for veth1f99de9: No such file or directory
Aug 9 03:16:31 sentry-docker00.cs.umd.edu systemd-udevd[687897]: Could not generate persistent MAC address for veth12a423e: No such file or directory
Aug 9 03:16:31 sentry-docker00.cs.umd.edu systemd-udevd[687895]: Could not generate persistent MAC address for veth066c19f: No such file or directory
Aug 9 03:36:39 sentry-docker00.cs.umd.edu systemd-udevd[697180]: link_config: could not get ethtool features for vethfa9589f
Aug 9 03:36:39 sentry-docker00.cs.umd.edu systemd-udevd[697180]: Could not set offload features of vethfa9589f: No such device
Aug 9 03:36:39 sentry-docker00.cs.umd.edu systemd-udevd[697196]: link_config: could not get ethtool features for vethee8bf29
Aug 9 03:36:39 sentry-docker00.cs.umd.edu systemd-udevd[697196]: Could not set offload features of vethee8bf29: No such device
Aug 9 03:36:39 sentry-docker00.cs.umd.edu systemd-udevd[697256]: Could not generate persistent MAC address for veth2c69547: No such file or directory
Aug 9 03:36:39 sentry-docker00.cs.umd.edu systemd-udevd[697257]: Could not generate persistent MAC address for veth6116a14: No such file or directory
Aug 9 03:36:39 sentry-docker00.cs.umd.edu systemd-udevd[697282]: Could not generate persistent MAC address for vethbfb6ee4: No such file or directory
Aug 9 03:36:39 sentry-docker00.cs.umd.edu systemd-udevd[697283]: Could not generate persistent MAC address for veth0d69a3f: No such file or directory
Aug 9 03:36:39 sentry-docker00.cs.umd.edu systemd-udevd[697325]: Could not generate persistent MAC address for vethd8ce2c6: No such file or directory
Aug 9 03:36:39 sentry-docker00.cs.umd.edu systemd-udevd[697320]: Could not generate persistent MAC address for vethf8eeaf5: No such file or directory
Aug 9 03:36:39 sentry-docker00.cs.umd.edu systemd-udevd[697305]: Could not generate persistent MAC address for veth38175b4: No such file or directory
Aug 9 03:36:39 sentry-docker00.cs.umd.edu systemd-udevd[697310]: Could not generate persistent MAC address for veth9011b35: No such file or directory
Aug 9 03:36:39 sentry-docker00.cs.umd.edu systemd-udevd[697396]: Could not generate persistent MAC address for veth2a9e05c: No such file or directory
Aug 9 03:36:39 sentry-docker00.cs.umd.edu systemd-udevd[697406]: Could not generate persistent MAC address for veth44b713b: No such file or directory
Aug 9 03:56:47 sentry-docker00.cs.umd.edu systemd-udevd[706715]: link_config: could not get ethtool features for veth2a9e05c
Aug 9 03:56:47 sentry-docker00.cs.umd.edu systemd-udevd[706715]: Could not set offload features of veth2a9e05c: No such device
... 12 more distinct messages not shown
== strawberry (2 distinct, 8 total) ==
Aug 9 03:09:44 strawberry udisksd[1067]: Error performing housekeeping for drive /org/freedesktop/UDisks2/drives/ST2000DM001_1CH164_W1E8J5KJ: Error updating SMART data: Error sending ATA command CHECK POWER MODE: Unexpected sense data returned:#0120000: 00 00 00 00 00 00 00 00 00 00 00 00 00 00 00 00 ................#0120010: 00 00 00 00 00 00 00 00 00 00 00 00 00 00 00 00 ................#012 (g-io-error-quark, 0) [x6]
Aug 9 03:34:42 strawberry smartd[5314]: Device: /dev/sda [SAT], failed to read SMART Attribute Data [x2]
== zfs00.cs.umd.edu (1 distinct, 1 total) ==
Aug 9 03:32:22 zfs00.cs.umd.edu kernel: kauditd_printk_skb: 4 callbacks suppressed
1
0
Command: /usr/local/sbin/syslog-digest.py
Time : 0.9853s
Status : exited 0
Output :
Syslog digest — 2026-08-09 03:05 EDT
Processed 9,290 lines, filtered 6,594 (70%). 2,696 unknown (55 distinct) from 15 host(s).
== abuse (3 distinct, 2260 total) ==
Aug 9 02:05:02 abuse systemd[1]: Failed to load environment files: Input/output error [x688]
Aug 9 02:05:02 abuse systemd[1]: choria-server.service failed to run 'start' task: Input/output error [x688]
Aug 9 02:05:07 abuse rsyslogd[21745]: imjournal: open() failed for path: '/var/lib/rsyslog/imjournal.state.tmp': Input/output error [v8.2404.0 try https://www.rsyslog.com/e/2433 ] [x884]
== b0b02.cs.umd.edu (4 distinct, 4 total) ==
Aug 9 02:22:22 b0b02.cs.umd.edu setroubleshoot[330084]: SELinux is preventing /usr/bin/python3.9 from getattr access on the file /etc/authselect/nsswitch.conf. For complete SELinux messages run: sealert -l 9a1e2952-3fde-4937-a8ab-f7f59791a458
Aug 9 02:22:25 b0b02.cs.umd.edu setroubleshoot[330084]: SELinux is preventing /usr/bin/python3.9 from read access on the file /etc/authselect/nsswitch.conf. For complete SELinux messages run: sealert -l 97d74423-e027-4cd6-8810-ad80944900b5
Aug 9 02:22:27 b0b02.cs.umd.edu setroubleshoot[330084]: SELinux is preventing /usr/bin/python3.9 from open access on the file /etc/authselect/nsswitch.conf. For complete SELinux messages run: sealert -l 4f253f6a-62d6-46dd-8eaf-0b4d29df41c6
Aug 9 02:51:09 b0b02.cs.umd.edu rustdesk[337516]: cannot open display:
== contest (1 distinct, 33 total) ==
Aug 9 02:06:43 contest goferd[1007]: [ERROR][worker-0] gofer.messaging.adapter.connect:33 - connect: proton+amqps://satellite8.cs.umd.edu:5647, failed: Connection amqps://satellite8.cs.umd.edu:5647 disconnected: Condition('proton.pythonio', 'Connection refused to all addresses') [x33]
== csfw00a (1 distinct, 268 total) ==
Aug 9 02:04:19 csfw00a kernel: bnxt_en 0000:09:00.0 eth3: NIC Link is Down [x268]
== idm00 (1 distinct, 1 total) ==
Aug 9 02:51:21 idm00 named[243294]: client @0x7f5f08007d58 10.73.240.42#55370: update '73.10.in-addr.arpa/IN' denied
== idmp0 (1 distinct, 1 total) ==
Aug 9 02:36:01 idmp0 named[1540302]: client @0x7ff7f0007ab8 10.73.240.43#62632: update '73.10.in-addr.arpa/IN' denied
== itmon02 (1 distinct, 40 total) ==
Aug 9 02:07:50 itmon02 sshd[1750555]: error: beginning MaxStartups throttling [x40]
== mcstic (1 distinct, 2 total) ==
Aug 9 02:45:39 mcstic krb5_child[2329817]: Preauthentication failed [x2]
== munin (2 distinct, 8 total) ==
Aug 9 02:37:53 munin sudo[4016485]: pam_systemd(sudo:session): Failed to stat() runtime directory '/run/user/0': No such file or directory [x4]
Aug 9 02:37:53 munin sudo[4016485]: pam_systemd(sudo:session): Not setting $XDG_RUNTIME_DIR, as the directory is not in order. [x4]
== newhonors2 (1 distinct, 24 total) ==
Aug 9 02:13:03 newhonors2 dhcpcd[942605]: dhcpcd is not running [x24]
== orchids (1 distinct, 1 total) ==
Aug 9 02:10:04 orchids gnome-software[1516991]: failed to commit changes to dconf: GDBus.Error:org.gtk.GDBus.UnmappedGError.Quark._g_2dfile_2derror_2dquark.Code2: Failed to create file “/adminhomes/jworden/.config/dconf/user.0BEOT3”: Permission denied
== outbound00.cs.umd.edu (1 distinct, 6 total) ==
Aug 9 02:09:09 outbound00.cs.umd.edu python3[198663]: ldapdb [x6]
== outbound01.cs.umd.edu (3 distinct, 8 total) ==
Aug 9 02:13:06 outbound01.cs.umd.edu python3[2430584]: ldapdb [x6]
Aug 9 03:03:35 outbound01.cs.umd.edu krb5_child[2442624]: Client 'admin(a)UMD.EDU' not found in Kerberos database
Aug 9 03:04:11 outbound01.cs.umd.edu sshd-session[2442633]: error: Protocol major versions differ: 2 vs. 1
== sentry-docker00.cs.umd.edu (32 distinct, 32 total) ==
Aug 9 02:16:06 sentry-docker00.cs.umd.edu systemd-udevd[659029]: Could not generate persistent MAC address for vethf943abe: No such file or directory
Aug 9 02:16:06 sentry-docker00.cs.umd.edu systemd-udevd[659030]: Could not generate persistent MAC address for vethb4e0374: No such file or directory
Aug 9 02:16:06 sentry-docker00.cs.umd.edu systemd-udevd[659055]: Could not generate persistent MAC address for veth111561c: No such file or directory
Aug 9 02:16:06 sentry-docker00.cs.umd.edu systemd-udevd[659056]: Could not generate persistent MAC address for vethb4a5937: No such file or directory
Aug 9 02:16:06 sentry-docker00.cs.umd.edu systemd-udevd[659070]: Could not generate persistent MAC address for veth145c769: No such file or directory
Aug 9 02:16:06 sentry-docker00.cs.umd.edu systemd-udevd[659077]: Could not generate persistent MAC address for veth68847cc: No such file or directory
Aug 9 02:16:06 sentry-docker00.cs.umd.edu systemd-udevd[659059]: Could not generate persistent MAC address for vethf45eaeb: No such file or directory
Aug 9 02:16:06 sentry-docker00.cs.umd.edu systemd-udevd[659074]: Could not generate persistent MAC address for veth63580c7: No such file or directory
Aug 9 02:16:06 sentry-docker00.cs.umd.edu systemd-udevd[659077]: Could not generate persistent MAC address for vetha8e34ab: No such file or directory
Aug 9 02:16:06 sentry-docker00.cs.umd.edu systemd-udevd[659059]: Could not generate persistent MAC address for veth8d1577d: No such file or directory
Aug 9 02:36:14 sentry-docker00.cs.umd.edu systemd-udevd[668765]: link_config: could not get ethtool features for veth111561c
Aug 9 02:36:14 sentry-docker00.cs.umd.edu systemd-udevd[668765]: Could not set offload features of veth111561c: No such device
Aug 9 02:36:14 sentry-docker00.cs.umd.edu systemd-udevd[668800]: Could not generate persistent MAC address for vethb7bb344: No such file or directory
Aug 9 02:36:14 sentry-docker00.cs.umd.edu systemd-udevd[668801]: Could not generate persistent MAC address for veth16f71fe: No such file or directory
Aug 9 02:36:14 sentry-docker00.cs.umd.edu systemd-udevd[668819]: Could not generate persistent MAC address for veth2d273dc: No such file or directory
Aug 9 02:36:14 sentry-docker00.cs.umd.edu systemd-udevd[668804]: Could not generate persistent MAC address for veth03bd6eb: No such file or directory
Aug 9 02:36:14 sentry-docker00.cs.umd.edu systemd-udevd[668801]: Could not generate persistent MAC address for veth2281572: No such file or directory
Aug 9 02:36:14 sentry-docker00.cs.umd.edu systemd-udevd[668806]: Could not generate persistent MAC address for veth4ac9e13: No such file or directory
Aug 9 02:36:14 sentry-docker00.cs.umd.edu systemd-udevd[668829]: Could not generate persistent MAC address for vetheb87ebd: No such file or directory
Aug 9 02:36:14 sentry-docker00.cs.umd.edu systemd-udevd[668813]: Could not generate persistent MAC address for veth973432f: No such file or directory
Aug 9 02:36:14 sentry-docker00.cs.umd.edu systemd-udevd[668832]: Could not generate persistent MAC address for vethf1ae379: No such file or directory
Aug 9 02:36:14 sentry-docker00.cs.umd.edu systemd-udevd[668833]: Could not generate persistent MAC address for veth894cd99: No such file or directory
Aug 9 02:56:23 sentry-docker00.cs.umd.edu systemd-udevd[678367]: Could not generate persistent MAC address for vethe456824: No such file or directory
Aug 9 02:56:23 sentry-docker00.cs.umd.edu systemd-udevd[678368]: Could not generate persistent MAC address for veth5a48f24: No such file or directory
Aug 9 02:56:23 sentry-docker00.cs.umd.edu systemd-udevd[678398]: Could not generate persistent MAC address for veth520b5f3: No such file or directory
Aug 9 02:56:23 sentry-docker00.cs.umd.edu systemd-udevd[678399]: Could not generate persistent MAC address for veth690190d: No such file or directory
Aug 9 02:56:23 sentry-docker00.cs.umd.edu systemd-udevd[678417]: Could not generate persistent MAC address for vethfede0a2: No such file or directory
Aug 9 02:56:23 sentry-docker00.cs.umd.edu systemd-udevd[678408]: Could not generate persistent MAC address for vetha4aac82: No such file or directory
Aug 9 02:56:23 sentry-docker00.cs.umd.edu systemd-udevd[678426]: Could not generate persistent MAC address for vethdfaedff: No such file or directory
Aug 9 02:56:23 sentry-docker00.cs.umd.edu systemd-udevd[678427]: Could not generate persistent MAC address for veth34f7373: No such file or directory
... 2 more distinct messages not shown
== strawberry (2 distinct, 8 total) ==
Aug 9 02:09:44 strawberry udisksd[1067]: Error performing housekeeping for drive /org/freedesktop/UDisks2/drives/ST2000DM001_1CH164_W1E8J5KJ: Error updating SMART data: Error sending ATA command CHECK POWER MODE: Unexpected sense data returned:#0120000: 00 00 00 00 00 00 00 00 00 00 00 00 00 00 00 00 ................#0120010: 00 00 00 00 00 00 00 00 00 00 00 00 00 00 00 00 ................#012 (g-io-error-quark, 0) [x6]
Aug 9 02:34:42 strawberry smartd[5314]: Device: /dev/sda [SAT], failed to read SMART Attribute Data [x2]
1
0
Command: /usr/local/sbin/syslog-digest.py
Time : 1.0563s
Status : exited 0
Output :
Syslog digest — 2026-08-09 02:05 EDT
Processed 11,221 lines, filtered 8,421 (75%). 2,800 unknown (121 distinct) from 22 host(s).
== abuse (3 distinct, 2254 total) ==
Aug 9 01:05:04 abuse systemd[1]: Failed to load environment files: Input/output error [x687]
Aug 9 01:05:04 abuse systemd[1]: choria-server.service failed to run 'start' task: Input/output error [x687]
Aug 9 01:05:04 abuse rsyslogd[21745]: imjournal: open() failed for path: '/var/lib/rsyslog/imjournal.state.tmp': Input/output error [v8.2404.0 try https://www.rsyslog.com/e/2433 ] [x880]
== b0b02.cs.umd.edu (1 distinct, 1 total) ==
Aug 9 01:51:05 b0b02.cs.umd.edu rustdesk[322341]: cannot open display:
== contest (9 distinct, 44 total) ==
Aug 9 01:06:00 contest goferd[1007]: [ERROR][worker-0] gofer.messaging.adapter.connect:33 - connect: proton+amqps://satellite8.cs.umd.edu:5647, failed: Connection amqps://satellite8.cs.umd.edu:5647 disconnected: Condition('proton.pythonio', 'Connection refused to all addresses') [x34]
Aug 9 01:48:19 contest setroubleshoot[868070]: SELinux is preventing /usr/libexec/platform-python3.6 from create access on the directory libdnf.xoLPFp. For complete SELinux messages run: sealert -l cb6b25c6-4765-4cf2-88a0-9b3b508e94e9
Aug 9 01:48:19 contest setroubleshoot[868070]: SELinux is preventing /usr/bin/gpgconf from add_name access on the directory repodata. For complete SELinux messages run: sealert -l 41cf7b1b-0f34-4609-98f2-b66e7825fef7
Aug 9 01:48:19 contest setroubleshoot[868070]: SELinux is preventing /usr/libexec/platform-python3.6 from create access on the file mirrorlist. For complete SELinux messages run: sealert -l fc20ff92-ea83-4f38-a24b-ddfd737a3141
Aug 9 01:48:20 contest setroubleshoot[868070]: SELinux is preventing /usr/libexec/platform-python3.6 from setattr access on the file repomd.xml. For complete SELinux messages run: sealert -l ac675631-fa35-4e93-adc9-b692b18e53e5 [x2]
Aug 9 01:48:20 contest setroubleshoot[868070]: SELinux is preventing /usr/libexec/platform-python3.6 from create access on the file repomd.xml.asc. For complete SELinux messages run: sealert -l fc20ff92-ea83-4f38-a24b-ddfd737a3141
Aug 9 01:48:20 contest setroubleshoot[868070]: SELinux is preventing /usr/libexec/platform-python3.6 from read access on the directory libdnf.xoLPFp. For complete SELinux messages run: sealert -l 45d103b6-0810-4890-a705-990118577ce8
Aug 9 01:48:20 contest setroubleshoot[868070]: SELinux is preventing /usr/libexec/platform-python3.6 from remove_name access on the directory repomd.xml. For complete SELinux messages run: sealert -l 7e499113-2fd7-4f67-bec6-3521efbe3637 [x2]
Aug 9 01:48:22 contest setroubleshoot[868070]: SELinux is preventing /usr/libexec/platform-python3.6 from rmdir access on the directory repodata. For complete SELinux messages run: sealert -l 3928930b-a1ed-448d-950b-0665ac2adef8
== csfw00a (1 distinct, 252 total) ==
Aug 9 01:04:21 csfw00a kernel: bnxt_en 0000:09:00.0 eth3: NIC Link is Down [x252]
== hackerman (1 distinct, 1 total) ==
Aug 9 01:19:00 hackerman gnome-software[2060381]: failed to commit changes to dconf: GDBus.Error:org.gtk.GDBus.UnmappedGError.Quark._g_2dfile_2derror_2dquark.Code2: Failed to create file “/adminhomes/sajith/.config/dconf/user.DWBKT3”: Permission denied
== hazfs.cs.umd.edu (11 distinct, 66 total) ==
Aug 9 01:47:36 hazfs.cs.umd.edu snmpd[1431]: send response: Failure in sendto [x6]
Aug 9 01:47:36 hazfs.cs.umd.edu snmpd[1431]: -- NET-SNMP-EXTEND-MIB::nsExtendStatus."userweb" [x6]
Aug 9 01:47:36 hazfs.cs.umd.edu snmpd[1431]: -- NET-SNMP-EXTEND-MIB::nsExtendStatus."zfslist" [x6]
Aug 9 01:47:36 hazfs.cs.umd.edu snmpd[1431]: -- NET-SNMP-EXTEND-MIB::nsExtendStatus."userhome" [x6]
Aug 9 01:47:36 hazfs.cs.umd.edu snmpd[1431]: -- NET-SNMP-EXTEND-MIB::nsExtendOutput1Line."userweb" [x6]
Aug 9 01:47:36 hazfs.cs.umd.edu snmpd[1431]: -- NET-SNMP-EXTEND-MIB::nsExtendOutput1Line."zfslist" [x6]
Aug 9 01:47:36 hazfs.cs.umd.edu snmpd[1431]: -- NET-SNMP-EXTEND-MIB::nsExtendOutput1Line."userhome" [x6]
Aug 9 01:47:36 hazfs.cs.umd.edu snmpd[1431]: -- NET-SNMP-EXTEND-MIB::nsExtendOutputFull."userweb" [x6]
Aug 9 01:47:36 hazfs.cs.umd.edu snmpd[1431]: -- NET-SNMP-EXTEND-MIB::nsExtendOutputFull."zfslist" [x6]
Aug 9 01:47:36 hazfs.cs.umd.edu snmpd[1431]: -- NET-SNMP-EXTEND-MIB::nsExtendOutputFull."userhome" [x6]
Aug 9 01:47:36 hazfs.cs.umd.edu snmpd[1431]: -- NET-SNMP-EXTEND-MIB::nsExtendOutNumLines."userweb" [x6]
== idm00 (2 distinct, 2 total) ==
Aug 9 01:24:10 idm00 named[243294]: client @0x7f5f08007d58 10.73.245.12#61457: update '73.10.in-addr.arpa/IN' denied
Aug 9 01:51:21 idm00 named[243294]: client @0x7f5f10073398 10.73.240.42#63353: update '73.10.in-addr.arpa/IN' denied
== idmp0 (1 distinct, 1 total) ==
Aug 9 01:36:01 idmp0 named[1540302]: client @0x7ff7a88c1b18 10.73.240.43#60664: update '73.10.in-addr.arpa/IN' denied
== itmon02 (1 distinct, 46 total) ==
Aug 9 01:07:49 itmon02 sshd[1750555]: error: beginning MaxStartups throttling [x46]
== krispykreme.cs.umd.edu (4 distinct, 4 total) ==
Aug 9 01:08:42 krispykreme.cs.umd.edu sshd-session[914216]: pam_access(sshd:auth): access denied for user `admin' from `104.199.1.77'
Aug 9 01:08:42 krispykreme.cs.umd.edu krb5_child[914218]: Client 'admin(a)UMD.EDU' not found in Kerberos database
Aug 9 01:08:42 krispykreme.cs.umd.edu sshd-session[914214]: error: PAM: System error for admin from 104.199.1.77
Aug 9 01:08:47 krispykreme.cs.umd.edu sshd-session[914220]: error: Protocol major versions differ: 2 vs. 1
== networkvm01.cs.umd.edu (9 distinct, 9 total) ==
Aug 9 01:26:54 networkvm01.cs.umd.edu setroubleshoot[3078225]: SELinux is preventing /usr/bin/gpg from write access on the directory /(null). For complete SELinux messages run: sealert -l 8ead1354-ae8a-4a17-bb3f-146ebf6c892c
Aug 9 01:26:54 networkvm01.cs.umd.edu setroubleshoot[3078225]: SELinux is preventing /usr/bin/gpg from add_name access on the directory /(null). For complete SELinux messages run: sealert -l f9b51e91-5dbc-455f-88c2-f0746a2f0f4c
Aug 9 01:26:54 networkvm01.cs.umd.edu setroubleshoot[3078225]: SELinux is preventing /usr/bin/gpg from create access on the file /(null). For complete SELinux messages run: sealert -l af0a60e6-c449-4bdd-bfb8-c69b58472884
Aug 9 01:26:54 networkvm01.cs.umd.edu setroubleshoot[3078225]: SELinux is preventing /usr/bin/gpg from link access on the file /(null). For complete SELinux messages run: sealert -l 3df452f6-4d9e-4e38-946b-ea8e1edd356c
Aug 9 01:26:54 networkvm01.cs.umd.edu setroubleshoot[3078225]: SELinux is preventing /usr/bin/gpg from remove_name access on the directory .#lk0x00005639aec1fed0.networkvm01.cs.umd.edu.3078224x. For complete SELinux messages run: sealert -l fcac71c9-c7c0-45a9-9dc2-a8dcbeccfc75
Aug 9 01:26:54 networkvm01.cs.umd.edu setroubleshoot[3078225]: SELinux is preventing /usr/bin/gpg from unlink access on the file .#lk0x00005639aec1fed0.networkvm01.cs.umd.edu.3078224x. For complete SELinux messages run: sealert -l a672ebb7-fa69-419c-b1f0-fb386b8b48a6
Aug 9 01:26:54 networkvm01.cs.umd.edu setroubleshoot[3078225]: SELinux is preventing /usr/bin/gpg from write access on the directory /(null). For complete SELinux messages run: sealert -l fec9104e-d27a-4fd4-9872-6b17088c2951
Aug 9 01:26:54 networkvm01.cs.umd.edu setroubleshoot[3078225]: SELinux is preventing /usr/bin/gpg from add_name access on the directory /(null). For complete SELinux messages run: sealert -l 26718b2a-493d-457d-818c-244bd8d4ec9d
Aug 9 01:26:54 networkvm01.cs.umd.edu setroubleshoot[3078225]: SELinux is preventing /usr/bin/gpg from remove_name access on the directory .#lk0x000055d00f4c6ee0.networkvm01.cs.umd.edu.3078251x. For complete SELinux messages run: sealert -l 80e6efe4-93f3-4219-8132-b2b52db1f517
== newhonors2 (1 distinct, 24 total) ==
Aug 9 01:13:03 newhonors2 dhcpcd[940763]: dhcpcd is not running [x24]
== outbound00.cs.umd.edu (1 distinct, 6 total) ==
Aug 9 01:09:09 outbound00.cs.umd.edu python3[184850]: ldapdb [x6]
== outbound01.cs.umd.edu (1 distinct, 6 total) ==
Aug 9 01:13:07 outbound01.cs.umd.edu python3[2416546]: ldapdb [x6]
== peach.cs.umd.edu (2 distinct, 2 total) ==
Aug 9 01:22:09 peach.cs.umd.edu setroubleshoot[3445198]: SELinux is preventing /usr/bin/qemu-ga from search access on the directory /var/lib/containers/storage/overlay. For complete SELinux messages run: sealert -l ba415951-a2c6-424e-b17d-305c5300b9f3
Aug 9 01:22:09 peach.cs.umd.edu setroubleshoot[3445198]: SELinux is preventing /usr/bin/qemu-ga from search access on the directory /var/lib/containers/storage/overlay. For complete SELinux messages run: sealert -l 6aeb0956-fcf2-462a-ae4d-439b912c16d0
== quiss (1 distinct, 1 total) ==
Aug 9 01:46:34 quiss gnome-software[879803]: failed to commit changes to dconf: GDBus.Error:org.gtk.GDBus.UnmappedGError.Quark._g_2dfile_2derror_2dquark.Code2: Failed to create file “/adminhomes/josephao/.config/dconf/user.YAWHT3”: Permission denied
== sentry-docker00.cs.umd.edu (40 distinct, 40 total) ==
Aug 9 01:15:41 sentry-docker00.cs.umd.edu systemd-udevd[630500]: link_config: could not get ethtool features for vethaf19879
Aug 9 01:15:41 sentry-docker00.cs.umd.edu systemd-udevd[630500]: Could not set offload features of vethaf19879: No such device
Aug 9 01:15:41 sentry-docker00.cs.umd.edu systemd-udevd[630504]: link_config: could not get ethtool features for vethb833168
Aug 9 01:15:41 sentry-docker00.cs.umd.edu systemd-udevd[630504]: Could not set offload features of vethb833168: No such device
Aug 9 01:15:41 sentry-docker00.cs.umd.edu systemd-udevd[630537]: Could not generate persistent MAC address for veth8fb3466: No such file or directory
Aug 9 01:15:41 sentry-docker00.cs.umd.edu systemd-udevd[630538]: Could not generate persistent MAC address for vethf94250c: No such file or directory
Aug 9 01:15:41 sentry-docker00.cs.umd.edu systemd-udevd[630541]: Could not generate persistent MAC address for veth97947ba: No such file or directory
Aug 9 01:15:41 sentry-docker00.cs.umd.edu systemd-udevd[630548]: Could not generate persistent MAC address for veth5c493e1: No such file or directory
Aug 9 01:15:41 sentry-docker00.cs.umd.edu systemd-udevd[630546]: Could not generate persistent MAC address for veth8e10a31: No such file or directory
Aug 9 01:15:41 sentry-docker00.cs.umd.edu systemd-udevd[630562]: Could not generate persistent MAC address for veth00d825f: No such file or directory
Aug 9 01:15:41 sentry-docker00.cs.umd.edu systemd-udevd[630562]: Could not generate persistent MAC address for veth8a2f147: No such file or directory
Aug 9 01:15:41 sentry-docker00.cs.umd.edu systemd-udevd[630552]: Could not generate persistent MAC address for veth5d3e60d: No such file or directory
Aug 9 01:15:41 sentry-docker00.cs.umd.edu systemd-udevd[630628]: Could not generate persistent MAC address for vethc48ecaa: No such file or directory
Aug 9 01:15:41 sentry-docker00.cs.umd.edu systemd-udevd[630629]: Could not generate persistent MAC address for veth4d65e9f: No such file or directory
Aug 9 01:35:49 sentry-docker00.cs.umd.edu systemd-udevd[640173]: link_config: could not get ethtool features for veth8a2f147
Aug 9 01:35:49 sentry-docker00.cs.umd.edu systemd-udevd[640173]: Could not set offload features of veth8a2f147: No such device
Aug 9 01:35:49 sentry-docker00.cs.umd.edu systemd-udevd[640235]: Could not generate persistent MAC address for vethd9162ea: No such file or directory
Aug 9 01:35:49 sentry-docker00.cs.umd.edu systemd-udevd[640236]: Could not generate persistent MAC address for vethf314cd1: No such file or directory
Aug 9 01:35:49 sentry-docker00.cs.umd.edu systemd-udevd[640254]: Could not generate persistent MAC address for veth93741ba: No such file or directory
Aug 9 01:35:49 sentry-docker00.cs.umd.edu systemd-udevd[640251]: Could not generate persistent MAC address for veth596929c: No such file or directory
Aug 9 01:35:49 sentry-docker00.cs.umd.edu systemd-udevd[640257]: Could not generate persistent MAC address for vethd6eecf1: No such file or directory
Aug 9 01:35:49 sentry-docker00.cs.umd.edu systemd-udevd[640259]: Could not generate persistent MAC address for vethbcc3412: No such file or directory
Aug 9 01:35:49 sentry-docker00.cs.umd.edu systemd-udevd[640266]: Could not generate persistent MAC address for vethdef2819: No such file or directory
Aug 9 01:35:49 sentry-docker00.cs.umd.edu systemd-udevd[640265]: Could not generate persistent MAC address for veth9450715: No such file or directory
Aug 9 01:35:49 sentry-docker00.cs.umd.edu systemd-udevd[640269]: Could not generate persistent MAC address for veth5288278: No such file or directory
Aug 9 01:35:49 sentry-docker00.cs.umd.edu systemd-udevd[640266]: Could not generate persistent MAC address for vethf662514: No such file or directory
Aug 9 01:55:58 sentry-docker00.cs.umd.edu systemd-udevd[649564]: link_config: could not get ethtool features for veth5288278
Aug 9 01:55:58 sentry-docker00.cs.umd.edu systemd-udevd[649564]: Could not set offload features of veth5288278: No such device
Aug 9 01:55:58 sentry-docker00.cs.umd.edu systemd-udevd[649566]: link_config: could not set ethtool features for veth596929c
Aug 9 01:55:58 sentry-docker00.cs.umd.edu systemd-udevd[649566]: Could not set offload features of veth596929c: Operation not permitted
... 10 more distinct messages not shown
== strawberry (2 distinct, 8 total) ==
Aug 9 01:09:44 strawberry udisksd[1067]: Error performing housekeeping for drive /org/freedesktop/UDisks2/drives/ST2000DM001_1CH164_W1E8J5KJ: Error updating SMART data: Error sending ATA command CHECK POWER MODE: Unexpected sense data returned:#0120000: 00 00 00 00 00 00 00 00 00 00 00 00 00 00 00 00 ................#0120010: 00 00 00 00 00 00 00 00 00 00 00 00 00 00 00 00 ................#012 (g-io-error-quark, 0) [x6]
Aug 9 01:34:42 strawberry smartd[5314]: Device: /dev/sda [SAT], failed to read SMART Attribute Data [x2]
== submit26-b9-2 (9 distinct, 9 total) ==
Aug 9 01:12:54 submit26-b9-2 setroubleshoot[1422282]: SELinux is preventing /usr/bin/python3.9 from create access on the directory /(null). For complete SELinux messages run: sealert -l d506243c-d61e-48f3-b42a-4592c913deb0
Aug 9 01:12:54 submit26-b9-2 setroubleshoot[1422282]: SELinux is preventing /usr/bin/python3.9 from add_name access on the directory /(null). For complete SELinux messages run: sealert -l 3b4752ac-1b9a-4af9-a05b-32e4c2eb13ab
Aug 9 01:12:54 submit26-b9-2 setroubleshoot[1422282]: SELinux is preventing /usr/bin/python3.9 from create access on the file /(null). For complete SELinux messages run: sealert -l 29e5adbd-4381-4467-b40d-a2219101e096
Aug 9 01:12:54 submit26-b9-2 setroubleshoot[1422282]: SELinux is preventing /usr/bin/python3.9 from open access on the file /tmp/libdnf.ukyoTb/repodata/repomd.xml. For complete SELinux messages run: sealert -l 1b38f2ec-01ce-4343-8059-ba7494ecc5c4
Aug 9 01:12:54 submit26-b9-2 setroubleshoot[1422282]: SELinux is preventing /usr/bin/python3.9 from setattr access on the file repomd.xml. For complete SELinux messages run: sealert -l e5f9af40-1f63-4924-b012-27ab2a7b2266
Aug 9 01:12:54 submit26-b9-2 setroubleshoot[1422282]: SELinux is preventing /usr/bin/python3.9 from read access on the directory libdnf.ukyoTb. For complete SELinux messages run: sealert -l 5c54db87-54a3-4a7c-97b4-b5c48d6c3543
Aug 9 01:12:54 submit26-b9-2 setroubleshoot[1422282]: SELinux is preventing /usr/bin/python3.9 from remove_name access on the directory repomd.xml. For complete SELinux messages run: sealert -l 63cd60e1-1e61-4276-afea-dd8526ffe8b2
Aug 9 01:12:54 submit26-b9-2 setroubleshoot[1422282]: SELinux is preventing /usr/bin/python3.9 from unlink access on the file repomd.xml. For complete SELinux messages run: sealert -l 81c7e9ec-e023-4c6d-b1ad-c02a242e655e
Aug 9 01:12:54 submit26-b9-2 setroubleshoot[1422282]: SELinux is preventing /usr/bin/python3.9 from rmdir access on the directory repodata. For complete SELinux messages run: sealert -l 6ae9a597-e123-4d74-8eec-a8ebe0f5e4d0
== submit26-b9-3 (10 distinct, 13 total) ==
Aug 9 01:20:40 submit26-b9-3 setroubleshoot[941555]: SELinux is preventing /usr/bin/python3.9 from create access on the directory /(null). For complete SELinux messages run: sealert -l 5b912a44-22fd-4560-b201-2a4e289b73f5
Aug 9 01:20:40 submit26-b9-3 setroubleshoot[941555]: SELinux is preventing /usr/bin/python3.9 from add_name access on the directory /(null). For complete SELinux messages run: sealert -l 7f1df1e4-725e-4953-98eb-1079f908f543
Aug 9 01:20:40 submit26-b9-3 setroubleshoot[941555]: SELinux is preventing /usr/bin/python3.9 from create access on the file /(null). For complete SELinux messages run: sealert -l 40b8852a-f77b-44b4-affe-5f11fa33de43 [x2]
Aug 9 01:20:41 submit26-b9-3 setroubleshoot[941555]: SELinux is preventing /usr/bin/python3.9 from open access on the file /tmp/libdnf.JCioJs/repodata/repomd.xml. For complete SELinux messages run: sealert -l 45a8019e-f6b5-4baa-92c1-862594b40d46
Aug 9 01:20:41 submit26-b9-3 setroubleshoot[941555]: SELinux is preventing /usr/bin/python3.9 from setattr access on the file repomd.xml. For complete SELinux messages run: sealert -l e9f0bfff-7784-4126-baa4-2bb06da56591 [x2]
Aug 9 01:20:41 submit26-b9-3 setroubleshoot[941555]: SELinux is preventing /usr/bin/python3.9 from read access on the directory libdnf.JCioJs. For complete SELinux messages run: sealert -l 0b17cc3d-cdc6-4fe2-a11f-3892e7c41dc7
Aug 9 01:20:41 submit26-b9-3 setroubleshoot[941555]: SELinux is preventing /usr/bin/python3.9 from remove_name access on the directory repomd.xml. For complete SELinux messages run: sealert -l 10e38c64-b65f-4cdd-901e-4375652d9a42
Aug 9 01:20:41 submit26-b9-3 setroubleshoot[941555]: SELinux is preventing /usr/bin/python3.9 from unlink access on the file repomd.xml. For complete SELinux messages run: sealert -l 7fd9cf72-ef38-48e1-b6aa-b571b26a7b22 [x2]
Aug 9 01:20:41 submit26-b9-3 setroubleshoot[941555]: SELinux is preventing /usr/bin/python3.9 from rmdir access on the directory repodata. For complete SELinux messages run: sealert -l b9b11116-89bd-4a3c-980c-1d422c5dcee4
Aug 9 01:20:41 submit26-b9-3 setroubleshoot[941555]: SELinux is preventing /usr/bin/python3.9 from open access on the file /tmp/libdnf.vwh0qZ/repodata/repomd.xml. For complete SELinux messages run: sealert -l 45a8019e-f6b5-4baa-92c1-862594b40d46
== submit26-clnb9 (9 distinct, 9 total) ==
Aug 9 01:32:00 submit26-clnb9 setroubleshoot[2006667]: SELinux is preventing /usr/bin/python3.9 from create access on the directory /(null). For complete SELinux messages run: sealert -l 6783ed2b-5ae4-42b5-975a-4bf50eec4658
Aug 9 01:32:00 submit26-clnb9 setroubleshoot[2006667]: SELinux is preventing /usr/bin/python3.9 from add_name access on the directory /(null). For complete SELinux messages run: sealert -l 9e7fa955-cc30-4804-ac8c-e1779e85946c
Aug 9 01:32:00 submit26-clnb9 setroubleshoot[2006667]: SELinux is preventing /usr/bin/python3.9 from create access on the file /(null). For complete SELinux messages run: sealert -l 69bfa6e3-089c-40ff-9563-fd30787d0774
Aug 9 01:32:00 submit26-clnb9 setroubleshoot[2006667]: SELinux is preventing /usr/bin/python3.9 from open access on the file /tmp/libdnf.XBPqHN/repodata/repomd.xml. For complete SELinux messages run: sealert -l 001acdb5-31ef-4e52-b10b-90f467a89ddc
Aug 9 01:32:00 submit26-clnb9 setroubleshoot[2006667]: SELinux is preventing /usr/bin/python3.9 from setattr access on the file repomd.xml. For complete SELinux messages run: sealert -l edacddcf-16ed-4dc3-8d82-7c597d5dee23
Aug 9 01:32:00 submit26-clnb9 setroubleshoot[2006667]: SELinux is preventing /usr/bin/python3.9 from read access on the directory libdnf.XBPqHN. For complete SELinux messages run: sealert -l 62b3782e-4730-4488-8178-94dafe9b552c
Aug 9 01:32:00 submit26-clnb9 setroubleshoot[2006667]: SELinux is preventing /usr/bin/python3.9 from remove_name access on the directory repomd.xml. For complete SELinux messages run: sealert -l 81cb3698-78f8-440a-8e3c-e5d1041e6b78
Aug 9 01:32:00 submit26-clnb9 setroubleshoot[2006667]: SELinux is preventing /usr/bin/python3.9 from unlink access on the file repomd.xml. For complete SELinux messages run: sealert -l 792b472a-115c-4799-9805-fc7436f916b9
Aug 9 01:32:00 submit26-clnb9 setroubleshoot[2006667]: SELinux is preventing /usr/bin/python3.9 from rmdir access on the directory repodata. For complete SELinux messages run: sealert -l 15c83a86-837b-41e2-b662-b39cd4e361cb
== zebatinsky.cs.umd.edu (2 distinct, 2 total) ==
Aug 9 01:21:16 zebatinsky.cs.umd.edu setroubleshoot[2194646]: SELinux is preventing pdns/comm-main from name_bind access on the udp_socket port 10514. For complete SELinux messages run: sealert -l 606ba02b-0a21-433e-9c00-e94e15b5015c
Aug 9 02:01:15 zebatinsky.cs.umd.edu setroubleshoot[2200648]: SELinux is preventing /usr/sbin/pdns_server from name_bind access on the udp_socket port 10110. For complete SELinux messages run: sealert -l 28344f9d-5d53-4ec9-9f0b-b3effbe47e8c
1
0
Command: /usr/local/sbin/syslog-digest.py
Time : 1.0775s
Status : exited 0
Output :
Syslog digest — 2026-08-09 01:05 EDT
Processed 12,247 lines, filtered 9,521 (77%). 2,726 unknown (120 distinct) from 38 host(s).
== abuse (3 distinct, 2249 total) ==
Aug 9 00:05:06 abuse systemd[1]: Failed to load environment files: Input/output error [x687]
Aug 9 00:05:06 abuse systemd[1]: choria-server.service failed to run 'start' task: Input/output error [x688]
Aug 9 00:05:06 abuse rsyslogd[21745]: imjournal: open() failed for path: '/var/lib/rsyslog/imjournal.state.tmp': Input/output error [v8.2404.0 try https://www.rsyslog.com/e/2433 ] [x874]
== atif01.cs.umd.edu (4 distinct, 7 total) ==
Aug 9 00:18:58 atif01.cs.umd.edu xinetd[26309]: warning: can't get client address: Connection reset by peer [x2]
Aug 9 00:18:58 atif01.cs.umd.edu kernel: nfsd: peername failed (err 107)! [x3]
Aug 9 00:30:23 atif01.cs.umd.edu kernel: net_ratelimit: 14 callbacks suppressed
Aug 9 00:30:28 atif01.cs.umd.edu kernel: net_ratelimit: 1 callbacks suppressed
== b0b02.cs.umd.edu (1 distinct, 1 total) ==
Aug 9 00:51:01 b0b02.cs.umd.edu rustdesk[307272]: cannot open display:
== biggulp.cs.umd.edu (4 distinct, 4 total) ==
Aug 9 00:56:50 biggulp.cs.umd.edu sshd-session[4158699]: pam_access(sshd:auth): access denied for user `admin' from `35.240.46.200'
Aug 9 00:56:50 biggulp.cs.umd.edu krb5_child[4158701]: Client 'admin(a)UMD.EDU' not found in Kerberos database
Aug 9 00:56:50 biggulp.cs.umd.edu sshd-session[4158697]: error: PAM: System error for admin from 35.240.46.200
Aug 9 00:57:39 biggulp.cs.umd.edu sshd-session[4158759]: error: Protocol major versions differ: 2 vs. 1
== contest (1 distinct, 34 total) ==
Aug 9 00:05:18 contest goferd[1007]: [ERROR][worker-0] gofer.messaging.adapter.connect:33 - connect: proton+amqps://satellite8.cs.umd.edu:5647, failed: Connection amqps://satellite8.cs.umd.edu:5647 disconnected: Condition('proton.pythonio', 'Connection refused to all addresses') [x34]
== csfw00a (2 distinct, 242 total) ==
Aug 9 00:05:10 csfw00a kernel: bnxt_en 0000:09:00.0 eth3: NIC Link is Down [x234]
Aug 9 00:07:56 csfw00a ospf6d[1477]: [EC 100663307] Could not send entire message [x8]
== cskayako (2 distinct, 2 total) ==
Aug 9 00:06:39 cskayako setroubleshoot[2814864]: SELinux is preventing /usr/bin/php from add_name access on the directory /var/www/html/(null). For complete SELinux messages run: sealert -l 5239c113-abc1-4953-a9c0-21d695a0d1bb
Aug 9 00:06:39 cskayako setroubleshoot[2814864]: SELinux is preventing /usr/bin/php from create access on the file /var/www/html/(null). For complete SELinux messages run: sealert -l cacf8f36-45b0-4374-9a33-d15de767aae7
== dojo (1 distinct, 1 total) ==
Aug 9 00:50:02 dojo sshd[1486218]: error: Protocol major versions differ: 2 vs. 1
== grades01.cs.umd.edu (3 distinct, 4 total) ==
Aug 9 00:10:12 grades01.cs.umd.edu systemd[1]: New main PID 22266 does not belong to service, and PID file is not owned by root. Refusing. [x2]
Aug 9 00:10:33 grades01.cs.umd.edu systemd[1]: Daemon never wrote its PID file. Failing.
Aug 9 00:10:48 grades01.cs.umd.edu systemd[1]: pmlogger.service: Supervising process 29792 which is not our child. We'll most likely not notice when it exits.
== idm00 (1 distinct, 1 total) ==
Aug 9 00:51:21 idm00 named[243294]: client @0x7f5f19397248 10.73.240.42#57688: update '73.10.in-addr.arpa/IN' denied
== idmp0 (1 distinct, 1 total) ==
Aug 9 00:36:01 idmp0 named[1540302]: client @0x7ff7dc006588 10.73.240.43#50211: update '73.10.in-addr.arpa/IN' denied
== inbound01.cs.umd.edu (1 distinct, 1 total) ==
Aug 9 00:12:16 inbound01.cs.umd.edu krb5_child[2434454]: Client 'admin(a)UMD.EDU' not found in Kerberos database
== itmon02 (2 distinct, 27 total) ==
Aug 9 00:07:57 itmon02 sshd[1750555]: error: beginning MaxStartups throttling [x26]
Aug 9 00:33:05 itmon02 (httpd)[1997860]: httpd.service: Referenced but unset environment variable evaluates to an empty string: OPTIONS
== jubjub.cs.umd.edu (3 distinct, 4 total) ==
Aug 9 00:10:12 jubjub.cs.umd.edu systemd[1]: New main PID 3232135 does not belong to service, and PID file is not owned by root. Refusing. [x2]
Aug 9 00:10:31 jubjub.cs.umd.edu systemd[1]: Daemon never wrote its PID file. Failing.
Aug 9 00:10:40 jubjub.cs.umd.edu systemd[1]: pmlogger.service: Supervising process 3239650 which is not our child. We'll most likely not notice when it exits.
== mirrors.cs.umd.edu (3 distinct, 4 total) ==
Aug 9 00:10:13 mirrors.cs.umd.edu systemd[1]: New main PID 12109 does not belong to service, and PID file is not owned by root. Refusing. [x2]
Aug 9 00:10:31 mirrors.cs.umd.edu systemd[1]: Daemon never wrote its PID file. Failing.
Aug 9 00:10:44 mirrors.cs.umd.edu systemd[1]: pmlogger.service: Supervising process 19156 which is not our child. We'll most likely not notice when it exits.
== misty.cs.umd.edu (3 distinct, 4 total) ==
Aug 9 00:10:15 misty.cs.umd.edu systemd[1]: New main PID 29854 does not belong to service, and PID file is not owned by root. Refusing. [x2]
Aug 9 00:10:35 misty.cs.umd.edu systemd[1]: Daemon never wrote its PID file. Failing.
Aug 9 00:10:51 misty.cs.umd.edu systemd[1]: pmlogger.service: Supervising process 37557 which is not our child. We'll most likely not notice when it exits.
== munin (3 distinct, 9 total) ==
Aug 9 00:38:08 munin sudo[3973016]: pam_systemd(sudo:session): Failed to stat() runtime directory '/run/user/0': No such file or directory [x4]
Aug 9 00:38:08 munin sudo[3973016]: pam_systemd(sudo:session): Not setting $XDG_RUNTIME_DIR, as the directory is not in order. [x4]
Aug 9 00:46:15 munin (httpd)[3975449]: httpd.service: Referenced but unset environment variable evaluates to an empty string: OPTIONS
== netbox (1 distinct, 1 total) ==
Aug 9 00:23:51 netbox (httpd)[2288845]: httpd.service: Referenced but unset environment variable evaluates to an empty string: OPTIONS
== netman.cs.umd.edu (5 distinct, 8 total) ==
Aug 9 00:30:02 netman.cs.umd.edu setroubleshoot[2646622]: SELinux is preventing /usr/bin/gpg from read access on the file gpg.conf. For complete SELinux messages run: sealert -l 019ad1da-a874-4814-8037-3b3e5f413ad2
Aug 9 00:30:03 netman.cs.umd.edu setroubleshoot[2646622]: SELinux is preventing /usr/bin/gpg from open access on the file /root/.gnupg/gpg.conf. For complete SELinux messages run: sealert -l cb54177e-d44c-46a1-b246-5c0bbb8343be
Aug 9 00:30:03 netman.cs.umd.edu setroubleshoot[2646622]: SELinux is preventing /usr/bin/gpg from getattr access on the file /root/.gnupg/gpg.conf. For complete SELinux messages run: sealert -l fbba2e30-b7ab-491c-9ec6-f553e9ef72af
Aug 9 00:43:35 netman.cs.umd.edu krb5_child[2650051]: Client 'admin(a)UMD.EDU' not found in Kerberos database [x4]
Aug 9 00:43:40 netman.cs.umd.edu sshd[2650048]: error: PAM: Authentication failure for admin from 207.175.74.189
== newhonors2 (1 distinct, 24 total) ==
Aug 9 00:13:02 newhonors2 dhcpcd[938921]: dhcpcd is not running [x24]
== openrepo (1 distinct, 1 total) ==
Aug 9 00:46:53 openrepo (nin-node)[1800639]: munin-node.service: Referenced but unset environment variable evaluates to an empty string: DAEMON_ARGS
== openvox08-board (1 distinct, 1 total) ==
Aug 9 00:22:18 openvox08-board (httpd)[1438332]: httpd.service: Referenced but unset environment variable evaluates to an empty string: OPTIONS
== orchids (1 distinct, 1 total) ==
Aug 9 00:10:04 orchids gnome-software[1516991]: failed to commit changes to dconf: GDBus.Error:org.gtk.GDBus.UnmappedGError.Quark._g_2dfile_2derror_2dquark.Code2: Failed to create file “/adminhomes/jworden/.config/dconf/user.1BUUT3”: Permission denied
== outbound00.cs.umd.edu (2 distinct, 7 total) ==
Aug 9 00:09:09 outbound00.cs.umd.edu python3[169305]: ldapdb [x6]
Aug 9 00:11:42 outbound00.cs.umd.edu krb5_child[170525]: Client 'admin(a)UMD.EDU' not found in Kerberos database
== outbound01.cs.umd.edu (1 distinct, 6 total) ==
Aug 9 00:13:06 outbound01.cs.umd.edu python3[2401688]: ldapdb [x6]
== peach.cs.umd.edu (2 distinct, 2 total) ==
Aug 9 00:22:08 peach.cs.umd.edu setroubleshoot[3438997]: SELinux is preventing /usr/bin/qemu-ga from search access on the directory /var/lib/containers/storage/overlay. For complete SELinux messages run: sealert -l ba415951-a2c6-424e-b17d-305c5300b9f3
Aug 9 00:22:08 peach.cs.umd.edu setroubleshoot[3438997]: SELinux is preventing /usr/bin/qemu-ga from search access on the directory /var/lib/containers/storage/overlay. For complete SELinux messages run: sealert -l 6aeb0956-fcf2-462a-ae4d-439b912c16d0
== sebatinsky.cs.umd.edu (1 distinct, 2 total) ==
Aug 9 00:25:58 sebatinsky.cs.umd.edu kernel: hpet1: lost 8 rtc interrupts [x2]
== sentry-docker00.cs.umd.edu (34 distinct, 34 total) ==
Aug 9 00:15:16 sentry-docker00.cs.umd.edu systemd-udevd[602185]: link_config: could not get ethtool features for veth97b5425
Aug 9 00:15:16 sentry-docker00.cs.umd.edu systemd-udevd[602185]: Could not set offload features of veth97b5425: No such device
Aug 9 00:15:16 sentry-docker00.cs.umd.edu systemd-udevd[602264]: Could not generate persistent MAC address for vethe46c3dc: No such file or directory
Aug 9 00:15:16 sentry-docker00.cs.umd.edu systemd-udevd[602265]: Could not generate persistent MAC address for veth4a80fd2: No such file or directory
Aug 9 00:15:16 sentry-docker00.cs.umd.edu systemd-udevd[602268]: Could not generate persistent MAC address for vetha347bfc: No such file or directory
Aug 9 00:15:16 sentry-docker00.cs.umd.edu systemd-udevd[602269]: Could not generate persistent MAC address for veth56fedf1: No such file or directory
Aug 9 00:15:16 sentry-docker00.cs.umd.edu systemd-udevd[602272]: Could not generate persistent MAC address for veth5d1866b: No such file or directory
Aug 9 00:15:16 sentry-docker00.cs.umd.edu systemd-udevd[602290]: Could not generate persistent MAC address for veth825fe17: No such file or directory
Aug 9 00:15:16 sentry-docker00.cs.umd.edu systemd-udevd[602294]: Could not generate persistent MAC address for veth42848f2: No such file or directory
Aug 9 00:15:16 sentry-docker00.cs.umd.edu systemd-udevd[602295]: Could not generate persistent MAC address for veth632fd81: No such file or directory
Aug 9 00:15:16 sentry-docker00.cs.umd.edu systemd-udevd[602313]: Could not generate persistent MAC address for veth76e730c: No such file or directory
Aug 9 00:15:16 sentry-docker00.cs.umd.edu systemd-udevd[602320]: Could not generate persistent MAC address for vethdfff745: No such file or directory
Aug 9 00:35:24 sentry-docker00.cs.umd.edu systemd-udevd[611450]: Could not generate persistent MAC address for vethae38f3d: No such file or directory
Aug 9 00:35:24 sentry-docker00.cs.umd.edu systemd-udevd[611449]: Could not generate persistent MAC address for veth92cb8da: No such file or directory
Aug 9 00:35:24 sentry-docker00.cs.umd.edu systemd-udevd[611475]: Could not generate persistent MAC address for veth2c21948: No such file or directory
Aug 9 00:35:24 sentry-docker00.cs.umd.edu systemd-udevd[611476]: Could not generate persistent MAC address for veth64ce986: No such file or directory
Aug 9 00:35:24 sentry-docker00.cs.umd.edu systemd-udevd[611501]: Could not generate persistent MAC address for vethf10792b: No such file or directory
Aug 9 00:35:24 sentry-docker00.cs.umd.edu systemd-udevd[611502]: Could not generate persistent MAC address for veth3975fb2: No such file or directory
Aug 9 00:35:24 sentry-docker00.cs.umd.edu systemd-udevd[611520]: Could not generate persistent MAC address for veth1aa57cb: No such file or directory
Aug 9 00:35:24 sentry-docker00.cs.umd.edu systemd-udevd[611524]: Could not generate persistent MAC address for vethc081e13: No such file or directory
Aug 9 00:35:24 sentry-docker00.cs.umd.edu systemd-udevd[611541]: Could not generate persistent MAC address for veth05f19dd: No such file or directory
Aug 9 00:35:24 sentry-docker00.cs.umd.edu systemd-udevd[611545]: Could not generate persistent MAC address for vethd5b3180: No such file or directory
Aug 9 00:55:33 sentry-docker00.cs.umd.edu systemd-udevd[620992]: link_config: could not get ethtool features for veth1aa57cb
Aug 9 00:55:33 sentry-docker00.cs.umd.edu systemd-udevd[620992]: Could not set offload features of veth1aa57cb: No such device
Aug 9 00:55:33 sentry-docker00.cs.umd.edu systemd-udevd[621083]: Could not generate persistent MAC address for veth325fb33: No such file or directory
Aug 9 00:55:33 sentry-docker00.cs.umd.edu systemd-udevd[621086]: Could not generate persistent MAC address for veth66d71fb: No such file or directory
Aug 9 00:55:33 sentry-docker00.cs.umd.edu systemd-udevd[621092]: Could not generate persistent MAC address for vethecf55c8: No such file or directory
Aug 9 00:55:33 sentry-docker00.cs.umd.edu systemd-udevd[621090]: Could not generate persistent MAC address for vethd0f58ba: No such file or directory
Aug 9 00:55:33 sentry-docker00.cs.umd.edu systemd-udevd[621101]: Could not generate persistent MAC address for vethd2a56c2: No such file or directory
Aug 9 00:55:33 sentry-docker00.cs.umd.edu systemd-udevd[621086]: Could not generate persistent MAC address for vethb833168: No such file or directory
... 4 more distinct messages not shown
== strawberry (3 distinct, 9 total) ==
Aug 9 00:09:44 strawberry udisksd[1067]: Error performing housekeeping for drive /org/freedesktop/UDisks2/drives/ST2000DM001_1CH164_W1E8J5KJ: Error updating SMART data: Error sending ATA command CHECK POWER MODE: Unexpected sense data returned:#0120000: 00 00 00 00 00 00 00 00 00 00 00 00 00 00 00 00 ................#0120010: 00 00 00 00 00 00 00 00 00 00 00 00 00 00 00 00 ................#012 (g-io-error-quark, 0) [x6]
Aug 9 00:34:42 strawberry smartd[5314]: Device: /dev/sda [SAT], failed to read SMART Attribute Data [x2]
Aug 9 01:04:42 strawberry smartd[5314]: Device: /dev/sda [SAT], not capable of Offline or Self-Testing.
== submit10-cln25 (3 distinct, 4 total) ==
Aug 9 00:10:11 submit10-cln25 systemd: New main PID 20640 does not belong to service, and PID file is not owned by root. Refusing. [x2]
Aug 9 00:10:30 submit10-cln25 systemd: Daemon never wrote its PID file. Failing.
Aug 9 00:10:36 submit10-cln25 systemd: pmlogger.service: Supervising process 27582 which is not our child. We'll most likely not notice when it exits.
== submit26-b9-4 (9 distinct, 9 total) ==
Aug 9 00:15:31 submit26-b9-4 setroubleshoot[1408155]: SELinux is preventing /usr/bin/python3.9 from create access on the directory /(null). For complete SELinux messages run: sealert -l a4e66030-8621-4da9-bd27-5988bb1bf8ad
Aug 9 00:15:31 submit26-b9-4 setroubleshoot[1408155]: SELinux is preventing /usr/bin/python3.9 from add_name access on the directory /(null). For complete SELinux messages run: sealert -l c055e37d-bbf5-4800-9083-d606f792c8c1
Aug 9 00:15:31 submit26-b9-4 setroubleshoot[1408155]: SELinux is preventing /usr/bin/python3.9 from create access on the file /(null). For complete SELinux messages run: sealert -l e5bc3a56-6d6f-4776-954f-ddde1579648f
Aug 9 00:15:31 submit26-b9-4 setroubleshoot[1408155]: SELinux is preventing /usr/bin/python3.9 from open access on the file /tmp/libdnf.yIEa5Q/repodata/repomd.xml. For complete SELinux messages run: sealert -l a8ec5e1b-49f9-4fbc-a8ae-22e800f7abf2
Aug 9 00:15:31 submit26-b9-4 setroubleshoot[1408155]: SELinux is preventing /usr/bin/python3.9 from setattr access on the file repomd.xml. For complete SELinux messages run: sealert -l 945db714-d0c0-4402-911e-932978b8b036
Aug 9 00:15:31 submit26-b9-4 setroubleshoot[1408155]: SELinux is preventing /usr/bin/python3.9 from read access on the directory libdnf.yIEa5Q. For complete SELinux messages run: sealert -l 463998a0-fb0d-463c-82b1-471135710a14
Aug 9 00:15:31 submit26-b9-4 setroubleshoot[1408155]: SELinux is preventing /usr/bin/python3.9 from remove_name access on the directory repomd.xml. For complete SELinux messages run: sealert -l 473d2e21-15d8-407a-a9ee-2b842607fa00
Aug 9 00:15:31 submit26-b9-4 setroubleshoot[1408155]: SELinux is preventing /usr/bin/python3.9 from unlink access on the file repomd.xml. For complete SELinux messages run: sealert -l 80c54d4f-bf4b-4501-addb-1627383587d0
Aug 9 00:15:31 submit26-b9-4 setroubleshoot[1408155]: SELinux is preventing /usr/bin/python3.9 from rmdir access on the directory repodata. For complete SELinux messages run: sealert -l c63d3890-151e-49a0-83f0-3dfb69d051e5
== teaching-awards (1 distinct, 1 total) ==
Aug 9 00:55:22 teaching-awards krb5_child[2214763]: Client 'admin(a)UMD.EDU' not found in Kerberos database
== tlsrpt (1 distinct, 1 total) ==
Aug 9 00:56:06 tlsrpt (httpd)[884448]: httpd.service: Referenced but unset environment variable evaluates to an empty string: OPTIONS
== tma-0 (3 distinct, 4 total) ==
Aug 9 00:10:13 tma-0 systemd[1]: New main PID 2192 does not belong to service, and PID file is not owned by root. Refusing. [x2]
Aug 9 00:10:30 tma-0 systemd[1]: Daemon never wrote its PID file. Failing.
Aug 9 00:10:38 tma-0 systemd[1]: pmlogger.service: Supervising process 9843 which is not our child. We'll most likely not notice when it exits.
== uffish.cs.umd.edu (3 distinct, 4 total) ==
Aug 9 00:10:13 uffish.cs.umd.edu systemd[1]: New main PID 2478769 does not belong to service, and PID file is not owned by root. Refusing. [x2]
Aug 9 00:10:39 uffish.cs.umd.edu systemd[1]: Daemon never wrote its PID file. Failing.
Aug 9 00:10:55 uffish.cs.umd.edu systemd[1]: pmlogger.service: Supervising process 2486237 which is not our child. We'll most likely not notice when it exits.
== updates00.cs.umd.edu (3 distinct, 4 total) ==
Aug 9 00:10:12 updates00.cs.umd.edu systemd[1]: New main PID 24202 does not belong to service, and PID file is not owned by root. Refusing. [x2]
Aug 9 00:10:30 updates00.cs.umd.edu systemd[1]: Daemon never wrote its PID file. Failing.
Aug 9 00:10:37 updates00.cs.umd.edu systemd[1]: pmlogger.service: Supervising process 31208 which is not our child. We'll most likely not notice when it exits.
== vacuum.cs.umd.edu (3 distinct, 4 total) ==
Aug 9 00:10:14 vacuum.cs.umd.edu systemd[1]: New main PID 21382 does not belong to service, and PID file is not owned by root. Refusing. [x2]
Aug 9 00:10:33 vacuum.cs.umd.edu systemd[1]: Daemon never wrote its PID file. Failing.
Aug 9 00:10:44 vacuum.cs.umd.edu systemd[1]: pmlogger.service: Supervising process 29019 which is not our child. We'll most likely not notice when it exits.
== whiffle.cs.umd.edu (3 distinct, 4 total) ==
Aug 9 00:10:14 whiffle.cs.umd.edu systemd[1]: New main PID 2245851 does not belong to service, and PID file is not owned by root. Refusing. [x2]
Aug 9 00:10:39 whiffle.cs.umd.edu systemd[1]: Daemon never wrote its PID file. Failing.
Aug 9 00:10:52 whiffle.cs.umd.edu systemd[1]: pmlogger.service: Supervising process 2253367 which is not our child. We'll most likely not notice when it exits.
1
0
Command: /usr/local/sbin/syslog-digest.py
Time : 1.0549s
Status : exited 0
Output :
Syslog digest — 2026-08-09 00:05 EDT
Processed 10,434 lines, filtered 7,634 (73%). 2,800 unknown (144 distinct) from 33 host(s).
== abuse (3 distinct, 2252 total) ==
Aug 8 23:05:03 abuse systemd[1]: Failed to load environment files: Input/output error [x688]
Aug 8 23:05:03 abuse systemd[1]: choria-server.service failed to run 'start' task: Input/output error [x688]
Aug 8 23:05:03 abuse rsyslogd[21745]: imjournal: open() failed for path: '/var/lib/rsyslog/imjournal.state.tmp': Input/output error [v8.2404.0 try https://www.rsyslog.com/e/2433 ] [x876]
== atif01.cs.umd.edu (2 distinct, 4 total) ==
Aug 8 23:53:19 atif01.cs.umd.edu kernel: net_ratelimit: 6 callbacks suppressed
Aug 8 23:54:16 atif01.cs.umd.edu kernel: net_ratelimit: 9 callbacks suppressed [x3]
== b0b02.cs.umd.edu (1 distinct, 1 total) ==
Aug 8 23:50:58 b0b02.cs.umd.edu rustdesk[291223]: cannot open display:
== contest (1 distinct, 33 total) ==
Aug 8 23:06:24 contest goferd[1007]: [ERROR][worker-0] gofer.messaging.adapter.connect:33 - connect: proton+amqps://satellite8.cs.umd.edu:5647, failed: Connection amqps://satellite8.cs.umd.edu:5647 disconnected: Condition('proton.pythonio', 'Connection refused to all addresses') [x33]
== csfw00a (1 distinct, 270 total) ==
Aug 8 23:04:35 csfw00a kernel: bnxt_en 0000:09:00.0 eth3: NIC Link is Down [x270]
== cskayako (2 distinct, 2 total) ==
Aug 9 00:00:12 cskayako setroubleshoot[2813907]: failed to retrieve rpm info for path '/var/log/php82-fpm_error.log':
Aug 9 00:00:13 cskayako setroubleshoot[2813907]: SELinux is preventing /opt/remi/php82/root/usr/sbin/php-fpm from open access on the file /var/log/php82-fpm_error.log. For complete SELinux messages run: sealert -l 0ba5d5da-2df6-4c48-bd39-9b458b25a6cc
== forge00 (1 distinct, 1 total) ==
Aug 9 00:01:54 forge00 (httpd)[2446768]: httpd.service: Referenced but unset environment variable evaluates to an empty string: OPTIONS
== hackerman (7 distinct, 12 total) ==
Aug 8 23:19:01 hackerman gnome-software[2060381]: failed to commit changes to dconf: GDBus.Error:org.gtk.GDBus.UnmappedGError.Quark._g_2dfile_2derror_2dquark.Code2: Failed to create file “/adminhomes/sajith/.config/dconf/user.2H6XT3”: Permission denied
Aug 8 23:20:04 hackerman gnome-software[2060381]: can't reliably fixup error code 4 in domain g-io-error-quark: Not a directory [x4]
Aug 8 23:20:12 hackerman gnome-software[2060381]: Only 0 apps for recent list, hiding
Aug 8 23:20:28 hackerman gnome-software[2060381]: failed to commit changes to dconf: GDBus.Error:org.gtk.GDBus.UnmappedGError.Quark._g_2dfile_2derror_2dquark.Code2: Failed to create file “/adminhomes/sajith/.config/dconf/user.D8ZTT3”: Permission denied
Aug 8 23:20:28 hackerman packagekitd[1071202]: Failed to get cache filename for libreoffice [x2]
Aug 8 23:20:28 hackerman packagekitd[1071202]: Failed to get cache filename for kernel [x2]
Aug 8 23:20:38 hackerman packagekitd[1071202]: failed to parse public key for /etc/pki/rpm-gpg/RPM-GPG-KEY-PQC-redhat-release
== hspc (1 distinct, 1 total) ==
Aug 9 00:00:06 hspc kernel: kauditd_printk_skb: 2 callbacks suppressed
== idm00 (28 distinct, 33 total) ==
Aug 8 23:51:21 idm00 named[1455]: client @0x7f330c5f7628 10.73.240.42#52043: update '73.10.in-addr.arpa/IN' denied
Aug 9 00:00:00 idm00 named[1455]: checkhints: unable to get root NS rrset from cache: not found [x6]
Aug 9 00:00:06 idm00 named[1455]: ../../../lib/dns/name.c:668: REQUIRE((name1->attributes & 0x00000001) == (name2->attributes & 0x00000001)) failed, back trace
Aug 9 00:00:06 idm00 named[1455]: #0 0x5560343286a1 in ??
Aug 9 00:00:06 idm00 named[1455]: #1 0x7f3322a984e0 in ??
Aug 9 00:00:06 idm00 named[1455]: #2 0x7f332289fb6a in ??
Aug 9 00:00:06 idm00 named[1455]: #3 0x7f33228b4afc in ??
Aug 9 00:00:06 idm00 named[1455]: #4 0x7f3322b83e18 in ??
Aug 9 00:00:06 idm00 named[1455]: #5 0x7f3322b88a6c in ??
Aug 9 00:00:06 idm00 named[1455]: #6 0x7f3322b8cc2b in ??
Aug 9 00:00:06 idm00 named[1455]: #7 0x7f3322ad38ad in ??
Aug 9 00:00:06 idm00 named[1455]: #8 0x7f3322abe929 in ??
Aug 9 00:00:06 idm00 named[1455]: #9 0x7f3322abeaa5 in ??
Aug 9 00:00:06 idm00 named[1455]: #10 0x7f3322abf297 in ??
Aug 9 00:00:06 idm00 named[1455]: #11 0x7f332261aafd in ??
Aug 9 00:00:06 idm00 named[1455]: #12 0x7f332263685e in ??
Aug 9 00:00:06 idm00 named[1455]: #13 0x7f3322620568 in ??
Aug 9 00:00:06 idm00 named[1455]: #14 0x7f3322abeb5b in ??
Aug 9 00:00:06 idm00 named[1455]: #15 0x7f3322ad168a in ??
Aug 9 00:00:06 idm00 named[1455]: #16 0x7f3321c8a0ea in ??
Aug 9 00:00:06 idm00 named[1455]: #17 0x7f3321d0f150 in ??
Aug 9 00:00:06 idm00 named[1455]: exiting (due to assertion failure)
Aug 9 00:00:07 idm00 systemd-coredump[243271]: Process 1455 (named) of user 25 dumped core.#012#012Stack trace of thread 1457:#012#0 0x00007f3321c8be2c __pthread_kill_implementation (libc.so.6 + 0x8be2c)#012#1 0x00007f3321c3eb46 raise (libc.so.6 + 0x3eb46)#012#2 0x00007f3321c28833 abort (libc.so.6 + 0x28833)#012#3 0x0000556034325635 assertion_failed.cold (named + 0x1c635)#012#4 0x00007f3322a984e0 isc_assertion_failed (libisc-9.16.23-RH.so + 0x1c4e0)#012#5 0x00007f332289fb6a dns_name_equal (libdns-9.16.23-RH.so + 0x9fb6a)#012#6 0x00007f33228b4afc dns_order_find (libdns-9.16.23-RH.so + 0xb4afc)#012#7 0x00007f3322b83e18 query_addrrset.lto_priv.0 (libns-9.16.23-RH.so + 0x1de18)#012#8 0x00007f3322b88a6c query_gotanswer (libns-9.16.23-RH.so + 0x22a6c)#012#9 0x00007f3322b8cc2b fetch_callback (libns-9.16.23-RH.so + 0x26c2b)#012#10 0x00007f3322ad38ad isc_task_run (libisc-9.16.23-RH.so + 0x578ad)#012#11 0x00007f3322abe929 process_netievent (libisc-9.16.23-RH.so + 0x42929)#012#12 0x0
0007f3322abeaa5 process_queue (libisc-9.16.23-RH.so + 0x42aa5)#012#13 0x00007f3322abf297 async_cb (libisc-9.16.23-RH.so + 0x43297)#012#14 0x00007f332261aafd uv__async_io.part.0 (libuv.so.1 + 0xaafd)#012#15 0x00007f332263685e uv__io_poll.part.0 (libuv.so.1 + 0x2685e)#012#16 0x00007f3322620568 uv_run (libuv.so.1 + 0x10568)#012#17 0x00007f3322abeb5b nm_thread (libisc-9.16.23-RH.so + 0x42b5b)#012#18 0x00007f3322ad168a isc__trampoline_run (libisc-9.16.23-RH.so + 0x5568a)#012#19 0x00007f3321c8a0ea start_thread (libc.so.6 + 0x8a0ea)#012#20 0x00007f3321d0f150 __clone3 (libc.so.6 + 0x10f150)#012#012Stack trace of thread 1460:#012#0 0x00007f3321d0e78e epoll_wait (libc.so.6 + 0x10e78e)#012#1 0x00007f3322636c01 uv__io_poll.part.0 (libuv.so.1 + 0x26c01)#012#2 0x00007f3322620568 uv_run (libuv.so.1 + 0x10568)#012#3 0x00007f3322abeb5b nm_thread (libisc-9.16.23-RH.so + 0x42b5b)#012#4 0x00007f3322ad168a isc__trampoline_run (libisc-9.16.23-RH.so + 0x5568a)#012#5 0x00007f3321c8a0ea start_thread (
libc.so.6 + 0x8a0ea)#012#6 0x00007f3321d0f150 __clone3 (libc.so.6 + 0x10f150)#012#012Stack trace of thread 1459:#012#0 0x00007f3321d0e78e epoll_wait (libc.so.6 + 0x10e78e)#012#1 0x00007f3322636c01 uv__io_poll.part.0 (libuv.so.1 + 0x26c01)#012#2 0x00007f3322620568 uv_run (libuv.so.1 + 0x10568)#012#3 0x00007f3322abeb5b nm_thread (libisc-9.16.23-RH.so + 0x42b5b)#012#4 0x00007f3322ad168a isc__trampoline_run (libisc-9.16.23-RH.so + 0x5568a)#012#5 0x00007f3321c8a0ea start_thread (libc.so.6 + 0x8a0ea)#012#6 0x00007f3321d0f150 __clone3 (libc.so.6 + 0x10f150)#012#012Stack trace of thread 1462:#012#0 0x00007f3321d0e78e epoll_wait (libc.so.6 + 0x10e78e)#012#1 0x00007f3322636c01 uv__io_poll.part.0 (libuv.so.1 + 0x26c01)#012#2 0x00007f3322620568 uv_run (libuv.so.1 + 0x10568)#012#3 0x00007f3322abeb5b nm_thread (libisc-9.16.23-RH.so + 0x42b5b)#012#4 0x00007f3322ad168a isc__trampoline_run (libisc-9.16.23-RH.so + 0x5568a)#012#5 0x00007f3321c8a0ea start_thread (libc.so.6 + 0x8a0ea)#012#
6 0x00007f3321d0f150 __clone3 (libc.so.6 + 0x10f150)#012#012Stack trace of thread 1683:#012#0 0x00007f3321c8717a __futex_abstimed_wait_common (libc.so.6 + 0x8717a)#012#1 0x00007f3321c896d2 pthread_cond_wait@@GLIBC_2.3.2 (libc.so.6 + 0x896d2)#012#2 0x00007f33226300cd uv_cond_wait (libuv.so.1 + 0x200cd)#012#3 0x00007f3322623936 worker (libuv.so.1 + 0x13936)#012#4 0x00007f3321c8a0ea start_thread (libc.so.6 + 0x8a0ea)#012#5 0x00007f3321d0f150 __clone3 (libc.so.6 + 0x10f150)#012#012Stack trace of thread 243066:#012#0 0x00007f3321d01f1f __poll (libc.so.6 + 0x101f1f)#012#1 0x00007f33195a9acd ldap_result (libldap.so.2 + 0x1dacd)#012#2 0x00007f33195d2702 ldap_sync_poll (libldap.so.2 + 0x46702)#012#3 0x00007f331961a581 ldap_sync_doit (ldap.so + 0x1e581)#012#4 0x00007f331961aa23 ldap_syncrepl_watcher.lto_priv.0 (ldap.so + 0x1ea23)#012#5 0x00007f3322ad168a isc__trampoline_run (libisc-9.16.23-RH.so + 0x5568a)#012#6 0x00007f3321c8a0ea start_thread (libc.so.6 + 0x8a0ea)#012#7 0x0000
7f3321d0f150 __clone3 (libc.so.6 + 0x10f150)#012#012Stack trace of thread 1458:#012#0 0x00007f3321d0e78e epoll_wait (libc.so.6 + 0x10e78e)#012#1 0x00007f3322636c01 uv__io_poll.part.0 (libuv.so.1 + 0x26c01)#012#2 0x00007f3322620568 uv_run (libuv.so.1 + 0x10568)#012#3 0x00007f3322abeb5b nm_thread (libisc-9.16.23-RH.so + 0x42b5b)#012#4 0x00007f3322ad168a isc__trampoline_run (libisc-9.16.23-RH.so + 0x5568a)#012#5 0x00007f3321c8a0ea start_thread (libc.so.6 + 0x8a0ea)#012#6 0x00007f3321d0f150 __clone3 (libc.so.6 + 0x10f150)#012#012Stack trace of thread 1463:#012#0 0x00007f3321d0e78e epoll_wait (libc.so.6 + 0x10e78e)#012#1 0x00007f3322636c01 uv__io_poll.part.0 (libuv.so.1 + 0x26c01)#012#2 0x00007f3322620568 uv_run (libuv.so.1 + 0x10568)#012#3 0x00007f3322abeb5b nm_thread (libisc-9.16.23-RH.so + 0x42b5b)#012#4 0x00007f3322ad168a isc__trampoline_run (libisc-9.16.23-RH.so + 0x5568a)#012#5 0x00007f3321c8a0ea start_thread (libc.so.6 + 0x8a0ea)#012#6 0x00007f3321d0f150 __clone3 (li
bc.so.6 + 0x10f150)#012#012Stack trace of thread 1680:#012#0 0x00007f3321c8717a __futex_abstimed_wait_common (libc.so.6 + 0x8717a)#012#1 0x00007f3321c896d2 pthread_cond_wait@@GLIBC_2.3.2 (libc.so.6 + 0x896d2)#012#2 0x00007f33226300cd uv_cond_wait (libuv.so.1 + 0x200cd)#012#3 0x00007f3322623936 worker (libuv.so.1 + 0x13936)#012#4 0x00007f3321c8a0ea start_thread (libc.so.6 + 0x8a0ea)#012#5 0x00007f3321d0f150 __clone3 (libc.so.6 + 0x10f150)#012#012Stack trace of thread 1466:#012#0 0x00007f3321d0e78e epoll_wait (libc.so.6 + 0x10e78e)#012#1 0x00007f3322adcb7c netthread (libisc-9.16.23-RH.so + 0x60b7c)#012#2 0x00007f3322ad168a isc__trampoline_run (libisc-9.16.23-RH.so + 0x5568a)#012#3 0x00007f3321c8a0ea start_thread (libc.so.6 + 0x8a0ea)#012#4 0x00007f3321d0f150 __clone3 (libc.so.6 + 0x10f150)#012#012Stack trace of thread 1467:#012#0 0x00007f3321d0e78e epoll_wait (libc.so.6 + 0x10e78e)#012#1 0x00007f3322adcb7c netthread (libisc-9.16.23-RH.so + 0x60b7c)#012#2 0x00007f3322ad16
8a isc__trampoline_run (libisc-9.16.23-RH.so + 0x5568a)#012#3 0x00007f3321c8a0ea start_thread (libc.so.6 + 0x8a0ea)#012#4 0x00007f3321d0f150 __clone3 (libc.so.6 + 0x10f150)#012#012Stack trace of thread 1461:#012#0 0x00007f3321d0e78e epoll_wait (libc.so.6 + 0x10e78e)#012#1 0x00007f3322636c01 uv__io_poll.part.0 (libuv.so.1 + 0x26c01)#012#2 0x00007f3322620568 uv_run (libuv.so.1 + 0x10568)#012#3 0x00007f3322abeb5b nm_thread (libisc-9.16.23-RH.so + 0x42b5b)#012#4 0x00007f3322ad168a isc__trampoline_run (libisc-9.16.23-RH.so + 0x5568a)#012#5 0x00007f3321c8a0ea start_thread (libc.so.6 + 0x8a0ea)#012#6 0x00007f3321d0f150 __clone3 (libc.so.6 + 0x10f150)#012#012Stack trace of thread 1455:#012#0 0x00007f3321c3f8da __sigtimedwait (libc.so.6 + 0x3f8da)#012#1 0x00007f3321c3ef7c sigwait (libc.so.6 + 0x3ef7c)#012#2 0x00007f3322aa2003 isc_app_ctxrun (libisc-9.16.23-RH.so + 0x26003)#012#3 0x00007f3322aa22cc isc_app_run (libisc-9.16.23-RH.so + 0x262cc)#012#4 0x00005560343264da main (named
+ 0x1d4da)#012#5 0x00007f3321c295d0 __libc_start_call_main (libc.so.6 + 0x295d0)#012#6 0x00007f3321c29680 __libc_start_main@@GLIBC_2.34 (libc.so.6 + 0x29680)#012#7 0x0000556034327005 _start (named + 0x1e005)#012#012Stack trace of thread 1681:#012#0 0x00007f3321c8717a __futex_abstimed_wait_common (libc.so.6 + 0x8717a)#012#1 0x00007f3321c896d2 pthread_cond_wait@@GLIBC_2.3.2 (libc.so.6 + 0x896d2)#012#2 0x00007f33226300cd uv_cond_wait (libuv.so.1 + 0x200cd)#012#3 0x00007f3322623936 worker (libuv.so.1 + 0x13936)#012#4 0x00007f3321c8a0ea start_thread (libc.so.6 + 0x8a0ea)#012#5 0x00007f3321d0f150 __clone3 (libc.so.6 + 0x10f150)#012#012Stack trace of thread 1682:#012#0 0x00007f3321c8717a __futex_abstimed_wait_common (libc.so.6 + 0x8717a)#012#1 0x00007f3321c896d2 pthread_cond_wait@@GLIBC_2.3.2 (libc.so.6 + 0x896d2)#012#2 0x00007f33226300cd uv_cond_wait (libuv.so.1 + 0x200cd)#012#3 0x00007f3322623936 worker (libuv.so.1 + 0x13936)#012#4 0x00007f3321c8a0ea start_thread (libc.so.
6 + 0x8a0ea)#012#5 0x00007f3321d0f150 __clone3 (libc.so.6 + 0x10f150)#012#012Stack trace of threa
Aug 9 00:00:07 idm00 systemd[1]: named.service: Main process exited, code=dumped, status=6/ABRT
Aug 9 00:00:11 idm00 systemd[1]: check-named-alive.service: Watchdog timeout (limit 5s)!
Aug 9 00:00:12 idm00 systemd-coredump[243289]: Process 243282 (dig) of user 0 dumped core.#012#012Stack trace of thread 243282:#012#0 0x00007f93d883f8da __sigtimedwait (libc.so.6 + 0x3f8da)#012#1 0x00007f93d883ef7c sigwait (libc.so.6 + 0x3ef7c)#012#2 0x00007f93d8efb003 isc_app_ctxrun (libisc-9.16.23-RH.so + 0x26003)#012#3 0x00007f93d8efb2cc isc_app_run (libisc-9.16.23-RH.so + 0x262cc)#012#4 0x00005634d0cc5efb main (dig + 0x8efb)#012#5 0x00007f93d88295d0 __libc_start_call_main (libc.so.6 + 0x295d0)#012#6 0x00007f93d8829680 __libc_start_main@@GLIBC_2.34 (libc.so.6 + 0x29680)#012#7 0x00005634d0cc5f45 _start (dig + 0x8f45)#012#012Stack trace of thread 243283:#012#0 0x00007f93d890e78e epoll_wait (libc.so.6 + 0x10e78e)#012#1 0x00007f93d8e92c01 uv__io_poll.part.0 (libuv.so.1 + 0x26c01)#012#2 0x00007f93d8e7c568 uv_run (libuv.so.1 + 0x10568)#012#3 0x00007f93d8f17b37 nm_thread (libisc-9.16.23-RH.so + 0x42b37)#012#4 0x00007f93d8f2a68a isc__trampoline_run (libisc-9.16.23-RH.so + 0x
5568a)#012#5 0x00007f93d888a0ea start_thread (libc.so.6 + 0x8a0ea)#012#6 0x00007f93d890f150 __clone3 (libc.so.6 + 0x10f150)#012#012Stack trace of thread 243286:#012#0 0x00007f93d890e78e epoll_wait (libc.so.6 + 0x10e78e)#012#1 0x00007f93d8f35b7c netthread (libisc-9.16.23-RH.so + 0x60b7c)#012#2 0x00007f93d8f2a68a isc__trampoline_run (libisc-9.16.23-RH.so + 0x5568a)#012#3 0x00007f93d888a0ea start_thread (libc.so.6 + 0x8a0ea)#012#4 0x00007f93d890f150 __clone3 (libc.so.6 + 0x10f150)#012#012Stack trace of thread 243284:#012#0 0x00007f93d890e78e epoll_wait (libc.so.6 + 0x10e78e)#012#1 0x00007f93d8e92c01 uv__io_poll.part.0 (libuv.so.1 + 0x26c01)#012#2 0x00007f93d8e7c568 uv_run (libuv.so.1 + 0x10568)#012#3 0x00007f93d8f17b37 nm_thread (libisc-9.16.23-RH.so + 0x42b37)#012#4 0x00007f93d8f2a68a isc__trampoline_run (libisc-9.16.23-RH.so + 0x5568a)#012#5 0x00007f93d888a0ea start_thread (libc.so.6 + 0x8a0ea)#012#6 0x00007f93d890f150 __clone3 (libc.so.6 + 0x10f150)#012#012Stack trace
of thread 243285:#012#0 0x00007f93d888717a __futex_abstimed_wait_common (libc.so.6 + 0x8717a)#012#1 0x00007f93d88898bf pthread_cond_timedwait@@GLIBC_2.3.2 (libc.so.6 + 0x898bf)#012#2 0x00007f93d8f3c180 isc_condition_waituntil (libisc-9.16.23-RH.so + 0x67180)#012#3 0x00007f93d8f2e3ef run (libisc-9.16.23-RH.so + 0x593ef)#012#4 0x00007f93d8f2a68a isc__trampoline_run (libisc-9.16.23-RH.so + 0x5568a)#012#5 0x00007f93d888a0ea start_thread (libc.so.6 + 0x8a0ea)#012#6 0x00007f93d890f150 __clone3 (libc.so.6 + 0x10f150)#012ELF object binary architecture: AMD x86-64
Aug 9 00:00:12 idm00 systemd-coredump[243311]: Process 1480 (check-named-ali) of user 0 dumped core.#012#012Stack trace of thread 1480:#012#0 0x00007f3974c3ee2b kill (libc.so.6 + 0x3ee2b)#012#1 0x000055c602040930 termsig_handler.part.0 (bash + 0x88930)#012#2 0x000055c6020b994b waitchld.constprop.0 (bash + 0x10194b)#012#3 0x000055c60201da7a wait_for (bash + 0x65a7a)#012#4 0x000055c602005ee8 execute_command_internal (bash + 0x4dee8)#012#5 0x000055c602006748 execute_command (bash + 0x4e748)#012#6 0x000055c6020052f0 execute_command_internal (bash + 0x4d2f0)#012#7 0x000055c6020053cb execute_command_internal (bash + 0x4d3cb)#012#8 0x000055c602006748 execute_command (bash + 0x4e748)#012#9 0x000055c60200538e execute_command_internal (bash + 0x4d38e)#012#10 0x000055c602006748 execute_command (bash + 0x4e748)#012#11 0x000055c60200538e execute_command_internal (bash + 0x4d38e)#012#12 0x000055c602006748 execute_command (bash + 0x4e748)#012#13 0x000055c60200538e execute_command_interna
l (bash + 0x4d38e)#012#14 0x000055c602006748 execute_command (bash + 0x4e748)#012#15 0x000055c6020068f0 execute_while_or_until (bash + 0x4e8f0)#012#16 0x000055c6020041c0 execute_command_internal (bash + 0x4c1c0)#012#17 0x000055c602006748 execute_command (bash + 0x4e748)#012#18 0x000055c601ff8109 reader_loop (bash + 0x40109)#012#19 0x000055c601fe997e main (bash + 0x3197e)#012#20 0x00007f3974c295d0 __libc_start_call_main (libc.so.6 + 0x295d0)#012#21 0x00007f3974c29680 __libc_start_main@@GLIBC_2.34 (libc.so.6 + 0x29680)#012#22 0x000055c601fe9d75 _start (bash + 0x31d75)#012ELF object binary architecture: AMD x86-64
Aug 9 00:00:12 idm00 systemd[1]: check-named-alive.service: Main process exited, code=dumped, status=6/ABRT
== idmh1 (1 distinct, 2 total) ==
Aug 9 00:00:00 idmh1 named[73276]: checkhints: unable to get root NS rrset from cache: not found [x2]
== idmp0 (28 distinct, 30 total) ==
Aug 8 23:36:00 idmp0 named[5198]: client @0x7f9914012c48 10.73.240.43#54023: update '73.10.in-addr.arpa/IN' denied
Aug 9 00:00:01 idmp0 named[5198]: checkhints: unable to get root NS rrset from cache: not found [x3]
Aug 9 00:00:14 idmp0 named[5198]: ../../../lib/dns/name.c:668: REQUIRE((name1->attributes & 0x00000001) == (name2->attributes & 0x00000001)) failed, back trace
Aug 9 00:00:14 idmp0 named[5198]: #0 0x55637260a6a1 in ??
Aug 9 00:00:14 idmp0 named[5198]: #1 0x7f9957c5f4e0 in ??
Aug 9 00:00:14 idmp0 named[5198]: #2 0x7f9957a9fb6a in ??
Aug 9 00:00:14 idmp0 named[5198]: #3 0x7f9957ab4afc in ??
Aug 9 00:00:14 idmp0 named[5198]: #4 0x7f9957d4ae18 in ??
Aug 9 00:00:14 idmp0 named[5198]: #5 0x7f9957d4fa6c in ??
Aug 9 00:00:14 idmp0 named[5198]: #6 0x7f9957d53c2b in ??
Aug 9 00:00:14 idmp0 named[5198]: #7 0x7f9957c9a8ad in ??
Aug 9 00:00:14 idmp0 named[5198]: #8 0x7f9957c85929 in ??
Aug 9 00:00:14 idmp0 named[5198]: #9 0x7f9957c85aa5 in ??
Aug 9 00:00:14 idmp0 named[5198]: #10 0x7f9957c86297 in ??
Aug 9 00:00:14 idmp0 named[5198]: #11 0x7f99577dfafd in ??
Aug 9 00:00:14 idmp0 named[5198]: #12 0x7f99577fb85e in ??
Aug 9 00:00:14 idmp0 named[5198]: #13 0x7f99577e5568 in ??
Aug 9 00:00:14 idmp0 named[5198]: #14 0x7f9957c85b5b in ??
Aug 9 00:00:14 idmp0 named[5198]: #15 0x7f9957c9868a in ??
Aug 9 00:00:14 idmp0 named[5198]: #16 0x7f9956e8a0ea in ??
Aug 9 00:00:14 idmp0 named[5198]: #17 0x7f9956f0f150 in ??
Aug 9 00:00:14 idmp0 named[5198]: exiting (due to assertion failure)
Aug 9 00:00:18 idmp0 systemd-coredump[1540274]: Process 5198 (named) of user 25 dumped core.#012#012Stack trace of thread 5208:#012#0 0x00007f9956e8be2c n/a (n/a + 0x0)#012ELF object binary architecture: AMD x86-64
Aug 9 00:00:19 idmp0 systemd[1]: named.service: Main process exited, code=dumped, status=6/ABRT
Aug 9 00:00:20 idmp0 systemd[1]: check-named-alive.service: Watchdog timeout (limit 5s)!
Aug 9 00:00:20 idmp0 systemd-coredump[1540296]: Process 1540279 (dig) of user 0 dumped core.#012#012Stack trace of thread 1540279:#012#0 0x00007fcbab83f8da __sigtimedwait (libc.so.6 + 0x3f8da)#012#1 0x00007fcbab83ef7c sigwait (libc.so.6 + 0x3ef7c)#012#2 0x00007fcbabb96003 isc_app_ctxrun (libisc-9.16.23-RH.so + 0x26003)#012#3 0x00007fcbabb962cc isc_app_run (libisc-9.16.23-RH.so + 0x262cc)#012#4 0x0000560aa67c6efb main (dig + 0x8efb)#012#5 0x00007fcbab8295d0 __libc_start_call_main (libc.so.6 + 0x295d0)#012#6 0x00007fcbab829680 __libc_start_main@@GLIBC_2.34 (libc.so.6 + 0x29680)#012#7 0x0000560aa67c6f45 _start (dig + 0x8f45)#012#012Stack trace of thread 1540281:#012#0 0x00007fcbab90e78e epoll_wait (libc.so.6 + 0x10e78e)#012#1 0x00007fcbaba7dc01 uv__io_poll.part.0 (libuv.so.1 + 0x26c01)#012#2 0x00007fcbaba67568 uv_run (libuv.so.1 + 0x10568)#012#3 0x00007fcbabbb2b37 nm_thread (libisc-9.16.23-RH.so + 0x42b37)#012#4 0x00007fcbabbc568a isc__trampoline_run (libisc-9.16.23-RH.so
+ 0x5568a)#012#5 0x00007fcbab88a0ea start_thread (libc.so.6 + 0x8a0ea)#012#6 0x00007fcbab90f150 __clone3 (libc.so.6 + 0x10f150)#012#012Stack trace of thread 1540280:#012#0 0x00007fcbab90e78e epoll_wait (libc.so.6 + 0x10e78e)#012#1 0x00007fcbaba7dc01 uv__io_poll.part.0 (libuv.so.1 + 0x26c01)#012#2 0x00007fcbaba67568 uv_run (libuv.so.1 + 0x10568)#012#3 0x00007fcbabbb2b37 nm_thread (libisc-9.16.23-RH.so + 0x42b37)#012#4 0x00007fcbabbc568a isc__trampoline_run (libisc-9.16.23-RH.so + 0x5568a)#012#5 0x00007fcbab88a0ea start_thread (libc.so.6 + 0x8a0ea)#012#6 0x00007fcbab90f150 __clone3 (libc.so.6 + 0x10f150)#012#012Stack trace of thread 1540282:#012#0 0x00007fcbab88717a __futex_abstimed_wait_common (libc.so.6 + 0x8717a)#012#1 0x00007fcbab8898bf pthread_cond_timedwait@@GLIBC_2.3.2 (libc.so.6 + 0x898bf)#012#2 0x00007fcbabbd7180 isc_condition_waituntil (libisc-9.16.23-RH.so + 0x67180)#012#3 0x00007fcbabbc93ef run (libisc-9.16.23-RH.so + 0x593ef)#012#4 0x00007fcbabbc568a isc__tr
ampoline_run (libisc-9.16.23-RH.so + 0x5568a)#012#5 0x00007fcbab88a0ea start_thread (libc.so.6 + 0x8a0ea)#012#6 0x00007fcbab90f150 __clone3 (libc.so.6 + 0x10f150)#012#012Stack trace of thread 1540283:#012#0 0x00007fcbab90e78e epoll_wait (libc.so.6 + 0x10e78e)#012#1 0x00007fcbabbd0b7c netthread (libisc-9.16.23-RH.so + 0x60b7c)#012#2 0x00007fcbabbc568a isc__trampoline_run (libisc-9.16.23-RH.so + 0x5568a)#012#3 0x00007fcbab88a0ea start_thread (libc.so.6 + 0x8a0ea)#012#4 0x00007fcbab90f150 __clone3 (libc.so.6 + 0x10f150)#012ELF object binary architecture: AMD x86-64
Aug 9 00:00:20 idmp0 systemd-coredump[1540358]: Process 5256 (check-named-ali) of user 0 dumped core.#012#012Stack trace of thread 5256:#012#0 0x00007fa94de3ee2b kill (libc.so.6 + 0x3ee2b)#012#1 0x0000556be964a930 termsig_handler.part.0 (bash + 0x88930)#012#2 0x0000556be96c394b waitchld.constprop.0 (bash + 0x10194b)#012#3 0x0000556be9627a7a wait_for (bash + 0x65a7a)#012#4 0x0000556be960fee8 execute_command_internal (bash + 0x4dee8)#012#5 0x0000556be9610748 execute_command (bash + 0x4e748)#012#6 0x0000556be960f2f0 execute_command_internal (bash + 0x4d2f0)#012#7 0x0000556be960f3cb execute_command_internal (bash + 0x4d3cb)#012#8 0x0000556be9610748 execute_command (bash + 0x4e748)#012#9 0x0000556be960f38e execute_command_internal (bash + 0x4d38e)#012#10 0x0000556be9610748 execute_command (bash + 0x4e748)#012#11 0x0000556be960f38e execute_command_internal (bash + 0x4d38e)#012#12 0x0000556be9610748 execute_command (bash + 0x4e748)#012#13 0x0000556be960f38e execute_command_intern
al (bash + 0x4d38e)#012#14 0x0000556be9610748 execute_command (bash + 0x4e748)#012#15 0x0000556be96108f0 execute_while_or_until (bash + 0x4e8f0)#012#16 0x0000556be960e1c0 execute_command_internal (bash + 0x4c1c0)#012#17 0x0000556be9610748 execute_command (bash + 0x4e748)#012#18 0x0000556be9602109 reader_loop (bash + 0x40109)#012#19 0x0000556be95f397e main (bash + 0x3197e)#012#20 0x00007fa94de295d0 __libc_start_call_main (libc.so.6 + 0x295d0)#012#21 0x00007fa94de29680 __libc_start_main@@GLIBC_2.34 (libc.so.6 + 0x29680)#012#22 0x0000556be95f3d75 _start (bash + 0x31d75)#012ELF object binary architecture: AMD x86-64
Aug 9 00:00:20 idmp0 systemd[1]: check-named-alive.service: Main process exited, code=dumped, status=6/ABRT
== idmv0 (1 distinct, 3 total) ==
Aug 9 00:00:01 idmv0 named[1889]: checkhints: unable to get root NS rrset from cache: not found [x3]
== inbound00.cs.umd.edu (3 distinct, 4 total) ==
Aug 8 23:07:25 inbound00.cs.umd.edu cockpit-ws[210208]: /usr/share/cockpit/static/login.js/favicon.ico: Failed to open file “/usr/share/cockpit/static/login.js/favicon.ico”: open() failed: Not a directory [x2]
Aug 8 23:38:01 inbound00.cs.umd.edu krb5_child[217488]: Client 'admin(a)UMD.EDU' not found in Kerberos database
Aug 8 23:38:23 inbound00.cs.umd.edu sshd-session[217525]: error: Protocol major versions differ: 2 vs. 1
== inbound01.cs.umd.edu (1 distinct, 2 total) ==
Aug 8 23:07:16 inbound01.cs.umd.edu cockpit-ws[2418113]: /usr/share/cockpit/static/login.js/favicon.ico: Failed to open file “/usr/share/cockpit/static/login.js/favicon.ico”: open() failed: Not a directory [x2]
== itmon02 (1 distinct, 34 total) ==
Aug 8 23:08:14 itmon02 sshd[1750555]: error: beginning MaxStartups throttling [x34]
== matrix (1 distinct, 1 total) ==
Aug 9 00:00:25 matrix (nin-node)[1407807]: munin-node.service: Referenced but unset environment variable evaluates to an empty string: DAEMON_ARGS
== neo-gizmonic (1 distinct, 1 total) ==
Aug 9 00:00:14 neo-gizmonic (nin-node)[1103872]: munin-node.service: Referenced but unset environment variable evaluates to an empty string: DAEMON_ARGS
== neoavion (1 distinct, 1 total) ==
Aug 9 00:00:25 neoavion (nin-node)[65701]: munin-node.service: Referenced but unset environment variable evaluates to an empty string: DAEMON_ARGS
== newhonors2 (2 distinct, 25 total) ==
Aug 8 23:13:03 newhonors2 dhcpcd[936875]: dhcpcd is not running [x24]
Aug 9 00:00:05 newhonors2 (nin-node)[938391]: munin-node.service: Referenced but unset environment variable evaluates to an empty string: DAEMON_ARGS
== orchids (7 distinct, 13 total) ==
Aug 8 23:11:25 orchids gnome-software[1516991]: can't reliably fixup error code 4 in domain g-io-error-quark: Not a directory [x4]
Aug 8 23:11:31 orchids gnome-software[1516991]: Only 0 apps for recent list, hiding
Aug 8 23:11:34 orchids packagekitd[809120]: Failed to get cache filename for libreoffice [x2]
Aug 8 23:11:34 orchids packagekitd[809120]: Failed to get cache filename for cups-filesystem [x2]
Aug 8 23:11:34 orchids packagekitd[809120]: Failed to get cache filename for kernel [x2]
Aug 8 23:11:35 orchids gnome-software[1516991]: failed to commit changes to dconf: GDBus.Error:org.gtk.GDBus.UnmappedGError.Quark._g_2dfile_2derror_2dquark.Code2: Failed to create file “/adminhomes/jworden/.config/dconf/user.JH01T3”: Permission denied
Aug 8 23:11:36 orchids packagekitd[809120]: failed to parse public key for /etc/pki/rpm-gpg/RPM-GPG-KEY-PQC-redhat-release
== outbound00.cs.umd.edu (1 distinct, 6 total) ==
Aug 8 23:09:09 outbound00.cs.umd.edu python3[155211]: ldapdb [x6]
== outbound01.cs.umd.edu (2 distinct, 11 total) ==
Aug 8 23:13:06 outbound01.cs.umd.edu python3[2386380]: ldapdb [x6]
Aug 8 23:44:51 outbound01.cs.umd.edu cockpit-ws[2393647]: /usr/share/cockpit/static/login.js/favicon.ico: Failed to open file “/usr/share/cockpit/static/login.js/favicon.ico”: open() failed: Not a directory [x5]
== peach.cs.umd.edu (2 distinct, 6 total) ==
Aug 8 23:12:08 peach.cs.umd.edu setroubleshoot[3431848]: SELinux is preventing /usr/bin/qemu-ga from search access on the directory /var/lib/containers/storage/overlay. For complete SELinux messages run: sealert -l ba415951-a2c6-424e-b17d-305c5300b9f3 [x3]
Aug 8 23:12:08 peach.cs.umd.edu setroubleshoot[3431848]: SELinux is preventing /usr/bin/qemu-ga from search access on the directory /var/lib/containers/storage/overlay. For complete SELinux messages run: sealert -l 6aeb0956-fcf2-462a-ae4d-439b912c16d0 [x3]
== quiss (1 distinct, 1 total) ==
Aug 8 23:46:34 quiss gnome-software[879803]: failed to commit changes to dconf: GDBus.Error:org.gtk.GDBus.UnmappedGError.Quark._g_2dfile_2derror_2dquark.Code2: Failed to create file “/adminhomes/josephao/.config/dconf/user.IJI1T3”: Permission denied
== sebatinsky.cs.umd.edu (1 distinct, 1 total) ==
Aug 8 23:35:58 sebatinsky.cs.umd.edu kernel: hpet1: lost 1 rtc interrupts
== sentry-docker00.cs.umd.edu (34 distinct, 34 total) ==
Aug 8 23:14:51 sentry-docker00.cs.umd.edu systemd-udevd[573727]: link_config: could not get ethtool features for veth43f2d2e
Aug 8 23:14:51 sentry-docker00.cs.umd.edu systemd-udevd[573727]: Could not set offload features of veth43f2d2e: No such device
Aug 8 23:14:51 sentry-docker00.cs.umd.edu systemd-udevd[573758]: Could not generate persistent MAC address for vethd299129: No such file or directory
Aug 8 23:14:51 sentry-docker00.cs.umd.edu systemd-udevd[573759]: Could not generate persistent MAC address for veth2aaf912: No such file or directory
Aug 8 23:14:51 sentry-docker00.cs.umd.edu systemd-udevd[573762]: Could not generate persistent MAC address for vethe450de0: No such file or directory
Aug 8 23:14:51 sentry-docker00.cs.umd.edu systemd-udevd[573763]: Could not generate persistent MAC address for veth5327644: No such file or directory
Aug 8 23:14:51 sentry-docker00.cs.umd.edu systemd-udevd[573787]: Could not generate persistent MAC address for veth155ec69: No such file or directory
Aug 8 23:14:51 sentry-docker00.cs.umd.edu systemd-udevd[573786]: Could not generate persistent MAC address for vethe481a19: No such file or directory
Aug 8 23:14:51 sentry-docker00.cs.umd.edu systemd-udevd[573790]: Could not generate persistent MAC address for veth02e1f42: No such file or directory
Aug 8 23:14:51 sentry-docker00.cs.umd.edu systemd-udevd[573791]: Could not generate persistent MAC address for vethd7eb52b: No such file or directory
Aug 8 23:14:51 sentry-docker00.cs.umd.edu systemd-udevd[573865]: Could not generate persistent MAC address for veth2d3b216: No such file or directory
Aug 8 23:14:51 sentry-docker00.cs.umd.edu systemd-udevd[573867]: Could not generate persistent MAC address for vethc63a837: No such file or directory
Aug 8 23:34:59 sentry-docker00.cs.umd.edu systemd-udevd[583159]: Could not generate persistent MAC address for veth440d885: No such file or directory
Aug 8 23:34:59 sentry-docker00.cs.umd.edu systemd-udevd[583160]: Could not generate persistent MAC address for veth249894f: No such file or directory
Aug 8 23:34:59 sentry-docker00.cs.umd.edu systemd-udevd[583163]: Could not generate persistent MAC address for vethb4ac1eb: No such file or directory
Aug 8 23:34:59 sentry-docker00.cs.umd.edu systemd-udevd[583167]: Could not generate persistent MAC address for vethf4f0b7e: No such file or directory
Aug 8 23:34:59 sentry-docker00.cs.umd.edu systemd-udevd[583180]: Could not generate persistent MAC address for veth04bc68c: No such file or directory
Aug 8 23:34:59 sentry-docker00.cs.umd.edu systemd-udevd[583184]: Could not generate persistent MAC address for vethc835717: No such file or directory
Aug 8 23:34:59 sentry-docker00.cs.umd.edu systemd-udevd[583189]: Could not generate persistent MAC address for veth29b9f9c: No such file or directory
Aug 8 23:34:59 sentry-docker00.cs.umd.edu systemd-udevd[583190]: Could not generate persistent MAC address for vetha6be156: No such file or directory
Aug 8 23:34:59 sentry-docker00.cs.umd.edu systemd-udevd[583216]: Could not generate persistent MAC address for veth04232a1: No such file or directory
Aug 8 23:34:59 sentry-docker00.cs.umd.edu systemd-udevd[583217]: Could not generate persistent MAC address for veth86bb20f: No such file or directory
Aug 8 23:55:08 sentry-docker00.cs.umd.edu systemd-udevd[592546]: link_config: could not get ethtool features for veth04bc68c
Aug 8 23:55:08 sentry-docker00.cs.umd.edu systemd-udevd[592546]: Could not set offload features of veth04bc68c: No such device
Aug 8 23:55:08 sentry-docker00.cs.umd.edu systemd-udevd[592551]: Could not generate persistent MAC address for vethe5febde: No such file or directory
Aug 8 23:55:08 sentry-docker00.cs.umd.edu systemd-udevd[592550]: Could not generate persistent MAC address for vethcdd9fa5: No such file or directory
Aug 8 23:55:08 sentry-docker00.cs.umd.edu systemd-udevd[592590]: Could not generate persistent MAC address for veth7be9a12: No such file or directory
Aug 8 23:55:08 sentry-docker00.cs.umd.edu systemd-udevd[592591]: Could not generate persistent MAC address for veth1d8dee7: No such file or directory
Aug 8 23:55:08 sentry-docker00.cs.umd.edu systemd-udevd[592594]: Could not generate persistent MAC address for vethf440ed5: No such file or directory
Aug 8 23:55:08 sentry-docker00.cs.umd.edu systemd-udevd[592590]: Could not generate persistent MAC address for vethb8d72d4: No such file or directory
... 4 more distinct messages not shown
== strawberry (3 distinct, 9 total) ==
Aug 8 23:09:44 strawberry udisksd[1067]: Error performing housekeeping for drive /org/freedesktop/UDisks2/drives/ST2000DM001_1CH164_W1E8J5KJ: Error updating SMART data: Error sending ATA command CHECK POWER MODE: Unexpected sense data returned:#0120000: 00 00 00 00 00 00 00 00 00 00 00 00 00 00 00 00 ................#0120010: 00 00 00 00 00 00 00 00 00 00 00 00 00 00 00 00 ................#012 (g-io-error-quark, 0) [x6]
Aug 8 23:34:42 strawberry smartd[5314]: Device: /dev/sda [SAT], failed to read SMART Attribute Data [x2]
Aug 9 00:00:03 strawberry kernel: kauditd_printk_skb: 2 callbacks suppressed
== talkhosts9 (1 distinct, 2 total) ==
Aug 8 23:11:29 talkhosts9 setroubleshoot[2213920]: SELinux is preventing /usr/bin/lsof from getattr access on the unix_stream_socket unix_stream_socket. For complete SELinux messages run: sealert -l a6df89b3-c497-469c-8232-c4fde0508abf [x2]
== tulgey.cs.umd.edu (1 distinct, 1 total) ==
Aug 9 00:00:00 tulgey.cs.umd.edu rsyslogd[2233]: imfile: poll_tree cannot stat file '/var/log/httpd/login.cs.umd.edu-8431_error_ssl.log' - ignored: No such file or directory [v8.2510.0-2.el9]
== wraith (2 distinct, 2 total) ==
Aug 9 00:00:10 wraith kernel: kauditd_printk_skb: 2 callbacks suppressed
Aug 9 00:00:10 wraith (nin-node)[174204]: munin-node.service: Referenced but unset environment variable evaluates to an empty string: DAEMON_ARGS
== zebatinsky.cs.umd.edu (1 distinct, 1 total) ==
Aug 9 00:01:09 zebatinsky.cs.umd.edu setroubleshoot[2182011]: SELinux is preventing pdns/comm-retre from using the execmem access on a process. For complete SELinux messages run: sealert -l 2a8c520a-a14b-4c88-afde-0cdf2724a845
== zwicker-computer (1 distinct, 1 total) ==
Aug 9 00:00:05 zwicker-computer kernel: kauditd_printk_skb: 2 callbacks suppressed
1
0