Command: /usr/local/sbin/syslog-digest.py
Time : 0.5002s
Status : exited 0
Output :
Syslog digest — 2026-07-29 07:05 EDT
Processed 4,002 lines, filtered 3,353 (83%). 649 unknown (123 distinct) from 22 host(s).
== abadi-computer (2 distinct, 2 total) ==
Jul 29 06:15:01 abadi-computer nologin[28503]: Attempted login by UNKNOWN (UID: 65534) on UNKNOWN
Jul 29 06:15:01 abadi-computer pipewire[28502]: mod.jackdbus-detect: Failed to receive jackdbus reply: org.freedesktop.DBus.Error.ServiceUnknown: The name org.jackaudio.service was not provided by any .service files
== abuse (1 distinct, 346 total) ==
Jul 29 06:05:06 abuse rsyslogd[21745]: imjournal: open() failed for path: '/var/lib/rsyslog/imjournal.state.tmp': Input/output error [v8.2404.0 try https://www.rsyslog.com/e/2433 ] [x346]
== alec.cs.umd.edu (3 distinct, 57 total) ==
Jul 29 06:05:21 alec.cs.umd.edu setroubleshoot[72844]: failed to retrieve rpm info for path '/run/netns/netns-9dfd0347-71eb-5698-085c-c769043aa5c3': [x12]
Jul 29 06:05:22 alec.cs.umd.edu sedispatch[1526]: AVC Message regarding setroubleshoot, ignoring message [x22]
Jul 29 06:05:22 alec.cs.umd.edu setroubleshoot[72844]: SELinux is preventing /usr/bin/df from getattr access on the file /run/netns/netns-9dfd0347-71eb-5698-085c-c769043aa5c3. For complete SELinux messages run: sealert -l 23f93208-3063-4aac-b78a-bb0fcb40740c [x23]
== b0b02.cs.umd.edu (4 distinct, 5 total) ==
Jul 29 06:20:01 b0b02.cs.umd.edu setroubleshoot[568728]: SELinux is preventing /usr/bin/python3.9 from getattr access on the file /etc/authselect/nsswitch.conf. For complete SELinux messages run: sealert -l 9a1e2952-3fde-4937-a8ab-f7f59791a458 [x2]
Jul 29 06:20:04 b0b02.cs.umd.edu setroubleshoot[568728]: SELinux is preventing /usr/bin/python3.9 from read access on the file /etc/authselect/nsswitch.conf. For complete SELinux messages run: sealert -l 97d74423-e027-4cd6-8810-ad80944900b5
Jul 29 06:20:07 b0b02.cs.umd.edu setroubleshoot[568728]: SELinux is preventing /usr/bin/python3.9 from open access on the file /etc/authselect/nsswitch.conf. For complete SELinux messages run: sealert -l 4f253f6a-62d6-46dd-8eaf-0b4d29df41c6
Jul 29 06:36:02 b0b02.cs.umd.edu rustdesk[573161]: cannot open display:
== contest (1 distinct, 34 total) ==
Jul 29 06:05:19 contest goferd[1007]: [ERROR][worker-0] gofer.messaging.adapter.connect:33 - connect: proton+amqps://satellite8.cs.umd.edu:5647, failed: Connection amqps://satellite8.cs.umd.edu:5647 disconnected: Condition('proton.pythonio', 'Connection refused to all addresses') [x34]
== csfw00a (1 distinct, 2 total) ==
Jul 29 06:36:26 csfw00a kernel: bnxt_en 0000:09:00.0 eth3: NIC Link is Down [x2]
== emaar (1 distinct, 1 total) ==
Jul 29 06:23:17 emaar systemd[1]: insights-client.service: Start request repeated too quickly.
== hackerman (9 distinct, 14 total) ==
Jul 29 06:20:04 hackerman gnome-software[2060381]: can't reliably fixup error code 4 in domain g-io-error-quark: Not a directory [x4]
Jul 29 06:20:12 hackerman gnome-software[2060381]: Only 0 apps for recent list, hiding
Jul 29 06:20:33 hackerman packagekitd[1730174]: Failed to get cache filename for chromium
Jul 29 06:20:33 hackerman packagekitd[1730174]: Failed to get cache filename for chromium-common
Jul 29 06:20:33 hackerman packagekitd[1730174]: Failed to get cache filename for libreoffice [x2]
Jul 29 06:20:33 hackerman packagekitd[1730174]: Failed to get cache filename for kernel [x2]
Jul 29 06:20:38 hackerman gnome-software[2060381]: failed to commit changes to dconf: GDBus.Error:org.gtk.GDBus.UnmappedGError.Quark._g_2dfile_2derror_2dquark.Code2: Failed to create file “/adminhomes/sajith/.config/dconf/user.TSE5S3”: Permission denied
Jul 29 06:20:39 hackerman gnome-software[2060381]: failed to commit changes to dconf: GDBus.Error:org.gtk.GDBus.UnmappedGError.Quark._g_2dfile_2derror_2dquark.Code2: Failed to create file “/adminhomes/sajith/.config/dconf/user.ZF2DT3”: Permission denied
Jul 29 06:20:46 hackerman packagekitd[1730174]: failed to parse public key for /etc/pki/rpm-gpg/RPM-GPG-KEY-PQC-redhat-release
== idm00 (1 distinct, 1 total) ==
Jul 29 06:51:10 idm00 named[1455]: client @0x7f33153cee88 10.73.240.42#61424: update '73.10.in-addr.arpa/IN' denied
== idmp0 (1 distinct, 1 total) ==
Jul 29 06:36:04 idmp0 named[5198]: client @0x7f992407d618 10.73.240.43#64945: update '73.10.in-addr.arpa/IN' denied
== inbound00.cs.umd.edu (1 distinct, 1 total) ==
Jul 29 06:06:56 inbound00.cs.umd.edu systemd[1]: Configuration file /usr/lib/systemd/system/authentication_milter.service is marked executable. Please remove executable permission bits. Proceeding anyway.
== inbound01.cs.umd.edu (1 distinct, 1 total) ==
Jul 29 06:17:53 inbound01.cs.umd.edu systemd[1]: Configuration file /usr/lib/systemd/system/authentication_milter.service is marked executable. Please remove executable permission bits. Proceeding anyway.
== itmon02 (1 distinct, 41 total) ==
Jul 29 06:08:04 itmon02 sshd[1834]: error: beginning MaxStartups throttling [x41]
== jaws.cs.umd.edu (4 distinct, 5 total) ==
Jul 29 06:36:01 jaws.cs.umd.edu systemd-coredump[2827433]: Process 2827414 (podman) of user 981 dumped core.#012#012Stack trace of thread 2827414:#012#0 0x0000559decf8446e internal/runtime/syscall/linux.Syscall6 (podman + 0x48b46e)#012#1 0x0000559ded0640a6 syscall.Syscall (podman + 0x56b0a6)#012#2 0x0000559ded064c50 syscall.Syscall.abi0 (podman + 0x56bc50)#012#3 0x0000559ded1cec2e github.com/containers/podman/vendor/golang.org/x/sys/unix.OpenTree (podman + 0x6d5c2e)#012#4 0x0000559ded827f4b github.com/containers/podman/vendor/github.com/cyphar/filepath-securejoin/p… (podman + 0xd2ef4b)#012#5 0x0000559ded827e54 github.com/containers/podman/vendor/github.com/cyphar/filepath-securejoin/p… (podman + 0xd2ee54)#012#6 0x0000559ded017dcc sync.(*Once).doSlow (podman + 0x51edcc)#012#7 0x0000559ded017cf9 sync.(*Once).Do (podman + 0x51ecf9)#012#8 0x0000559ded827d
c5 github.com/containers/podman/vendor/github.com/cyphar/filepath-securejoin/p… (podman + 0xd2edc5)#012#9 0x0000559ded8293e2 github.com/containers/podman/vendor/github.com/cyphar/filepath-securejoin/p… (podman + 0xd303e2)#012#10 0x0000559ded8297f3 github.com/containers/podman/vendor/github.com/cyphar/filepath-securejoin/p… (podman + 0xd307f3)#012#11 0x0000559ded82891c github.com/containers/podman/vendor/github.com/cyphar/filepath-securejoin/p… (podman + 0xd2f91c)#012#12 0x0000559ded828358 github.com/containers/podman/vendor/github.com/cyphar/filepath-securejoin/p… (podman + 0xd2f358)#012#13 0x0000559ded017dcc sync.(*Once).doSlow (podman + 0x51edcc)#012#14 0x0000559ded017cf9 sync.(*Once).D
o (podman + 0x51ecf9)#012#15 0x0000559ded8282c5 github.com/containers/podman/vendor/github.com/cyphar/filepath-securejoin/p… (podman + 0xd2f2c5)#012#16 0x0000559ded82979a github.com/containers/podman/vendor/github.com/cyphar/filepath-securejoin/p… (podman + 0xd3079a)#012#17 0x0000559ded83034e github.com/containers/podman/vendor/github.com/opencontainers/selinux/go-se… (podman + 0xd3734e)#012#18 0x0000559ded830838 github.com/containers/podman/vendor/github.com/opencontainers/selinux/go-se… (podman + 0xd37838)#012#19 0x0000559ded82f5df github.com/containers/podman/vendor/github.com/opencontainers/selinux/go-se… (podman + 0xd365df)#012#20 0x0000559ded82f873 github.com/containers/podman/vendor/github.com/opencontainers/selinux/go-se… (podman + 0xd36873)#012#21 0x000
0559deda27f4b github.com/containers/podman/vendor/go.podman.io/common/pkg/config.defaultC… (podman + 0xf2ef4b)#012#22 0x0000559deda2b912 github.com/containers/podman/vendor/go.podman.io/common/pkg/config.newLocked (podman + 0xf32912)#012#23 0x0000559deda2b605 github.com/containers/podman/vendor/go.podman.io/common/pkg/config.New (podman + 0xf32605)#012#24 0x0000559dee19efd3 github.com/containers/podman/cmd/podman/registry.newPodmanConfig (podman + 0x16a5fd3)#012#25 0x0000559ded017dcc sync.(*Once).doSlow (podman + 0x51edcc)#012#26 0x0000559dee1bfc50 github.com/containers/podman/cmd/podman/common.init (podman + 0x16c6c50)#012#27 0x0000559decfdda57 runtime.doInit1 (podman + 0x4e4a57)#012#28 0x0000559decfcdf90 runtime.main (podman + 0x4d4f90)#012#29 0x0000559ded00dee1 runtime.goexit.abi0 (podman + 0x514ee1)#012ELF object binary architecture: AMD x86-64
Jul 29 06:36:02 jaws.cs.umd.edu systemd-coredump[2827452]: Process 2827444 (podman) of user 981 dumped core.#012#012Stack trace of thread 2827444:#012#0 0x00005641b106546e internal/runtime/syscall/linux.Syscall6 (podman + 0x48b46e)#012#1 0x00005641b11450a6 syscall.Syscall (podman + 0x56b0a6)#012#2 0x00005641b1145c50 syscall.Syscall.abi0 (podman + 0x56bc50)#012#3 0x00005641b12afc2e github.com/containers/podman/vendor/golang.org/x/sys/unix.OpenTree (podman + 0x6d5c2e)#012#4 0x00005641b1908f4b github.com/containers/podman/vendor/github.com/cyphar/filepath-securejoin/p… (podman + 0xd2ef4b)#012#5 0x00005641b1908e54 github.com/containers/podman/vendor/github.com/cyphar/filepath-securejoin/p… (podman + 0xd2ee54)#012#6 0x00005641b10f8dcc sync.(*Once).doSlow (podman + 0x51edcc)#012#7 0x00005641b10f8cf9 sync.(*Once).Do (podman + 0x51ecf9)#012#8 0x00005641b1908d
c5 github.com/containers/podman/vendor/github.com/cyphar/filepath-securejoin/p… (podman + 0xd2edc5)#012#9 0x00005641b190a3e2 github.com/containers/podman/vendor/github.com/cyphar/filepath-securejoin/p… (podman + 0xd303e2)#012#10 0x00005641b190a7f3 github.com/containers/podman/vendor/github.com/cyphar/filepath-securejoin/p… (podman + 0xd307f3)#012#11 0x00005641b190991c github.com/containers/podman/vendor/github.com/cyphar/filepath-securejoin/p… (podman + 0xd2f91c)#012#12 0x00005641b1909358 github.com/containers/podman/vendor/github.com/cyphar/filepath-securejoin/p… (podman + 0xd2f358)#012#13 0x00005641b10f8dcc sync.(*Once).doSlow (podman + 0x51edcc)#012#14 0x00005641b10f8cf9 sync.(*Once).D
o (podman + 0x51ecf9)#012#15 0x00005641b19092c5 github.com/containers/podman/vendor/github.com/cyphar/filepath-securejoin/p… (podman + 0xd2f2c5)#012#16 0x00005641b190a79a github.com/containers/podman/vendor/github.com/cyphar/filepath-securejoin/p… (podman + 0xd3079a)#012#17 0x00005641b191134e github.com/containers/podman/vendor/github.com/opencontainers/selinux/go-se… (podman + 0xd3734e)#012#18 0x00005641b1911838 github.com/containers/podman/vendor/github.com/opencontainers/selinux/go-se… (podman + 0xd37838)#012#19 0x00005641b19105df github.com/containers/podman/vendor/github.com/opencontainers/selinux/go-se… (podman + 0xd365df)#012#20 0x00005641b1910873 github.com/containers/podman/vendor/github.com/opencontainers/selinux/go-se… (podman + 0xd36873)#012#21 0x000
05641b1b08f4b github.com/containers/podman/vendor/go.podman.io/common/pkg/config.defaultC… (podman + 0xf2ef4b)#012#22 0x00005641b1b0c912 github.com/containers/podman/vendor/go.podman.io/common/pkg/config.newLocked (podman + 0xf32912)#012#23 0x00005641b1b0c605 github.com/containers/podman/vendor/go.podman.io/common/pkg/config.New (podman + 0xf32605)#012#24 0x00005641b227ffd3 github.com/containers/podman/cmd/podman/registry.newPodmanConfig (podman + 0x16a5fd3)#012#25 0x00005641b10f8dcc sync.(*Once).doSlow (podman + 0x51edcc)#012#26 0x00005641b22a0c50 github.com/containers/podman/cmd/podman/common.init (podman + 0x16c6c50)#012#27 0x00005641b10bea57 runtime.doInit1 (podman + 0x4e4a57)#012#28 0x00005641b10aef90 runtime.main (podman + 0x4d4f90)#012#29 0x00005641b10eeee1 runtime.goexit.abi0 (podman + 0x514ee1)#012ELF object binary architecture: AMD x86-64
Jul 29 06:36:03 jaws.cs.umd.edu systemd-coredump[2827476]: Process 2827468 (podman) of user 981 dumped core.#012#012Stack trace of thread 2827468:#012#0 0x0000561a374e146e internal/runtime/syscall/linux.Syscall6 (podman + 0x48b46e)#012#1 0x0000561a375c10a6 syscall.Syscall (podman + 0x56b0a6)#012#2 0x0000561a375c1c50 syscall.Syscall.abi0 (podman + 0x56bc50)#012#3 0x0000561a3772bc2e github.com/containers/podman/vendor/golang.org/x/sys/unix.OpenTree (podman + 0x6d5c2e)#012#4 0x0000561a37d84f4b github.com/containers/podman/vendor/github.com/cyphar/filepath-securejoin/p… (podman + 0xd2ef4b)#012#5 0x0000561a37d84e54 github.com/containers/podman/vendor/github.com/cyphar/filepath-securejoin/p… (podman + 0xd2ee54)#012#6 0x0000561a37574dcc sync.(*Once).doSlow (podman + 0x51edcc)#012#7 0x0000561a37574cf9 sync.(*Once).Do (podman + 0x51ecf9)#012#8 0x0000561a37d84d
c5 github.com/containers/podman/vendor/github.com/cyphar/filepath-securejoin/p… (podman + 0xd2edc5)#012#9 0x0000561a37d863e2 github.com/containers/podman/vendor/github.com/cyphar/filepath-securejoin/p… (podman + 0xd303e2)#012#10 0x0000561a37d867f3 github.com/containers/podman/vendor/github.com/cyphar/filepath-securejoin/p… (podman + 0xd307f3)#012#11 0x0000561a37d8591c github.com/containers/podman/vendor/github.com/cyphar/filepath-securejoin/p… (podman + 0xd2f91c)#012#12 0x0000561a37d85358 github.com/containers/podman/vendor/github.com/cyphar/filepath-securejoin/p… (podman + 0xd2f358)#012#13 0x0000561a37574dcc sync.(*Once).doSlow (podman + 0x51edcc)#012#14 0x0000561a37574cf9 sync.(*Once).D
o (podman + 0x51ecf9)#012#15 0x0000561a37d852c5 github.com/containers/podman/vendor/github.com/cyphar/filepath-securejoin/p… (podman + 0xd2f2c5)#012#16 0x0000561a37d8679a github.com/containers/podman/vendor/github.com/cyphar/filepath-securejoin/p… (podman + 0xd3079a)#012#17 0x0000561a37d8d34e github.com/containers/podman/vendor/github.com/opencontainers/selinux/go-se… (podman + 0xd3734e)#012#18 0x0000561a37d8d838 github.com/containers/podman/vendor/github.com/opencontainers/selinux/go-se… (podman + 0xd37838)#012#19 0x0000561a37d8c5df github.com/containers/podman/vendor/github.com/opencontainers/selinux/go-se… (podman + 0xd365df)#012#20 0x0000561a37d8c873 github.com/containers/podman/vendor/github.com/opencontainers/selinux/go-se… (podman + 0xd36873)#012#21 0x000
0561a37f84f4b github.com/containers/podman/vendor/go.podman.io/common/pkg/config.defaultC… (podman + 0xf2ef4b)#012#22 0x0000561a37f88912 github.com/containers/podman/vendor/go.podman.io/common/pkg/config.newLocked (podman + 0xf32912)#012#23 0x0000561a37f88605 github.com/containers/podman/vendor/go.podman.io/common/pkg/config.New (podman + 0xf32605)#012#24 0x0000561a386fbfd3 github.com/containers/podman/cmd/podman/registry.newPodmanConfig (podman + 0x16a5fd3)#012#25 0x0000561a37574dcc sync.(*Once).doSlow (podman + 0x51edcc)#012#26 0x0000561a3871cc50 github.com/containers/podman/cmd/podman/common.init (podman + 0x16c6c50)#012#27 0x0000561a3753aa57 runtime.doInit1 (podman + 0x4e4a57)#012#28 0x0000561a3752af90 runtime.main (podman + 0x4d4f90)#012#29 0x0000561a3756aee1 runtime.goexit.abi0 (podman + 0x514ee1)#012ELF object binary architecture: AMD x86-64
Jul 29 06:36:04 jaws.cs.umd.edu setroubleshoot[2827418]: SELinux is preventing /usr/bin/podman from using the nnp_transition access on a process. For complete SELinux messages run: sealert -l 3c7643bc-dd69-4695-b48c-7d780b62b6cf [x2]
== neodontcare.cs.umd.edu (5 distinct, 7 total) ==
Jul 29 06:13:30 neodontcare.cs.umd.edu gnome-software[7556]: Only 0 apps for recent list, hiding
Jul 29 06:13:34 neodontcare.cs.umd.edu packagekitd[396255]: Failed to get cache filename for gnu-free-mono-fonts
Jul 29 06:13:34 neodontcare.cs.umd.edu packagekitd[396255]: Failed to get cache filename for gnu-free-serif-fonts
Jul 29 06:13:34 neodontcare.cs.umd.edu packagekitd[396255]: Failed to get cache filename for libreoffice [x3]
Jul 29 06:13:38 neodontcare.cs.umd.edu packagekitd[396255]: failed to parse public key for /etc/pki/rpm-gpg/RPM-GPG-KEY-PQC-redhat-release
== newhonors2 (38 distinct, 65 total) ==
Jul 29 06:13:03 newhonors2 dhcpcd[438848]: dhcpcd is not running [x28]
Jul 29 06:48:21 newhonors2 puppet-agent[440316]: Could not update: Execution of '/usr/bin/apt-get -q -y -o DPkg::Options::=--force-confold --force-yes install openvox-agent=8.27.0-1+ubuntu24.04' returned 100: Reading package lists...
Jul 29 06:48:21 newhonors2 puppet-agent[440316]: Building dependency tree...
Jul 29 06:48:21 newhonors2 puppet-agent[440316]: Reading state information...
Jul 29 06:48:21 newhonors2 puppet-agent[440316]: Package openvox-agent is not available, but is referred to by another package.
Jul 29 06:48:21 newhonors2 puppet-agent[440316]: This may mean that the package is missing, has been obsoleted, or
Jul 29 06:48:21 newhonors2 puppet-agent[440316]: is only available from another source
Jul 29 06:48:21 newhonors2 puppet-agent[440316]:
Jul 29 06:48:21 newhonors2 puppet-agent[440316]: W: --force-yes is deprecated, use one of the options starting with --allow instead.
Jul 29 06:48:21 newhonors2 puppet-agent[440316]: E: Version '8.27.0-1+ubuntu24.04' for 'openvox-agent' was not found
Jul 29 06:48:21 newhonors2 puppet-agent[440316]: (/Stage[main]/Puppet::Agent::Install/Package[openvox-agent]/ensure) change from '7.37.2-1+ubuntu24.04' to '8.27.0-1+ubuntu24.04' failed: Could not update: Execution of '/usr/bin/apt-get -q -y -o DPkg::Options::=--force-confold --force-yes install openvox-agent=8.27.0-1+ubuntu24.04' returned 100: Reading package lists...
Jul 29 06:48:21 newhonors2 puppet-agent[440316]: (/Stage[main]/Puppet::Agent::Install/Package[openvox-agent]/ensure) Building dependency tree...
Jul 29 06:48:21 newhonors2 puppet-agent[440316]: (/Stage[main]/Puppet::Agent::Install/Package[openvox-agent]/ensure) Reading state information...
Jul 29 06:48:21 newhonors2 puppet-agent[440316]: (/Stage[main]/Puppet::Agent::Install/Package[openvox-agent]/ensure) Package openvox-agent is not available, but is referred to by another package.
Jul 29 06:48:21 newhonors2 puppet-agent[440316]: (/Stage[main]/Puppet::Agent::Install/Package[openvox-agent]/ensure) This may mean that the package is missing, has been obsoleted, or
Jul 29 06:48:21 newhonors2 puppet-agent[440316]: (/Stage[main]/Puppet::Agent::Install/Package[openvox-agent]/ensure) is only available from another source
Jul 29 06:48:21 newhonors2 puppet-agent[440316]: (/Stage[main]/Puppet::Agent::Install/Package[openvox-agent]/ensure)
Jul 29 06:48:21 newhonors2 puppet-agent[440316]: (/Stage[main]/Puppet::Agent::Install/Package[openvox-agent]/ensure) W: --force-yes is deprecated, use one of the options starting with --allow instead.
Jul 29 06:48:21 newhonors2 puppet-agent[440316]: (/Stage[main]/Puppet::Agent::Install/Package[openvox-agent]/ensure) E: Version '8.27.0-1+ubuntu24.04' for 'openvox-agent' was not found
Jul 29 06:48:45 newhonors2 puppet-agent[440316]: (/Stage[main]/Puppet::Agent::Config/Puppet::Config::Agent[classfile]/Puppet::Config::Entry[agent_classfile]/Concat::Fragment[puppet.conf_agent]/Concat_fragment[puppet.conf_agent]) Skipping because of failed dependencies
Jul 29 06:48:45 newhonors2 puppet-agent[440316]: (/Stage[main]/Puppet::Agent::Config/Puppet::Config::Agent[classfile]/Puppet::Config::Entry[agent_classfile]/Concat::Fragment[puppet.conf_agent_end]/Concat_fragment[puppet.conf_agent_end]) Skipping because of failed dependencies
Jul 29 06:48:45 newhonors2 puppet-agent[440316]: (/Stage[main]/Puppet::Agent::Config/Puppet::Config::Agent[classfile]/Puppet::Config::Entry[agent_classfile]/Concat::Fragment[puppet.conf_agent_classfile]/Concat_fragment[puppet.conf_agent_classfile]) Skipping because of failed dependencies
Jul 29 06:48:45 newhonors2 puppet-agent[440316]: (/Stage[main]/Puppet::Agent::Config/Puppet::Config::Agent[default_schedules]/Puppet::Config::Entry[agent_default_schedules]/Concat::Fragment[puppet.conf_agent_default_schedules]/Concat_fragment[puppet.conf_agent_default_schedules]) Skipping because of failed dependencies
Jul 29 06:48:45 newhonors2 puppet-agent[440316]: (/Stage[main]/Puppet::Agent::Config/Puppet::Config::Agent[report]/Puppet::Config::Entry[agent_report]/Concat::Fragment[puppet.conf_agent_report]/Concat_fragment[puppet.conf_agent_report]) Skipping because of failed dependencies
Jul 29 06:48:45 newhonors2 puppet-agent[440316]: (/Stage[main]/Puppet::Agent::Config/Puppet::Config::Agent[masterport]/Puppet::Config::Entry[agent_masterport]/Concat::Fragment[puppet.conf_agent_masterport]/Concat_fragment[puppet.conf_agent_masterport]) Skipping because of failed dependencies
Jul 29 06:48:45 newhonors2 puppet-agent[440316]: (/Stage[main]/Puppet::Agent::Config/Puppet::Config::Agent[splay]/Puppet::Config::Entry[agent_splay]/Concat::Fragment[puppet.conf_agent_splay]/Concat_fragment[puppet.conf_agent_splay]) Skipping because of failed dependencies
Jul 29 06:48:45 newhonors2 puppet-agent[440316]: (/Stage[main]/Puppet::Agent::Config/Puppet::Config::Agent[splaylimit]/Puppet::Config::Entry[agent_splaylimit]/Concat::Fragment[puppet.conf_agent_splaylimit]/Concat_fragment[puppet.conf_agent_splaylimit]) Skipping because of failed dependencies
Jul 29 06:48:45 newhonors2 puppet-agent[440316]: (/Stage[main]/Puppet::Agent::Config/Puppet::Config::Agent[runinterval]/Puppet::Config::Entry[agent_runinterval]/Concat::Fragment[puppet.conf_agent_runinterval]/Concat_fragment[puppet.conf_agent_runinterval]) Skipping because of failed dependencies
Jul 29 06:48:45 newhonors2 puppet-agent[440316]: (/Stage[main]/Puppet::Agent::Config/Puppet::Config::Agent[noop]/Puppet::Config::Entry[agent_noop]/Concat::Fragment[puppet.conf_agent_noop]/Concat_fragment[puppet.conf_agent_noop]) Skipping because of failed dependencies
Jul 29 06:48:45 newhonors2 puppet-agent[440316]: (/Stage[main]/Puppet::Agent::Config/Puppet::Config::Agent[usecacheonfailure]/Puppet::Config::Entry[agent_usecacheonfailure]/Concat::Fragment[puppet.conf_agent_usecacheonfailure]/Concat_fragment[puppet.conf_agent_usecacheonfailure]) Skipping because of failed dependencies
... 8 more distinct messages not shown
== orchids (5 distinct, 5 total) ==
Jul 29 06:11:31 orchids gnome-software[1516991]: Only 0 apps for recent list, hiding
Jul 29 06:11:38 orchids packagekitd[3002966]: Failed to get cache filename for libreoffice
Jul 29 06:11:38 orchids packagekitd[3002966]: Failed to get cache filename for chromium
Jul 29 06:11:38 orchids packagekitd[3002966]: Failed to get cache filename for chromium-common
Jul 29 06:11:52 orchids packagekitd[3002966]: failed to parse public key for /etc/pki/rpm-gpg/RPM-GPG-KEY-PQC-redhat-release
== outbound00.cs.umd.edu (1 distinct, 6 total) ==
Jul 29 06:09:09 outbound00.cs.umd.edu python3[708169]: ldapdb [x6]
== outbound01.cs.umd.edu (2 distinct, 8 total) ==
Jul 29 06:13:06 outbound01.cs.umd.edu python3[2933336]: ldapdb [x6]
Jul 29 06:33:40 outbound01.cs.umd.edu krb5_child[2938433]: Client 'admin(a)UMD.EDU' not found in Kerberos database [x2]
== sentry-docker00.cs.umd.edu (36 distinct, 36 total) ==
Jul 29 06:08:54 sentry-docker00.cs.umd.edu systemd-udevd[1670766]: link_config: could not get ethtool features for vethbc5106e
Jul 29 06:08:54 sentry-docker00.cs.umd.edu systemd-udevd[1670766]: Could not set offload features of vethbc5106e: No such device
Jul 29 06:08:54 sentry-docker00.cs.umd.edu systemd-udevd[1670794]: Could not generate persistent MAC address for veth0cc61f0: No such file or directory
Jul 29 06:08:54 sentry-docker00.cs.umd.edu systemd-udevd[1670795]: Could not generate persistent MAC address for veth4a313fc: No such file or directory
Jul 29 06:08:55 sentry-docker00.cs.umd.edu systemd-udevd[1670820]: Could not generate persistent MAC address for veth8302783: No such file or directory
Jul 29 06:08:55 sentry-docker00.cs.umd.edu systemd-udevd[1670821]: Could not generate persistent MAC address for veth4e44c87: No such file or directory
Jul 29 06:08:55 sentry-docker00.cs.umd.edu systemd-udevd[1670839]: Could not generate persistent MAC address for veth4bebfad: No such file or directory
Jul 29 06:08:55 sentry-docker00.cs.umd.edu systemd-udevd[1670837]: Could not generate persistent MAC address for veth729b123: No such file or directory
Jul 29 06:08:55 sentry-docker00.cs.umd.edu systemd-udevd[1670848]: Could not generate persistent MAC address for vethb408d39: No such file or directory
Jul 29 06:08:55 sentry-docker00.cs.umd.edu systemd-udevd[1670849]: Could not generate persistent MAC address for vethb07176a: No such file or directory
Jul 29 06:15:11 sentry-docker00.cs.umd.edu systemd-udevd[1673254]: Could not generate persistent MAC address for veth73cdfdd: No such file or directory
Jul 29 06:15:11 sentry-docker00.cs.umd.edu systemd-udevd[1673255]: Could not generate persistent MAC address for veth848b208: No such file or directory
Jul 29 06:29:02 sentry-docker00.cs.umd.edu systemd-udevd[1680229]: link_config: could not set ethtool features for vethb408d39
Jul 29 06:29:02 sentry-docker00.cs.umd.edu systemd-udevd[1680229]: Could not set offload features of vethb408d39: Operation not permitted
Jul 29 06:29:03 sentry-docker00.cs.umd.edu systemd-udevd[1680258]: Could not generate persistent MAC address for veth1bcb328: No such file or directory
Jul 29 06:29:03 sentry-docker00.cs.umd.edu systemd-udevd[1680259]: Could not generate persistent MAC address for vethdeff530: No such file or directory
Jul 29 06:29:03 sentry-docker00.cs.umd.edu systemd-udevd[1680262]: Could not generate persistent MAC address for veth75e4452: No such file or directory
Jul 29 06:29:03 sentry-docker00.cs.umd.edu systemd-udevd[1680263]: Could not generate persistent MAC address for vethed1cebd: No such file or directory
Jul 29 06:29:03 sentry-docker00.cs.umd.edu systemd-udevd[1680277]: Could not generate persistent MAC address for veth336fa2e: No such file or directory
Jul 29 06:29:03 sentry-docker00.cs.umd.edu systemd-udevd[1680266]: Could not generate persistent MAC address for veth1c1fbae: No such file or directory
Jul 29 06:29:03 sentry-docker00.cs.umd.edu systemd-udevd[1680288]: Could not generate persistent MAC address for veth250af21: No such file or directory
Jul 29 06:29:03 sentry-docker00.cs.umd.edu systemd-udevd[1680289]: Could not generate persistent MAC address for veth931ee17: No such file or directory
Jul 29 06:35:19 sentry-docker00.cs.umd.edu systemd-udevd[1683008]: Could not generate persistent MAC address for veth127c585: No such file or directory
Jul 29 06:35:19 sentry-docker00.cs.umd.edu systemd-udevd[1683009]: Could not generate persistent MAC address for veth93eb99b: No such file or directory
Jul 29 06:49:11 sentry-docker00.cs.umd.edu systemd-udevd[1689695]: link_config: could not get ethtool features for veth75e4452
Jul 29 06:49:11 sentry-docker00.cs.umd.edu systemd-udevd[1689695]: Could not set offload features of veth75e4452: No such device
Jul 29 06:49:11 sentry-docker00.cs.umd.edu systemd-udevd[1689733]: Could not generate persistent MAC address for veth9406204: No such file or directory
Jul 29 06:49:11 sentry-docker00.cs.umd.edu systemd-udevd[1689734]: Could not generate persistent MAC address for veth41c95ad: No such file or directory
Jul 29 06:49:11 sentry-docker00.cs.umd.edu systemd-udevd[1689737]: Could not generate persistent MAC address for veth4156381: No such file or directory
Jul 29 06:49:11 sentry-docker00.cs.umd.edu systemd-udevd[1689738]: Could not generate persistent MAC address for vethde9fc45: No such file or directory
... 6 more distinct messages not shown
== strawberry (4 distinct, 10 total) ==
Jul 29 06:09:44 strawberry udisksd[1067]: Error performing housekeeping for drive /org/freedesktop/UDisks2/drives/ST2000DM001_1CH164_W1E8J5KJ: Error updating SMART data: Error sending ATA command CHECK POWER MODE: Unexpected sense data returned:#0120000: 00 00 00 00 00 00 00 00 00 00 00 00 00 00 00 00 ................#0120010: 00 00 00 00 00 00 00 00 00 00 00 00 00 00 00 00 ................#012 (g-io-error-quark, 0) [x6]
Jul 29 06:31:04 strawberry nologin[3065783]: Attempted login by UNKNOWN (UID: 65534) on UNKNOWN
Jul 29 06:31:04 strawberry pipewire[3065782]: mod.jackdbus-detect: Failed to receive jackdbus reply: org.freedesktop.DBus.Error.ServiceUnknown: The name org.jackaudio.service was not provided by any .service files
Jul 29 06:34:42 strawberry smartd[5314]: Device: /dev/sda [SAT], failed to read SMART Attribute Data [x2]
== tlsrpt (1 distinct, 1 total) ==
Jul 29 06:38:03 tlsrpt (httpd)[368112]: httpd.service: Referenced but unset environment variable evaluates to an empty string: OPTIONS
1
0
Command: /usr/local/sbin/syslog-digest.py
Time : 0.4823s
Status : exited 0
Output :
Syslog digest — 2026-07-29 06:05 EDT
Processed 4,062 lines, filtered 3,409 (83%). 653 unknown (124 distinct) from 22 host(s).
== abuse (1 distinct, 346 total) ==
Jul 29 05:05:06 abuse rsyslogd[21745]: imjournal: open() failed for path: '/var/lib/rsyslog/imjournal.state.tmp': Input/output error [v8.2404.0 try https://www.rsyslog.com/e/2433 ] [x346]
== alec.cs.umd.edu (3 distinct, 60 total) ==
Jul 29 05:05:24 alec.cs.umd.edu setroubleshoot[57619]: failed to retrieve rpm info for path '/run/netns/netns-9dfd0347-71eb-5698-085c-c769043aa5c3': [x12]
Jul 29 05:05:25 alec.cs.umd.edu sedispatch[1526]: AVC Message regarding setroubleshoot, ignoring message [x24]
Jul 29 05:05:25 alec.cs.umd.edu setroubleshoot[57619]: SELinux is preventing /usr/bin/df from getattr access on the file /run/netns/netns-9dfd0347-71eb-5698-085c-c769043aa5c3. For complete SELinux messages run: sealert -l 23f93208-3063-4aac-b78a-bb0fcb40740c [x24]
== b0b02.cs.umd.edu (4 distinct, 5 total) ==
Jul 29 05:19:57 b0b02.cs.umd.edu setroubleshoot[553599]: SELinux is preventing /usr/bin/python3.9 from getattr access on the file /etc/authselect/nsswitch.conf. For complete SELinux messages run: sealert -l 9a1e2952-3fde-4937-a8ab-f7f59791a458 [x2]
Jul 29 05:20:00 b0b02.cs.umd.edu setroubleshoot[553599]: SELinux is preventing /usr/bin/python3.9 from read access on the file /etc/authselect/nsswitch.conf. For complete SELinux messages run: sealert -l 97d74423-e027-4cd6-8810-ad80944900b5
Jul 29 05:20:02 b0b02.cs.umd.edu setroubleshoot[553599]: SELinux is preventing /usr/bin/python3.9 from open access on the file /etc/authselect/nsswitch.conf. For complete SELinux messages run: sealert -l 4f253f6a-62d6-46dd-8eaf-0b4d29df41c6
Jul 29 05:35:59 b0b02.cs.umd.edu rustdesk[558066]: cannot open display:
== bachata (10 distinct, 10 total) ==
Jul 29 05:53:56 bachata smbd[2078614]: [2026/07/29 05:53:56.347241, 0] ../../source3/smbd/smb2_service.c:117(chdir_current_service)
Jul 29 05:53:56 bachata smbd[2078614]: chdir_current_service: vfs_ChDir(/fs/junkfood/mount) failed: Permission denied. Current token: uid=11255, gid=11255, 12 groups: 11255 319000009 25038 15294 15229 755 25030 25025 30880 25029 770 15026
Jul 29 05:53:56 bachata smbd[2078614]: [2026/07/29 05:53:56.349633, 0] ../../source3/smbd/smbXsrv_tcon.c:914(smbXsrv_tcon_disconnect)
Jul 29 05:53:56 bachata smbd[2078614]: smbXsrv_tcon_disconnect: disconnect(0xb4b3ceb9, 'mount'): chdir_current_service() failed: NT_STATUS_INTERNAL_ERROR
Jul 29 05:53:56 bachata smbd[2078614]: [2026/07/29 05:53:56.349999, 0] ../../source3/smbd/smbXsrv_tcon.c:1028(smbXsrv_tcon_disconnect_all)
Jul 29 05:53:56 bachata smbd[2078614]: smbXsrv_tcon_disconnect_all: count[2] errors[1] first[NT_STATUS_INTERNAL_ERROR]
Jul 29 05:53:56 bachata smbd[2078614]: [2026/07/29 05:53:56.350244, 0] ../../source3/smbd/smbXsrv_session.c:1900(smbXsrv_session_logoff)
Jul 29 05:53:56 bachata smbd[2078614]: smbXsrv_session_logoff: smbXsrv_session_logoff(0x6a655c45): smb2srv_tcon_disconnect_all() failed: NT_STATUS_INTERNAL_ERROR
Jul 29 05:53:56 bachata smbd[2078614]: [2026/07/29 05:53:56.350462, 0] ../../source3/smbd/smbXsrv_session.c:1728(smbXsrv_session_remove_channel_done)
Jul 29 05:53:56 bachata smbd[2078614]: smbXsrv_session_remove_channel_done: smbXsrv_session_logoff(1785027653) failed: NT_STATUS_INTERNAL_ERROR
== contest (10 distinct, 43 total) ==
Jul 29 05:06:24 contest goferd[1007]: [ERROR][worker-0] gofer.messaging.adapter.connect:33 - connect: proton+amqps://satellite8.cs.umd.edu:5647, failed: Connection amqps://satellite8.cs.umd.edu:5647 disconnected: Condition('proton.pythonio', 'Connection refused to all addresses') [x33]
Jul 29 05:48:14 contest setroubleshoot[268811]: SELinux is preventing /usr/libexec/platform-python3.6 from create access on the directory libdnf.igb3XI. For complete SELinux messages run: sealert -l cb6b25c6-4765-4cf2-88a0-9b3b508e94e9
Jul 29 05:48:14 contest setroubleshoot[268811]: SELinux is preventing /usr/bin/gpgconf from add_name access on the directory repodata. For complete SELinux messages run: sealert -l 41cf7b1b-0f34-4609-98f2-b66e7825fef7
Jul 29 05:48:14 contest setroubleshoot[268811]: SELinux is preventing /usr/libexec/platform-python3.6 from create access on the file mirrorlist. For complete SELinux messages run: sealert -l fc20ff92-ea83-4f38-a24b-ddfd737a3141
Jul 29 05:48:14 contest setroubleshoot[268811]: SELinux is preventing /usr/libexec/platform-python3.6 from setattr access on the file repomd.xml. For complete SELinux messages run: sealert -l ac675631-fa35-4e93-adc9-b692b18e53e5
Jul 29 05:48:14 contest setroubleshoot[268811]: SELinux is preventing /usr/bin/gpgconf from add_name access on the directory repomd.xml.asc. For complete SELinux messages run: sealert -l 41cf7b1b-0f34-4609-98f2-b66e7825fef7
Jul 29 05:48:14 contest setroubleshoot[268811]: SELinux is preventing /usr/libexec/platform-python3.6 from read access on the directory libdnf.igb3XI. For complete SELinux messages run: sealert -l 45d103b6-0810-4890-a705-990118577ce8
Jul 29 05:48:14 contest setroubleshoot[268811]: SELinux is preventing /usr/libexec/platform-python3.6 from remove_name access on the directory repomd.xml. For complete SELinux messages run: sealert -l 7e499113-2fd7-4f67-bec6-3521efbe3637 [x2]
Jul 29 05:48:15 contest setroubleshoot[268811]: SELinux is preventing /usr/libexec/platform-python3.6 from rmdir access on the directory repodata. For complete SELinux messages run: sealert -l 3928930b-a1ed-448d-950b-0665ac2adef8
Jul 29 05:48:16 contest setroubleshoot[268811]: SELinux is preventing /usr/libexec/platform-python3.6 from create access on the directory libdnf.aAYrl5. For complete SELinux messages run: sealert -l cb6b25c6-4765-4cf2-88a0-9b3b508e94e9
== csfw00a (1 distinct, 4 total) ==
Jul 29 05:23:46 csfw00a kernel: bnxt_en 0000:09:00.0 eth3: NIC Link is Down [x4]
== grades01.cs.umd.edu (1 distinct, 1 total) ==
Jul 29 05:48:07 grades01.cs.umd.edu puppet-agent[14627]: The directory '/srv/grades' contains 2471 entries, which exceeds the default soft limit 1000 and may cause excessive resource consumption and degraded performance. To remove this warning set a value for `max_files` parameter or consider using an alternate method to manage large directory trees
== hackerman (1 distinct, 1 total) ==
Jul 29 05:19:01 hackerman gnome-software[2060381]: failed to commit changes to dconf: GDBus.Error:org.gtk.GDBus.UnmappedGError.Quark._g_2dfile_2derror_2dquark.Code2: Failed to create file “/adminhomes/sajith/.config/dconf/user.O1TZS3”: Permission denied
== idm00 (1 distinct, 1 total) ==
Jul 29 05:51:10 idm00 named[1455]: client @0x7f330c9c5098 10.73.240.42#56915: update '73.10.in-addr.arpa/IN' denied
== idmp0 (1 distinct, 1 total) ==
Jul 29 05:36:04 idmp0 named[5198]: client @0x7f98fc03bf48 10.73.240.43#60734: update '73.10.in-addr.arpa/IN' denied
== itmon02 (1 distinct, 44 total) ==
Jul 29 05:07:47 itmon02 sshd[1834]: error: beginning MaxStartups throttling [x44]
== matrix (11 distinct, 13 total) ==
Jul 29 05:54:26 matrix systemd[1]: networkd-dispatcher.service: Got notification message from PID 866949, but reception only permitted for main PID 720
Jul 29 05:54:26 matrix systemd[1]: networkd-dispatcher.service: Got notification message from PID 866959, but reception only permitted for main PID 720
Jul 29 05:54:33 matrix systemd[1]: networkd-dispatcher.service: Got notification message from PID 867052, but reception only permitted for main PID 720
Jul 29 05:54:34 matrix systemd[1]: networkd-dispatcher.service: Got notification message from PID 867059, but reception only permitted for main PID 720
Jul 29 05:54:34 matrix networkctl[867073]: Interface "veth444b5c8" not found.
Jul 29 05:54:34 matrix systemd[1]: networkd-dispatcher.service: Got notification message from PID 867073, but reception only permitted for main PID 720 [x2]
Jul 29 05:54:34 matrix systemd[1]: networkd-dispatcher.service: Got notification message from PID 867138, but reception only permitted for main PID 720
Jul 29 05:54:43 matrix systemd[1]: networkd-dispatcher.service: Got notification message from PID 867212, but reception only permitted for main PID 720
Jul 29 05:54:43 matrix systemd[1]: networkd-dispatcher.service: Got notification message from PID 867219, but reception only permitted for main PID 720
Jul 29 05:54:43 matrix networkctl[867232]: Interface "vethd36610b" not found.
Jul 29 05:54:43 matrix systemd[1]: networkd-dispatcher.service: Got notification message from PID 867232, but reception only permitted for main PID 720 [x2]
== newhonors2 (1 distinct, 24 total) ==
Jul 29 05:13:03 newhonors2 dhcpcd[437010]: dhcpcd is not running [x24]
== outbound00.cs.umd.edu (1 distinct, 6 total) ==
Jul 29 05:09:09 outbound00.cs.umd.edu python3[694348]: ldapdb [x6]
== outbound01.cs.umd.edu (3 distinct, 9 total) ==
Jul 29 05:08:18 outbound01.cs.umd.edu python3[2917548]: ldapdb [x7]
Jul 29 05:09:25 outbound01.cs.umd.edu systemd[1]: Configuration file /usr/lib/systemd/system/authentication_milter.service is marked executable. Please remove executable permission bits. Proceeding anyway.
Jul 29 05:49:50 outbound01.cs.umd.edu krb5_child[2927536]: Client 'admin(a)UMD.EDU' not found in Kerberos database
== peach.cs.umd.edu (2 distinct, 2 total) ==
Jul 29 05:12:09 peach.cs.umd.edu setroubleshoot[1417778]: SELinux is preventing /usr/bin/qemu-ga from search access on the directory /var/lib/containers/storage/overlay. For complete SELinux messages run: sealert -l ba415951-a2c6-424e-b17d-305c5300b9f3
Jul 29 05:12:09 peach.cs.umd.edu setroubleshoot[1417778]: SELinux is preventing /usr/bin/qemu-ga from search access on the directory /var/lib/containers/storage/overlay. For complete SELinux messages run: sealert -l 6aeb0956-fcf2-462a-ae4d-439b912c16d0
== sentry-docker00.cs.umd.edu (40 distinct, 40 total) ==
Jul 29 05:08:29 sentry-docker00.cs.umd.edu systemd-udevd[1642191]: link_config: could not get ethtool features for veth5c14a88
Jul 29 05:08:29 sentry-docker00.cs.umd.edu systemd-udevd[1642191]: Could not set offload features of veth5c14a88: No such device
Jul 29 05:08:29 sentry-docker00.cs.umd.edu systemd-udevd[1642229]: Could not generate persistent MAC address for vethda318e9: No such file or directory
Jul 29 05:08:29 sentry-docker00.cs.umd.edu systemd-udevd[1642230]: Could not generate persistent MAC address for vethd1d4e9b: No such file or directory
Jul 29 05:08:29 sentry-docker00.cs.umd.edu systemd-udevd[1642233]: Could not generate persistent MAC address for veth5c074eb: No such file or directory
Jul 29 05:08:29 sentry-docker00.cs.umd.edu systemd-udevd[1642234]: Could not generate persistent MAC address for veth5d1c92e: No such file or directory
Jul 29 05:08:29 sentry-docker00.cs.umd.edu systemd-udevd[1642233]: Could not generate persistent MAC address for vethefb9cf6: No such file or directory
Jul 29 05:08:29 sentry-docker00.cs.umd.edu systemd-udevd[1642242]: Could not generate persistent MAC address for veth446840a: No such file or directory
Jul 29 05:08:30 sentry-docker00.cs.umd.edu systemd-udevd[1642259]: Could not generate persistent MAC address for vethb4042b8: No such file or directory
Jul 29 05:08:30 sentry-docker00.cs.umd.edu systemd-udevd[1642260]: Could not generate persistent MAC address for veth008ed0c: No such file or directory
Jul 29 05:14:54 sentry-docker00.cs.umd.edu systemd-udevd[1644707]: Could not generate persistent MAC address for veth27d8e88: No such file or directory
Jul 29 05:14:54 sentry-docker00.cs.umd.edu systemd-udevd[1644708]: Could not generate persistent MAC address for vethc8ee49c: No such file or directory
Jul 29 05:28:37 sentry-docker00.cs.umd.edu systemd-udevd[1651797]: link_config: could not get ethtool features for veth5c074eb
Jul 29 05:28:37 sentry-docker00.cs.umd.edu systemd-udevd[1651797]: Could not set offload features of veth5c074eb: No such device
Jul 29 05:28:38 sentry-docker00.cs.umd.edu systemd-udevd[1651892]: Could not generate persistent MAC address for veth2212843: No such file or directory
Jul 29 05:28:38 sentry-docker00.cs.umd.edu systemd-udevd[1651893]: Could not generate persistent MAC address for veth12fe2af: No such file or directory
Jul 29 05:28:38 sentry-docker00.cs.umd.edu systemd-udevd[1651896]: Could not generate persistent MAC address for vethd5da0e4: No such file or directory
Jul 29 05:28:38 sentry-docker00.cs.umd.edu systemd-udevd[1651897]: Could not generate persistent MAC address for veth26f4469: No such file or directory
Jul 29 05:28:38 sentry-docker00.cs.umd.edu systemd-udevd[1651944]: Could not generate persistent MAC address for vethea7005c: No such file or directory
Jul 29 05:28:38 sentry-docker00.cs.umd.edu systemd-udevd[1651946]: Could not generate persistent MAC address for veth9846c2b: No such file or directory
Jul 29 05:28:38 sentry-docker00.cs.umd.edu systemd-udevd[1651990]: Could not generate persistent MAC address for veth56ec23f: No such file or directory
Jul 29 05:28:38 sentry-docker00.cs.umd.edu systemd-udevd[1651968]: Could not generate persistent MAC address for veth9f3442c: No such file or directory
Jul 29 05:34:58 sentry-docker00.cs.umd.edu systemd-udevd[1654354]: link_config: could not get ethtool features for veth27d8e88
Jul 29 05:34:58 sentry-docker00.cs.umd.edu systemd-udevd[1654354]: Could not set offload features of veth27d8e88: No such device
Jul 29 05:34:58 sentry-docker00.cs.umd.edu systemd-udevd[1654370]: Could not generate persistent MAC address for veth53d72a4: No such file or directory
Jul 29 05:34:58 sentry-docker00.cs.umd.edu systemd-udevd[1654371]: Could not generate persistent MAC address for vethf0a9ea8: No such file or directory
Jul 29 05:48:46 sentry-docker00.cs.umd.edu systemd-udevd[1661345]: link_config: could not get ethtool features for vethd5da0e4
Jul 29 05:48:46 sentry-docker00.cs.umd.edu systemd-udevd[1661345]: Could not set offload features of vethd5da0e4: No such device
Jul 29 05:48:46 sentry-docker00.cs.umd.edu systemd-udevd[1661374]: Could not generate persistent MAC address for veth0162930: No such file or directory
Jul 29 05:48:46 sentry-docker00.cs.umd.edu systemd-udevd[1661375]: Could not generate persistent MAC address for veth0b6bbcc: No such file or directory
... 10 more distinct messages not shown
== strawberry (2 distinct, 8 total) ==
Jul 29 05:09:44 strawberry udisksd[1067]: Error performing housekeeping for drive /org/freedesktop/UDisks2/drives/ST2000DM001_1CH164_W1E8J5KJ: Error updating SMART data: Error sending ATA command CHECK POWER MODE: Unexpected sense data returned:#0120000: 00 00 00 00 00 00 00 00 00 00 00 00 00 00 00 00 ................#0120010: 00 00 00 00 00 00 00 00 00 00 00 00 00 00 00 00 ................#012 (g-io-error-quark, 0) [x6]
Jul 29 05:34:42 strawberry smartd[5314]: Device: /dev/sda [SAT], failed to read SMART Attribute Data [x2]
== submit26-b9-2 (9 distinct, 12 total) ==
Jul 29 05:12:50 submit26-b9-2 setroubleshoot[397823]: SELinux is preventing /usr/bin/python3.9 from create access on the directory /(null). For complete SELinux messages run: sealert -l d506243c-d61e-48f3-b42a-4592c913deb0
Jul 29 05:12:50 submit26-b9-2 setroubleshoot[397823]: SELinux is preventing /usr/bin/python3.9 from add_name access on the directory /(null). For complete SELinux messages run: sealert -l 3b4752ac-1b9a-4af9-a05b-32e4c2eb13ab
Jul 29 05:12:50 submit26-b9-2 setroubleshoot[397823]: SELinux is preventing /usr/bin/python3.9 from create access on the file /(null). For complete SELinux messages run: sealert -l 29e5adbd-4381-4467-b40d-a2219101e096 [x2]
Jul 29 05:12:50 submit26-b9-2 setroubleshoot[397823]: SELinux is preventing /usr/bin/python3.9 from open access on the file /tmp/libdnf.PHFcdo/repodata/repomd.xml. For complete SELinux messages run: sealert -l 1b38f2ec-01ce-4343-8059-ba7494ecc5c4 [x2]
Jul 29 05:12:51 submit26-b9-2 setroubleshoot[397823]: SELinux is preventing /usr/bin/python3.9 from setattr access on the file repomd.xml. For complete SELinux messages run: sealert -l e5f9af40-1f63-4924-b012-27ab2a7b2266 [x2]
Jul 29 05:12:51 submit26-b9-2 setroubleshoot[397823]: SELinux is preventing /usr/bin/python3.9 from read access on the directory libdnf.PHFcdo. For complete SELinux messages run: sealert -l 5c54db87-54a3-4a7c-97b4-b5c48d6c3543
Jul 29 05:12:51 submit26-b9-2 setroubleshoot[397823]: SELinux is preventing /usr/bin/python3.9 from remove_name access on the directory repomd.xml. For complete SELinux messages run: sealert -l 63cd60e1-1e61-4276-afea-dd8526ffe8b2
Jul 29 05:12:51 submit26-b9-2 setroubleshoot[397823]: SELinux is preventing /usr/bin/python3.9 from unlink access on the file repomd.xml. For complete SELinux messages run: sealert -l 81c7e9ec-e023-4c6d-b1ad-c02a242e655e
Jul 29 05:12:51 submit26-b9-2 setroubleshoot[397823]: SELinux is preventing /usr/bin/python3.9 from rmdir access on the directory repodata. For complete SELinux messages run: sealert -l 6ae9a597-e123-4d74-8eec-a8ebe0f5e4d0
== submit26-b9-3 (9 distinct, 11 total) ==
Jul 29 05:20:36 submit26-b9-3 setroubleshoot[674771]: SELinux is preventing /usr/bin/python3.9 from create access on the directory /(null). For complete SELinux messages run: sealert -l 5b912a44-22fd-4560-b201-2a4e289b73f5 [x2]
Jul 29 05:20:36 submit26-b9-3 setroubleshoot[674771]: SELinux is preventing /usr/bin/python3.9 from add_name access on the directory /(null). For complete SELinux messages run: sealert -l 7f1df1e4-725e-4953-98eb-1079f908f543 [x2]
Jul 29 05:20:36 submit26-b9-3 setroubleshoot[674771]: SELinux is preventing /usr/bin/python3.9 from create access on the file /(null). For complete SELinux messages run: sealert -l 40b8852a-f77b-44b4-affe-5f11fa33de43
Jul 29 05:20:36 submit26-b9-3 setroubleshoot[674771]: SELinux is preventing /usr/bin/python3.9 from open access on the file /tmp/libdnf.PEWSat/repodata/repomd.xml. For complete SELinux messages run: sealert -l 45a8019e-f6b5-4baa-92c1-862594b40d46
Jul 29 05:20:36 submit26-b9-3 setroubleshoot[674771]: SELinux is preventing /usr/bin/python3.9 from setattr access on the file repomd.xml. For complete SELinux messages run: sealert -l e9f0bfff-7784-4126-baa4-2bb06da56591
Jul 29 05:20:36 submit26-b9-3 setroubleshoot[674771]: SELinux is preventing /usr/bin/python3.9 from read access on the directory libdnf.PEWSat. For complete SELinux messages run: sealert -l 0b17cc3d-cdc6-4fe2-a11f-3892e7c41dc7
Jul 29 05:20:36 submit26-b9-3 setroubleshoot[674771]: SELinux is preventing /usr/bin/python3.9 from remove_name access on the directory repomd.xml. For complete SELinux messages run: sealert -l 10e38c64-b65f-4cdd-901e-4375652d9a42
Jul 29 05:20:36 submit26-b9-3 setroubleshoot[674771]: SELinux is preventing /usr/bin/python3.9 from unlink access on the file repomd.xml. For complete SELinux messages run: sealert -l 7fd9cf72-ef38-48e1-b6aa-b571b26a7b22
Jul 29 05:20:36 submit26-b9-3 setroubleshoot[674771]: SELinux is preventing /usr/bin/python3.9 from rmdir access on the directory repodata. For complete SELinux messages run: sealert -l b9b11116-89bd-4a3c-980c-1d422c5dcee4
== submit26-clnb9 (9 distinct, 9 total) ==
Jul 29 05:31:54 submit26-clnb9 setroubleshoot[1475646]: SELinux is preventing /usr/bin/python3.9 from create access on the directory /(null). For complete SELinux messages run: sealert -l 6783ed2b-5ae4-42b5-975a-4bf50eec4658
Jul 29 05:31:54 submit26-clnb9 setroubleshoot[1475646]: SELinux is preventing /usr/bin/python3.9 from add_name access on the directory /(null). For complete SELinux messages run: sealert -l 9e7fa955-cc30-4804-ac8c-e1779e85946c
Jul 29 05:31:54 submit26-clnb9 setroubleshoot[1475646]: SELinux is preventing /usr/bin/python3.9 from create access on the file /(null). For complete SELinux messages run: sealert -l 69bfa6e3-089c-40ff-9563-fd30787d0774
Jul 29 05:31:54 submit26-clnb9 setroubleshoot[1475646]: SELinux is preventing /usr/bin/python3.9 from open access on the file /tmp/libdnf.G1RJIT/repodata/repomd.xml. For complete SELinux messages run: sealert -l 001acdb5-31ef-4e52-b10b-90f467a89ddc
Jul 29 05:31:54 submit26-clnb9 setroubleshoot[1475646]: SELinux is preventing /usr/bin/python3.9 from setattr access on the file repomd.xml. For complete SELinux messages run: sealert -l edacddcf-16ed-4dc3-8d82-7c597d5dee23
Jul 29 05:31:54 submit26-clnb9 setroubleshoot[1475646]: SELinux is preventing /usr/bin/python3.9 from read access on the directory libdnf.G1RJIT. For complete SELinux messages run: sealert -l 62b3782e-4730-4488-8178-94dafe9b552c
Jul 29 05:31:54 submit26-clnb9 setroubleshoot[1475646]: SELinux is preventing /usr/bin/python3.9 from remove_name access on the directory repomd.xml. For complete SELinux messages run: sealert -l 81cb3698-78f8-440a-8e3c-e5d1041e6b78
Jul 29 05:31:54 submit26-clnb9 setroubleshoot[1475646]: SELinux is preventing /usr/bin/python3.9 from unlink access on the file repomd.xml. For complete SELinux messages run: sealert -l 792b472a-115c-4799-9805-fc7436f916b9
Jul 29 05:31:54 submit26-clnb9 setroubleshoot[1475646]: SELinux is preventing /usr/bin/python3.9 from rmdir access on the directory repodata. For complete SELinux messages run: sealert -l 15c83a86-837b-41e2-b662-b39cd4e361cb
== updates00.cs.umd.edu (3 distinct, 3 total) ==
Jul 29 05:18:31 updates00.cs.umd.edu puppet-agent[22345]: Could not retrieve catalog from remote server: Error 500 on SERVER: Server Error: Function lookup() did not find a value for the name 'vault::kerberos' on node updates00.cs.umd.edu
Jul 29 05:18:31 updates00.cs.umd.edu puppet-agent[22345]: Not using cache on failed catalog
Jul 29 05:18:31 updates00.cs.umd.edu puppet-agent[22345]: Could not retrieve catalog; skipping run
1
0
Command: /usr/local/sbin/syslog-digest.py
Time : 0.4869s
Status : exited 0
Output :
Syslog digest — 2026-07-29 05:05 EDT
Processed 3,975 lines, filtered 3,367 (84%). 608 unknown (85 distinct) from 22 host(s).
== abadi-computer (2 distinct, 2 total) ==
Jul 29 04:15:01 abadi-computer nologin[13225]: Attempted login by UNKNOWN (UID: 65534) on UNKNOWN
Jul 29 04:15:01 abadi-computer pipewire[13224]: mod.jackdbus-detect: Failed to receive jackdbus reply: org.freedesktop.DBus.Error.ServiceUnknown: The name org.jackaudio.service was not provided by any .service files
== abuse (1 distinct, 346 total) ==
Jul 29 04:05:06 abuse rsyslogd[21745]: imjournal: open() failed for path: '/var/lib/rsyslog/imjournal.state.tmp': Input/output error [v8.2404.0 try https://www.rsyslog.com/e/2433 ] [x346]
== alec.cs.umd.edu (3 distinct, 62 total) ==
Jul 29 04:05:25 alec.cs.umd.edu setroubleshoot[42335]: failed to retrieve rpm info for path '/run/netns/netns-9dfd0347-71eb-5698-085c-c769043aa5c3': [x12]
Jul 29 04:05:26 alec.cs.umd.edu sedispatch[1526]: AVC Message regarding setroubleshoot, ignoring message [x24]
Jul 29 04:05:26 alec.cs.umd.edu setroubleshoot[42335]: SELinux is preventing /usr/bin/df from getattr access on the file /run/netns/netns-9dfd0347-71eb-5698-085c-c769043aa5c3. For complete SELinux messages run: sealert -l 23f93208-3063-4aac-b78a-bb0fcb40740c [x26]
== b0b02.cs.umd.edu (4 distinct, 5 total) ==
Jul 29 04:19:52 b0b02.cs.umd.edu setroubleshoot[538510]: SELinux is preventing /usr/bin/python3.9 from getattr access on the file /etc/authselect/nsswitch.conf. For complete SELinux messages run: sealert -l 9a1e2952-3fde-4937-a8ab-f7f59791a458 [x2]
Jul 29 04:19:55 b0b02.cs.umd.edu setroubleshoot[538510]: SELinux is preventing /usr/bin/python3.9 from read access on the file /etc/authselect/nsswitch.conf. For complete SELinux messages run: sealert -l 97d74423-e027-4cd6-8810-ad80944900b5
Jul 29 04:19:58 b0b02.cs.umd.edu setroubleshoot[538510]: SELinux is preventing /usr/bin/python3.9 from open access on the file /etc/authselect/nsswitch.conf. For complete SELinux messages run: sealert -l 4f253f6a-62d6-46dd-8eaf-0b4d29df41c6
Jul 29 04:35:56 b0b02.cs.umd.edu rustdesk[542997]: cannot open display:
== contest (1 distinct, 34 total) ==
Jul 29 04:05:42 contest goferd[1007]: [ERROR][worker-0] gofer.messaging.adapter.connect:33 - connect: proton+amqps://satellite8.cs.umd.edu:5647, failed: Connection amqps://satellite8.cs.umd.edu:5647 disconnected: Condition('proton.pythonio', 'Connection refused to all addresses') [x34]
== csfw00a (1 distinct, 2 total) ==
Jul 29 04:21:37 csfw00a kernel: bnxt_en 0000:09:00.0 eth3: NIC Link is Down [x2]
== dojo (1 distinct, 1 total) ==
Jul 29 04:15:24 dojo nologin[575185]: Attempted login by UNKNOWN (UID: 65534) on UNKNOWN
== forge00 (1 distinct, 1 total) ==
Jul 29 04:09:03 forge00 (httpd)[908034]: httpd.service: Referenced but unset environment variable evaluates to an empty string: OPTIONS
== idm00 (1 distinct, 1 total) ==
Jul 29 04:51:10 idm00 named[1455]: client @0x7f33103836b8 10.73.240.42#52950: update '73.10.in-addr.arpa/IN' denied
== idmp0 (1 distinct, 1 total) ==
Jul 29 04:36:04 idmp0 named[5198]: client @0x7f9910042b08 10.73.240.43#59293: update '73.10.in-addr.arpa/IN' denied
== itmon02 (1 distinct, 40 total) ==
Jul 29 04:07:58 itmon02 sshd[1834]: error: beginning MaxStartups throttling [x40]
== jaws.cs.umd.edu (4 distinct, 5 total) ==
Jul 29 04:35:59 jaws.cs.umd.edu systemd-coredump[2800757]: Process 2800738 (podman) of user 981 dumped core.#012#012Stack trace of thread 2800738:#012#0 0x0000558e184a046e internal/runtime/syscall/linux.Syscall6 (podman + 0x48b46e)#012#1 0x0000558e185800a6 syscall.Syscall (podman + 0x56b0a6)#012#2 0x0000558e18580c50 syscall.Syscall.abi0 (podman + 0x56bc50)#012#3 0x0000558e186eac2e github.com/containers/podman/vendor/golang.org/x/sys/unix.OpenTree (podman + 0x6d5c2e)#012#4 0x0000558e18d43f4b github.com/containers/podman/vendor/github.com/cyphar/filepath-securejoin/p… (podman + 0xd2ef4b)#012#5 0x0000558e18d43e54 github.com/containers/podman/vendor/github.com/cyphar/filepath-securejoin/p… (podman + 0xd2ee54)#012#6 0x0000558e18533dcc sync.(*Once).doSlow (podman + 0x51edcc)#012#7 0x0000558e18533cf9 sync.(*Once).Do (podman + 0x51ecf9)#012#8 0x0000558e18d43d
c5 github.com/containers/podman/vendor/github.com/cyphar/filepath-securejoin/p… (podman + 0xd2edc5)#012#9 0x0000558e18d453e2 github.com/containers/podman/vendor/github.com/cyphar/filepath-securejoin/p… (podman + 0xd303e2)#012#10 0x0000558e18d457f3 github.com/containers/podman/vendor/github.com/cyphar/filepath-securejoin/p… (podman + 0xd307f3)#012#11 0x0000558e18d4491c github.com/containers/podman/vendor/github.com/cyphar/filepath-securejoin/p… (podman + 0xd2f91c)#012#12 0x0000558e18d44358 github.com/containers/podman/vendor/github.com/cyphar/filepath-securejoin/p… (podman + 0xd2f358)#012#13 0x0000558e18533dcc sync.(*Once).doSlow (podman + 0x51edcc)#012#14 0x0000558e18533cf9 sync.(*Once).D
o (podman + 0x51ecf9)#012#15 0x0000558e18d442c5 github.com/containers/podman/vendor/github.com/cyphar/filepath-securejoin/p… (podman + 0xd2f2c5)#012#16 0x0000558e18d4579a github.com/containers/podman/vendor/github.com/cyphar/filepath-securejoin/p… (podman + 0xd3079a)#012#17 0x0000558e18d4c34e github.com/containers/podman/vendor/github.com/opencontainers/selinux/go-se… (podman + 0xd3734e)#012#18 0x0000558e18d4c838 github.com/containers/podman/vendor/github.com/opencontainers/selinux/go-se… (podman + 0xd37838)#012#19 0x0000558e18d4b5df github.com/containers/podman/vendor/github.com/opencontainers/selinux/go-se… (podman + 0xd365df)#012#20 0x0000558e18d4b873 github.com/containers/podman/vendor/github.com/opencontainers/selinux/go-se… (podman + 0xd36873)#012#21 0x000
0558e18f43f4b github.com/containers/podman/vendor/go.podman.io/common/pkg/config.defaultC… (podman + 0xf2ef4b)#012#22 0x0000558e18f47912 github.com/containers/podman/vendor/go.podman.io/common/pkg/config.newLocked (podman + 0xf32912)#012#23 0x0000558e18f47605 github.com/containers/podman/vendor/go.podman.io/common/pkg/config.New (podman + 0xf32605)#012#24 0x0000558e196bafd3 github.com/containers/podman/cmd/podman/registry.newPodmanConfig (podman + 0x16a5fd3)#012#25 0x0000558e18533dcc sync.(*Once).doSlow (podman + 0x51edcc)#012#26 0x0000558e196dbc50 github.com/containers/podman/cmd/podman/common.init (podman + 0x16c6c50)#012#27 0x0000558e184f9a57 runtime.doInit1 (podman + 0x4e4a57)#012#28 0x0000558e184e9f90 runtime.main (podman + 0x4d4f90)#012#29 0x0000558e18529ee1 runtime.goexit.abi0 (podman + 0x514ee1)#012ELF object binary architecture: AMD x86-64
Jul 29 04:36:00 jaws.cs.umd.edu systemd-coredump[2800775]: Process 2800766 (podman) of user 981 dumped core.#012#012Stack trace of thread 2800766:#012#0 0x000055868110446e internal/runtime/syscall/linux.Syscall6 (podman + 0x48b46e)#012#1 0x00005586811e40a6 syscall.Syscall (podman + 0x56b0a6)#012#2 0x00005586811e4c50 syscall.Syscall.abi0 (podman + 0x56bc50)#012#3 0x000055868134ec2e github.com/containers/podman/vendor/golang.org/x/sys/unix.OpenTree (podman + 0x6d5c2e)#012#4 0x00005586819a7f4b github.com/containers/podman/vendor/github.com/cyphar/filepath-securejoin/p… (podman + 0xd2ef4b)#012#5 0x00005586819a7e54 github.com/containers/podman/vendor/github.com/cyphar/filepath-securejoin/p… (podman + 0xd2ee54)#012#6 0x0000558681197dcc sync.(*Once).doSlow (podman + 0x51edcc)#012#7 0x0000558681197cf9 sync.(*Once).Do (podman + 0x51ecf9)#012#8 0x00005586819a7d
c5 github.com/containers/podman/vendor/github.com/cyphar/filepath-securejoin/p… (podman + 0xd2edc5)#012#9 0x00005586819a93e2 github.com/containers/podman/vendor/github.com/cyphar/filepath-securejoin/p… (podman + 0xd303e2)#012#10 0x00005586819a97f3 github.com/containers/podman/vendor/github.com/cyphar/filepath-securejoin/p… (podman + 0xd307f3)#012#11 0x00005586819a891c github.com/containers/podman/vendor/github.com/cyphar/filepath-securejoin/p… (podman + 0xd2f91c)#012#12 0x00005586819a8358 github.com/containers/podman/vendor/github.com/cyphar/filepath-securejoin/p… (podman + 0xd2f358)#012#13 0x0000558681197dcc sync.(*Once).doSlow (podman + 0x51edcc)#012#14 0x0000558681197cf9 sync.(*Once).D
o (podman + 0x51ecf9)#012#15 0x00005586819a82c5 github.com/containers/podman/vendor/github.com/cyphar/filepath-securejoin/p… (podman + 0xd2f2c5)#012#16 0x00005586819a979a github.com/containers/podman/vendor/github.com/cyphar/filepath-securejoin/p… (podman + 0xd3079a)#012#17 0x00005586819b034e github.com/containers/podman/vendor/github.com/opencontainers/selinux/go-se… (podman + 0xd3734e)#012#18 0x00005586819b0838 github.com/containers/podman/vendor/github.com/opencontainers/selinux/go-se… (podman + 0xd37838)#012#19 0x00005586819af5df github.com/containers/podman/vendor/github.com/opencontainers/selinux/go-se… (podman + 0xd365df)#012#20 0x00005586819af873 github.com/containers/podman/vendor/github.com/opencontainers/selinux/go-se… (podman + 0xd36873)#012#21 0x000
0558681ba7f4b github.com/containers/podman/vendor/go.podman.io/common/pkg/config.defaultC… (podman + 0xf2ef4b)#012#22 0x0000558681bab912 github.com/containers/podman/vendor/go.podman.io/common/pkg/config.newLocked (podman + 0xf32912)#012#23 0x0000558681bab605 github.com/containers/podman/vendor/go.podman.io/common/pkg/config.New (podman + 0xf32605)#012#24 0x000055868231efd3 github.com/containers/podman/cmd/podman/registry.newPodmanConfig (podman + 0x16a5fd3)#012#25 0x0000558681197dcc sync.(*Once).doSlow (podman + 0x51edcc)#012#26 0x000055868233fc50 github.com/containers/podman/cmd/podman/common.init (podman + 0x16c6c50)#012#27 0x000055868115da57 runtime.doInit1 (podman + 0x4e4a57)#012#28 0x000055868114df90 runtime.main (podman + 0x4d4f90)#012#29 0x000055868118dee1 runtime.goexit.abi0 (podman + 0x514ee1)#012ELF object binary architecture: AMD x86-64
Jul 29 04:36:00 jaws.cs.umd.edu setroubleshoot[2800756]: SELinux is preventing /usr/bin/podman from using the nnp_transition access on a process. For complete SELinux messages run: sealert -l 3c7643bc-dd69-4695-b48c-7d780b62b6cf [x2]
Jul 29 04:36:00 jaws.cs.umd.edu systemd-coredump[2800802]: Process 2800793 (podman) of user 981 dumped core.#012#012Stack trace of thread 2800793:#012#0 0x000055ffcee6746e internal/runtime/syscall/linux.Syscall6 (podman + 0x48b46e)#012#1 0x000055ffcef470a6 syscall.Syscall (podman + 0x56b0a6)#012#2 0x000055ffcef47c50 syscall.Syscall.abi0 (podman + 0x56bc50)#012#3 0x000055ffcf0b1c2e github.com/containers/podman/vendor/golang.org/x/sys/unix.OpenTree (podman + 0x6d5c2e)#012#4 0x000055ffcf70af4b github.com/containers/podman/vendor/github.com/cyphar/filepath-securejoin/p… (podman + 0xd2ef4b)#012#5 0x000055ffcf70ae54 github.com/containers/podman/vendor/github.com/cyphar/filepath-securejoin/p… (podman + 0xd2ee54)#012#6 0x000055ffceefadcc sync.(*Once).doSlow (podman + 0x51edcc)#012#7 0x000055ffceefacf9 sync.(*Once).Do (podman + 0x51ecf9)#012#8 0x000055ffcf70ad
c5 github.com/containers/podman/vendor/github.com/cyphar/filepath-securejoin/p… (podman + 0xd2edc5)#012#9 0x000055ffcf70c3e2 github.com/containers/podman/vendor/github.com/cyphar/filepath-securejoin/p… (podman + 0xd303e2)#012#10 0x000055ffcf70c7f3 github.com/containers/podman/vendor/github.com/cyphar/filepath-securejoin/p… (podman + 0xd307f3)#012#11 0x000055ffcf70b91c github.com/containers/podman/vendor/github.com/cyphar/filepath-securejoin/p… (podman + 0xd2f91c)#012#12 0x000055ffcf70b358 github.com/containers/podman/vendor/github.com/cyphar/filepath-securejoin/p… (podman + 0xd2f358)#012#13 0x000055ffceefadcc sync.(*Once).doSlow (podman + 0x51edcc)#012#14 0x000055ffceefacf9 sync.(*Once).D
o (podman + 0x51ecf9)#012#15 0x000055ffcf70b2c5 github.com/containers/podman/vendor/github.com/cyphar/filepath-securejoin/p… (podman + 0xd2f2c5)#012#16 0x000055ffcf70c79a github.com/containers/podman/vendor/github.com/cyphar/filepath-securejoin/p… (podman + 0xd3079a)#012#17 0x000055ffcf71334e github.com/containers/podman/vendor/github.com/opencontainers/selinux/go-se… (podman + 0xd3734e)#012#18 0x000055ffcf713838 github.com/containers/podman/vendor/github.com/opencontainers/selinux/go-se… (podman + 0xd37838)#012#19 0x000055ffcf7125df github.com/containers/podman/vendor/github.com/opencontainers/selinux/go-se… (podman + 0xd365df)#012#20 0x000055ffcf712873 github.com/containers/podman/vendor/github.com/opencontainers/selinux/go-se… (podman + 0xd36873)#012#21 0x000
055ffcf90af4b github.com/containers/podman/vendor/go.podman.io/common/pkg/config.defaultC… (podman + 0xf2ef4b)#012#22 0x000055ffcf90e912 github.com/containers/podman/vendor/go.podman.io/common/pkg/config.newLocked (podman + 0xf32912)#012#23 0x000055ffcf90e605 github.com/containers/podman/vendor/go.podman.io/common/pkg/config.New (podman + 0xf32605)#012#24 0x000055ffd0081fd3 github.com/containers/podman/cmd/podman/registry.newPodmanConfig (podman + 0x16a5fd3)#012#25 0x000055ffceefadcc sync.(*Once).doSlow (podman + 0x51edcc)#012#26 0x000055ffd00a2c50 github.com/containers/podman/cmd/podman/common.init (podman + 0x16c6c50)#012#27 0x000055ffceec0a57 runtime.doInit1 (podman + 0x4e4a57)#012#28 0x000055ffceeb0f90 runtime.main (podman + 0x4d4f90)#012#29 0x000055ffceef0ee1 runtime.goexit.abi0 (podman + 0x514ee1)#012ELF object binary architecture: AMD x86-64
== netman.cs.umd.edu (3 distinct, 3 total) ==
Jul 29 04:29:58 netman.cs.umd.edu setroubleshoot[2371305]: SELinux is preventing /usr/bin/gpg from read access on the file gpg.conf. For complete SELinux messages run: sealert -l 019ad1da-a874-4814-8037-3b3e5f413ad2
Jul 29 04:29:59 netman.cs.umd.edu setroubleshoot[2371305]: SELinux is preventing /usr/bin/gpg from open access on the file /root/.gnupg/gpg.conf. For complete SELinux messages run: sealert -l cb54177e-d44c-46a1-b246-5c0bbb8343be
Jul 29 04:30:03 netman.cs.umd.edu setroubleshoot[2371305]: SELinux is preventing /usr/bin/gpg from getattr access on the file /root/.gnupg/gpg.conf. For complete SELinux messages run: sealert -l fbba2e30-b7ab-491c-9ec6-f553e9ef72af
== newhonors2 (1 distinct, 24 total) ==
Jul 29 04:13:02 newhonors2 dhcpcd[435142]: dhcpcd is not running [x24]
== outbound00.cs.umd.edu (1 distinct, 6 total) ==
Jul 29 04:09:09 outbound00.cs.umd.edu python3[680423]: ldapdb [x6]
== outbound01.cs.umd.edu (2 distinct, 7 total) ==
Jul 29 04:13:06 outbound01.cs.umd.edu python3[2904437]: ldapdb [x6]
Jul 29 04:51:47 outbound01.cs.umd.edu krb5_child[2913169]: Preauthentication failed
== peach.cs.umd.edu (2 distinct, 4 total) ==
Jul 29 04:12:08 peach.cs.umd.edu setroubleshoot[1411441]: SELinux is preventing /usr/bin/qemu-ga from search access on the directory /var/lib/containers/storage/overlay. For complete SELinux messages run: sealert -l ba415951-a2c6-424e-b17d-305c5300b9f3 [x2]
Jul 29 04:12:08 peach.cs.umd.edu setroubleshoot[1411441]: SELinux is preventing /usr/bin/qemu-ga from search access on the directory /var/lib/containers/storage/overlay. For complete SELinux messages run: sealert -l 6aeb0956-fcf2-462a-ae4d-439b912c16d0 [x2]
== sentry-docker00.cs.umd.edu (40 distinct, 40 total) ==
Jul 29 04:08:04 sentry-docker00.cs.umd.edu systemd-udevd[1612628]: link_config: could not get ethtool features for veth95c12cf
Jul 29 04:08:04 sentry-docker00.cs.umd.edu systemd-udevd[1612628]: Could not set offload features of veth95c12cf: No such device
Jul 29 04:08:04 sentry-docker00.cs.umd.edu systemd-udevd[1612649]: Could not generate persistent MAC address for veth5f719a3: No such file or directory
Jul 29 04:08:04 sentry-docker00.cs.umd.edu systemd-udevd[1612650]: Could not generate persistent MAC address for veth7cae019: No such file or directory
Jul 29 04:08:04 sentry-docker00.cs.umd.edu systemd-udevd[1612653]: Could not generate persistent MAC address for vetha5c8cba: No such file or directory
Jul 29 04:08:04 sentry-docker00.cs.umd.edu systemd-udevd[1612654]: Could not generate persistent MAC address for veth3f94f5e: No such file or directory
Jul 29 04:08:04 sentry-docker00.cs.umd.edu systemd-udevd[1612677]: Could not generate persistent MAC address for veth9234cec: No such file or directory
Jul 29 04:08:04 sentry-docker00.cs.umd.edu systemd-udevd[1612678]: Could not generate persistent MAC address for veth0d9ffdb: No such file or directory
Jul 29 04:08:04 sentry-docker00.cs.umd.edu systemd-udevd[1612703]: Could not generate persistent MAC address for veth1a84cfb: No such file or directory
Jul 29 04:08:04 sentry-docker00.cs.umd.edu systemd-udevd[1612704]: Could not generate persistent MAC address for vethab9dd81: No such file or directory
Jul 29 04:14:29 sentry-docker00.cs.umd.edu systemd-udevd[1616160]: link_config: could not get ethtool features for veth449bdbc
Jul 29 04:14:29 sentry-docker00.cs.umd.edu systemd-udevd[1616160]: Could not set offload features of veth449bdbc: No such device
Jul 29 04:14:29 sentry-docker00.cs.umd.edu systemd-udevd[1616178]: Could not generate persistent MAC address for veth02fcbe1: No such file or directory
Jul 29 04:14:29 sentry-docker00.cs.umd.edu systemd-udevd[1616179]: Could not generate persistent MAC address for veth6af0a82: No such file or directory
Jul 29 04:28:13 sentry-docker00.cs.umd.edu systemd-udevd[1623164]: link_config: could not get ethtool features for veth1a84cfb
Jul 29 04:28:13 sentry-docker00.cs.umd.edu systemd-udevd[1623164]: Could not set offload features of veth1a84cfb: No such device
Jul 29 04:28:13 sentry-docker00.cs.umd.edu systemd-udevd[1623227]: Could not generate persistent MAC address for veth4e9fa9f: No such file or directory
Jul 29 04:28:13 sentry-docker00.cs.umd.edu systemd-udevd[1623228]: Could not generate persistent MAC address for vethe26665b: No such file or directory
Jul 29 04:28:13 sentry-docker00.cs.umd.edu systemd-udevd[1623231]: Could not generate persistent MAC address for veth63653da: No such file or directory
Jul 29 04:28:13 sentry-docker00.cs.umd.edu systemd-udevd[1623232]: Could not generate persistent MAC address for veth3155b7a: No such file or directory
Jul 29 04:28:13 sentry-docker00.cs.umd.edu systemd-udevd[1623256]: Could not generate persistent MAC address for veth74f3c4e: No such file or directory
Jul 29 04:28:13 sentry-docker00.cs.umd.edu systemd-udevd[1623255]: Could not generate persistent MAC address for veth76da8fc: No such file or directory
Jul 29 04:28:13 sentry-docker00.cs.umd.edu systemd-udevd[1623260]: Could not generate persistent MAC address for veth7e9eed0: No such file or directory
Jul 29 04:28:13 sentry-docker00.cs.umd.edu systemd-udevd[1623273]: Could not generate persistent MAC address for veth002236e: No such file or directory
Jul 29 04:34:37 sentry-docker00.cs.umd.edu systemd-udevd[1625794]: link_config: could not get ethtool features for veth02fcbe1
Jul 29 04:34:37 sentry-docker00.cs.umd.edu systemd-udevd[1625794]: Could not set offload features of veth02fcbe1: No such device
Jul 29 04:34:38 sentry-docker00.cs.umd.edu systemd-udevd[1625810]: Could not generate persistent MAC address for vethea04be7: No such file or directory
Jul 29 04:34:38 sentry-docker00.cs.umd.edu systemd-udevd[1625811]: Could not generate persistent MAC address for vethdec2212: No such file or directory
Jul 29 04:48:21 sentry-docker00.cs.umd.edu systemd-udevd[1632692]: link_config: could not get ethtool features for veth76da8fc
Jul 29 04:48:21 sentry-docker00.cs.umd.edu systemd-udevd[1632692]: Could not set offload features of veth76da8fc: No such device
... 10 more distinct messages not shown
== smokeping-slave (1 distinct, 1 total) ==
Jul 29 04:15:31 smokeping-slave nologin[52521]: Attempted login by UNKNOWN (UID: 65534) on UNKNOWN
== strawberry (4 distinct, 10 total) ==
Jul 29 04:09:44 strawberry udisksd[1067]: Error performing housekeeping for drive /org/freedesktop/UDisks2/drives/ST2000DM001_1CH164_W1E8J5KJ: Error updating SMART data: Error sending ATA command CHECK POWER MODE: Unexpected sense data returned:#0120000: 00 00 00 00 00 00 00 00 00 00 00 00 00 00 00 00 ................#0120010: 00 00 00 00 00 00 00 00 00 00 00 00 00 00 00 00 ................#012 (g-io-error-quark, 0) [x6]
Jul 29 04:15:04 strawberry nologin[3057724]: Attempted login by UNKNOWN (UID: 65534) on UNKNOWN
Jul 29 04:15:04 strawberry pipewire[3057722]: mod.jackdbus-detect: Failed to receive jackdbus reply: org.freedesktop.DBus.Error.ServiceUnknown: The name org.jackaudio.service was not provided by any .service files
Jul 29 04:34:42 strawberry smartd[5314]: Device: /dev/sda [SAT], failed to read SMART Attribute Data [x2]
== submit26-b9-4 (9 distinct, 11 total) ==
Jul 29 04:16:11 submit26-b9-4 setroubleshoot[403525]: SELinux is preventing /usr/bin/python3.9 from create access on the directory /(null). For complete SELinux messages run: sealert -l a4e66030-8621-4da9-bd27-5988bb1bf8ad [x2]
Jul 29 04:16:11 submit26-b9-4 setroubleshoot[403525]: SELinux is preventing /usr/bin/python3.9 from add_name access on the directory /(null). For complete SELinux messages run: sealert -l c055e37d-bbf5-4800-9083-d606f792c8c1 [x2]
Jul 29 04:16:11 submit26-b9-4 setroubleshoot[403525]: SELinux is preventing /usr/bin/python3.9 from create access on the file /(null). For complete SELinux messages run: sealert -l e5bc3a56-6d6f-4776-954f-ddde1579648f
Jul 29 04:16:11 submit26-b9-4 setroubleshoot[403525]: SELinux is preventing /usr/bin/python3.9 from open access on the file /tmp/libdnf.dG9vWS/repodata/repomd.xml. For complete SELinux messages run: sealert -l a8ec5e1b-49f9-4fbc-a8ae-22e800f7abf2
Jul 29 04:16:11 submit26-b9-4 setroubleshoot[403525]: SELinux is preventing /usr/bin/python3.9 from setattr access on the file repomd.xml. For complete SELinux messages run: sealert -l 945db714-d0c0-4402-911e-932978b8b036
Jul 29 04:16:11 submit26-b9-4 setroubleshoot[403525]: SELinux is preventing /usr/bin/python3.9 from read access on the directory libdnf.dG9vWS. For complete SELinux messages run: sealert -l 463998a0-fb0d-463c-82b1-471135710a14
Jul 29 04:16:11 submit26-b9-4 setroubleshoot[403525]: SELinux is preventing /usr/bin/python3.9 from remove_name access on the directory repomd.xml. For complete SELinux messages run: sealert -l 473d2e21-15d8-407a-a9ee-2b842607fa00
Jul 29 04:16:11 submit26-b9-4 setroubleshoot[403525]: SELinux is preventing /usr/bin/python3.9 from unlink access on the file repomd.xml. For complete SELinux messages run: sealert -l 80c54d4f-bf4b-4501-addb-1627383587d0
Jul 29 04:16:11 submit26-b9-4 setroubleshoot[403525]: SELinux is preventing /usr/bin/python3.9 from rmdir access on the directory repodata. For complete SELinux messages run: sealert -l c63d3890-151e-49a0-83f0-3dfb69d051e5
== talkhosts9 (1 distinct, 2 total) ==
Jul 29 05:04:13 talkhosts9 setroubleshoot[4180099]: SELinux is preventing /usr/bin/lsof from getattr access on the unix_stream_socket unix_stream_socket. For complete SELinux messages run: sealert -l a6df89b3-c497-469c-8232-c4fde0508abf [x2]
1
0
Command: /usr/local/sbin/syslog-digest.py
Time : 0.4655s
Status : exited 0
Output :
Syslog digest — 2026-07-29 04:05 EDT
Processed 4,051 lines, filtered 3,464 (85%). 587 unknown (66 distinct) from 19 host(s).
== abuse (1 distinct, 346 total) ==
Jul 29 03:05:06 abuse rsyslogd[21745]: imjournal: open() failed for path: '/var/lib/rsyslog/imjournal.state.tmp': Input/output error [v8.2404.0 try https://www.rsyslog.com/e/2433 ] [x346]
== alec.cs.umd.edu (3 distinct, 60 total) ==
Jul 29 03:05:33 alec.cs.umd.edu setroubleshoot[27649]: failed to retrieve rpm info for path '/run/netns/netns-9dfd0347-71eb-5698-085c-c769043aa5c3': [x12]
Jul 29 03:05:34 alec.cs.umd.edu sedispatch[1526]: AVC Message regarding setroubleshoot, ignoring message [x24]
Jul 29 03:05:34 alec.cs.umd.edu setroubleshoot[27649]: SELinux is preventing /usr/bin/df from getattr access on the file /run/netns/netns-9dfd0347-71eb-5698-085c-c769043aa5c3. For complete SELinux messages run: sealert -l 23f93208-3063-4aac-b78a-bb0fcb40740c [x24]
== b0b02.cs.umd.edu (4 distinct, 4 total) ==
Jul 29 03:19:48 b0b02.cs.umd.edu setroubleshoot[523165]: SELinux is preventing /usr/bin/python3.9 from getattr access on the file /etc/authselect/nsswitch.conf. For complete SELinux messages run: sealert -l 9a1e2952-3fde-4937-a8ab-f7f59791a458
Jul 29 03:19:50 b0b02.cs.umd.edu setroubleshoot[523165]: SELinux is preventing /usr/bin/python3.9 from read access on the file /etc/authselect/nsswitch.conf. For complete SELinux messages run: sealert -l 97d74423-e027-4cd6-8810-ad80944900b5
Jul 29 03:19:53 b0b02.cs.umd.edu setroubleshoot[523165]: SELinux is preventing /usr/bin/python3.9 from open access on the file /etc/authselect/nsswitch.conf. For complete SELinux messages run: sealert -l 4f253f6a-62d6-46dd-8eaf-0b4d29df41c6
Jul 29 03:35:53 b0b02.cs.umd.edu rustdesk[527606]: cannot open display:
== bachata (6 distinct, 6 total) ==
Jul 29 03:42:10 bachata setroubleshoot[2093049]: failed to retrieve rpm info for path '/fs/www/404.html':
Jul 29 03:42:11 bachata setroubleshoot[2093049]: SELinux is preventing /usr/sbin/smbd from getattr access on the file /fs/www/404.html. For complete SELinux messages run: sealert -l 278fa2f7-7c6d-4613-8831-0c7902342a33
Jul 29 03:42:11 bachata setroubleshoot[2093049]: SELinux is preventing /usr/sbin/smbd from read access on the file 404.html. For complete SELinux messages run: sealert -l a2f5acec-ed56-4193-b84b-9c355ad24121
Jul 29 03:42:11 bachata setroubleshoot[2093049]: failed to retrieve rpm info for path '/fs/www/alumni':
Jul 29 03:42:11 bachata setroubleshoot[2093049]: SELinux is preventing /usr/sbin/smbd from getattr access on the lnk_file /fs/www/alumni. For complete SELinux messages run: sealert -l fcd56e6d-4082-40d2-8d07-7512890e4b51
Jul 29 03:42:11 bachata setroubleshoot[2093049]: SELinux is preventing /usr/sbin/smbd from read access on the lnk_file alumni. For complete SELinux messages run: sealert -l 8052e635-6f2f-45b1-a983-55d5d837ba65
== contest (1 distinct, 33 total) ==
Jul 29 03:06:47 contest goferd[1007]: [ERROR][worker-0] gofer.messaging.adapter.connect:33 - connect: proton+amqps://satellite8.cs.umd.edu:5647, failed: Connection amqps://satellite8.cs.umd.edu:5647 disconnected: Condition('proton.pythonio', 'Connection refused to all addresses') [x33]
== csfw00a (1 distinct, 10 total) ==
Jul 29 03:06:34 csfw00a kernel: bnxt_en 0000:09:00.0 eth3: NIC Link is Down [x10]
== hackerman (1 distinct, 1 total) ==
Jul 29 03:19:01 hackerman gnome-software[2060381]: failed to commit changes to dconf: GDBus.Error:org.gtk.GDBus.UnmappedGError.Quark._g_2dfile_2derror_2dquark.Code2: Failed to create file “/adminhomes/sajith/.config/dconf/user.2NS1S3”: Permission denied
== idm00 (1 distinct, 1 total) ==
Jul 29 03:51:10 idm00 named[1455]: client @0x7f3310546cd8 10.73.240.42#55556: update '73.10.in-addr.arpa/IN' denied
== idmp0 (1 distinct, 1 total) ==
Jul 29 03:36:04 idmp0 named[5198]: client @0x7f99000dfeb8 10.73.240.43#51463: update '73.10.in-addr.arpa/IN' denied
== itmon02 (2 distinct, 39 total) ==
Jul 29 03:07:50 itmon02 sshd[1834]: error: beginning MaxStartups throttling [x38]
Jul 29 03:15:03 itmon02 (httpd)[722875]: httpd.service: Referenced but unset environment variable evaluates to an empty string: OPTIONS
== kadath.cs.umd.edu (1 distinct, 1 total) ==
Jul 29 03:47:30 kadath.cs.umd.edu puppet-agent[411887]: (Facter) invalid or malformed lldp data: MalformedDataError: no lldp interface data found
== matrix (2 distinct, 3 total) ==
Jul 29 03:05:29 matrix krb5_child[769628]: Client 'admin(a)UMD.EDU' not found in Kerberos database [x2]
Jul 29 03:05:31 matrix sshd[769622]: error: PAM: Authentication failure for admin from 207.175.159.11
== netbox (1 distinct, 1 total) ==
Jul 29 03:08:02 netbox (httpd)[768479]: httpd.service: Referenced but unset environment variable evaluates to an empty string: OPTIONS
== newhonors2 (1 distinct, 24 total) ==
Jul 29 03:13:03 newhonors2 dhcpcd[432666]: dhcpcd is not running [x24]
== outbound00.cs.umd.edu (2 distinct, 8 total) ==
Jul 29 03:09:09 outbound00.cs.umd.edu python3[665811]: ldapdb [x7]
Jul 29 03:24:12 outbound00.cs.umd.edu systemd[1]: Configuration file /usr/lib/systemd/system/authentication_milter.service is marked executable. Please remove executable permission bits. Proceeding anyway.
== outbound01.cs.umd.edu (2 distinct, 7 total) ==
Jul 29 03:13:07 outbound01.cs.umd.edu python3[2890539]: ldapdb [x6]
Jul 29 03:40:41 outbound01.cs.umd.edu krb5_child[2897010]: Preauthentication failed
== sentry-docker00.cs.umd.edu (32 distinct, 32 total) ==
Jul 29 03:07:39 sentry-docker00.cs.umd.edu systemd-udevd[1584309]: Could not generate persistent MAC address for veth4b069b1: No such file or directory
Jul 29 03:07:39 sentry-docker00.cs.umd.edu systemd-udevd[1584310]: Could not generate persistent MAC address for veth5377ccb: No such file or directory
Jul 29 03:07:39 sentry-docker00.cs.umd.edu systemd-udevd[1584341]: Could not generate persistent MAC address for vethe564120: No such file or directory
Jul 29 03:07:39 sentry-docker00.cs.umd.edu systemd-udevd[1584342]: Could not generate persistent MAC address for vethf93dd85: No such file or directory
Jul 29 03:07:39 sentry-docker00.cs.umd.edu systemd-udevd[1584360]: Could not generate persistent MAC address for veth89dbd93: No such file or directory
Jul 29 03:07:39 sentry-docker00.cs.umd.edu systemd-udevd[1584363]: Could not generate persistent MAC address for veth20a0171: No such file or directory
Jul 29 03:07:39 sentry-docker00.cs.umd.edu systemd-udevd[1584414]: Could not generate persistent MAC address for veth26e2304: No such file or directory
Jul 29 03:07:39 sentry-docker00.cs.umd.edu systemd-udevd[1584417]: Could not generate persistent MAC address for vetha4db087: No such file or directory
Jul 29 03:14:13 sentry-docker00.cs.umd.edu systemd-udevd[1587865]: Could not generate persistent MAC address for vethca2de84: No such file or directory
Jul 29 03:14:13 sentry-docker00.cs.umd.edu systemd-udevd[1587866]: Could not generate persistent MAC address for vethe8f786b: No such file or directory
Jul 29 03:27:48 sentry-docker00.cs.umd.edu systemd-udevd[1593766]: Could not generate persistent MAC address for vethdbaadcd: No such file or directory
Jul 29 03:27:48 sentry-docker00.cs.umd.edu systemd-udevd[1593767]: Could not generate persistent MAC address for veth6f439ec: No such file or directory
Jul 29 03:27:48 sentry-docker00.cs.umd.edu systemd-udevd[1593792]: Could not generate persistent MAC address for veth041d6d6: No such file or directory
Jul 29 03:27:48 sentry-docker00.cs.umd.edu systemd-udevd[1593793]: Could not generate persistent MAC address for veth0000c0e: No such file or directory
Jul 29 03:27:48 sentry-docker00.cs.umd.edu systemd-udevd[1593796]: Could not generate persistent MAC address for veth2dacd8d: No such file or directory
Jul 29 03:27:48 sentry-docker00.cs.umd.edu systemd-udevd[1593814]: Could not generate persistent MAC address for veth6bcbe04: No such file or directory
Jul 29 03:27:48 sentry-docker00.cs.umd.edu systemd-udevd[1593814]: Could not generate persistent MAC address for veth0d33796: No such file or directory
Jul 29 03:27:48 sentry-docker00.cs.umd.edu systemd-udevd[1593826]: Could not generate persistent MAC address for veth4638371: No such file or directory
Jul 29 03:34:21 sentry-docker00.cs.umd.edu systemd-udevd[1597292]: Could not generate persistent MAC address for veth077ec9e: No such file or directory
Jul 29 03:34:21 sentry-docker00.cs.umd.edu systemd-udevd[1597293]: Could not generate persistent MAC address for veth517e411: No such file or directory
Jul 29 03:47:56 sentry-docker00.cs.umd.edu systemd-udevd[1603185]: link_config: could not get ethtool features for veth4638371
Jul 29 03:47:56 sentry-docker00.cs.umd.edu systemd-udevd[1603185]: Could not set offload features of veth4638371: No such device
Jul 29 03:47:56 sentry-docker00.cs.umd.edu systemd-udevd[1603212]: Could not generate persistent MAC address for veth95c12cf: No such file or directory
Jul 29 03:47:56 sentry-docker00.cs.umd.edu systemd-udevd[1603213]: Could not generate persistent MAC address for vethf87e974: No such file or directory
Jul 29 03:47:56 sentry-docker00.cs.umd.edu systemd-udevd[1603216]: Could not generate persistent MAC address for vetha0f09fb: No such file or directory
Jul 29 03:47:56 sentry-docker00.cs.umd.edu systemd-udevd[1603223]: Could not generate persistent MAC address for vethf61f624: No such file or directory
Jul 29 03:47:56 sentry-docker00.cs.umd.edu systemd-udevd[1603233]: Could not generate persistent MAC address for veth0fc6522: No such file or directory
Jul 29 03:47:56 sentry-docker00.cs.umd.edu systemd-udevd[1603216]: Could not generate persistent MAC address for vethc768a0c: No such file or directory
Jul 29 03:47:56 sentry-docker00.cs.umd.edu systemd-udevd[1603267]: Could not generate persistent MAC address for vethc7c9fd5: No such file or directory
Jul 29 03:47:56 sentry-docker00.cs.umd.edu systemd-udevd[1603268]: Could not generate persistent MAC address for veth0331a10: No such file or directory
... 2 more distinct messages not shown
== soul (2 distinct, 2 total) ==
Jul 29 03:18:26 soul krb5_child[2414697]: Client 'admin(a)UMD.EDU' not found in Kerberos database
Jul 29 03:18:51 soul sshd-session[2414710]: error: Protocol major versions differ: 2 vs. 1
== strawberry (2 distinct, 8 total) ==
Jul 29 03:09:44 strawberry udisksd[1067]: Error performing housekeeping for drive /org/freedesktop/UDisks2/drives/ST2000DM001_1CH164_W1E8J5KJ: Error updating SMART data: Error sending ATA command CHECK POWER MODE: Unexpected sense data returned:#0120000: 00 00 00 00 00 00 00 00 00 00 00 00 00 00 00 00 ................#0120010: 00 00 00 00 00 00 00 00 00 00 00 00 00 00 00 00 ................#012 (g-io-error-quark, 0) [x6]
Jul 29 03:34:42 strawberry smartd[5314]: Device: /dev/sda [SAT], failed to read SMART Attribute Data [x2]
1
0
Command: /usr/local/sbin/syslog-digest.py
Time : 0.4820s
Status : exited 0
Output :
Syslog digest — 2026-07-29 03:05 EDT
Processed 4,042 lines, filtered 3,451 (85%). 591 unknown (60 distinct) from 16 host(s).
== abuse (1 distinct, 347 total) ==
Jul 29 02:05:06 abuse rsyslogd[21745]: imjournal: open() failed for path: '/var/lib/rsyslog/imjournal.state.tmp': Input/output error [v8.2404.0 try https://www.rsyslog.com/e/2433 ] [x347]
== alec.cs.umd.edu (3 distinct, 57 total) ==
Jul 29 02:05:07 alec.cs.umd.edu setroubleshoot[12586]: failed to retrieve rpm info for path '/run/netns/netns-9dfd0347-71eb-5698-085c-c769043aa5c3': [x12]
Jul 29 02:05:08 alec.cs.umd.edu sedispatch[1526]: AVC Message regarding setroubleshoot, ignoring message [x22]
Jul 29 02:05:08 alec.cs.umd.edu setroubleshoot[12586]: SELinux is preventing /usr/bin/df from getattr access on the file /run/netns/netns-9dfd0347-71eb-5698-085c-c769043aa5c3. For complete SELinux messages run: sealert -l 23f93208-3063-4aac-b78a-bb0fcb40740c [x23]
== b0b02.cs.umd.edu (4 distinct, 4 total) ==
Jul 29 02:19:43 b0b02.cs.umd.edu setroubleshoot[508090]: SELinux is preventing /usr/bin/python3.9 from getattr access on the file /etc/authselect/nsswitch.conf. For complete SELinux messages run: sealert -l 9a1e2952-3fde-4937-a8ab-f7f59791a458
Jul 29 02:19:46 b0b02.cs.umd.edu setroubleshoot[508090]: SELinux is preventing /usr/bin/python3.9 from read access on the file /etc/authselect/nsswitch.conf. For complete SELinux messages run: sealert -l 97d74423-e027-4cd6-8810-ad80944900b5
Jul 29 02:19:49 b0b02.cs.umd.edu setroubleshoot[508090]: SELinux is preventing /usr/bin/python3.9 from open access on the file /etc/authselect/nsswitch.conf. For complete SELinux messages run: sealert -l 4f253f6a-62d6-46dd-8eaf-0b4d29df41c6
Jul 29 02:35:49 b0b02.cs.umd.edu rustdesk[512538]: cannot open display:
== cheezit.cs.umd.edu (2 distinct, 10 total) ==
Jul 29 02:14:34 cheezit.cs.umd.edu sshd-session[2957205]: pam_access(sshd:auth): access denied for user `root' from `5.75.159.187' [x5]
Jul 29 02:14:36 cheezit.cs.umd.edu sshd-session[2957203]: error: PAM: Authentication failure for root from 5.75.159.187 [x5]
== contest (1 distinct, 34 total) ==
Jul 29 02:06:05 contest goferd[1007]: [ERROR][worker-0] gofer.messaging.adapter.connect:33 - connect: proton+amqps://satellite8.cs.umd.edu:5647, failed: Connection amqps://satellite8.cs.umd.edu:5647 disconnected: Condition('proton.pythonio', 'Connection refused to all addresses') [x34]
== csfw00a (1 distinct, 4 total) ==
Jul 29 02:12:50 csfw00a kernel: bnxt_en 0000:09:00.0 eth3: NIC Link is Down [x4]
== idm00 (1 distinct, 1 total) ==
Jul 29 02:51:10 idm00 named[1455]: client @0x7f330c4585e8 10.73.240.42#59077: update '73.10.in-addr.arpa/IN' denied
== idmp0 (1 distinct, 1 total) ==
Jul 29 02:36:04 idmp0 named[5198]: client @0x7f9914046628 10.73.240.43#50573: update '73.10.in-addr.arpa/IN' denied
== inbound00.cs.umd.edu (2 distinct, 2 total) ==
Jul 29 02:11:54 inbound00.cs.umd.edu krb5_child[680789]: Client 'admin(a)UMD.EDU' not found in Kerberos database
Jul 29 02:12:32 inbound00.cs.umd.edu sshd-session[680895]: error: Protocol major versions differ: 2 vs. 1
== itmon02 (1 distinct, 48 total) ==
Jul 29 02:08:01 itmon02 sshd[1834]: error: beginning MaxStartups throttling [x48]
== jaws.cs.umd.edu (4 distinct, 5 total) ==
Jul 29 02:35:56 jaws.cs.umd.edu systemd-coredump[2773691]: Process 2773673 (podman) of user 981 dumped core.#012#012Stack trace of thread 2773673:#012#0 0x000055fa8c9ff46e internal/runtime/syscall/linux.Syscall6 (podman + 0x48b46e)#012#1 0x000055fa8cadf0a6 syscall.Syscall (podman + 0x56b0a6)#012#2 0x000055fa8cadfc50 syscall.Syscall.abi0 (podman + 0x56bc50)#012#3 0x000055fa8cc49c2e github.com/containers/podman/vendor/golang.org/x/sys/unix.OpenTree (podman + 0x6d5c2e)#012#4 0x000055fa8d2a2f4b github.com/containers/podman/vendor/github.com/cyphar/filepath-securejoin/p… (podman + 0xd2ef4b)#012#5 0x000055fa8d2a2e54 github.com/containers/podman/vendor/github.com/cyphar/filepath-securejoin/p… (podman + 0xd2ee54)#012#6 0x000055fa8ca92dcc sync.(*Once).doSlow (podman + 0x51edcc)#012#7 0x000055fa8ca92cf9 sync.(*Once).Do (podman + 0x51ecf9)#012#8 0x000055fa8d2a2d
c5 github.com/containers/podman/vendor/github.com/cyphar/filepath-securejoin/p… (podman + 0xd2edc5)#012#9 0x000055fa8d2a43e2 github.com/containers/podman/vendor/github.com/cyphar/filepath-securejoin/p… (podman + 0xd303e2)#012#10 0x000055fa8d2a47f3 github.com/containers/podman/vendor/github.com/cyphar/filepath-securejoin/p… (podman + 0xd307f3)#012#11 0x000055fa8d2a391c github.com/containers/podman/vendor/github.com/cyphar/filepath-securejoin/p… (podman + 0xd2f91c)#012#12 0x000055fa8d2a3358 github.com/containers/podman/vendor/github.com/cyphar/filepath-securejoin/p… (podman + 0xd2f358)#012#13 0x000055fa8ca92dcc sync.(*Once).doSlow (podman + 0x51edcc)#012#14 0x000055fa8ca92cf9 sync.(*Once).D
o (podman + 0x51ecf9)#012#15 0x000055fa8d2a32c5 github.com/containers/podman/vendor/github.com/cyphar/filepath-securejoin/p… (podman + 0xd2f2c5)#012#16 0x000055fa8d2a479a github.com/containers/podman/vendor/github.com/cyphar/filepath-securejoin/p… (podman + 0xd3079a)#012#17 0x000055fa8d2ab34e github.com/containers/podman/vendor/github.com/opencontainers/selinux/go-se… (podman + 0xd3734e)#012#18 0x000055fa8d2ab838 github.com/containers/podman/vendor/github.com/opencontainers/selinux/go-se… (podman + 0xd37838)#012#19 0x000055fa8d2aa5df github.com/containers/podman/vendor/github.com/opencontainers/selinux/go-se… (podman + 0xd365df)#012#20 0x000055fa8d2aa873 github.com/containers/podman/vendor/github.com/opencontainers/selinux/go-se… (podman + 0xd36873)#012#21 0x000
055fa8d4a2f4b github.com/containers/podman/vendor/go.podman.io/common/pkg/config.defaultC… (podman + 0xf2ef4b)#012#22 0x000055fa8d4a6912 github.com/containers/podman/vendor/go.podman.io/common/pkg/config.newLocked (podman + 0xf32912)#012#23 0x000055fa8d4a6605 github.com/containers/podman/vendor/go.podman.io/common/pkg/config.New (podman + 0xf32605)#012#24 0x000055fa8dc19fd3 github.com/containers/podman/cmd/podman/registry.newPodmanConfig (podman + 0x16a5fd3)#012#25 0x000055fa8ca92dcc sync.(*Once).doSlow (podman + 0x51edcc)#012#26 0x000055fa8dc3ac50 github.com/containers/podman/cmd/podman/common.init (podman + 0x16c6c50)#012#27 0x000055fa8ca58a57 runtime.doInit1 (podman + 0x4e4a57)#012#28 0x000055fa8ca48f90 runtime.main (podman + 0x4d4f90)#012#29 0x000055fa8ca88ee1 runtime.goexit.abi0 (podman + 0x514ee1)#012ELF object binary architecture: AMD x86-64
Jul 29 02:35:57 jaws.cs.umd.edu systemd-coredump[2773708]: Process 2773700 (podman) of user 981 dumped core.#012#012Stack trace of thread 2773700:#012#0 0x000055e39ef8546e internal/runtime/syscall/linux.Syscall6 (podman + 0x48b46e)#012#1 0x000055e39f0650a6 syscall.Syscall (podman + 0x56b0a6)#012#2 0x000055e39f065c50 syscall.Syscall.abi0 (podman + 0x56bc50)#012#3 0x000055e39f1cfc2e github.com/containers/podman/vendor/golang.org/x/sys/unix.OpenTree (podman + 0x6d5c2e)#012#4 0x000055e39f828f4b github.com/containers/podman/vendor/github.com/cyphar/filepath-securejoin/p… (podman + 0xd2ef4b)#012#5 0x000055e39f828e54 github.com/containers/podman/vendor/github.com/cyphar/filepath-securejoin/p… (podman + 0xd2ee54)#012#6 0x000055e39f018dcc sync.(*Once).doSlow (podman + 0x51edcc)#012#7 0x000055e39f018cf9 sync.(*Once).Do (podman + 0x51ecf9)#012#8 0x000055e39f828d
c5 github.com/containers/podman/vendor/github.com/cyphar/filepath-securejoin/p… (podman + 0xd2edc5)#012#9 0x000055e39f82a3e2 github.com/containers/podman/vendor/github.com/cyphar/filepath-securejoin/p… (podman + 0xd303e2)#012#10 0x000055e39f82a7f3 github.com/containers/podman/vendor/github.com/cyphar/filepath-securejoin/p… (podman + 0xd307f3)#012#11 0x000055e39f82991c github.com/containers/podman/vendor/github.com/cyphar/filepath-securejoin/p… (podman + 0xd2f91c)#012#12 0x000055e39f829358 github.com/containers/podman/vendor/github.com/cyphar/filepath-securejoin/p… (podman + 0xd2f358)#012#13 0x000055e39f018dcc sync.(*Once).doSlow (podman + 0x51edcc)#012#14 0x000055e39f018cf9 sync.(*Once).D
o (podman + 0x51ecf9)#012#15 0x000055e39f8292c5 github.com/containers/podman/vendor/github.com/cyphar/filepath-securejoin/p… (podman + 0xd2f2c5)#012#16 0x000055e39f82a79a github.com/containers/podman/vendor/github.com/cyphar/filepath-securejoin/p… (podman + 0xd3079a)#012#17 0x000055e39f83134e github.com/containers/podman/vendor/github.com/opencontainers/selinux/go-se… (podman + 0xd3734e)#012#18 0x000055e39f831838 github.com/containers/podman/vendor/github.com/opencontainers/selinux/go-se… (podman + 0xd37838)#012#19 0x000055e39f8305df github.com/containers/podman/vendor/github.com/opencontainers/selinux/go-se… (podman + 0xd365df)#012#20 0x000055e39f830873 github.com/containers/podman/vendor/github.com/opencontainers/selinux/go-se… (podman + 0xd36873)#012#21 0x000
055e39fa28f4b github.com/containers/podman/vendor/go.podman.io/common/pkg/config.defaultC… (podman + 0xf2ef4b)#012#22 0x000055e39fa2c912 github.com/containers/podman/vendor/go.podman.io/common/pkg/config.newLocked (podman + 0xf32912)#012#23 0x000055e39fa2c605 github.com/containers/podman/vendor/go.podman.io/common/pkg/config.New (podman + 0xf32605)#012#24 0x000055e3a019ffd3 github.com/containers/podman/cmd/podman/registry.newPodmanConfig (podman + 0x16a5fd3)#012#25 0x000055e39f018dcc sync.(*Once).doSlow (podman + 0x51edcc)#012#26 0x000055e3a01c0c50 github.com/containers/podman/cmd/podman/common.init (podman + 0x16c6c50)#012#27 0x000055e39efdea57 runtime.doInit1 (podman + 0x4e4a57)#012#28 0x000055e39efcef90 runtime.main (podman + 0x4d4f90)#012#29 0x000055e39f00eee1 runtime.goexit.abi0 (podman + 0x514ee1)#012ELF object binary architecture: AMD x86-64
Jul 29 02:35:58 jaws.cs.umd.edu systemd-coredump[2773730]: Process 2773722 (podman) of user 981 dumped core.#012#012Stack trace of thread 2773722:#012#0 0x00005580d49e646e internal/runtime/syscall/linux.Syscall6 (podman + 0x48b46e)#012#1 0x00005580d4ac60a6 syscall.Syscall (podman + 0x56b0a6)#012#2 0x00005580d4ac6c50 syscall.Syscall.abi0 (podman + 0x56bc50)#012#3 0x00005580d4c30c2e github.com/containers/podman/vendor/golang.org/x/sys/unix.OpenTree (podman + 0x6d5c2e)#012#4 0x00005580d5289f4b github.com/containers/podman/vendor/github.com/cyphar/filepath-securejoin/p… (podman + 0xd2ef4b)#012#5 0x00005580d5289e54 github.com/containers/podman/vendor/github.com/cyphar/filepath-securejoin/p… (podman + 0xd2ee54)#012#6 0x00005580d4a79dcc sync.(*Once).doSlow (podman + 0x51edcc)#012#7 0x00005580d4a79cf9 sync.(*Once).Do (podman + 0x51ecf9)#012#8 0x00005580d5289d
c5 github.com/containers/podman/vendor/github.com/cyphar/filepath-securejoin/p… (podman + 0xd2edc5)#012#9 0x00005580d528b3e2 github.com/containers/podman/vendor/github.com/cyphar/filepath-securejoin/p… (podman + 0xd303e2)#012#10 0x00005580d528b7f3 github.com/containers/podman/vendor/github.com/cyphar/filepath-securejoin/p… (podman + 0xd307f3)#012#11 0x00005580d528a91c github.com/containers/podman/vendor/github.com/cyphar/filepath-securejoin/p… (podman + 0xd2f91c)#012#12 0x00005580d528a358 github.com/containers/podman/vendor/github.com/cyphar/filepath-securejoin/p… (podman + 0xd2f358)#012#13 0x00005580d4a79dcc sync.(*Once).doSlow (podman + 0x51edcc)#012#14 0x00005580d4a79cf9 sync.(*Once).D
o (podman + 0x51ecf9)#012#15 0x00005580d528a2c5 github.com/containers/podman/vendor/github.com/cyphar/filepath-securejoin/p… (podman + 0xd2f2c5)#012#16 0x00005580d528b79a github.com/containers/podman/vendor/github.com/cyphar/filepath-securejoin/p… (podman + 0xd3079a)#012#17 0x00005580d529234e github.com/containers/podman/vendor/github.com/opencontainers/selinux/go-se… (podman + 0xd3734e)#012#18 0x00005580d5292838 github.com/containers/podman/vendor/github.com/opencontainers/selinux/go-se… (podman + 0xd37838)#012#19 0x00005580d52915df github.com/containers/podman/vendor/github.com/opencontainers/selinux/go-se… (podman + 0xd365df)#012#20 0x00005580d5291873 github.com/containers/podman/vendor/github.com/opencontainers/selinux/go-se… (podman + 0xd36873)#012#21 0x000
05580d5489f4b github.com/containers/podman/vendor/go.podman.io/common/pkg/config.defaultC… (podman + 0xf2ef4b)#012#22 0x00005580d548d912 github.com/containers/podman/vendor/go.podman.io/common/pkg/config.newLocked (podman + 0xf32912)#012#23 0x00005580d548d605 github.com/containers/podman/vendor/go.podman.io/common/pkg/config.New (podman + 0xf32605)#012#24 0x00005580d5c00fd3 github.com/containers/podman/cmd/podman/registry.newPodmanConfig (podman + 0x16a5fd3)#012#25 0x00005580d4a79dcc sync.(*Once).doSlow (podman + 0x51edcc)#012#26 0x00005580d5c21c50 github.com/containers/podman/cmd/podman/common.init (podman + 0x16c6c50)#012#27 0x00005580d4a3fa57 runtime.doInit1 (podman + 0x4e4a57)#012#28 0x00005580d4a2ff90 runtime.main (podman + 0x4d4f90)#012#29 0x00005580d4a6fee1 runtime.goexit.abi0 (podman + 0x514ee1)#012ELF object binary architecture: AMD x86-64
Jul 29 02:35:59 jaws.cs.umd.edu setroubleshoot[2773690]: SELinux is preventing /usr/bin/podman from using the nnp_transition access on a process. For complete SELinux messages run: sealert -l 3c7643bc-dd69-4695-b48c-7d780b62b6cf [x2]
== newhonors2 (1 distinct, 24 total) ==
Jul 29 02:13:03 newhonors2 dhcpcd[430819]: dhcpcd is not running [x24]
== outbound00.cs.umd.edu (1 distinct, 6 total) ==
Jul 29 02:09:08 outbound00.cs.umd.edu python3[651807]: ldapdb [x6]
== outbound01.cs.umd.edu (1 distinct, 6 total) ==
Jul 29 02:13:07 outbound01.cs.umd.edu python3[2876647]: ldapdb [x6]
== sentry-docker00.cs.umd.edu (34 distinct, 34 total) ==
Jul 29 02:07:14 sentry-docker00.cs.umd.edu systemd-udevd[1555509]: Could not generate persistent MAC address for veth697c4eb: No such file or directory
Jul 29 02:07:14 sentry-docker00.cs.umd.edu systemd-udevd[1555510]: Could not generate persistent MAC address for veth9c7c4ad: No such file or directory
Jul 29 02:07:14 sentry-docker00.cs.umd.edu systemd-udevd[1555513]: Could not generate persistent MAC address for veth206d368: No such file or directory
Jul 29 02:07:14 sentry-docker00.cs.umd.edu systemd-udevd[1555514]: Could not generate persistent MAC address for veth0eba296: No such file or directory
Jul 29 02:07:14 sentry-docker00.cs.umd.edu systemd-udevd[1555537]: Could not generate persistent MAC address for veth755de68: No such file or directory
Jul 29 02:07:14 sentry-docker00.cs.umd.edu systemd-udevd[1555538]: Could not generate persistent MAC address for vethc9e9cad: No such file or directory
Jul 29 02:07:14 sentry-docker00.cs.umd.edu systemd-udevd[1555552]: Could not generate persistent MAC address for vetha3fcf36: No such file or directory
Jul 29 02:07:14 sentry-docker00.cs.umd.edu systemd-udevd[1555546]: Could not generate persistent MAC address for veth861788a: No such file or directory
Jul 29 02:13:56 sentry-docker00.cs.umd.edu systemd-udevd[1559118]: Could not generate persistent MAC address for veth67e3a35: No such file or directory
Jul 29 02:13:56 sentry-docker00.cs.umd.edu systemd-udevd[1559119]: Could not generate persistent MAC address for vethd2822ae: No such file or directory
Jul 29 02:27:23 sentry-docker00.cs.umd.edu systemd-udevd[1565029]: link_config: could not get ethtool features for veth206d368
Jul 29 02:27:23 sentry-docker00.cs.umd.edu systemd-udevd[1565029]: Could not set offload features of veth206d368: No such device
Jul 29 02:27:23 sentry-docker00.cs.umd.edu systemd-udevd[1565055]: Could not generate persistent MAC address for veth03741e7: No such file or directory
Jul 29 02:27:23 sentry-docker00.cs.umd.edu systemd-udevd[1565056]: Could not generate persistent MAC address for veth328a84c: No such file or directory
Jul 29 02:27:23 sentry-docker00.cs.umd.edu systemd-udevd[1565059]: Could not generate persistent MAC address for veth4c3992f: No such file or directory
Jul 29 02:27:23 sentry-docker00.cs.umd.edu systemd-udevd[1565060]: Could not generate persistent MAC address for vethaca1247: No such file or directory
Jul 29 02:27:23 sentry-docker00.cs.umd.edu systemd-udevd[1565064]: Could not generate persistent MAC address for veth92eefa2: No such file or directory
Jul 29 02:27:23 sentry-docker00.cs.umd.edu systemd-udevd[1565062]: Could not generate persistent MAC address for veth425a72e: No such file or directory
Jul 29 02:27:23 sentry-docker00.cs.umd.edu systemd-udevd[1565076]: Could not generate persistent MAC address for vethec35fd0: No such file or directory
Jul 29 02:27:23 sentry-docker00.cs.umd.edu systemd-udevd[1565055]: Could not generate persistent MAC address for vethcdb57e8: No such file or directory
Jul 29 02:34:04 sentry-docker00.cs.umd.edu systemd-udevd[1568744]: Could not generate persistent MAC address for vethb184285: No such file or directory
Jul 29 02:34:04 sentry-docker00.cs.umd.edu systemd-udevd[1568745]: Could not generate persistent MAC address for vethb620d1c: No such file or directory
Jul 29 02:47:31 sentry-docker00.cs.umd.edu systemd-udevd[1574673]: link_config: could not get ethtool features for veth92eefa2
Jul 29 02:47:31 sentry-docker00.cs.umd.edu systemd-udevd[1574673]: Could not set offload features of veth92eefa2: No such device
Jul 29 02:47:31 sentry-docker00.cs.umd.edu systemd-udevd[1574699]: Could not generate persistent MAC address for veth817889f: No such file or directory
Jul 29 02:47:31 sentry-docker00.cs.umd.edu systemd-udevd[1574700]: Could not generate persistent MAC address for vethddb3397: No such file or directory
Jul 29 02:47:31 sentry-docker00.cs.umd.edu systemd-udevd[1574718]: Could not generate persistent MAC address for veth6c7deef: No such file or directory
Jul 29 02:47:31 sentry-docker00.cs.umd.edu systemd-udevd[1574725]: Could not generate persistent MAC address for veth1c37415: No such file or directory
Jul 29 02:47:31 sentry-docker00.cs.umd.edu systemd-udevd[1574724]: Could not generate persistent MAC address for veth289de6b: No such file or directory
Jul 29 02:47:31 sentry-docker00.cs.umd.edu systemd-udevd[1574707]: Could not generate persistent MAC address for veth677dcb2: No such file or directory
... 4 more distinct messages not shown
== strawberry (2 distinct, 8 total) ==
Jul 29 02:09:44 strawberry udisksd[1067]: Error performing housekeeping for drive /org/freedesktop/UDisks2/drives/ST2000DM001_1CH164_W1E8J5KJ: Error updating SMART data: Error sending ATA command CHECK POWER MODE: Unexpected sense data returned:#0120000: 00 00 00 00 00 00 00 00 00 00 00 00 00 00 00 00 ................#0120010: 00 00 00 00 00 00 00 00 00 00 00 00 00 00 00 00 ................#012 (g-io-error-quark, 0) [x6]
Jul 29 02:34:42 strawberry smartd[5314]: Device: /dev/sda [SAT], failed to read SMART Attribute Data [x2]
1
0
Command: /usr/local/sbin/syslog-digest.py
Time : 0.4944s
Status : exited 0
Output :
Syslog digest — 2026-07-29 02:05 EDT
Processed 3,920 lines, filtered 3,201 (81%). 719 unknown (132 distinct) from 23 host(s).
== abuse (1 distinct, 347 total) ==
Jul 29 01:05:06 abuse rsyslogd[21745]: imjournal: open() failed for path: '/var/lib/rsyslog/imjournal.state.tmp': Input/output error [v8.2404.0 try https://www.rsyslog.com/e/2433 ] [x347]
== alec.cs.umd.edu (3 distinct, 58 total) ==
Jul 29 01:05:15 alec.cs.umd.edu setroubleshoot[4191472]: failed to retrieve rpm info for path '/run/netns/netns-9dfd0347-71eb-5698-085c-c769043aa5c3': [x12]
Jul 29 01:05:16 alec.cs.umd.edu sedispatch[1526]: AVC Message regarding setroubleshoot, ignoring message [x24]
Jul 29 01:05:16 alec.cs.umd.edu setroubleshoot[4191472]: SELinux is preventing /usr/bin/df from getattr access on the file /run/netns/netns-9dfd0347-71eb-5698-085c-c769043aa5c3. For complete SELinux messages run: sealert -l 23f93208-3063-4aac-b78a-bb0fcb40740c [x22]
== b0b02.cs.umd.edu (4 distinct, 4 total) ==
Jul 29 01:19:39 b0b02.cs.umd.edu setroubleshoot[492963]: SELinux is preventing /usr/bin/python3.9 from getattr access on the file /etc/authselect/nsswitch.conf. For complete SELinux messages run: sealert -l 9a1e2952-3fde-4937-a8ab-f7f59791a458
Jul 29 01:19:42 b0b02.cs.umd.edu setroubleshoot[492963]: SELinux is preventing /usr/bin/python3.9 from read access on the file /etc/authselect/nsswitch.conf. For complete SELinux messages run: sealert -l 97d74423-e027-4cd6-8810-ad80944900b5
Jul 29 01:19:45 b0b02.cs.umd.edu setroubleshoot[492963]: SELinux is preventing /usr/bin/python3.9 from open access on the file /etc/authselect/nsswitch.conf. For complete SELinux messages run: sealert -l 4f253f6a-62d6-46dd-8eaf-0b4d29df41c6
Jul 29 01:35:46 b0b02.cs.umd.edu rustdesk[497442]: cannot open display:
== bachata (1 distinct, 2 total) ==
Jul 29 01:50:50 bachata setroubleshoot[2088758]: SELinux is preventing /usr/sbin/smbd from name_bind access on the udp_socket port 766. For complete SELinux messages run: sealert -l 8f7247f1-69a5-4a62-a4f0-88a324bfd75c [x2]
== cheezit.cs.umd.edu (11 distinct, 13 total) ==
Jul 29 01:36:49 cheezit.cs.umd.edu setroubleshoot[2948385]: failed to retrieve rpm info for path '/var/log/falconctl.log':
Jul 29 01:36:50 cheezit.cs.umd.edu setroubleshoot[2948385]: SELinux is preventing /opt/CrowdStrike/falconctl18708 from append access on the file /var/log/falconctl.log. For complete SELinux messages run: sealert -l 63f66d53-fcfc-44da-a79e-c789b1ce2ce8
Jul 29 01:36:52 cheezit.cs.umd.edu setroubleshoot[2948385]: SELinux is preventing /opt/CrowdStrike/falconctl18708 from write access on the file falconstore. For complete SELinux messages run: sealert -l 386506af-597f-4357-89de-bc382f369a6e
Jul 29 01:37:03 cheezit.cs.umd.edu setroubleshoot[2948756]: failed to retrieve rpm info for path '/var/lib/sss/pipes/nss': [x2]
Jul 29 01:37:04 cheezit.cs.umd.edu setroubleshoot[2948756]: SELinux is preventing /usr/bin/lsof from write access on the sock_file /var/lib/sss/pipes/nss. For complete SELinux messages run: sealert -l f570494d-54d2-4dac-97e2-28395659abf1 [x2]
Jul 29 01:37:04 cheezit.cs.umd.edu setroubleshoot[2948756]: SELinux is preventing /usr/bin/lsof from write access on the sock_file socket. For complete SELinux messages run: sealert -l 9ff2383b-9e1d-44ff-b8ae-af91637450ae
Jul 29 01:37:45 cheezit.cs.umd.edu setroubleshoot[2949170]: SELinux is preventing /usr/bin/python3.9 from read access on the file /etc/selinux/targeted/contexts/files/file_contexts.subs_dist. For complete SELinux messages run: sealert -l 679eb260-cf5d-4783-99f4-ce308edb3295
Jul 29 01:37:45 cheezit.cs.umd.edu setroubleshoot[2949170]: SELinux is preventing /usr/bin/python3.9 from open access on the file /etc/selinux/targeted/contexts/files/file_contexts.subs_dist. For complete SELinux messages run: sealert -l 77caba8a-5cd0-4e18-b188-6e35c461772d
Jul 29 01:37:45 cheezit.cs.umd.edu setroubleshoot[2949170]: SELinux is preventing /usr/bin/python3.9 from read access on the file /etc/selinux/targeted/contexts/files/file_contexts.subs. For complete SELinux messages run: sealert -l d9c6dd0d-0a34-4430-a5ff-e985c55cb064
Jul 29 01:37:45 cheezit.cs.umd.edu setroubleshoot[2949170]: SELinux is preventing /usr/bin/python3.9 from open access on the file /etc/selinux/targeted/contexts/files/file_contexts.subs. For complete SELinux messages run: sealert -l 8edbce57-8212-4ac8-af50-3fe403231eda
Jul 29 01:37:45 cheezit.cs.umd.edu setroubleshoot[2949170]: SELinux is preventing /usr/bin/python3.9 from map access on the file /etc/selinux/targeted/contexts/files/file_contexts.bin. For complete SELinux messages run: sealert -l 4a0cbe3b-6f49-4c7e-95c6-380f7aef806e
== contest (9 distinct, 44 total) ==
Jul 29 01:05:23 contest goferd[1007]: [ERROR][worker-0] gofer.messaging.adapter.connect:33 - connect: proton+amqps://satellite8.cs.umd.edu:5647, failed: Connection amqps://satellite8.cs.umd.edu:5647 disconnected: Condition('proton.pythonio', 'Connection refused to all addresses') [x34]
Jul 29 01:48:14 contest setroubleshoot[259642]: SELinux is preventing /usr/libexec/platform-python3.6 from create access on the directory libdnf.xEsBGP. For complete SELinux messages run: sealert -l cb6b25c6-4765-4cf2-88a0-9b3b508e94e9
Jul 29 01:48:14 contest setroubleshoot[259642]: SELinux is preventing /usr/bin/gpgconf from add_name access on the directory repodata. For complete SELinux messages run: sealert -l 41cf7b1b-0f34-4609-98f2-b66e7825fef7
Jul 29 01:48:14 contest setroubleshoot[259642]: SELinux is preventing /usr/libexec/platform-python3.6 from create access on the file mirrorlist. For complete SELinux messages run: sealert -l fc20ff92-ea83-4f38-a24b-ddfd737a3141
Jul 29 01:48:14 contest setroubleshoot[259642]: SELinux is preventing /usr/libexec/platform-python3.6 from setattr access on the file repomd.xml. For complete SELinux messages run: sealert -l ac675631-fa35-4e93-adc9-b692b18e53e5 [x2]
Jul 29 01:48:15 contest setroubleshoot[259642]: SELinux is preventing /usr/libexec/platform-python3.6 from create access on the file repomd.xml.asc. For complete SELinux messages run: sealert -l fc20ff92-ea83-4f38-a24b-ddfd737a3141
Jul 29 01:48:15 contest setroubleshoot[259642]: SELinux is preventing /usr/libexec/platform-python3.6 from read access on the directory libdnf.xEsBGP. For complete SELinux messages run: sealert -l 45d103b6-0810-4890-a705-990118577ce8
Jul 29 01:48:15 contest setroubleshoot[259642]: SELinux is preventing /usr/libexec/platform-python3.6 from remove_name access on the directory repomd.xml. For complete SELinux messages run: sealert -l 7e499113-2fd7-4f67-bec6-3521efbe3637 [x2]
Jul 29 01:48:16 contest setroubleshoot[259642]: SELinux is preventing /usr/libexec/platform-python3.6 from rmdir access on the directory repodata. For complete SELinux messages run: sealert -l 3928930b-a1ed-448d-950b-0665ac2adef8
== csfw00a (1 distinct, 8 total) ==
Jul 29 01:08:04 csfw00a kernel: bnxt_en 0000:09:00.0 eth3: NIC Link is Down [x8]
== hackerman (1 distinct, 1 total) ==
Jul 29 01:19:01 hackerman gnome-software[2060381]: failed to commit changes to dconf: GDBus.Error:org.gtk.GDBus.UnmappedGError.Quark._g_2dfile_2derror_2dquark.Code2: Failed to create file “/adminhomes/sajith/.config/dconf/user.1C43S3”: Permission denied
== hazfs.cs.umd.edu (11 distinct, 66 total) ==
Jul 29 01:44:46 hazfs.cs.umd.edu snmpd[1431]: send response: Failure in sendto [x6]
Jul 29 01:44:46 hazfs.cs.umd.edu snmpd[1431]: -- NET-SNMP-EXTEND-MIB::nsExtendStatus."userweb" [x6]
Jul 29 01:44:46 hazfs.cs.umd.edu snmpd[1431]: -- NET-SNMP-EXTEND-MIB::nsExtendStatus."zfslist" [x6]
Jul 29 01:44:46 hazfs.cs.umd.edu snmpd[1431]: -- NET-SNMP-EXTEND-MIB::nsExtendStatus."userhome" [x6]
Jul 29 01:44:46 hazfs.cs.umd.edu snmpd[1431]: -- NET-SNMP-EXTEND-MIB::nsExtendOutput1Line."userweb" [x6]
Jul 29 01:44:46 hazfs.cs.umd.edu snmpd[1431]: -- NET-SNMP-EXTEND-MIB::nsExtendOutput1Line."zfslist" [x6]
Jul 29 01:44:46 hazfs.cs.umd.edu snmpd[1431]: -- NET-SNMP-EXTEND-MIB::nsExtendOutput1Line."userhome" [x6]
Jul 29 01:44:46 hazfs.cs.umd.edu snmpd[1431]: -- NET-SNMP-EXTEND-MIB::nsExtendOutputFull."userweb" [x6]
Jul 29 01:44:46 hazfs.cs.umd.edu snmpd[1431]: -- NET-SNMP-EXTEND-MIB::nsExtendOutputFull."zfslist" [x6]
Jul 29 01:44:46 hazfs.cs.umd.edu snmpd[1431]: -- NET-SNMP-EXTEND-MIB::nsExtendOutputFull."userhome" [x6]
Jul 29 01:44:46 hazfs.cs.umd.edu snmpd[1431]: -- NET-SNMP-EXTEND-MIB::nsExtendOutNumLines."userweb" [x6]
== idm00 (2 distinct, 2 total) ==
Jul 29 01:24:00 idm00 named[1455]: client @0x7f330c1a7c08 10.73.245.12#64479: update '73.10.in-addr.arpa/IN' denied
Jul 29 01:51:09 idm00 named[1455]: client @0x7f33040e61c8 10.73.240.42#49943: update '73.10.in-addr.arpa/IN' denied
== idmp0 (1 distinct, 1 total) ==
Jul 29 01:36:04 idmp0 named[5198]: client @0x7f99280434c8 10.73.240.43#59907: update '73.10.in-addr.arpa/IN' denied
== itmon02 (1 distinct, 39 total) ==
Jul 29 01:08:15 itmon02 sshd[1834]: error: beginning MaxStartups throttling [x39]
== netman.cs.umd.edu (4 distinct, 11 total) ==
Jul 29 01:56:12 netman.cs.umd.edu krb5_child[2326413]: Client 'admin(a)UMD.EDU' not found in Kerberos database [x8]
Jul 29 01:56:18 netman.cs.umd.edu sshd[2326405]: error: PAM: Authentication failure for admin from 111.70.23.241
Jul 29 01:57:04 netman.cs.umd.edu sshd[2326986]: error: PAM: Authentication failure for admin from 34.78.204.56
Jul 29 01:58:17 netman.cs.umd.edu sshd[2327445]: error: Protocol major versions differ: 2 vs. 1
== networkvm01.cs.umd.edu (9 distinct, 9 total) ==
Jul 29 01:18:53 networkvm01.cs.umd.edu setroubleshoot[803987]: SELinux is preventing /usr/bin/gpg from write access on the directory /(null). For complete SELinux messages run: sealert -l 8ead1354-ae8a-4a17-bb3f-146ebf6c892c
Jul 29 01:18:53 networkvm01.cs.umd.edu setroubleshoot[803987]: SELinux is preventing /usr/bin/gpg from add_name access on the directory /(null). For complete SELinux messages run: sealert -l f9b51e91-5dbc-455f-88c2-f0746a2f0f4c
Jul 29 01:18:53 networkvm01.cs.umd.edu setroubleshoot[803987]: SELinux is preventing /usr/bin/gpg from create access on the file /(null). For complete SELinux messages run: sealert -l af0a60e6-c449-4bdd-bfb8-c69b58472884
Jul 29 01:18:53 networkvm01.cs.umd.edu setroubleshoot[803987]: SELinux is preventing /usr/bin/gpg from link access on the file /(null). For complete SELinux messages run: sealert -l 3df452f6-4d9e-4e38-946b-ea8e1edd356c
Jul 29 01:18:53 networkvm01.cs.umd.edu setroubleshoot[803987]: SELinux is preventing /usr/bin/gpg from remove_name access on the directory .#lk0x00005597f2036ed0.networkvm01.cs.umd.edu.803986x. For complete SELinux messages run: sealert -l fcac71c9-c7c0-45a9-9dc2-a8dcbeccfc75
Jul 29 01:18:53 networkvm01.cs.umd.edu setroubleshoot[803987]: SELinux is preventing /usr/bin/gpg from unlink access on the file .#lk0x00005597f2036ed0.networkvm01.cs.umd.edu.803986x. For complete SELinux messages run: sealert -l a672ebb7-fa69-419c-b1f0-fb386b8b48a6
Jul 29 01:18:53 networkvm01.cs.umd.edu setroubleshoot[803987]: SELinux is preventing /usr/bin/gpg from write access on the directory /(null). For complete SELinux messages run: sealert -l fec9104e-d27a-4fd4-9872-6b17088c2951
Jul 29 01:18:53 networkvm01.cs.umd.edu setroubleshoot[803987]: SELinux is preventing /usr/bin/gpg from add_name access on the directory /(null). For complete SELinux messages run: sealert -l 26718b2a-493d-457d-818c-244bd8d4ec9d
Jul 29 01:18:54 networkvm01.cs.umd.edu setroubleshoot[803987]: SELinux is preventing /usr/bin/gpg from remove_name access on the directory .#lk0x0000557fb2466ee0.networkvm01.cs.umd.edu.804005x. For complete SELinux messages run: sealert -l 80e6efe4-93f3-4219-8132-b2b52db1f517
== newhonors2 (1 distinct, 24 total) ==
Jul 29 01:13:03 newhonors2 dhcpcd[428980]: dhcpcd is not running [x24]
== outbound00.cs.umd.edu (1 distinct, 6 total) ==
Jul 29 01:09:09 outbound00.cs.umd.edu python3[637966]: ldapdb [x6]
== outbound01.cs.umd.edu (1 distinct, 6 total) ==
Jul 29 01:13:06 outbound01.cs.umd.edu python3[2862590]: ldapdb [x6]
== sentry-docker00.cs.umd.edu (40 distinct, 40 total) ==
Jul 29 01:06:49 sentry-docker00.cs.umd.edu systemd-udevd[1527019]: link_config: could not get ethtool features for veth1f3d400
Jul 29 01:06:49 sentry-docker00.cs.umd.edu systemd-udevd[1527019]: Could not set offload features of veth1f3d400: No such device
Jul 29 01:06:49 sentry-docker00.cs.umd.edu systemd-udevd[1527024]: link_config: could not get ethtool features for vethbf377bd
Jul 29 01:06:49 sentry-docker00.cs.umd.edu systemd-udevd[1527024]: Could not set offload features of vethbf377bd: No such device
Jul 29 01:06:49 sentry-docker00.cs.umd.edu systemd-udevd[1527055]: Could not generate persistent MAC address for veth3a7636c: No such file or directory
Jul 29 01:06:49 sentry-docker00.cs.umd.edu systemd-udevd[1527056]: Could not generate persistent MAC address for veth9ed4f0e: No such file or directory
Jul 29 01:06:49 sentry-docker00.cs.umd.edu systemd-udevd[1527059]: Could not generate persistent MAC address for veth274133e: No such file or directory
Jul 29 01:06:49 sentry-docker00.cs.umd.edu systemd-udevd[1527060]: Could not generate persistent MAC address for veth1a6b481: No such file or directory
Jul 29 01:06:49 sentry-docker00.cs.umd.edu systemd-udevd[1527083]: Could not generate persistent MAC address for veth2f94df2: No such file or directory
Jul 29 01:06:49 sentry-docker00.cs.umd.edu systemd-udevd[1527084]: Could not generate persistent MAC address for veth743bb02: No such file or directory
Jul 29 01:06:50 sentry-docker00.cs.umd.edu systemd-udevd[1527107]: Could not generate persistent MAC address for vetha24e0f1: No such file or directory
Jul 29 01:06:50 sentry-docker00.cs.umd.edu systemd-udevd[1527104]: Could not generate persistent MAC address for veth4a915c5: No such file or directory
Jul 29 01:13:35 sentry-docker00.cs.umd.edu systemd-udevd[1530641]: Could not generate persistent MAC address for veth86f14fa: No such file or directory
Jul 29 01:13:35 sentry-docker00.cs.umd.edu systemd-udevd[1530642]: Could not generate persistent MAC address for vetha4567f8: No such file or directory
Jul 29 01:26:58 sentry-docker00.cs.umd.edu systemd-udevd[1536654]: link_config: could not get ethtool features for veth274133e
Jul 29 01:26:58 sentry-docker00.cs.umd.edu systemd-udevd[1536654]: Could not set offload features of veth274133e: No such device
Jul 29 01:26:58 sentry-docker00.cs.umd.edu systemd-udevd[1536690]: Could not generate persistent MAC address for vethd32d29a: No such file or directory
Jul 29 01:26:58 sentry-docker00.cs.umd.edu systemd-udevd[1536691]: Could not generate persistent MAC address for vethd11614d: No such file or directory
Jul 29 01:26:58 sentry-docker00.cs.umd.edu systemd-udevd[1536694]: Could not generate persistent MAC address for vethf6a06a6: No such file or directory
Jul 29 01:26:58 sentry-docker00.cs.umd.edu systemd-udevd[1536716]: Could not generate persistent MAC address for veth3608b24: No such file or directory
Jul 29 01:26:58 sentry-docker00.cs.umd.edu systemd-udevd[1536702]: Could not generate persistent MAC address for veth01ae20a: No such file or directory
Jul 29 01:26:58 sentry-docker00.cs.umd.edu systemd-udevd[1536708]: Could not generate persistent MAC address for veth1415c84: No such file or directory
Jul 29 01:26:58 sentry-docker00.cs.umd.edu systemd-udevd[1536694]: Could not generate persistent MAC address for veth6700fa0: No such file or directory
Jul 29 01:26:58 sentry-docker00.cs.umd.edu systemd-udevd[1536701]: Could not generate persistent MAC address for vethc5135c5: No such file or directory
Jul 29 01:33:43 sentry-docker00.cs.umd.edu systemd-udevd[1540297]: link_config: could not set ethtool features for veth86f14fa
Jul 29 01:33:43 sentry-docker00.cs.umd.edu systemd-udevd[1540297]: Could not set offload features of veth86f14fa: Operation not permitted
Jul 29 01:33:43 sentry-docker00.cs.umd.edu systemd-udevd[1540307]: Could not generate persistent MAC address for veth6906197: No such file or directory
Jul 29 01:33:43 sentry-docker00.cs.umd.edu systemd-udevd[1540308]: Could not generate persistent MAC address for veth20358c1: No such file or directory
Jul 29 01:47:06 sentry-docker00.cs.umd.edu systemd-udevd[1546037]: link_config: could not get ethtool features for vethc5135c5
Jul 29 01:47:06 sentry-docker00.cs.umd.edu systemd-udevd[1546037]: Could not set offload features of vethc5135c5: No such device
... 10 more distinct messages not shown
== strawberry (2 distinct, 8 total) ==
Jul 29 01:09:44 strawberry udisksd[1067]: Error performing housekeeping for drive /org/freedesktop/UDisks2/drives/ST2000DM001_1CH164_W1E8J5KJ: Error updating SMART data: Error sending ATA command CHECK POWER MODE: Unexpected sense data returned:#0120000: 00 00 00 00 00 00 00 00 00 00 00 00 00 00 00 00 ................#0120010: 00 00 00 00 00 00 00 00 00 00 00 00 00 00 00 00 ................#012 (g-io-error-quark, 0) [x6]
Jul 29 01:34:42 strawberry smartd[5314]: Device: /dev/sda [SAT], failed to read SMART Attribute Data [x2]
== submit26-b9-2 (9 distinct, 9 total) ==
Jul 29 01:12:50 submit26-b9-2 setroubleshoot[387972]: SELinux is preventing /usr/bin/python3.9 from create access on the directory /(null). For complete SELinux messages run: sealert -l d506243c-d61e-48f3-b42a-4592c913deb0
Jul 29 01:12:50 submit26-b9-2 setroubleshoot[387972]: SELinux is preventing /usr/bin/python3.9 from add_name access on the directory /(null). For complete SELinux messages run: sealert -l 3b4752ac-1b9a-4af9-a05b-32e4c2eb13ab
Jul 29 01:12:50 submit26-b9-2 setroubleshoot[387972]: SELinux is preventing /usr/bin/python3.9 from create access on the file /(null). For complete SELinux messages run: sealert -l 29e5adbd-4381-4467-b40d-a2219101e096
Jul 29 01:12:50 submit26-b9-2 setroubleshoot[387972]: SELinux is preventing /usr/bin/python3.9 from open access on the file /tmp/libdnf.MVFGni/repodata/repomd.xml. For complete SELinux messages run: sealert -l 1b38f2ec-01ce-4343-8059-ba7494ecc5c4
Jul 29 01:12:50 submit26-b9-2 setroubleshoot[387972]: SELinux is preventing /usr/bin/python3.9 from setattr access on the file repomd.xml. For complete SELinux messages run: sealert -l e5f9af40-1f63-4924-b012-27ab2a7b2266
Jul 29 01:12:50 submit26-b9-2 setroubleshoot[387972]: SELinux is preventing /usr/bin/python3.9 from read access on the directory libdnf.MVFGni. For complete SELinux messages run: sealert -l 5c54db87-54a3-4a7c-97b4-b5c48d6c3543
Jul 29 01:12:50 submit26-b9-2 setroubleshoot[387972]: SELinux is preventing /usr/bin/python3.9 from remove_name access on the directory repomd.xml. For complete SELinux messages run: sealert -l 63cd60e1-1e61-4276-afea-dd8526ffe8b2
Jul 29 01:12:50 submit26-b9-2 setroubleshoot[387972]: SELinux is preventing /usr/bin/python3.9 from unlink access on the file repomd.xml. For complete SELinux messages run: sealert -l 81c7e9ec-e023-4c6d-b1ad-c02a242e655e
Jul 29 01:12:50 submit26-b9-2 setroubleshoot[387972]: SELinux is preventing /usr/bin/python3.9 from rmdir access on the directory repodata. For complete SELinux messages run: sealert -l 6ae9a597-e123-4d74-8eec-a8ebe0f5e4d0
== submit26-b9-3 (9 distinct, 9 total) ==
Jul 29 01:20:36 submit26-b9-3 setroubleshoot[670596]: SELinux is preventing /usr/bin/python3.9 from create access on the directory /(null). For complete SELinux messages run: sealert -l 5b912a44-22fd-4560-b201-2a4e289b73f5
Jul 29 01:20:36 submit26-b9-3 setroubleshoot[670596]: SELinux is preventing /usr/bin/python3.9 from add_name access on the directory /(null). For complete SELinux messages run: sealert -l 7f1df1e4-725e-4953-98eb-1079f908f543
Jul 29 01:20:36 submit26-b9-3 setroubleshoot[670596]: SELinux is preventing /usr/bin/python3.9 from create access on the file /(null). For complete SELinux messages run: sealert -l 40b8852a-f77b-44b4-affe-5f11fa33de43
Jul 29 01:20:36 submit26-b9-3 setroubleshoot[670596]: SELinux is preventing /usr/bin/python3.9 from open access on the file /tmp/libdnf.NbMRTm/repodata/repomd.xml. For complete SELinux messages run: sealert -l 45a8019e-f6b5-4baa-92c1-862594b40d46
Jul 29 01:20:36 submit26-b9-3 setroubleshoot[670596]: SELinux is preventing /usr/bin/python3.9 from setattr access on the file repomd.xml. For complete SELinux messages run: sealert -l e9f0bfff-7784-4126-baa4-2bb06da56591
Jul 29 01:20:36 submit26-b9-3 setroubleshoot[670596]: SELinux is preventing /usr/bin/python3.9 from read access on the directory libdnf.NbMRTm. For complete SELinux messages run: sealert -l 0b17cc3d-cdc6-4fe2-a11f-3892e7c41dc7
Jul 29 01:20:36 submit26-b9-3 setroubleshoot[670596]: SELinux is preventing /usr/bin/python3.9 from remove_name access on the directory repomd.xml. For complete SELinux messages run: sealert -l 10e38c64-b65f-4cdd-901e-4375652d9a42
Jul 29 01:20:36 submit26-b9-3 setroubleshoot[670596]: SELinux is preventing /usr/bin/python3.9 from unlink access on the file repomd.xml. For complete SELinux messages run: sealert -l 7fd9cf72-ef38-48e1-b6aa-b571b26a7b22
Jul 29 01:20:36 submit26-b9-3 setroubleshoot[670596]: SELinux is preventing /usr/bin/python3.9 from rmdir access on the directory repodata. For complete SELinux messages run: sealert -l b9b11116-89bd-4a3c-980c-1d422c5dcee4
== submit26-clnb9 (9 distinct, 11 total) ==
Jul 29 01:31:54 submit26-clnb9 setroubleshoot[1467371]: SELinux is preventing /usr/bin/python3.9 from create access on the directory /(null). For complete SELinux messages run: sealert -l 6783ed2b-5ae4-42b5-975a-4bf50eec4658 [x2]
Jul 29 01:31:54 submit26-clnb9 setroubleshoot[1467371]: SELinux is preventing /usr/bin/python3.9 from add_name access on the directory /(null). For complete SELinux messages run: sealert -l 9e7fa955-cc30-4804-ac8c-e1779e85946c [x2]
Jul 29 01:31:54 submit26-clnb9 setroubleshoot[1467371]: SELinux is preventing /usr/bin/python3.9 from create access on the file /(null). For complete SELinux messages run: sealert -l 69bfa6e3-089c-40ff-9563-fd30787d0774
Jul 29 01:31:54 submit26-clnb9 setroubleshoot[1467371]: SELinux is preventing /usr/bin/python3.9 from open access on the file /tmp/libdnf.vKxPum/repodata/repomd.xml. For complete SELinux messages run: sealert -l 001acdb5-31ef-4e52-b10b-90f467a89ddc
Jul 29 01:31:54 submit26-clnb9 setroubleshoot[1467371]: SELinux is preventing /usr/bin/python3.9 from setattr access on the file repomd.xml. For complete SELinux messages run: sealert -l edacddcf-16ed-4dc3-8d82-7c597d5dee23
Jul 29 01:31:54 submit26-clnb9 setroubleshoot[1467371]: SELinux is preventing /usr/bin/python3.9 from read access on the directory libdnf.vKxPum. For complete SELinux messages run: sealert -l 62b3782e-4730-4488-8178-94dafe9b552c
Jul 29 01:31:54 submit26-clnb9 setroubleshoot[1467371]: SELinux is preventing /usr/bin/python3.9 from remove_name access on the directory repomd.xml. For complete SELinux messages run: sealert -l 81cb3698-78f8-440a-8e3c-e5d1041e6b78
Jul 29 01:31:54 submit26-clnb9 setroubleshoot[1467371]: SELinux is preventing /usr/bin/python3.9 from unlink access on the file repomd.xml. For complete SELinux messages run: sealert -l 792b472a-115c-4799-9805-fc7436f916b9
Jul 29 01:31:54 submit26-clnb9 setroubleshoot[1467371]: SELinux is preventing /usr/bin/python3.9 from rmdir access on the directory repodata. For complete SELinux messages run: sealert -l 15c83a86-837b-41e2-b662-b39cd4e361cb
== tma-0 (1 distinct, 1 total) ==
Jul 29 02:01:10 tma-0 sshd[30370]: error: PAM: Authentication failure for admin from 139.28.156.34.bc.googleusercontent.com
1
0
Command: /usr/local/sbin/syslog-digest.py
Time : 0.5039s
Status : exited 0
Output :
Syslog digest — 2026-07-29 01:05 EDT
Processed 4,142 lines, filtered 3,457 (83%). 685 unknown (143 distinct) from 34 host(s).
== abuse (1 distinct, 346 total) ==
Jul 29 00:05:06 abuse rsyslogd[21745]: imjournal: open() failed for path: '/var/lib/rsyslog/imjournal.state.tmp': Input/output error [v8.2404.0 try https://www.rsyslog.com/e/2433 ] [x346]
== alec.cs.umd.edu (3 distinct, 61 total) ==
Jul 29 00:05:14 alec.cs.umd.edu setroubleshoot[4176722]: failed to retrieve rpm info for path '/run/netns/netns-9dfd0347-71eb-5698-085c-c769043aa5c3': [x12]
Jul 29 00:05:15 alec.cs.umd.edu sedispatch[1526]: AVC Message regarding setroubleshoot, ignoring message [x24]
Jul 29 00:05:15 alec.cs.umd.edu setroubleshoot[4176722]: SELinux is preventing /usr/bin/df from getattr access on the file /run/netns/netns-9dfd0347-71eb-5698-085c-c769043aa5c3. For complete SELinux messages run: sealert -l 23f93208-3063-4aac-b78a-bb0fcb40740c [x25]
== atif01.cs.umd.edu (24 distinct, 46 total) ==
Jul 29 00:26:07 atif01.cs.umd.edu sshd[63908]: error: maximum authentication attempts exceeded for root from 41.63.0.139 port 50903 ssh2 [preauth]
Jul 29 00:26:07 atif01.cs.umd.edu sshd[63908]: PAM service(sshd) ignoring max retries; 6 > 3 [x23]
Jul 29 00:26:22 atif01.cs.umd.edu sshd[63934]: error: maximum authentication attempts exceeded for root from 41.63.0.139 port 53981 ssh2 [preauth]
Jul 29 00:26:37 atif01.cs.umd.edu sshd[63942]: error: maximum authentication attempts exceeded for root from 41.63.0.139 port 56811 ssh2 [preauth]
Jul 29 00:26:53 atif01.cs.umd.edu sshd[63952]: error: maximum authentication attempts exceeded for root from 41.63.0.139 port 59505 ssh2 [preauth]
Jul 29 00:27:07 atif01.cs.umd.edu sshd[63970]: error: maximum authentication attempts exceeded for root from 41.63.0.139 port 62502 ssh2 [preauth]
Jul 29 00:27:22 atif01.cs.umd.edu sshd[63978]: error: maximum authentication attempts exceeded for root from 41.63.0.139 port 65450 ssh2 [preauth]
Jul 29 00:27:37 atif01.cs.umd.edu sshd[63988]: error: maximum authentication attempts exceeded for root from 41.63.0.139 port 51780 ssh2 [preauth]
Jul 29 00:27:52 atif01.cs.umd.edu sshd[63996]: error: maximum authentication attempts exceeded for root from 41.63.0.139 port 54558 ssh2 [preauth]
Jul 29 00:28:07 atif01.cs.umd.edu sshd[64014]: error: maximum authentication attempts exceeded for root from 41.63.0.139 port 57347 ssh2 [preauth]
Jul 29 00:28:22 atif01.cs.umd.edu sshd[64024]: error: maximum authentication attempts exceeded for root from 41.63.0.139 port 60143 ssh2 [preauth]
Jul 29 00:28:38 atif01.cs.umd.edu sshd[64032]: error: maximum authentication attempts exceeded for root from 41.63.0.139 port 62924 ssh2 [preauth]
Jul 29 00:28:54 atif01.cs.umd.edu sshd[64042]: error: maximum authentication attempts exceeded for root from 41.63.0.139 port 49379 ssh2 [preauth]
Jul 29 00:29:10 atif01.cs.umd.edu sshd[64058]: error: maximum authentication attempts exceeded for root from 41.63.0.139 port 52123 ssh2 [preauth]
Jul 29 00:29:26 atif01.cs.umd.edu sshd[64068]: error: maximum authentication attempts exceeded for root from 41.63.0.139 port 55058 ssh2 [preauth]
Jul 29 00:29:43 atif01.cs.umd.edu sshd[64078]: error: maximum authentication attempts exceeded for root from 41.63.0.139 port 57902 ssh2 [preauth]
Jul 29 00:30:00 atif01.cs.umd.edu sshd[64087]: error: maximum authentication attempts exceeded for root from 41.63.0.139 port 60843 ssh2 [preauth]
Jul 29 00:30:16 atif01.cs.umd.edu sshd[64105]: error: maximum authentication attempts exceeded for root from 41.63.0.139 port 63690 ssh2 [preauth]
Jul 29 00:30:33 atif01.cs.umd.edu sshd[64140]: error: maximum authentication attempts exceeded for root from 41.63.0.139 port 50261 ssh2 [preauth]
Jul 29 00:30:49 atif01.cs.umd.edu sshd[64148]: error: maximum authentication attempts exceeded for root from 41.63.0.139 port 53013 ssh2 [preauth]
Jul 29 00:31:06 atif01.cs.umd.edu sshd[64158]: error: maximum authentication attempts exceeded for root from 41.63.0.139 port 55791 ssh2 [preauth]
Jul 29 00:31:22 atif01.cs.umd.edu sshd[64182]: error: maximum authentication attempts exceeded for root from 41.63.0.139 port 58701 ssh2 [preauth]
Jul 29 00:31:38 atif01.cs.umd.edu sshd[64192]: error: maximum authentication attempts exceeded for root from 41.63.0.139 port 61743 ssh2 [preauth]
Jul 29 00:31:55 atif01.cs.umd.edu sshd[64202]: error: maximum authentication attempts exceeded for root from 41.63.0.139 port 64482 ssh2 [preauth]
== b0b02.cs.umd.edu (1 distinct, 1 total) ==
Jul 29 00:35:42 b0b02.cs.umd.edu rustdesk[482320]: cannot open display:
== cheezit.cs.umd.edu (4 distinct, 4 total) ==
Jul 29 00:51:40 cheezit.cs.umd.edu sshd-session[2936854]: pam_access(sshd:auth): access denied for user `admin' from `35.241.223.100'
Jul 29 00:51:40 cheezit.cs.umd.edu krb5_child[2936856]: Client 'admin(a)UMD.EDU' not found in Kerberos database
Jul 29 00:51:40 cheezit.cs.umd.edu sshd-session[2936852]: error: PAM: System error for admin from 35.241.223.100
Jul 29 00:52:11 cheezit.cs.umd.edu sshd-session[2936898]: error: Protocol major versions differ: 2 vs. 1
== contest (1 distinct, 33 total) ==
Jul 29 00:06:29 contest goferd[1007]: [ERROR][worker-0] gofer.messaging.adapter.connect:33 - connect: proton+amqps://satellite8.cs.umd.edu:5647, failed: Connection amqps://satellite8.cs.umd.edu:5647 disconnected: Condition('proton.pythonio', 'Connection refused to all addresses') [x33]
== csfw00a (1 distinct, 2 total) ==
Jul 29 00:18:38 csfw00a kernel: bnxt_en 0000:09:00.0 eth3: NIC Link is Down [x2]
== grades01.cs.umd.edu (3 distinct, 4 total) ==
Jul 29 00:10:14 grades01.cs.umd.edu systemd[1]: New main PID 6759 does not belong to service, and PID file is not owned by root. Refusing. [x2]
Jul 29 00:10:38 grades01.cs.umd.edu systemd[1]: Daemon never wrote its PID file. Failing.
Jul 29 00:10:53 grades01.cs.umd.edu systemd[1]: pmlogger.service: Supervising process 14345 which is not our child. We'll most likely not notice when it exits.
== idm00 (1 distinct, 1 total) ==
Jul 29 00:51:09 idm00 named[1455]: client @0x7f3304253ec8 10.73.240.42#51889: update '73.10.in-addr.arpa/IN' denied
== idmp0 (1 distinct, 1 total) ==
Jul 29 00:36:04 idmp0 named[5198]: client @0x7f990800e068 10.73.240.43#51921: update '73.10.in-addr.arpa/IN' denied
== itmon02 (1 distinct, 32 total) ==
Jul 29 00:07:52 itmon02 sshd[1834]: error: beginning MaxStartups throttling [x32]
== jaws.cs.umd.edu (4 distinct, 5 total) ==
Jul 29 00:35:53 jaws.cs.umd.edu systemd-coredump[2747156]: Process 2747147 (podman) of user 981 dumped core.#012#012Stack trace of thread 2747147:#012#0 0x000055d91e70746e internal/runtime/syscall/linux.Syscall6 (podman + 0x48b46e)#012#1 0x000055d91e7e70a6 syscall.Syscall (podman + 0x56b0a6)#012#2 0x000055d91e7e7c50 syscall.Syscall.abi0 (podman + 0x56bc50)#012#3 0x000055d91e951c2e github.com/containers/podman/vendor/golang.org/x/sys/unix.OpenTree (podman + 0x6d5c2e)#012#4 0x000055d91efaaf4b github.com/containers/podman/vendor/github.com/cyphar/filepath-securejoin/p… (podman + 0xd2ef4b)#012#5 0x000055d91efaae54 github.com/containers/podman/vendor/github.com/cyphar/filepath-securejoin/p… (podman + 0xd2ee54)#012#6 0x000055d91e79adcc sync.(*Once).doSlow (podman + 0x51edcc)#012#7 0x000055d91e79acf9 sync.(*Once).Do (podman + 0x51ecf9)#012#8 0x000055d91efaad
c5 github.com/containers/podman/vendor/github.com/cyphar/filepath-securejoin/p… (podman + 0xd2edc5)#012#9 0x000055d91efac3e2 github.com/containers/podman/vendor/github.com/cyphar/filepath-securejoin/p… (podman + 0xd303e2)#012#10 0x000055d91efac7f3 github.com/containers/podman/vendor/github.com/cyphar/filepath-securejoin/p… (podman + 0xd307f3)#012#11 0x000055d91efab91c github.com/containers/podman/vendor/github.com/cyphar/filepath-securejoin/p… (podman + 0xd2f91c)#012#12 0x000055d91efab358 github.com/containers/podman/vendor/github.com/cyphar/filepath-securejoin/p… (podman + 0xd2f358)#012#13 0x000055d91e79adcc sync.(*Once).doSlow (podman + 0x51edcc)#012#14 0x000055d91e79acf9 sync.(*Once).D
o (podman + 0x51ecf9)#012#15 0x000055d91efab2c5 github.com/containers/podman/vendor/github.com/cyphar/filepath-securejoin/p… (podman + 0xd2f2c5)#012#16 0x000055d91efac79a github.com/containers/podman/vendor/github.com/cyphar/filepath-securejoin/p… (podman + 0xd3079a)#012#17 0x000055d91efb334e github.com/containers/podman/vendor/github.com/opencontainers/selinux/go-se… (podman + 0xd3734e)#012#18 0x000055d91efb3838 github.com/containers/podman/vendor/github.com/opencontainers/selinux/go-se… (podman + 0xd37838)#012#19 0x000055d91efb25df github.com/containers/podman/vendor/github.com/opencontainers/selinux/go-se… (podman + 0xd365df)#012#20 0x000055d91efb2873 github.com/containers/podman/vendor/github.com/opencontainers/selinux/go-se… (podman + 0xd36873)#012#21 0x000
055d91f1aaf4b github.com/containers/podman/vendor/go.podman.io/common/pkg/config.defaultC… (podman + 0xf2ef4b)#012#22 0x000055d91f1ae912 github.com/containers/podman/vendor/go.podman.io/common/pkg/config.newLocked (podman + 0xf32912)#012#23 0x000055d91f1ae605 github.com/containers/podman/vendor/go.podman.io/common/pkg/config.New (podman + 0xf32605)#012#24 0x000055d91f921fd3 github.com/containers/podman/cmd/podman/registry.newPodmanConfig (podman + 0x16a5fd3)#012#25 0x000055d91e79adcc sync.(*Once).doSlow (podman + 0x51edcc)#012#26 0x000055d91f942c50 github.com/containers/podman/cmd/podman/common.init (podman + 0x16c6c50)#012#27 0x000055d91e760a57 runtime.doInit1 (podman + 0x4e4a57)#012#28 0x000055d91e750f90 runtime.main (podman + 0x4d4f90)#012#29 0x000055d91e790ee1 runtime.goexit.abi0 (podman + 0x514ee1)#012ELF object binary architecture: AMD x86-64
Jul 29 00:35:55 jaws.cs.umd.edu systemd-coredump[2747182]: Process 2747165 (podman) of user 981 dumped core.#012#012Stack trace of thread 2747165:#012#0 0x000055f49303046e internal/runtime/syscall/linux.Syscall6 (podman + 0x48b46e)#012#1 0x000055f4931100a6 syscall.Syscall (podman + 0x56b0a6)#012#2 0x000055f493110c50 syscall.Syscall.abi0 (podman + 0x56bc50)#012#3 0x000055f49327ac2e github.com/containers/podman/vendor/golang.org/x/sys/unix.OpenTree (podman + 0x6d5c2e)#012#4 0x000055f4938d3f4b github.com/containers/podman/vendor/github.com/cyphar/filepath-securejoin/p… (podman + 0xd2ef4b)#012#5 0x000055f4938d3e54 github.com/containers/podman/vendor/github.com/cyphar/filepath-securejoin/p… (podman + 0xd2ee54)#012#6 0x000055f4930c3dcc sync.(*Once).doSlow (podman + 0x51edcc)#012#7 0x000055f4930c3cf9 sync.(*Once).Do (podman + 0x51ecf9)#012#8 0x000055f4938d3d
c5 github.com/containers/podman/vendor/github.com/cyphar/filepath-securejoin/p… (podman + 0xd2edc5)#012#9 0x000055f4938d53e2 github.com/containers/podman/vendor/github.com/cyphar/filepath-securejoin/p… (podman + 0xd303e2)#012#10 0x000055f4938d57f3 github.com/containers/podman/vendor/github.com/cyphar/filepath-securejoin/p… (podman + 0xd307f3)#012#11 0x000055f4938d491c github.com/containers/podman/vendor/github.com/cyphar/filepath-securejoin/p… (podman + 0xd2f91c)#012#12 0x000055f4938d4358 github.com/containers/podman/vendor/github.com/cyphar/filepath-securejoin/p… (podman + 0xd2f358)#012#13 0x000055f4930c3dcc sync.(*Once).doSlow (podman + 0x51edcc)#012#14 0x000055f4930c3cf9 sync.(*Once).D
o (podman + 0x51ecf9)#012#15 0x000055f4938d42c5 github.com/containers/podman/vendor/github.com/cyphar/filepath-securejoin/p… (podman + 0xd2f2c5)#012#16 0x000055f4938d579a github.com/containers/podman/vendor/github.com/cyphar/filepath-securejoin/p… (podman + 0xd3079a)#012#17 0x000055f4938dc34e github.com/containers/podman/vendor/github.com/opencontainers/selinux/go-se… (podman + 0xd3734e)#012#18 0x000055f4938dc838 github.com/containers/podman/vendor/github.com/opencontainers/selinux/go-se… (podman + 0xd37838)#012#19 0x000055f4938db5df github.com/containers/podman/vendor/github.com/opencontainers/selinux/go-se… (podman + 0xd365df)#012#20 0x000055f4938db873 github.com/containers/podman/vendor/github.com/opencontainers/selinux/go-se… (podman + 0xd36873)#012#21 0x000
055f493ad3f4b github.com/containers/podman/vendor/go.podman.io/common/pkg/config.defaultC… (podman + 0xf2ef4b)#012#22 0x000055f493ad7912 github.com/containers/podman/vendor/go.podman.io/common/pkg/config.newLocked (podman + 0xf32912)#012#23 0x000055f493ad7605 github.com/containers/podman/vendor/go.podman.io/common/pkg/config.New (podman + 0xf32605)#012#24 0x000055f49424afd3 github.com/containers/podman/cmd/podman/registry.newPodmanConfig (podman + 0x16a5fd3)#012#25 0x000055f4930c3dcc sync.(*Once).doSlow (podman + 0x51edcc)#012#26 0x000055f49426bc50 github.com/containers/podman/cmd/podman/common.init (podman + 0x16c6c50)#012#27 0x000055f493089a57 runtime.doInit1 (podman + 0x4e4a57)#012#28 0x000055f493079f90 runtime.main (podman + 0x4d4f90)#012#29 0x000055f4930b9ee1 runtime.goexit.abi0 (podman + 0x514ee1)#012ELF object binary architecture: AMD x86-64
Jul 29 00:35:56 jaws.cs.umd.edu setroubleshoot[2747155]: SELinux is preventing /usr/bin/podman from using the nnp_transition access on a process. For complete SELinux messages run: sealert -l 3c7643bc-dd69-4695-b48c-7d780b62b6cf [x2]
Jul 29 00:35:56 jaws.cs.umd.edu systemd-coredump[2747215]: Process 2747196 (podman) of user 981 dumped core.#012#012Stack trace of thread 2747196:#012#0 0x000055773d65f46e internal/runtime/syscall/linux.Syscall6 (podman + 0x48b46e)#012#1 0x000055773d73f0a6 syscall.Syscall (podman + 0x56b0a6)#012#2 0x000055773d73fc50 syscall.Syscall.abi0 (podman + 0x56bc50)#012#3 0x000055773d8a9c2e github.com/containers/podman/vendor/golang.org/x/sys/unix.OpenTree (podman + 0x6d5c2e)#012#4 0x000055773df02f4b github.com/containers/podman/vendor/github.com/cyphar/filepath-securejoin/p… (podman + 0xd2ef4b)#012#5 0x000055773df02e54 github.com/containers/podman/vendor/github.com/cyphar/filepath-securejoin/p… (podman + 0xd2ee54)#012#6 0x000055773d6f2dcc sync.(*Once).doSlow (podman + 0x51edcc)#012#7 0x000055773d6f2cf9 sync.(*Once).Do (podman + 0x51ecf9)#012#8 0x000055773df02d
c5 github.com/containers/podman/vendor/github.com/cyphar/filepath-securejoin/p… (podman + 0xd2edc5)#012#9 0x000055773df043e2 github.com/containers/podman/vendor/github.com/cyphar/filepath-securejoin/p… (podman + 0xd303e2)#012#10 0x000055773df047f3 github.com/containers/podman/vendor/github.com/cyphar/filepath-securejoin/p… (podman + 0xd307f3)#012#11 0x000055773df0391c github.com/containers/podman/vendor/github.com/cyphar/filepath-securejoin/p… (podman + 0xd2f91c)#012#12 0x000055773df03358 github.com/containers/podman/vendor/github.com/cyphar/filepath-securejoin/p… (podman + 0xd2f358)#012#13 0x000055773d6f2dcc sync.(*Once).doSlow (podman + 0x51edcc)#012#14 0x000055773d6f2cf9 sync.(*Once).D
o (podman + 0x51ecf9)#012#15 0x000055773df032c5 github.com/containers/podman/vendor/github.com/cyphar/filepath-securejoin/p… (podman + 0xd2f2c5)#012#16 0x000055773df0479a github.com/containers/podman/vendor/github.com/cyphar/filepath-securejoin/p… (podman + 0xd3079a)#012#17 0x000055773df0b34e github.com/containers/podman/vendor/github.com/opencontainers/selinux/go-se… (podman + 0xd3734e)#012#18 0x000055773df0b838 github.com/containers/podman/vendor/github.com/opencontainers/selinux/go-se… (podman + 0xd37838)#012#19 0x000055773df0a5df github.com/containers/podman/vendor/github.com/opencontainers/selinux/go-se… (podman + 0xd365df)#012#20 0x000055773df0a873 github.com/containers/podman/vendor/github.com/opencontainers/selinux/go-se… (podman + 0xd36873)#012#21 0x000
055773e102f4b github.com/containers/podman/vendor/go.podman.io/common/pkg/config.defaultC… (podman + 0xf2ef4b)#012#22 0x000055773e106912 github.com/containers/podman/vendor/go.podman.io/common/pkg/config.newLocked (podman + 0xf32912)#012#23 0x000055773e106605 github.com/containers/podman/vendor/go.podman.io/common/pkg/config.New (podman + 0xf32605)#012#24 0x000055773e879fd3 github.com/containers/podman/cmd/podman/registry.newPodmanConfig (podman + 0x16a5fd3)#012#25 0x000055773d6f2dcc sync.(*Once).doSlow (podman + 0x51edcc)#012#26 0x000055773e89ac50 github.com/containers/podman/cmd/podman/common.init (podman + 0x16c6c50)#012#27 0x000055773d6b8a57 runtime.doInit1 (podman + 0x4e4a57)#012#28 0x000055773d6a8f90 runtime.main (podman + 0x4d4f90)#012#29 0x000055773d6e8ee1 runtime.goexit.abi0 (podman + 0x514ee1)#012ELF object binary architecture: AMD x86-64
== jubjub.cs.umd.edu (3 distinct, 4 total) ==
Jul 29 00:10:12 jubjub.cs.umd.edu systemd[1]: New main PID 4034131 does not belong to service, and PID file is not owned by root. Refusing. [x2]
Jul 29 00:10:31 jubjub.cs.umd.edu systemd[1]: Daemon never wrote its PID file. Failing.
Jul 29 00:10:40 jubjub.cs.umd.edu systemd[1]: pmlogger.service: Supervising process 4041637 which is not our child. We'll most likely not notice when it exits.
== krispykreme.cs.umd.edu (3 distinct, 3 total) ==
Jul 29 00:51:08 krispykreme.cs.umd.edu sshd-session[614404]: pam_access(sshd:auth): access denied for user `admin' from `35.241.223.100'
Jul 29 00:51:08 krispykreme.cs.umd.edu krb5_child[614406]: Client 'admin(a)UMD.EDU' not found in Kerberos database
Jul 29 00:51:08 krispykreme.cs.umd.edu sshd-session[614402]: error: PAM: System error for admin from 35.241.223.100
== mcstic (3 distinct, 6 total) ==
Jul 29 00:33:08 mcstic krb5_child[1799553]: Client 'admin(a)UMD.EDU' not found in Kerberos database [x4]
Jul 29 00:33:14 mcstic sshd[1799548]: error: PAM: Authentication failure for admin from 34.14.44.205
Jul 29 00:33:17 mcstic sshd[1799564]: error: Protocol major versions differ: 2 vs. 1
== mirrors.cs.umd.edu (3 distinct, 4 total) ==
Jul 29 00:10:12 mirrors.cs.umd.edu systemd[1]: New main PID 20014 does not belong to service, and PID file is not owned by root. Refusing. [x2]
Jul 29 00:10:31 mirrors.cs.umd.edu systemd[1]: Daemon never wrote its PID file. Failing.
Jul 29 00:10:46 mirrors.cs.umd.edu systemd[1]: pmlogger.service: Supervising process 27122 which is not our child. We'll most likely not notice when it exits.
== misty.cs.umd.edu (3 distinct, 4 total) ==
Jul 29 00:10:15 misty.cs.umd.edu systemd[1]: New main PID 4016 does not belong to service, and PID file is not owned by root. Refusing. [x2]
Jul 29 00:10:35 misty.cs.umd.edu systemd[1]: Daemon never wrote its PID file. Failing.
Jul 29 00:10:51 misty.cs.umd.edu systemd[1]: pmlogger.service: Supervising process 11849 which is not our child. We'll most likely not notice when it exits.
== netbox (1 distinct, 1 total) ==
Jul 29 00:10:04 netbox (httpd)[751119]: httpd.service: Referenced but unset environment variable evaluates to an empty string: OPTIONS
== netman.cs.umd.edu (3 distinct, 3 total) ==
Jul 29 00:29:58 netman.cs.umd.edu setroubleshoot[2302689]: SELinux is preventing /usr/bin/gpg from read access on the file gpg.conf. For complete SELinux messages run: sealert -l 019ad1da-a874-4814-8037-3b3e5f413ad2
Jul 29 00:29:59 netman.cs.umd.edu setroubleshoot[2302689]: SELinux is preventing /usr/bin/gpg from open access on the file /root/.gnupg/gpg.conf. For complete SELinux messages run: sealert -l cb54177e-d44c-46a1-b246-5c0bbb8343be
Jul 29 00:30:03 netman.cs.umd.edu setroubleshoot[2302689]: SELinux is preventing /usr/bin/gpg from getattr access on the file /root/.gnupg/gpg.conf. For complete SELinux messages run: sealert -l fbba2e30-b7ab-491c-9ec6-f553e9ef72af
== newhonors.cs.umd.edu (1 distinct, 1 total) ==
Jul 29 00:56:04 newhonors.cs.umd.edu sshd[18076]: fatal: Unable to negotiate with 207.175.163.176 port 27508: no matching key exchange method found. Their offer: diffie-hellman-group1-sha1 [preauth]
== newhonors2 (1 distinct, 24 total) ==
Jul 29 00:13:02 newhonors2 dhcpcd[427150]: dhcpcd is not running [x24]
== outbound00.cs.umd.edu (2 distinct, 7 total) ==
Jul 29 00:09:09 outbound00.cs.umd.edu python3[623563]: ldapdb [x6]
Jul 29 00:55:12 outbound00.cs.umd.edu krb5_child[634968]: Client 'admin(a)UMD.EDU' not found in Kerberos database
== outbound01.cs.umd.edu (3 distinct, 8 total) ==
Jul 29 00:13:06 outbound01.cs.umd.edu python3[2848714]: ldapdb [x6]
Jul 29 00:56:02 outbound01.cs.umd.edu krb5_child[2859065]: Client 'admin(a)UMD.EDU' not found in Kerberos database
Jul 29 00:56:17 outbound01.cs.umd.edu sshd-session[2859070]: error: Protocol major versions differ: 2 vs. 1
== peach.cs.umd.edu (2 distinct, 2 total) ==
Jul 29 00:22:08 peach.cs.umd.edu setroubleshoot[1381188]: SELinux is preventing /usr/bin/qemu-ga from search access on the directory /var/lib/containers/storage/overlay. For complete SELinux messages run: sealert -l ba415951-a2c6-424e-b17d-305c5300b9f3
Jul 29 00:22:08 peach.cs.umd.edu setroubleshoot[1381188]: SELinux is preventing /usr/bin/qemu-ga from search access on the directory /var/lib/containers/storage/overlay. For complete SELinux messages run: sealert -l 6aeb0956-fcf2-462a-ae4d-439b912c16d0
== sentry-docker00.cs.umd.edu (38 distinct, 38 total) ==
Jul 29 00:06:24 sentry-docker00.cs.umd.edu systemd-udevd[1498748]: link_config: could not set ethtool features for veth6c9739b
Jul 29 00:06:24 sentry-docker00.cs.umd.edu systemd-udevd[1498748]: Could not set offload features of veth6c9739b: Operation not permitted
Jul 29 00:06:25 sentry-docker00.cs.umd.edu systemd-udevd[1498771]: Could not generate persistent MAC address for vethb748e65: No such file or directory
Jul 29 00:06:25 sentry-docker00.cs.umd.edu systemd-udevd[1498772]: Could not generate persistent MAC address for veth9a8dcfb: No such file or directory
Jul 29 00:06:25 sentry-docker00.cs.umd.edu systemd-udevd[1498775]: Could not generate persistent MAC address for veth3baa188: No such file or directory
Jul 29 00:06:25 sentry-docker00.cs.umd.edu systemd-udevd[1498776]: Could not generate persistent MAC address for veth6d5c3ee: No such file or directory
Jul 29 00:06:25 sentry-docker00.cs.umd.edu systemd-udevd[1498776]: Could not generate persistent MAC address for veth645bebe: No such file or directory
Jul 29 00:06:25 sentry-docker00.cs.umd.edu systemd-udevd[1498790]: Could not generate persistent MAC address for veth1e202c1: No such file or directory
Jul 29 00:06:25 sentry-docker00.cs.umd.edu systemd-udevd[1498795]: Could not generate persistent MAC address for veth2d3a8a8: No such file or directory
Jul 29 00:06:25 sentry-docker00.cs.umd.edu systemd-udevd[1498782]: Could not generate persistent MAC address for veth76b5d20: No such file or directory
Jul 29 00:13:14 sentry-docker00.cs.umd.edu systemd-udevd[1502347]: Could not generate persistent MAC address for vethd4c7dc4: No such file or directory
Jul 29 00:13:14 sentry-docker00.cs.umd.edu systemd-udevd[1502348]: Could not generate persistent MAC address for vethfc240cf: No such file or directory
Jul 29 00:26:33 sentry-docker00.cs.umd.edu systemd-udevd[1508151]: link_config: could not get ethtool features for veth3baa188
Jul 29 00:26:33 sentry-docker00.cs.umd.edu systemd-udevd[1508151]: Could not set offload features of veth3baa188: No such device
Jul 29 00:26:34 sentry-docker00.cs.umd.edu systemd-udevd[1508215]: Could not generate persistent MAC address for vethafc7cb1: No such file or directory
Jul 29 00:26:34 sentry-docker00.cs.umd.edu systemd-udevd[1508216]: Could not generate persistent MAC address for vethb1d6c16: No such file or directory
Jul 29 00:26:34 sentry-docker00.cs.umd.edu systemd-udevd[1508219]: Could not generate persistent MAC address for veth7f6b457: No such file or directory
Jul 29 00:26:34 sentry-docker00.cs.umd.edu systemd-udevd[1508220]: Could not generate persistent MAC address for vethe9ac90a: No such file or directory
Jul 29 00:26:34 sentry-docker00.cs.umd.edu systemd-udevd[1508231]: Could not generate persistent MAC address for vethd2554bc: No such file or directory
Jul 29 00:26:34 sentry-docker00.cs.umd.edu systemd-udevd[1508222]: Could not generate persistent MAC address for veth412c305: No such file or directory
Jul 29 00:26:34 sentry-docker00.cs.umd.edu systemd-udevd[1508236]: Could not generate persistent MAC address for vethe229324: No such file or directory
Jul 29 00:26:34 sentry-docker00.cs.umd.edu systemd-udevd[1508235]: Could not generate persistent MAC address for veth293737a: No such file or directory
Jul 29 00:33:23 sentry-docker00.cs.umd.edu systemd-udevd[1511808]: Could not generate persistent MAC address for veth4c0c302: No such file or directory
Jul 29 00:33:23 sentry-docker00.cs.umd.edu systemd-udevd[1511809]: Could not generate persistent MAC address for veth7e3774f: No such file or directory
Jul 29 00:46:41 sentry-docker00.cs.umd.edu systemd-udevd[1517581]: link_config: could not get ethtool features for vethe229324
Jul 29 00:46:41 sentry-docker00.cs.umd.edu systemd-udevd[1517581]: Could not set offload features of vethe229324: No such device
Jul 29 00:46:42 sentry-docker00.cs.umd.edu systemd-udevd[1517648]: Could not generate persistent MAC address for veth1f3d400: No such file or directory
Jul 29 00:46:42 sentry-docker00.cs.umd.edu systemd-udevd[1517649]: Could not generate persistent MAC address for veth2733f73: No such file or directory
Jul 29 00:46:42 sentry-docker00.cs.umd.edu systemd-udevd[1517652]: Could not generate persistent MAC address for vethbf377bd: No such file or directory
Jul 29 00:46:42 sentry-docker00.cs.umd.edu systemd-udevd[1517653]: Could not generate persistent MAC address for veth393ecef: No such file or directory
... 8 more distinct messages not shown
== strawberry (3 distinct, 9 total) ==
Jul 29 00:09:44 strawberry udisksd[1067]: Error performing housekeeping for drive /org/freedesktop/UDisks2/drives/ST2000DM001_1CH164_W1E8J5KJ: Error updating SMART data: Error sending ATA command CHECK POWER MODE: Unexpected sense data returned:#0120000: 00 00 00 00 00 00 00 00 00 00 00 00 00 00 00 00 ................#0120010: 00 00 00 00 00 00 00 00 00 00 00 00 00 00 00 00 ................#012 (g-io-error-quark, 0) [x6]
Jul 29 00:34:42 strawberry smartd[5314]: Device: /dev/sda [SAT], failed to read SMART Attribute Data [x2]
Jul 29 01:04:42 strawberry smartd[5314]: Device: /dev/sda [SAT], not capable of Offline or Self-Testing.
== submit10-cln25 (3 distinct, 4 total) ==
Jul 29 00:10:11 submit10-cln25 systemd: New main PID 22349 does not belong to service, and PID file is not owned by root. Refusing. [x2]
Jul 29 00:10:30 submit10-cln25 systemd: Daemon never wrote its PID file. Failing.
Jul 29 00:10:37 submit10-cln25 systemd: pmlogger.service: Supervising process 29264 which is not our child. We'll most likely not notice when it exits.
== submit26-b9-4 (9 distinct, 9 total) ==
Jul 29 00:15:26 submit26-b9-4 setroubleshoot[393710]: SELinux is preventing /usr/bin/python3.9 from create access on the directory /(null). For complete SELinux messages run: sealert -l a4e66030-8621-4da9-bd27-5988bb1bf8ad
Jul 29 00:15:26 submit26-b9-4 setroubleshoot[393710]: SELinux is preventing /usr/bin/python3.9 from add_name access on the directory /(null). For complete SELinux messages run: sealert -l c055e37d-bbf5-4800-9083-d606f792c8c1
Jul 29 00:15:26 submit26-b9-4 setroubleshoot[393710]: SELinux is preventing /usr/bin/python3.9 from create access on the file /(null). For complete SELinux messages run: sealert -l e5bc3a56-6d6f-4776-954f-ddde1579648f
Jul 29 00:15:26 submit26-b9-4 setroubleshoot[393710]: SELinux is preventing /usr/bin/python3.9 from open access on the file /tmp/libdnf.Ri64WJ/repodata/repomd.xml. For complete SELinux messages run: sealert -l a8ec5e1b-49f9-4fbc-a8ae-22e800f7abf2
Jul 29 00:15:26 submit26-b9-4 setroubleshoot[393710]: SELinux is preventing /usr/bin/python3.9 from setattr access on the file repomd.xml. For complete SELinux messages run: sealert -l 945db714-d0c0-4402-911e-932978b8b036
Jul 29 00:15:26 submit26-b9-4 setroubleshoot[393710]: SELinux is preventing /usr/bin/python3.9 from read access on the directory libdnf.Ri64WJ. For complete SELinux messages run: sealert -l 463998a0-fb0d-463c-82b1-471135710a14
Jul 29 00:15:26 submit26-b9-4 setroubleshoot[393710]: SELinux is preventing /usr/bin/python3.9 from remove_name access on the directory repomd.xml. For complete SELinux messages run: sealert -l 473d2e21-15d8-407a-a9ee-2b842607fa00
Jul 29 00:15:26 submit26-b9-4 setroubleshoot[393710]: SELinux is preventing /usr/bin/python3.9 from unlink access on the file repomd.xml. For complete SELinux messages run: sealert -l 80c54d4f-bf4b-4501-addb-1627383587d0
Jul 29 00:15:26 submit26-b9-4 setroubleshoot[393710]: SELinux is preventing /usr/bin/python3.9 from rmdir access on the directory repodata. For complete SELinux messages run: sealert -l c63d3890-151e-49a0-83f0-3dfb69d051e5
== teaching-awards (2 distinct, 2 total) ==
Jul 29 00:57:00 teaching-awards krb5_child[1522174]: Client 'admin(a)UMD.EDU' not found in Kerberos database
Jul 29 00:57:34 teaching-awards sshd-session[1522188]: error: Protocol major versions differ: 2 vs. 1
== tma-0 (3 distinct, 4 total) ==
Jul 29 00:10:13 tma-0 systemd[1]: New main PID 32025 does not belong to service, and PID file is not owned by root. Refusing. [x2]
Jul 29 00:10:31 tma-0 systemd[1]: Daemon never wrote its PID file. Failing.
Jul 29 00:10:38 tma-0 systemd[1]: pmlogger.service: Supervising process 6948 which is not our child. We'll most likely not notice when it exits.
== uffish.cs.umd.edu (3 distinct, 4 total) ==
Jul 29 00:10:13 uffish.cs.umd.edu systemd[1]: New main PID 3481021 does not belong to service, and PID file is not owned by root. Refusing. [x2]
Jul 29 00:10:36 uffish.cs.umd.edu systemd[1]: Daemon never wrote its PID file. Failing.
Jul 29 00:10:52 uffish.cs.umd.edu systemd[1]: pmlogger.service: Supervising process 3488620 which is not our child. We'll most likely not notice when it exits.
== updates00.cs.umd.edu (3 distinct, 4 total) ==
Jul 29 00:10:12 updates00.cs.umd.edu systemd[1]: New main PID 23590 does not belong to service, and PID file is not owned by root. Refusing. [x2]
Jul 29 00:10:30 updates00.cs.umd.edu systemd[1]: Daemon never wrote its PID file. Failing.
Jul 29 00:10:36 updates00.cs.umd.edu systemd[1]: pmlogger.service: Supervising process 30484 which is not our child. We'll most likely not notice when it exits.
== vacuum.cs.umd.edu (3 distinct, 4 total) ==
Jul 29 00:10:14 vacuum.cs.umd.edu systemd[1]: New main PID 14136 does not belong to service, and PID file is not owned by root. Refusing. [x2]
Jul 29 00:10:33 vacuum.cs.umd.edu systemd[1]: Daemon never wrote its PID file. Failing.
Jul 29 00:10:44 vacuum.cs.umd.edu systemd[1]: pmlogger.service: Supervising process 21337 which is not our child. We'll most likely not notice when it exits.
== whiffle.cs.umd.edu (3 distinct, 4 total) ==
Jul 29 00:10:14 whiffle.cs.umd.edu systemd[1]: New main PID 3316342 does not belong to service, and PID file is not owned by root. Refusing. [x2]
Jul 29 00:10:33 whiffle.cs.umd.edu systemd[1]: Daemon never wrote its PID file. Failing.
Jul 29 00:10:46 whiffle.cs.umd.edu systemd[1]: pmlogger.service: Supervising process 3323866 which is not our child. We'll most likely not notice when it exits.
1
0
Command: /usr/local/sbin/syslog-digest.py
Time : 0.4648s
Status : exited 0
Output :
Syslog digest — 2026-07-29 00:05 EDT
Processed 4,135 lines, filtered 3,546 (85%). 589 unknown (71 distinct) from 22 host(s).
== abuse (1 distinct, 346 total) ==
Jul 28 23:05:06 abuse rsyslogd[21745]: imjournal: open() failed for path: '/var/lib/rsyslog/imjournal.state.tmp': Input/output error [v8.2404.0 try https://www.rsyslog.com/e/2433 ] [x346]
== alec.cs.umd.edu (3 distinct, 59 total) ==
Jul 28 23:05:23 alec.cs.umd.edu setroubleshoot[4161944]: failed to retrieve rpm info for path '/run/netns/netns-9dfd0347-71eb-5698-085c-c769043aa5c3': [x12]
Jul 28 23:05:24 alec.cs.umd.edu sedispatch[1526]: AVC Message regarding setroubleshoot, ignoring message [x24]
Jul 28 23:05:24 alec.cs.umd.edu setroubleshoot[4161944]: SELinux is preventing /usr/bin/df from getattr access on the file /run/netns/netns-9dfd0347-71eb-5698-085c-c769043aa5c3. For complete SELinux messages run: sealert -l 23f93208-3063-4aac-b78a-bb0fcb40740c [x23]
== b0b02.cs.umd.edu (1 distinct, 1 total) ==
Jul 28 23:35:39 b0b02.cs.umd.edu rustdesk[466247]: cannot open display:
== bachata (1 distinct, 1 total) ==
Jul 28 23:50:17 bachata setroubleshoot[2084305]: SELinux is preventing /usr/sbin/smbd from name_bind access on the udp_socket port 766. For complete SELinux messages run: sealert -l 8f7247f1-69a5-4a62-a4f0-88a324bfd75c
== cmsc436-0101-redis (5 distinct, 5 total) ==
Jul 28 23:36:25 cmsc436-0101-redis sshd-session[454550]: error: maximum authentication attempts exceeded for root from 114.218.83.242 port 10246 ssh2 [preauth]
Jul 28 23:36:32 cmsc436-0101-redis sshd-session[454562]: error: maximum authentication attempts exceeded for root from 114.218.83.242 port 10318 ssh2 [preauth]
Jul 28 23:36:41 cmsc436-0101-redis sshd-session[454564]: error: maximum authentication attempts exceeded for root from 114.218.83.242 port 10388 ssh2 [preauth]
Jul 28 23:36:53 cmsc436-0101-redis sshd-session[454568]: error: maximum authentication attempts exceeded for admin from 114.218.83.242 port 10512 ssh2 [preauth]
Jul 28 23:37:01 cmsc436-0101-redis sshd-session[454570]: error: maximum authentication attempts exceeded for admin from 114.218.83.242 port 10577 ssh2 [preauth]
== contest (1 distinct, 34 total) ==
Jul 28 23:05:47 contest goferd[1007]: [ERROR][worker-0] gofer.messaging.adapter.connect:33 - connect: proton+amqps://satellite8.cs.umd.edu:5647, failed: Connection amqps://satellite8.cs.umd.edu:5647 disconnected: Condition('proton.pythonio', 'Connection refused to all addresses') [x34]
== csfw00a (1 distinct, 6 total) ==
Jul 28 23:29:15 csfw00a kernel: bnxt_en 0000:09:00.0 eth3: NIC Link is Down [x6]
== frabjous (2 distinct, 2 total) ==
Jul 28 23:13:11 frabjous krb5_child[1976729]: Client 'admin(a)UMD.EDU' not found in Kerberos database
Jul 28 23:13:13 frabjous sshd-session[1976724]: error: PAM: Authentication failure for admin from 35.233.89.9
== hackerman (7 distinct, 12 total) ==
Jul 28 23:19:01 hackerman gnome-software[2060381]: failed to commit changes to dconf: GDBus.Error:org.gtk.GDBus.UnmappedGError.Quark._g_2dfile_2derror_2dquark.Code2: Failed to create file “/adminhomes/sajith/.config/dconf/user.ZYZ0S3”: Permission denied
Jul 28 23:20:04 hackerman gnome-software[2060381]: can't reliably fixup error code 4 in domain g-io-error-quark: Not a directory [x4]
Jul 28 23:20:12 hackerman gnome-software[2060381]: Only 0 apps for recent list, hiding
Jul 28 23:20:27 hackerman gnome-software[2060381]: failed to commit changes to dconf: GDBus.Error:org.gtk.GDBus.UnmappedGError.Quark._g_2dfile_2derror_2dquark.Code2: Failed to create file “/adminhomes/sajith/.config/dconf/user.CO61S3”: Permission denied
Jul 28 23:20:28 hackerman packagekitd[1640349]: Failed to get cache filename for libreoffice [x2]
Jul 28 23:20:28 hackerman packagekitd[1640349]: Failed to get cache filename for kernel [x2]
Jul 28 23:20:38 hackerman packagekitd[1640349]: failed to parse public key for /etc/pki/rpm-gpg/RPM-GPG-KEY-PQC-redhat-release
== idm00 (1 distinct, 1 total) ==
Jul 28 23:51:09 idm00 named[1455]: client @0x7f330ca369a8 10.73.240.42#52945: update '73.10.in-addr.arpa/IN' denied
== idmp0 (1 distinct, 1 total) ==
Jul 28 23:36:04 idmp0 named[5198]: client @0x7f98e88b27f8 10.73.240.43#63380: update '73.10.in-addr.arpa/IN' denied
== itmon02 (1 distinct, 36 total) ==
Jul 28 23:07:51 itmon02 sshd[1834]: error: beginning MaxStartups throttling [x36]
== matrix (1 distinct, 1 total) ==
Jul 29 00:00:03 matrix (nin-node)[660830]: munin-node.service: Referenced but unset environment variable evaluates to an empty string: DAEMON_ARGS
== neo-gizmonic (1 distinct, 1 total) ==
Jul 29 00:00:08 neo-gizmonic (nin-node)[4023022]: munin-node.service: Referenced but unset environment variable evaluates to an empty string: DAEMON_ARGS
== neoavion (1 distinct, 1 total) ==
Jul 29 00:00:26 neoavion (nin-node)[2226714]: munin-node.service: Referenced but unset environment variable evaluates to an empty string: DAEMON_ARGS
== newhonors2 (2 distinct, 25 total) ==
Jul 28 23:13:03 newhonors2 dhcpcd[425018]: dhcpcd is not running [x24]
Jul 29 00:00:16 newhonors2 (nin-node)[426598]: munin-node.service: Referenced but unset environment variable evaluates to an empty string: DAEMON_ARGS
== openrepo (1 distinct, 1 total) ==
Jul 29 00:03:27 openrepo (nin-node)[356555]: munin-node.service: Referenced but unset environment variable evaluates to an empty string: DAEMON_ARGS
== outbound00.cs.umd.edu (1 distinct, 6 total) ==
Jul 28 23:09:09 outbound00.cs.umd.edu python3[609537]: ldapdb [x6]
== outbound01.cs.umd.edu (1 distinct, 6 total) ==
Jul 28 23:13:06 outbound01.cs.umd.edu python3[2834088]: ldapdb [x6]
== sentry-docker00.cs.umd.edu (34 distinct, 34 total) ==
Jul 28 23:06:00 sentry-docker00.cs.umd.edu systemd-udevd[1470425]: Could not generate persistent MAC address for veth6250bc2: No such file or directory
Jul 28 23:06:00 sentry-docker00.cs.umd.edu systemd-udevd[1470426]: Could not generate persistent MAC address for vethac7920a: No such file or directory
Jul 28 23:06:00 sentry-docker00.cs.umd.edu systemd-udevd[1470429]: Could not generate persistent MAC address for veth1b965f8: No such file or directory
Jul 28 23:06:00 sentry-docker00.cs.umd.edu systemd-udevd[1470430]: Could not generate persistent MAC address for veth9706b5f: No such file or directory
Jul 28 23:06:00 sentry-docker00.cs.umd.edu systemd-udevd[1470453]: Could not generate persistent MAC address for vethda28a5d: No such file or directory
Jul 28 23:06:00 sentry-docker00.cs.umd.edu systemd-udevd[1470454]: Could not generate persistent MAC address for veth743501d: No such file or directory
Jul 28 23:06:00 sentry-docker00.cs.umd.edu systemd-udevd[1470457]: Could not generate persistent MAC address for vethc8b1d83: No such file or directory
Jul 28 23:06:00 sentry-docker00.cs.umd.edu systemd-udevd[1470460]: Could not generate persistent MAC address for veth0d44b3f: No such file or directory
Jul 28 23:12:49 sentry-docker00.cs.umd.edu systemd-udevd[1474044]: Could not generate persistent MAC address for veth9871a8c: No such file or directory
Jul 28 23:12:49 sentry-docker00.cs.umd.edu systemd-udevd[1474045]: Could not generate persistent MAC address for veth3f5049c: No such file or directory
Jul 28 23:26:08 sentry-docker00.cs.umd.edu systemd-udevd[1479834]: link_config: could not get ethtool features for vethc8b1d83
Jul 28 23:26:08 sentry-docker00.cs.umd.edu systemd-udevd[1479834]: Could not set offload features of vethc8b1d83: No such device
Jul 28 23:26:08 sentry-docker00.cs.umd.edu systemd-udevd[1479894]: Could not generate persistent MAC address for vethbc6047e: No such file or directory
Jul 28 23:26:08 sentry-docker00.cs.umd.edu systemd-udevd[1479895]: Could not generate persistent MAC address for veth27a4278: No such file or directory
Jul 28 23:26:08 sentry-docker00.cs.umd.edu systemd-udevd[1479898]: Could not generate persistent MAC address for veth18b4c60: No such file or directory
Jul 28 23:26:08 sentry-docker00.cs.umd.edu systemd-udevd[1479899]: Could not generate persistent MAC address for vethd84f33e: No such file or directory
Jul 28 23:26:08 sentry-docker00.cs.umd.edu systemd-udevd[1479922]: Could not generate persistent MAC address for veth3a0a934: No such file or directory
Jul 28 23:26:08 sentry-docker00.cs.umd.edu systemd-udevd[1479923]: Could not generate persistent MAC address for veth3741a9d: No such file or directory
Jul 28 23:26:08 sentry-docker00.cs.umd.edu systemd-udevd[1479948]: Could not generate persistent MAC address for vethb4c737a: No such file or directory
Jul 28 23:26:08 sentry-docker00.cs.umd.edu systemd-udevd[1479949]: Could not generate persistent MAC address for veth47f3e0b: No such file or directory
Jul 28 23:32:58 sentry-docker00.cs.umd.edu systemd-udevd[1483514]: Could not generate persistent MAC address for veth16da7bf: No such file or directory
Jul 28 23:32:58 sentry-docker00.cs.umd.edu systemd-udevd[1483515]: Could not generate persistent MAC address for veth2d756c0: No such file or directory
Jul 28 23:46:16 sentry-docker00.cs.umd.edu systemd-udevd[1489320]: link_config: could not get ethtool features for veth18b4c60
Jul 28 23:46:16 sentry-docker00.cs.umd.edu systemd-udevd[1489320]: Could not set offload features of veth18b4c60: No such device
Jul 28 23:46:16 sentry-docker00.cs.umd.edu systemd-udevd[1489344]: Could not generate persistent MAC address for veth6c9739b: No such file or directory
Jul 28 23:46:16 sentry-docker00.cs.umd.edu systemd-udevd[1489345]: Could not generate persistent MAC address for veth75a510e: No such file or directory
Jul 28 23:46:16 sentry-docker00.cs.umd.edu systemd-udevd[1489348]: Could not generate persistent MAC address for vethc43c009: No such file or directory
Jul 28 23:46:16 sentry-docker00.cs.umd.edu systemd-udevd[1489349]: Could not generate persistent MAC address for veth9d58064: No such file or directory
Jul 28 23:46:16 sentry-docker00.cs.umd.edu systemd-udevd[1489372]: Could not generate persistent MAC address for vetha8bbaa2: No such file or directory
Jul 28 23:46:16 sentry-docker00.cs.umd.edu systemd-udevd[1489373]: Could not generate persistent MAC address for veth88bc62d: No such file or directory
... 4 more distinct messages not shown
== strawberry (2 distinct, 8 total) ==
Jul 28 23:09:44 strawberry udisksd[1067]: Error performing housekeeping for drive /org/freedesktop/UDisks2/drives/ST2000DM001_1CH164_W1E8J5KJ: Error updating SMART data: Error sending ATA command CHECK POWER MODE: Unexpected sense data returned:#0120000: 00 00 00 00 00 00 00 00 00 00 00 00 00 00 00 00 ................#0120010: 00 00 00 00 00 00 00 00 00 00 00 00 00 00 00 00 ................#012 (g-io-error-quark, 0) [x6]
Jul 28 23:34:42 strawberry smartd[5314]: Device: /dev/sda [SAT], failed to read SMART Attribute Data [x2]
== wraith (2 distinct, 2 total) ==
Jul 29 00:00:06 wraith kernel: kauditd_printk_skb: 4 callbacks suppressed
Jul 29 00:00:06 wraith (nin-node)[753110]: munin-node.service: Referenced but unset environment variable evaluates to an empty string: DAEMON_ARGS
1
0
Command: /usr/local/sbin/syslog-digest.py
Time : 0.4844s
Status : exited 0
Output :
Syslog digest — 2026-07-28 23:05 EDT
Processed 3,994 lines, filtered 3,390 (84%). 604 unknown (79 distinct) from 22 host(s).
== abuse (1 distinct, 347 total) ==
Jul 28 22:05:06 abuse rsyslogd[21745]: imjournal: open() failed for path: '/var/lib/rsyslog/imjournal.state.tmp': Input/output error [v8.2404.0 try https://www.rsyslog.com/e/2433 ] [x347]
== alec.cs.umd.edu (3 distinct, 60 total) ==
Jul 28 22:05:06 alec.cs.umd.edu setroubleshoot[4147103]: failed to retrieve rpm info for path '/run/netns/netns-9dfd0347-71eb-5698-085c-c769043aa5c3': [x12]
Jul 28 22:05:07 alec.cs.umd.edu sedispatch[1526]: AVC Message regarding setroubleshoot, ignoring message [x24]
Jul 28 22:05:07 alec.cs.umd.edu setroubleshoot[4147103]: SELinux is preventing /usr/bin/df from getattr access on the file /run/netns/netns-9dfd0347-71eb-5698-085c-c769043aa5c3. For complete SELinux messages run: sealert -l 23f93208-3063-4aac-b78a-bb0fcb40740c [x24]
== b0b02.cs.umd.edu (1 distinct, 1 total) ==
Jul 28 22:35:35 b0b02.cs.umd.edu rustdesk[451232]: cannot open display:
== bale (1 distinct, 1 total) ==
Jul 28 22:05:38 bale setroubleshoot[2273079]: SELinux is preventing /usr/bin/tar from using the fowner capability. For complete SELinux messages run: sealert -l 8f58859c-1c63-4aee-afff-7c8e1dd95f45
== biggulp.cs.umd.edu (6 distinct, 7 total) ==
Jul 28 22:12:25 biggulp.cs.umd.edu sshd-session[1181044]: pam_access(sshd:auth): access denied for user `admin' from `34.140.63.202'
Jul 28 22:12:25 biggulp.cs.umd.edu krb5_child[1181046]: Client 'admin(a)UMD.EDU' not found in Kerberos database [x2]
Jul 28 22:12:25 biggulp.cs.umd.edu sshd-session[1181042]: error: PAM: System error for admin from 34.140.63.202
Jul 28 22:13:08 biggulp.cs.umd.edu sshd-session[1181186]: pam_access(sshd:auth): access denied for user `admin' from `35.205.246.21'
Jul 28 22:13:08 biggulp.cs.umd.edu sshd-session[1181183]: error: PAM: System error for admin from 35.205.246.21
Jul 28 22:14:25 biggulp.cs.umd.edu sshd-session[1181255]: error: Protocol major versions differ: 2 vs. 1
== cmsc436-0101-redis (2 distinct, 2 total) ==
Jul 28 22:40:57 cmsc436-0101-redis krb5_child[452715]: Client 'admin(a)UMD.EDU' not found in Kerberos database
Jul 28 22:40:59 cmsc436-0101-redis sshd-session[452711]: error: PAM: Authentication failure for admin from 34.156.28.139
== contest (1 distinct, 34 total) ==
Jul 28 22:05:05 contest goferd[1007]: [ERROR][worker-0] gofer.messaging.adapter.connect:33 - connect: proton+amqps://satellite8.cs.umd.edu:5647, failed: Connection amqps://satellite8.cs.umd.edu:5647 disconnected: Condition('proton.pythonio', 'Connection refused to all addresses') [x34]
== csfw00a (1 distinct, 6 total) ==
Jul 28 22:29:03 csfw00a kernel: bnxt_en 0000:09:00.0 eth3: NIC Link is Down [x6]
== hackerman (6 distinct, 11 total) ==
Jul 28 22:20:04 hackerman gnome-software[2060381]: can't reliably fixup error code 4 in domain g-io-error-quark: Not a directory [x4]
Jul 28 22:20:12 hackerman gnome-software[2060381]: Only 0 apps for recent list, hiding
Jul 28 22:20:28 hackerman gnome-software[2060381]: failed to commit changes to dconf: GDBus.Error:org.gtk.GDBus.UnmappedGError.Quark._g_2dfile_2derror_2dquark.Code2: Failed to create file “/adminhomes/sajith/.config/dconf/user.2P43S3”: Permission denied
Jul 28 22:20:28 hackerman packagekitd[1627590]: Failed to get cache filename for libreoffice [x2]
Jul 28 22:20:28 hackerman packagekitd[1627590]: Failed to get cache filename for kernel [x2]
Jul 28 22:20:38 hackerman packagekitd[1627590]: failed to parse public key for /etc/pki/rpm-gpg/RPM-GPG-KEY-PQC-redhat-release
== idm00 (1 distinct, 1 total) ==
Jul 28 22:51:09 idm00 named[1455]: client @0x7f330c44b1c8 10.73.240.42#64125: update '73.10.in-addr.arpa/IN' denied
== idmp0 (1 distinct, 1 total) ==
Jul 28 22:36:04 idmp0 named[5198]: client @0x7f98fc000cc8 10.73.240.43#55128: update '73.10.in-addr.arpa/IN' denied
== inbound01.cs.umd.edu (1 distinct, 1 total) ==
Jul 28 22:31:42 inbound01.cs.umd.edu krb5_child[2838929]: Client 'admin(a)UMD.EDU' not found in Kerberos database
== itmon02 (1 distinct, 38 total) ==
Jul 28 22:07:59 itmon02 sshd[1834]: error: beginning MaxStartups throttling [x38]
== jaws.cs.umd.edu (4 distinct, 5 total) ==
Jul 28 22:35:51 jaws.cs.umd.edu systemd-coredump[2720523]: Process 2720507 (podman) of user 981 dumped core.#012#012Stack trace of thread 2720507:#012#0 0x0000555665add46e internal/runtime/syscall/linux.Syscall6 (podman + 0x48b46e)#012#1 0x0000555665bbd0a6 syscall.Syscall (podman + 0x56b0a6)#012#2 0x0000555665bbdc50 syscall.Syscall.abi0 (podman + 0x56bc50)#012#3 0x0000555665d27c2e github.com/containers/podman/vendor/golang.org/x/sys/unix.OpenTree (podman + 0x6d5c2e)#012#4 0x0000555666380f4b github.com/containers/podman/vendor/github.com/cyphar/filepath-securejoin/p… (podman + 0xd2ef4b)#012#5 0x0000555666380e54 github.com/containers/podman/vendor/github.com/cyphar/filepath-securejoin/p… (podman + 0xd2ee54)#012#6 0x0000555665b70dcc sync.(*Once).doSlow (podman + 0x51edcc)#012#7 0x0000555665b70cf9 sync.(*Once).Do (podman + 0x51ecf9)#012#8 0x0000555666380d
c5 github.com/containers/podman/vendor/github.com/cyphar/filepath-securejoin/p… (podman + 0xd2edc5)#012#9 0x00005556663823e2 github.com/containers/podman/vendor/github.com/cyphar/filepath-securejoin/p… (podman + 0xd303e2)#012#10 0x00005556663827f3 github.com/containers/podman/vendor/github.com/cyphar/filepath-securejoin/p… (podman + 0xd307f3)#012#11 0x000055566638191c github.com/containers/podman/vendor/github.com/cyphar/filepath-securejoin/p… (podman + 0xd2f91c)#012#12 0x0000555666381358 github.com/containers/podman/vendor/github.com/cyphar/filepath-securejoin/p… (podman + 0xd2f358)#012#13 0x0000555665b70dcc sync.(*Once).doSlow (podman + 0x51edcc)#012#14 0x0000555665b70cf9 sync.(*Once).D
o (podman + 0x51ecf9)#012#15 0x00005556663812c5 github.com/containers/podman/vendor/github.com/cyphar/filepath-securejoin/p… (podman + 0xd2f2c5)#012#16 0x000055566638279a github.com/containers/podman/vendor/github.com/cyphar/filepath-securejoin/p… (podman + 0xd3079a)#012#17 0x000055566638934e github.com/containers/podman/vendor/github.com/opencontainers/selinux/go-se… (podman + 0xd3734e)#012#18 0x0000555666389838 github.com/containers/podman/vendor/github.com/opencontainers/selinux/go-se… (podman + 0xd37838)#012#19 0x00005556663885df github.com/containers/podman/vendor/github.com/opencontainers/selinux/go-se… (podman + 0xd365df)#012#20 0x0000555666388873 github.com/containers/podman/vendor/github.com/opencontainers/selinux/go-se… (podman + 0xd36873)#012#21 0x000
0555666580f4b github.com/containers/podman/vendor/go.podman.io/common/pkg/config.defaultC… (podman + 0xf2ef4b)#012#22 0x0000555666584912 github.com/containers/podman/vendor/go.podman.io/common/pkg/config.newLocked (podman + 0xf32912)#012#23 0x0000555666584605 github.com/containers/podman/vendor/go.podman.io/common/pkg/config.New (podman + 0xf32605)#012#24 0x0000555666cf7fd3 github.com/containers/podman/cmd/podman/registry.newPodmanConfig (podman + 0x16a5fd3)#012#25 0x0000555665b70dcc sync.(*Once).doSlow (podman + 0x51edcc)#012#26 0x0000555666d18c50 github.com/containers/podman/cmd/podman/common.init (podman + 0x16c6c50)#012#27 0x0000555665b36a57 runtime.doInit1 (podman + 0x4e4a57)#012#28 0x0000555665b26f90 runtime.main (podman + 0x4d4f90)#012#29 0x0000555665b66ee1 runtime.goexit.abi0 (podman + 0x514ee1)#012ELF object binary architecture: AMD x86-64
Jul 28 22:35:52 jaws.cs.umd.edu systemd-coredump[2720540]: Process 2720532 (podman) of user 981 dumped core.#012#012Stack trace of thread 2720532:#012#0 0x0000562b1eb7f46e internal/runtime/syscall/linux.Syscall6 (podman + 0x48b46e)#012#1 0x0000562b1ec5f0a6 syscall.Syscall (podman + 0x56b0a6)#012#2 0x0000562b1ec5fc50 syscall.Syscall.abi0 (podman + 0x56bc50)#012#3 0x0000562b1edc9c2e github.com/containers/podman/vendor/golang.org/x/sys/unix.OpenTree (podman + 0x6d5c2e)#012#4 0x0000562b1f422f4b github.com/containers/podman/vendor/github.com/cyphar/filepath-securejoin/p… (podman + 0xd2ef4b)#012#5 0x0000562b1f422e54 github.com/containers/podman/vendor/github.com/cyphar/filepath-securejoin/p… (podman + 0xd2ee54)#012#6 0x0000562b1ec12dcc sync.(*Once).doSlow (podman + 0x51edcc)#012#7 0x0000562b1ec12cf9 sync.(*Once).Do (podman + 0x51ecf9)#012#8 0x0000562b1f422d
c5 github.com/containers/podman/vendor/github.com/cyphar/filepath-securejoin/p… (podman + 0xd2edc5)#012#9 0x0000562b1f4243e2 github.com/containers/podman/vendor/github.com/cyphar/filepath-securejoin/p… (podman + 0xd303e2)#012#10 0x0000562b1f4247f3 github.com/containers/podman/vendor/github.com/cyphar/filepath-securejoin/p… (podman + 0xd307f3)#012#11 0x0000562b1f42391c github.com/containers/podman/vendor/github.com/cyphar/filepath-securejoin/p… (podman + 0xd2f91c)#012#12 0x0000562b1f423358 github.com/containers/podman/vendor/github.com/cyphar/filepath-securejoin/p… (podman + 0xd2f358)#012#13 0x0000562b1ec12dcc sync.(*Once).doSlow (podman + 0x51edcc)#012#14 0x0000562b1ec12cf9 sync.(*Once).D
o (podman + 0x51ecf9)#012#15 0x0000562b1f4232c5 github.com/containers/podman/vendor/github.com/cyphar/filepath-securejoin/p… (podman + 0xd2f2c5)#012#16 0x0000562b1f42479a github.com/containers/podman/vendor/github.com/cyphar/filepath-securejoin/p… (podman + 0xd3079a)#012#17 0x0000562b1f42b34e github.com/containers/podman/vendor/github.com/opencontainers/selinux/go-se… (podman + 0xd3734e)#012#18 0x0000562b1f42b838 github.com/containers/podman/vendor/github.com/opencontainers/selinux/go-se… (podman + 0xd37838)#012#19 0x0000562b1f42a5df github.com/containers/podman/vendor/github.com/opencontainers/selinux/go-se… (podman + 0xd365df)#012#20 0x0000562b1f42a873 github.com/containers/podman/vendor/github.com/opencontainers/selinux/go-se… (podman + 0xd36873)#012#21 0x000
0562b1f622f4b github.com/containers/podman/vendor/go.podman.io/common/pkg/config.defaultC… (podman + 0xf2ef4b)#012#22 0x0000562b1f626912 github.com/containers/podman/vendor/go.podman.io/common/pkg/config.newLocked (podman + 0xf32912)#012#23 0x0000562b1f626605 github.com/containers/podman/vendor/go.podman.io/common/pkg/config.New (podman + 0xf32605)#012#24 0x0000562b1fd99fd3 github.com/containers/podman/cmd/podman/registry.newPodmanConfig (podman + 0x16a5fd3)#012#25 0x0000562b1ec12dcc sync.(*Once).doSlow (podman + 0x51edcc)#012#26 0x0000562b1fdbac50 github.com/containers/podman/cmd/podman/common.init (podman + 0x16c6c50)#012#27 0x0000562b1ebd8a57 runtime.doInit1 (podman + 0x4e4a57)#012#28 0x0000562b1ebc8f90 runtime.main (podman + 0x4d4f90)#012#29 0x0000562b1ec08ee1 runtime.goexit.abi0 (podman + 0x514ee1)#012ELF object binary architecture: AMD x86-64
Jul 28 22:35:53 jaws.cs.umd.edu setroubleshoot[2720522]: SELinux is preventing /usr/bin/podman from using the nnp_transition access on a process. For complete SELinux messages run: sealert -l 3c7643bc-dd69-4695-b48c-7d780b62b6cf [x2]
Jul 28 22:35:53 jaws.cs.umd.edu systemd-coredump[2720565]: Process 2720556 (podman) of user 981 dumped core.#012#012Stack trace of thread 2720556:#012#0 0x000055aefe74546e internal/runtime/syscall/linux.Syscall6 (podman + 0x48b46e)#012#1 0x000055aefe8250a6 syscall.Syscall (podman + 0x56b0a6)#012#2 0x000055aefe825c50 syscall.Syscall.abi0 (podman + 0x56bc50)#012#3 0x000055aefe98fc2e github.com/containers/podman/vendor/golang.org/x/sys/unix.OpenTree (podman + 0x6d5c2e)#012#4 0x000055aefefe8f4b github.com/containers/podman/vendor/github.com/cyphar/filepath-securejoin/p… (podman + 0xd2ef4b)#012#5 0x000055aefefe8e54 github.com/containers/podman/vendor/github.com/cyphar/filepath-securejoin/p… (podman + 0xd2ee54)#012#6 0x000055aefe7d8dcc sync.(*Once).doSlow (podman + 0x51edcc)#012#7 0x000055aefe7d8cf9 sync.(*Once).Do (podman + 0x51ecf9)#012#8 0x000055aefefe8d
c5 github.com/containers/podman/vendor/github.com/cyphar/filepath-securejoin/p… (podman + 0xd2edc5)#012#9 0x000055aefefea3e2 github.com/containers/podman/vendor/github.com/cyphar/filepath-securejoin/p… (podman + 0xd303e2)#012#10 0x000055aefefea7f3 github.com/containers/podman/vendor/github.com/cyphar/filepath-securejoin/p… (podman + 0xd307f3)#012#11 0x000055aefefe991c github.com/containers/podman/vendor/github.com/cyphar/filepath-securejoin/p… (podman + 0xd2f91c)#012#12 0x000055aefefe9358 github.com/containers/podman/vendor/github.com/cyphar/filepath-securejoin/p… (podman + 0xd2f358)#012#13 0x000055aefe7d8dcc sync.(*Once).doSlow (podman + 0x51edcc)#012#14 0x000055aefe7d8cf9 sync.(*Once).D
o (podman + 0x51ecf9)#012#15 0x000055aefefe92c5 github.com/containers/podman/vendor/github.com/cyphar/filepath-securejoin/p… (podman + 0xd2f2c5)#012#16 0x000055aefefea79a github.com/containers/podman/vendor/github.com/cyphar/filepath-securejoin/p… (podman + 0xd3079a)#012#17 0x000055aefeff134e github.com/containers/podman/vendor/github.com/opencontainers/selinux/go-se… (podman + 0xd3734e)#012#18 0x000055aefeff1838 github.com/containers/podman/vendor/github.com/opencontainers/selinux/go-se… (podman + 0xd37838)#012#19 0x000055aefeff05df github.com/containers/podman/vendor/github.com/opencontainers/selinux/go-se… (podman + 0xd365df)#012#20 0x000055aefeff0873 github.com/containers/podman/vendor/github.com/opencontainers/selinux/go-se… (podman + 0xd36873)#012#21 0x000
055aeff1e8f4b github.com/containers/podman/vendor/go.podman.io/common/pkg/config.defaultC… (podman + 0xf2ef4b)#012#22 0x000055aeff1ec912 github.com/containers/podman/vendor/go.podman.io/common/pkg/config.newLocked (podman + 0xf32912)#012#23 0x000055aeff1ec605 github.com/containers/podman/vendor/go.podman.io/common/pkg/config.New (podman + 0xf32605)#012#24 0x000055aeff95ffd3 github.com/containers/podman/cmd/podman/registry.newPodmanConfig (podman + 0x16a5fd3)#012#25 0x000055aefe7d8dcc sync.(*Once).doSlow (podman + 0x51edcc)#012#26 0x000055aeff980c50 github.com/containers/podman/cmd/podman/common.init (podman + 0x16c6c50)#012#27 0x000055aefe79ea57 runtime.doInit1 (podman + 0x4e4a57)#012#28 0x000055aefe78ef90 runtime.main (podman + 0x4d4f90)#012#29 0x000055aefe7ceee1 runtime.goexit.abi0 (podman + 0x514ee1)#012ELF object binary architecture: AMD x86-64
== netman.cs.umd.edu (1 distinct, 1 total) ==
Jul 28 22:48:33 netman.cs.umd.edu sshd[2273933]: error: PAM: Authentication failure for nobody from 106.201.230.195
== newhonors2 (1 distinct, 24 total) ==
Jul 28 22:13:03 newhonors2 dhcpcd[423175]: dhcpcd is not running [x24]
== outbound00.cs.umd.edu (1 distinct, 6 total) ==
Jul 28 22:09:09 outbound00.cs.umd.edu python3[595527]: ldapdb [x6]
== outbound01.cs.umd.edu (1 distinct, 6 total) ==
Jul 28 22:13:06 outbound01.cs.umd.edu python3[2820258]: ldapdb [x6]
== sentry-docker00.cs.umd.edu (38 distinct, 38 total) ==
Jul 28 22:05:34 sentry-docker00.cs.umd.edu systemd-udevd[1442080]: link_config: could not get ethtool features for veth88227ad
Jul 28 22:05:34 sentry-docker00.cs.umd.edu systemd-udevd[1442080]: Could not set offload features of veth88227ad: No such device
Jul 28 22:05:35 sentry-docker00.cs.umd.edu systemd-udevd[1442105]: Could not generate persistent MAC address for veth2fb4a43: No such file or directory
Jul 28 22:05:35 sentry-docker00.cs.umd.edu systemd-udevd[1442106]: Could not generate persistent MAC address for veth03e088b: No such file or directory
Jul 28 22:05:35 sentry-docker00.cs.umd.edu systemd-udevd[1442109]: Could not generate persistent MAC address for veth0c9531a: No such file or directory
Jul 28 22:05:35 sentry-docker00.cs.umd.edu systemd-udevd[1442110]: Could not generate persistent MAC address for veth9c31382: No such file or directory
Jul 28 22:05:35 sentry-docker00.cs.umd.edu systemd-udevd[1442109]: Could not generate persistent MAC address for vetheadf33d: No such file or directory
Jul 28 22:05:35 sentry-docker00.cs.umd.edu systemd-udevd[1442118]: Could not generate persistent MAC address for veth1a2975e: No such file or directory
Jul 28 22:05:35 sentry-docker00.cs.umd.edu systemd-udevd[1442106]: Could not generate persistent MAC address for vetha2e7a42: No such file or directory
Jul 28 22:05:35 sentry-docker00.cs.umd.edu systemd-udevd[1442125]: Could not generate persistent MAC address for veth38cc36a: No such file or directory
Jul 28 22:12:24 sentry-docker00.cs.umd.edu systemd-udevd[1445702]: Could not generate persistent MAC address for veth7ee1a72: No such file or directory
Jul 28 22:12:24 sentry-docker00.cs.umd.edu systemd-udevd[1445703]: Could not generate persistent MAC address for veth174ec92: No such file or directory
Jul 28 22:25:43 sentry-docker00.cs.umd.edu systemd-udevd[1451484]: link_config: could not get ethtool features for veth2fb4a43
Jul 28 22:25:43 sentry-docker00.cs.umd.edu systemd-udevd[1451484]: Could not set offload features of veth2fb4a43: No such device
Jul 28 22:25:43 sentry-docker00.cs.umd.edu systemd-udevd[1451578]: Could not generate persistent MAC address for veth07769e0: No such file or directory
Jul 28 22:25:43 sentry-docker00.cs.umd.edu systemd-udevd[1451579]: Could not generate persistent MAC address for vethe7da219: No such file or directory
Jul 28 22:25:43 sentry-docker00.cs.umd.edu systemd-udevd[1451582]: Could not generate persistent MAC address for vethcf95fac: No such file or directory
Jul 28 22:25:43 sentry-docker00.cs.umd.edu systemd-udevd[1451600]: Could not generate persistent MAC address for veth649a7e9: No such file or directory
Jul 28 22:25:43 sentry-docker00.cs.umd.edu systemd-udevd[1451579]: Could not generate persistent MAC address for veth9d239bc: No such file or directory
Jul 28 22:25:43 sentry-docker00.cs.umd.edu systemd-udevd[1451584]: Could not generate persistent MAC address for vethe32ce88: No such file or directory
Jul 28 22:25:43 sentry-docker00.cs.umd.edu systemd-udevd[1451598]: Could not generate persistent MAC address for vethb9f9d68: No such file or directory
Jul 28 22:25:43 sentry-docker00.cs.umd.edu systemd-udevd[1451603]: Could not generate persistent MAC address for veth745548d: No such file or directory
Jul 28 22:32:33 sentry-docker00.cs.umd.edu systemd-udevd[1455119]: Could not generate persistent MAC address for vethbe14da8: No such file or directory
Jul 28 22:32:33 sentry-docker00.cs.umd.edu systemd-udevd[1455120]: Could not generate persistent MAC address for vethcd39e5b: No such file or directory
Jul 28 22:45:51 sentry-docker00.cs.umd.edu systemd-udevd[1460951]: link_config: could not get ethtool features for veth07769e0
Jul 28 22:45:51 sentry-docker00.cs.umd.edu systemd-udevd[1460951]: Could not set offload features of veth07769e0: No such device
Jul 28 22:45:52 sentry-docker00.cs.umd.edu systemd-udevd[1460975]: Could not generate persistent MAC address for vetheda59e7: No such file or directory
Jul 28 22:45:52 sentry-docker00.cs.umd.edu systemd-udevd[1460976]: Could not generate persistent MAC address for vethd517a48: No such file or directory
Jul 28 22:45:52 sentry-docker00.cs.umd.edu systemd-udevd[1460979]: Could not generate persistent MAC address for veth60e9f1c: No such file or directory
Jul 28 22:45:52 sentry-docker00.cs.umd.edu systemd-udevd[1460980]: Could not generate persistent MAC address for veth803e660: No such file or directory
... 8 more distinct messages not shown
== strawberry (2 distinct, 8 total) ==
Jul 28 22:09:44 strawberry udisksd[1067]: Error performing housekeeping for drive /org/freedesktop/UDisks2/drives/ST2000DM001_1CH164_W1E8J5KJ: Error updating SMART data: Error sending ATA command CHECK POWER MODE: Unexpected sense data returned:#0120000: 00 00 00 00 00 00 00 00 00 00 00 00 00 00 00 00 ................#0120010: 00 00 00 00 00 00 00 00 00 00 00 00 00 00 00 00 ................#012 (g-io-error-quark, 0) [x6]
Jul 28 22:34:42 strawberry smartd[5314]: Device: /dev/sda [SAT], failed to read SMART Attribute Data [x2]
== talkhosts9 (1 distinct, 2 total) ==
Jul 28 23:04:10 talkhosts9 setroubleshoot[4133202]: SELinux is preventing /usr/bin/lsof from getattr access on the unix_stream_socket unix_stream_socket. For complete SELinux messages run: sealert -l a6df89b3-c497-469c-8232-c4fde0508abf [x2]
== vacuum.cs.umd.edu (4 distinct, 4 total) ==
Jul 28 22:11:59 vacuum.cs.umd.edu abrt-hook-ccpp[15445]: Process 11033 (driver) of user 33 killed by SIGABRT - dumping core
Jul 28 22:11:59 vacuum.cs.umd.edu abrt-server[15447]: Package 'amanda-backup_server' isn't signed with proper key
Jul 28 22:11:59 vacuum.cs.umd.edu abrt-server[15447]: 'post-create' on '/var/spool/abrt/ccpp-2026-07-28-22:11:59-11033' exited with 1
Jul 28 22:11:59 vacuum.cs.umd.edu abrt-server[15447]: Deleting problem directory '/var/spool/abrt/ccpp-2026-07-28-22:11:59-11033'
1
0
Command: /usr/local/sbin/syslog-digest.py
Time : 0.4836s
Status : exited 0
Output :
Syslog digest — 2026-07-28 22:05 EDT
Processed 4,179 lines, filtered 3,536 (84%). 643 unknown (104 distinct) from 23 host(s).
== abuse (1 distinct, 346 total) ==
Jul 28 21:05:06 abuse rsyslogd[21745]: imjournal: open() failed for path: '/var/lib/rsyslog/imjournal.state.tmp': Input/output error [v8.2404.0 try https://www.rsyslog.com/e/2433 ] [x346]
== alec.cs.umd.edu (3 distinct, 60 total) ==
Jul 28 21:05:27 alec.cs.umd.edu setroubleshoot[4132466]: failed to retrieve rpm info for path '/run/netns/netns-9dfd0347-71eb-5698-085c-c769043aa5c3': [x12]
Jul 28 21:05:27 alec.cs.umd.edu sedispatch[1526]: AVC Message regarding setroubleshoot, ignoring message [x24]
Jul 28 21:05:27 alec.cs.umd.edu setroubleshoot[4132466]: SELinux is preventing /usr/bin/df from getattr access on the file /run/netns/netns-9dfd0347-71eb-5698-085c-c769043aa5c3. For complete SELinux messages run: sealert -l 23f93208-3063-4aac-b78a-bb0fcb40740c [x24]
== b0b02.cs.umd.edu (1 distinct, 1 total) ==
Jul 28 21:35:31 b0b02.cs.umd.edu rustdesk[435970]: cannot open display:
== bachata (1 distinct, 2 total) ==
Jul 28 21:49:43 bachata setroubleshoot[2079639]: SELinux is preventing /usr/sbin/smbd from name_bind access on the udp_socket port 766. For complete SELinux messages run: sealert -l 8f7247f1-69a5-4a62-a4f0-88a324bfd75c [x2]
== contest (9 distinct, 43 total) ==
Jul 28 21:06:10 contest goferd[1007]: [ERROR][worker-0] gofer.messaging.adapter.connect:33 - connect: proton+amqps://satellite8.cs.umd.edu:5647, failed: Connection amqps://satellite8.cs.umd.edu:5647 disconnected: Condition('proton.pythonio', 'Connection refused to all addresses') [x33]
Jul 28 21:48:14 contest setroubleshoot[250389]: SELinux is preventing /usr/libexec/platform-python3.6 from create access on the directory libdnf.HujYl5. For complete SELinux messages run: sealert -l cb6b25c6-4765-4cf2-88a0-9b3b508e94e9
Jul 28 21:48:14 contest setroubleshoot[250389]: SELinux is preventing /usr/bin/gpgconf from add_name access on the directory repodata. For complete SELinux messages run: sealert -l 41cf7b1b-0f34-4609-98f2-b66e7825fef7 [x2]
Jul 28 21:48:14 contest setroubleshoot[250389]: SELinux is preventing /usr/libexec/platform-python3.6 from create access on the file mirrorlist. For complete SELinux messages run: sealert -l fc20ff92-ea83-4f38-a24b-ddfd737a3141
Jul 28 21:48:14 contest setroubleshoot[250389]: SELinux is preventing /usr/libexec/platform-python3.6 from setattr access on the file repomd.xml. For complete SELinux messages run: sealert -l ac675631-fa35-4e93-adc9-b692b18e53e5
Jul 28 21:48:14 contest setroubleshoot[250389]: SELinux is preventing /usr/libexec/platform-python3.6 from read access on the directory libdnf.HujYl5. For complete SELinux messages run: sealert -l 45d103b6-0810-4890-a705-990118577ce8
Jul 28 21:48:14 contest setroubleshoot[250389]: SELinux is preventing /usr/libexec/platform-python3.6 from remove_name access on the directory repomd.xml. For complete SELinux messages run: sealert -l 7e499113-2fd7-4f67-bec6-3521efbe3637 [x2]
Jul 28 21:48:14 contest setroubleshoot[250389]: SELinux is preventing /usr/libexec/platform-python3.6 from rmdir access on the directory repodata. For complete SELinux messages run: sealert -l 3928930b-a1ed-448d-950b-0665ac2adef8
Jul 28 21:48:15 contest setroubleshoot[250389]: SELinux is preventing /usr/libexec/platform-python3.6 from create access on the directory libdnf.xiuszc. For complete SELinux messages run: sealert -l cb6b25c6-4765-4cf2-88a0-9b3b508e94e9
== csfw00a (1 distinct, 14 total) ==
Jul 28 21:06:28 csfw00a kernel: bnxt_en 0000:09:00.0 eth3: NIC Link is Down [x14]
== hackerman (7 distinct, 12 total) ==
Jul 28 21:19:01 hackerman gnome-software[2060381]: failed to commit changes to dconf: GDBus.Error:org.gtk.GDBus.UnmappedGError.Quark._g_2dfile_2derror_2dquark.Code2: Failed to create file “/adminhomes/sajith/.config/dconf/user.5FK0S3”: Permission denied
Jul 28 21:20:04 hackerman gnome-software[2060381]: can't reliably fixup error code 4 in domain g-io-error-quark: Not a directory [x4]
Jul 28 21:20:12 hackerman gnome-software[2060381]: Only 0 apps for recent list, hiding
Jul 28 21:20:29 hackerman gnome-software[2060381]: failed to commit changes to dconf: GDBus.Error:org.gtk.GDBus.UnmappedGError.Quark._g_2dfile_2derror_2dquark.Code2: Failed to create file “/adminhomes/sajith/.config/dconf/user.S6C7S3”: Permission denied
Jul 28 21:20:29 hackerman packagekitd[1614625]: Failed to get cache filename for libreoffice [x2]
Jul 28 21:20:29 hackerman packagekitd[1614625]: Failed to get cache filename for kernel [x2]
Jul 28 21:20:38 hackerman packagekitd[1614625]: failed to parse public key for /etc/pki/rpm-gpg/RPM-GPG-KEY-PQC-redhat-release
== idm00 (1 distinct, 1 total) ==
Jul 28 21:51:09 idm00 named[1455]: client @0x7f3314afcec8 10.73.240.42#57162: update '73.10.in-addr.arpa/IN' denied
== idmp0 (1 distinct, 1 total) ==
Jul 28 21:36:03 idmp0 named[5198]: client @0x7f992c025008 10.73.240.43#52626: update '73.10.in-addr.arpa/IN' denied
== itmon02 (1 distinct, 39 total) ==
Jul 28 21:07:59 itmon02 sshd[1834]: error: beginning MaxStartups throttling [x39]
== netman.cs.umd.edu (1 distinct, 2 total) ==
Jul 28 21:46:44 netman.cs.umd.edu krb5_child[2257301]: Client 'admin(a)UMD.EDU' not found in Kerberos database [x2]
== newhonors.cs.umd.edu (2 distinct, 2 total) ==
Jul 28 21:25:43 newhonors.cs.umd.edu sshd[17161]: error: maximum authentication attempts exceeded for root from 221.144.183.98 port 59562 ssh2 [preauth]
Jul 28 21:25:43 newhonors.cs.umd.edu sshd[17161]: PAM service(sshd) ignoring max retries; 6 > 3
== newhonors2 (1 distinct, 24 total) ==
Jul 28 21:13:03 newhonors2 dhcpcd[421347]: dhcpcd is not running [x24]
== outbound00.cs.umd.edu (1 distinct, 6 total) ==
Jul 28 21:09:08 outbound00.cs.umd.edu python3[581635]: ldapdb [x6]
== outbound01.cs.umd.edu (1 distinct, 6 total) ==
Jul 28 21:13:06 outbound01.cs.umd.edu python3[2806164]: ldapdb [x6]
== sentry-docker00.cs.umd.edu (38 distinct, 38 total) ==
Jul 28 21:05:09 sentry-docker00.cs.umd.edu systemd-udevd[1413437]: link_config: could not get ethtool features for veth5beeba9
Jul 28 21:05:09 sentry-docker00.cs.umd.edu systemd-udevd[1413437]: Could not set offload features of veth5beeba9: No such device
Jul 28 21:05:09 sentry-docker00.cs.umd.edu systemd-udevd[1413440]: link_config: could not get ethtool features for veth80677f2
Jul 28 21:05:09 sentry-docker00.cs.umd.edu systemd-udevd[1413440]: Could not set offload features of veth80677f2: No such device
Jul 28 21:05:10 sentry-docker00.cs.umd.edu systemd-udevd[1413489]: Could not generate persistent MAC address for vethb2dfcd3: No such file or directory
Jul 28 21:05:10 sentry-docker00.cs.umd.edu systemd-udevd[1413490]: Could not generate persistent MAC address for veth7037ed2: No such file or directory
Jul 28 21:05:10 sentry-docker00.cs.umd.edu systemd-udevd[1413493]: Could not generate persistent MAC address for veth0496e44: No such file or directory
Jul 28 21:05:10 sentry-docker00.cs.umd.edu systemd-udevd[1413494]: Could not generate persistent MAC address for veth12366f5: No such file or directory
Jul 28 21:05:10 sentry-docker00.cs.umd.edu systemd-udevd[1413517]: Could not generate persistent MAC address for vethaa77fa1: No such file or directory
Jul 28 21:05:10 sentry-docker00.cs.umd.edu systemd-udevd[1413518]: Could not generate persistent MAC address for vetha8a4133: No such file or directory
Jul 28 21:05:10 sentry-docker00.cs.umd.edu systemd-udevd[1413522]: Could not generate persistent MAC address for veth8f6be99: No such file or directory
Jul 28 21:05:10 sentry-docker00.cs.umd.edu systemd-udevd[1413523]: Could not generate persistent MAC address for vethf7e4f2a: No such file or directory
Jul 28 21:12:00 sentry-docker00.cs.umd.edu systemd-udevd[1417156]: Could not generate persistent MAC address for vethc6b8e37: No such file or directory
Jul 28 21:12:00 sentry-docker00.cs.umd.edu systemd-udevd[1417157]: Could not generate persistent MAC address for veth73f044c: No such file or directory
Jul 28 21:25:18 sentry-docker00.cs.umd.edu systemd-udevd[1423155]: link_config: could not get ethtool features for veth0496e44
Jul 28 21:25:18 sentry-docker00.cs.umd.edu systemd-udevd[1423155]: Could not set offload features of veth0496e44: No such device
Jul 28 21:25:19 sentry-docker00.cs.umd.edu systemd-udevd[1423198]: Could not generate persistent MAC address for vethdfd36ae: No such file or directory
Jul 28 21:25:19 sentry-docker00.cs.umd.edu systemd-udevd[1423199]: Could not generate persistent MAC address for veth5ea8a8b: No such file or directory
Jul 28 21:25:19 sentry-docker00.cs.umd.edu systemd-udevd[1423208]: Could not generate persistent MAC address for veth7a42bc6: No such file or directory
Jul 28 21:25:19 sentry-docker00.cs.umd.edu systemd-udevd[1423209]: Could not generate persistent MAC address for veth94dbec6: No such file or directory
Jul 28 21:25:19 sentry-docker00.cs.umd.edu systemd-udevd[1423226]: Could not generate persistent MAC address for veth73997b1: No such file or directory
Jul 28 21:25:19 sentry-docker00.cs.umd.edu systemd-udevd[1423227]: Could not generate persistent MAC address for veth1f119c2: No such file or directory
Jul 28 21:25:19 sentry-docker00.cs.umd.edu systemd-udevd[1423252]: Could not generate persistent MAC address for vethda34668: No such file or directory
Jul 28 21:25:19 sentry-docker00.cs.umd.edu systemd-udevd[1423253]: Could not generate persistent MAC address for veth658a1cb: No such file or directory
Jul 28 21:32:08 sentry-docker00.cs.umd.edu systemd-udevd[1426799]: Could not generate persistent MAC address for vethab5d93f: No such file or directory
Jul 28 21:32:08 sentry-docker00.cs.umd.edu systemd-udevd[1426800]: Could not generate persistent MAC address for vethba77543: No such file or directory
Jul 28 21:45:26 sentry-docker00.cs.umd.edu systemd-udevd[1432602]: link_config: could not get ethtool features for vethdfd36ae
Jul 28 21:45:26 sentry-docker00.cs.umd.edu systemd-udevd[1432602]: Could not set offload features of vethdfd36ae: No such device
Jul 28 21:45:27 sentry-docker00.cs.umd.edu systemd-udevd[1432626]: Could not generate persistent MAC address for veth184fa46: No such file or directory
Jul 28 21:45:27 sentry-docker00.cs.umd.edu systemd-udevd[1432627]: Could not generate persistent MAC address for veth6eb5ab9: No such file or directory
... 8 more distinct messages not shown
== strawberry (2 distinct, 8 total) ==
Jul 28 21:09:44 strawberry udisksd[1067]: Error performing housekeeping for drive /org/freedesktop/UDisks2/drives/ST2000DM001_1CH164_W1E8J5KJ: Error updating SMART data: Error sending ATA command CHECK POWER MODE: Unexpected sense data returned:#0120000: 00 00 00 00 00 00 00 00 00 00 00 00 00 00 00 00 ................#0120010: 00 00 00 00 00 00 00 00 00 00 00 00 00 00 00 00 ................#012 (g-io-error-quark, 0) [x6]
Jul 28 21:34:42 strawberry smartd[5314]: Device: /dev/sda [SAT], failed to read SMART Attribute Data [x2]
== submit26-b9-2 (9 distinct, 9 total) ==
Jul 28 21:12:50 submit26-b9-2 setroubleshoot[378270]: SELinux is preventing /usr/bin/python3.9 from create access on the directory /(null). For complete SELinux messages run: sealert -l d506243c-d61e-48f3-b42a-4592c913deb0
Jul 28 21:12:50 submit26-b9-2 setroubleshoot[378270]: SELinux is preventing /usr/bin/python3.9 from add_name access on the directory /(null). For complete SELinux messages run: sealert -l 3b4752ac-1b9a-4af9-a05b-32e4c2eb13ab
Jul 28 21:12:50 submit26-b9-2 setroubleshoot[378270]: SELinux is preventing /usr/bin/python3.9 from create access on the file /(null). For complete SELinux messages run: sealert -l 29e5adbd-4381-4467-b40d-a2219101e096
Jul 28 21:12:50 submit26-b9-2 setroubleshoot[378270]: SELinux is preventing /usr/bin/python3.9 from open access on the file /tmp/libdnf.KyM92y/repodata/repomd.xml. For complete SELinux messages run: sealert -l 1b38f2ec-01ce-4343-8059-ba7494ecc5c4
Jul 28 21:12:50 submit26-b9-2 setroubleshoot[378270]: SELinux is preventing /usr/bin/python3.9 from setattr access on the file repomd.xml. For complete SELinux messages run: sealert -l e5f9af40-1f63-4924-b012-27ab2a7b2266
Jul 28 21:12:50 submit26-b9-2 setroubleshoot[378270]: SELinux is preventing /usr/bin/python3.9 from read access on the directory libdnf.KyM92y. For complete SELinux messages run: sealert -l 5c54db87-54a3-4a7c-97b4-b5c48d6c3543
Jul 28 21:12:50 submit26-b9-2 setroubleshoot[378270]: SELinux is preventing /usr/bin/python3.9 from remove_name access on the directory repomd.xml. For complete SELinux messages run: sealert -l 63cd60e1-1e61-4276-afea-dd8526ffe8b2
Jul 28 21:12:50 submit26-b9-2 setroubleshoot[378270]: SELinux is preventing /usr/bin/python3.9 from unlink access on the file repomd.xml. For complete SELinux messages run: sealert -l 81c7e9ec-e023-4c6d-b1ad-c02a242e655e
Jul 28 21:12:50 submit26-b9-2 setroubleshoot[378270]: SELinux is preventing /usr/bin/python3.9 from rmdir access on the directory repodata. For complete SELinux messages run: sealert -l 6ae9a597-e123-4d74-8eec-a8ebe0f5e4d0
== submit26-b9-3 (9 distinct, 9 total) ==
Jul 28 21:20:36 submit26-b9-3 setroubleshoot[666503]: SELinux is preventing /usr/bin/python3.9 from create access on the directory /(null). For complete SELinux messages run: sealert -l 5b912a44-22fd-4560-b201-2a4e289b73f5
Jul 28 21:20:36 submit26-b9-3 setroubleshoot[666503]: SELinux is preventing /usr/bin/python3.9 from add_name access on the directory /(null). For complete SELinux messages run: sealert -l 7f1df1e4-725e-4953-98eb-1079f908f543
Jul 28 21:20:36 submit26-b9-3 setroubleshoot[666503]: SELinux is preventing /usr/bin/python3.9 from create access on the file /(null). For complete SELinux messages run: sealert -l 40b8852a-f77b-44b4-affe-5f11fa33de43
Jul 28 21:20:36 submit26-b9-3 setroubleshoot[666503]: SELinux is preventing /usr/bin/python3.9 from open access on the file /tmp/libdnf.5Y7EQn/repodata/repomd.xml. For complete SELinux messages run: sealert -l 45a8019e-f6b5-4baa-92c1-862594b40d46
Jul 28 21:20:36 submit26-b9-3 setroubleshoot[666503]: SELinux is preventing /usr/bin/python3.9 from setattr access on the file repomd.xml. For complete SELinux messages run: sealert -l e9f0bfff-7784-4126-baa4-2bb06da56591
Jul 28 21:20:36 submit26-b9-3 setroubleshoot[666503]: SELinux is preventing /usr/bin/python3.9 from read access on the directory libdnf.5Y7EQn. For complete SELinux messages run: sealert -l 0b17cc3d-cdc6-4fe2-a11f-3892e7c41dc7
Jul 28 21:20:36 submit26-b9-3 setroubleshoot[666503]: SELinux is preventing /usr/bin/python3.9 from remove_name access on the directory repomd.xml. For complete SELinux messages run: sealert -l 10e38c64-b65f-4cdd-901e-4375652d9a42
Jul 28 21:20:36 submit26-b9-3 setroubleshoot[666503]: SELinux is preventing /usr/bin/python3.9 from unlink access on the file repomd.xml. For complete SELinux messages run: sealert -l 7fd9cf72-ef38-48e1-b6aa-b571b26a7b22
Jul 28 21:20:36 submit26-b9-3 setroubleshoot[666503]: SELinux is preventing /usr/bin/python3.9 from rmdir access on the directory repodata. For complete SELinux messages run: sealert -l b9b11116-89bd-4a3c-980c-1d422c5dcee4
== submit26-b9-4 (1 distinct, 3 total) ==
Jul 28 21:06:37 submit26-b9-4 systemd[1]: user(a)1001.service: Main process exited, code=killed, status=9/KILL [x3]
== submit26-clnb9 (10 distinct, 14 total) ==
Jul 28 21:31:54 submit26-clnb9 setroubleshoot[1459460]: SELinux is preventing /usr/bin/python3.9 from create access on the directory /(null). For complete SELinux messages run: sealert -l 6783ed2b-5ae4-42b5-975a-4bf50eec4658 [x2]
Jul 28 21:31:54 submit26-clnb9 setroubleshoot[1459460]: SELinux is preventing /usr/bin/python3.9 from add_name access on the directory /(null). For complete SELinux messages run: sealert -l 9e7fa955-cc30-4804-ac8c-e1779e85946c [x2]
Jul 28 21:31:54 submit26-clnb9 setroubleshoot[1459460]: SELinux is preventing /usr/bin/python3.9 from create access on the file /(null). For complete SELinux messages run: sealert -l 69bfa6e3-089c-40ff-9563-fd30787d0774
Jul 28 21:31:54 submit26-clnb9 setroubleshoot[1459460]: SELinux is preventing /usr/bin/python3.9 from open access on the file /tmp/libdnf.pFZKWB/repodata/repomd.xml. For complete SELinux messages run: sealert -l 001acdb5-31ef-4e52-b10b-90f467a89ddc
Jul 28 21:31:54 submit26-clnb9 setroubleshoot[1459460]: SELinux is preventing /usr/bin/python3.9 from setattr access on the file repomd.xml. For complete SELinux messages run: sealert -l edacddcf-16ed-4dc3-8d82-7c597d5dee23
Jul 28 21:31:54 submit26-clnb9 setroubleshoot[1459460]: SELinux is preventing /usr/bin/python3.9 from read access on the directory libdnf.pFZKWB. For complete SELinux messages run: sealert -l 62b3782e-4730-4488-8178-94dafe9b552c
Jul 28 21:31:54 submit26-clnb9 setroubleshoot[1459460]: SELinux is preventing /usr/bin/python3.9 from remove_name access on the directory repomd.xml. For complete SELinux messages run: sealert -l 81cb3698-78f8-440a-8e3c-e5d1041e6b78 [x2]
Jul 28 21:31:54 submit26-clnb9 setroubleshoot[1459460]: SELinux is preventing /usr/bin/python3.9 from unlink access on the file repomd.xml. For complete SELinux messages run: sealert -l 792b472a-115c-4799-9805-fc7436f916b9
Jul 28 21:31:54 submit26-clnb9 setroubleshoot[1459460]: SELinux is preventing /usr/bin/python3.9 from rmdir access on the directory repodata. For complete SELinux messages run: sealert -l 15c83a86-837b-41e2-b662-b39cd4e361cb [x2]
Jul 28 21:31:54 submit26-clnb9 setroubleshoot[1459460]: SELinux is preventing /usr/bin/python3.9 from read access on the directory libdnf.1z1tFW. For complete SELinux messages run: sealert -l 62b3782e-4730-4488-8178-94dafe9b552c
== whiffle.cs.umd.edu (2 distinct, 2 total) ==
Jul 28 21:21:53 whiffle.cs.umd.edu kernel: libceph: wrong peer, want 10.73.235.200:6801/-1847179276, got 10.73.235.200:6801/-1947649014
Jul 28 21:21:53 whiffle.cs.umd.edu kernel: libceph: osd0 10.73.235.200:6801 wrong peer at address
== wraith (1 distinct, 1 total) ==
Jul 28 21:38:23 wraith kernel: workqueue: output_poll_execute hogged CPU for >10000us 32771 times, consider switching to WQ_UNBOUND
1
0