Command: /usr/local/sbin/syslog-digest.py
Time : 0.4654s
Status : exited 0
Output :
Syslog digest — 2026-07-22 05:05 EDT
Processed 3,587 lines, filtered 3,029 (84%). 558 unknown (67 distinct) from 18 host(s).
== abadi-computer (2 distinct, 2 total) ==
Jul 22 04:15:01 abadi-computer nologin[2868494]: Attempted login by UNKNOWN (UID: 65534) on UNKNOWN
Jul 22 04:15:01 abadi-computer pipewire[2868492]: mod.jackdbus-detect: Failed to receive jackdbus reply: org.freedesktop.DBus.Error.ServiceUnknown: The name org.jackaudio.service was not provided by any .service files
== abuse (1 distinct, 347 total) ==
Jul 22 04:05:06 abuse rsyslogd[21745]: imjournal: open() failed for path: '/var/lib/rsyslog/imjournal.state.tmp': Input/output error [v8.2404.0 try https://www.rsyslog.com/e/2433 ] [x347]
== b0b02.cs.umd.edu (4 distinct, 4 total) ==
Jul 22 04:10:38 b0b02.cs.umd.edu rustdesk[1555930]: cannot open display:
Jul 22 04:39:34 b0b02.cs.umd.edu setroubleshoot[1563274]: SELinux is preventing /usr/bin/python3.9 from getattr access on the file /etc/authselect/nsswitch.conf. For complete SELinux messages run: sealert -l 9a1e2952-3fde-4937-a8ab-f7f59791a458
Jul 22 04:39:37 b0b02.cs.umd.edu setroubleshoot[1563274]: SELinux is preventing /usr/bin/python3.9 from read access on the file /etc/authselect/nsswitch.conf. For complete SELinux messages run: sealert -l 97d74423-e027-4cd6-8810-ad80944900b5
Jul 22 04:39:40 b0b02.cs.umd.edu setroubleshoot[1563274]: SELinux is preventing /usr/bin/python3.9 from open access on the file /etc/authselect/nsswitch.conf. For complete SELinux messages run: sealert -l 4f253f6a-62d6-46dd-8eaf-0b4d29df41c6
== contest (1 distinct, 34 total) ==
Jul 22 04:05:05 contest goferd[994]: [ERROR][worker-0] gofer.messaging.adapter.connect:33 - connect: proton+amqps://satellite8.cs.umd.edu:5647, failed: Connection amqps://satellite8.cs.umd.edu:5647 disconnected: Condition('proton.pythonio', 'Connection refused to all addresses') [x34]
== csfw00a (1 distinct, 26 total) ==
Jul 22 04:55:30 csfw00a kernel: bnxt_en 0000:09:00.0 eth3: NIC Link is Down [x26]
== dojo (1 distinct, 1 total) ==
Jul 22 04:15:11 dojo nologin[9597]: Attempted login by UNKNOWN (UID: 65534) on UNKNOWN
== forge00 (1 distinct, 1 total) ==
Jul 22 04:09:02 forge00 (httpd)[4100670]: httpd.service: Referenced but unset environment variable evaluates to an empty string: OPTIONS
== idm00 (1 distinct, 1 total) ==
Jul 22 04:51:03 idm00 named[1455]: client @0x7f3314aed008 10.73.240.42#59272: update '73.10.in-addr.arpa/IN' denied
== idmp0 (1 distinct, 1 total) ==
Jul 22 04:34:57 idmp0 named[5198]: client @0x7f990c04e038 10.73.240.43#56840: update '73.10.in-addr.arpa/IN' denied
== itmon02 (1 distinct, 48 total) ==
Jul 22 04:08:10 itmon02 sshd[1904]: error: beginning MaxStartups throttling [x48]
== jaws.cs.umd.edu (4 distinct, 4 total) ==
Jul 22 04:32:13 jaws.cs.umd.edu systemd-coredump[522052]: Process 522034 (podman) of user 981 dumped core.#012#012Stack trace of thread 522034:#012#0 0x000055e21893a46e internal/runtime/syscall/linux.Syscall6 (podman + 0x48b46e)#012#1 0x000055e218a1a0a6 syscall.Syscall (podman + 0x56b0a6)#012#2 0x000055e218a1ac50 syscall.Syscall.abi0 (podman + 0x56bc50)#012#3 0x000055e218b84c2e github.com/containers/podman/vendor/golang.org/x/sys/unix.OpenTree (podman + 0x6d5c2e)#012#4 0x000055e2191ddf4b github.com/containers/podman/vendor/github.com/cyphar/filepath-securejoin/p… (podman + 0xd2ef4b)#012#5 0x000055e2191dde54 github.com/containers/podman/vendor/github.com/cyphar/filepath-securejoin/p… (podman + 0xd2ee54)#012#6 0x000055e2189cddcc sync.(*Once).doSlow (podman + 0x51edcc)#012#7 0x000055e2189cdcf9 sync.(*Once).Do (podman + 0x51ecf9)#012#8 0x000055e2191dddc5
github.com/containers/podman/vendor/github.com/cyphar/filepath-securejoin/p… (podman + 0xd2edc5)#012#9 0x000055e2191df3e2 github.com/containers/podman/vendor/github.com/cyphar/filepath-securejoin/p… (podman + 0xd303e2)#012#10 0x000055e2191df7f3 github.com/containers/podman/vendor/github.com/cyphar/filepath-securejoin/p… (podman + 0xd307f3)#012#11 0x000055e2191de91c github.com/containers/podman/vendor/github.com/cyphar/filepath-securejoin/p… (podman + 0xd2f91c)#012#12 0x000055e2191de358 github.com/containers/podman/vendor/github.com/cyphar/filepath-securejoin/p… (podman + 0xd2f358)#012#13 0x000055e2189cddcc sync.(*Once).doSlow (podman + 0x51edcc)#012#14 0x000055e2189cdcf9 sync.(*Once).Do (
podman + 0x51ecf9)#012#15 0x000055e2191de2c5 github.com/containers/podman/vendor/github.com/cyphar/filepath-securejoin/p… (podman + 0xd2f2c5)#012#16 0x000055e2191df79a github.com/containers/podman/vendor/github.com/cyphar/filepath-securejoin/p… (podman + 0xd3079a)#012#17 0x000055e2191e634e github.com/containers/podman/vendor/github.com/opencontainers/selinux/go-se… (podman + 0xd3734e)#012#18 0x000055e2191e6838 github.com/containers/podman/vendor/github.com/opencontainers/selinux/go-se… (podman + 0xd37838)#012#19 0x000055e2191e55df github.com/containers/podman/vendor/github.com/opencontainers/selinux/go-se… (podman + 0xd365df)#012#20 0x000055e2191e5873 github.com/containers/podman/vendor/github.com/opencontainers/selinux/go-se… (podman + 0xd36873)#012#21 0x000055
e2193ddf4b github.com/containers/podman/vendor/go.podman.io/common/pkg/config.defaultC… (podman + 0xf2ef4b)#012#22 0x000055e2193e1912 github.com/containers/podman/vendor/go.podman.io/common/pkg/config.newLocked (podman + 0xf32912)#012#23 0x000055e2193e1605 github.com/containers/podman/vendor/go.podman.io/common/pkg/config.New (podman + 0xf32605)#012#24 0x000055e219b54fd3 github.com/containers/podman/cmd/podman/registry.newPodmanConfig (podman + 0x16a5fd3)#012#25 0x000055e2189cddcc sync.(*Once).doSlow (podman + 0x51edcc)#012#26 0x000055e219b75c50 github.com/containers/podman/cmd/podman/common.init (podman + 0x16c6c50)#012#27 0x000055e218993a57 runtime.doInit1 (podman + 0x4e4a57)#012#28 0x000055e218983f90 runtime.main (podman + 0x4d4f90)#012#29 0x000055e2189c3ee1 runtime.goexit.abi0 (podman + 0x514ee1)#012ELF object binary architecture: AMD x86-64
Jul 22 04:32:14 jaws.cs.umd.edu systemd-coredump[522071]: Process 522061 (podman) of user 981 dumped core.#012#012Stack trace of thread 522061:#012#0 0x0000563fde65946e internal/runtime/syscall/linux.Syscall6 (podman + 0x48b46e)#012#1 0x0000563fde7390a6 syscall.Syscall (podman + 0x56b0a6)#012#2 0x0000563fde739c50 syscall.Syscall.abi0 (podman + 0x56bc50)#012#3 0x0000563fde8a3c2e github.com/containers/podman/vendor/golang.org/x/sys/unix.OpenTree (podman + 0x6d5c2e)#012#4 0x0000563fdeefcf4b github.com/containers/podman/vendor/github.com/cyphar/filepath-securejoin/p… (podman + 0xd2ef4b)#012#5 0x0000563fdeefce54 github.com/containers/podman/vendor/github.com/cyphar/filepath-securejoin/p… (podman + 0xd2ee54)#012#6 0x0000563fde6ecdcc sync.(*Once).doSlow (podman + 0x51edcc)#012#7 0x0000563fde6eccf9 sync.(*Once).Do (podman + 0x51ecf9)#012#8 0x0000563fdeefcdc5
github.com/containers/podman/vendor/github.com/cyphar/filepath-securejoin/p… (podman + 0xd2edc5)#012#9 0x0000563fdeefe3e2 github.com/containers/podman/vendor/github.com/cyphar/filepath-securejoin/p… (podman + 0xd303e2)#012#10 0x0000563fdeefe7f3 github.com/containers/podman/vendor/github.com/cyphar/filepath-securejoin/p… (podman + 0xd307f3)#012#11 0x0000563fdeefd91c github.com/containers/podman/vendor/github.com/cyphar/filepath-securejoin/p… (podman + 0xd2f91c)#012#12 0x0000563fdeefd358 github.com/containers/podman/vendor/github.com/cyphar/filepath-securejoin/p… (podman + 0xd2f358)#012#13 0x0000563fde6ecdcc sync.(*Once).doSlow (podman + 0x51edcc)#012#14 0x0000563fde6eccf9 sync.(*Once).Do (
podman + 0x51ecf9)#012#15 0x0000563fdeefd2c5 github.com/containers/podman/vendor/github.com/cyphar/filepath-securejoin/p… (podman + 0xd2f2c5)#012#16 0x0000563fdeefe79a github.com/containers/podman/vendor/github.com/cyphar/filepath-securejoin/p… (podman + 0xd3079a)#012#17 0x0000563fdef0534e github.com/containers/podman/vendor/github.com/opencontainers/selinux/go-se… (podman + 0xd3734e)#012#18 0x0000563fdef05838 github.com/containers/podman/vendor/github.com/opencontainers/selinux/go-se… (podman + 0xd37838)#012#19 0x0000563fdef045df github.com/containers/podman/vendor/github.com/opencontainers/selinux/go-se… (podman + 0xd365df)#012#20 0x0000563fdef04873 github.com/containers/podman/vendor/github.com/opencontainers/selinux/go-se… (podman + 0xd36873)#012#21 0x000056
3fdf0fcf4b github.com/containers/podman/vendor/go.podman.io/common/pkg/config.defaultC… (podman + 0xf2ef4b)#012#22 0x0000563fdf100912 github.com/containers/podman/vendor/go.podman.io/common/pkg/config.newLocked (podman + 0xf32912)#012#23 0x0000563fdf100605 github.com/containers/podman/vendor/go.podman.io/common/pkg/config.New (podman + 0xf32605)#012#24 0x0000563fdf873fd3 github.com/containers/podman/cmd/podman/registry.newPodmanConfig (podman + 0x16a5fd3)#012#25 0x0000563fde6ecdcc sync.(*Once).doSlow (podman + 0x51edcc)#012#26 0x0000563fdf894c50 github.com/containers/podman/cmd/podman/common.init (podman + 0x16c6c50)#012#27 0x0000563fde6b2a57 runtime.doInit1 (podman + 0x4e4a57)#012#28 0x0000563fde6a2f90 runtime.main (podman + 0x4d4f90)#012#29 0x0000563fde6e2ee1 runtime.goexit.abi0 (podman + 0x514ee1)#012ELF object binary architecture: AMD x86-64
Jul 22 04:32:15 jaws.cs.umd.edu systemd-coredump[522093]: Process 522076 (podman) of user 981 dumped core.#012#012Stack trace of thread 522076:#012#0 0x000055e81757a46e internal/runtime/syscall/linux.Syscall6 (podman + 0x48b46e)#012#1 0x000055e81765a0a6 syscall.Syscall (podman + 0x56b0a6)#012#2 0x000055e81765ac50 syscall.Syscall.abi0 (podman + 0x56bc50)#012#3 0x000055e8177c4c2e github.com/containers/podman/vendor/golang.org/x/sys/unix.OpenTree (podman + 0x6d5c2e)#012#4 0x000055e817e1df4b github.com/containers/podman/vendor/github.com/cyphar/filepath-securejoin/p… (podman + 0xd2ef4b)#012#5 0x000055e817e1de54 github.com/containers/podman/vendor/github.com/cyphar/filepath-securejoin/p… (podman + 0xd2ee54)#012#6 0x000055e81760ddcc sync.(*Once).doSlow (podman + 0x51edcc)#012#7 0x000055e81760dcf9 sync.(*Once).Do (podman + 0x51ecf9)#012#8 0x000055e817e1ddc5
github.com/containers/podman/vendor/github.com/cyphar/filepath-securejoin/p… (podman + 0xd2edc5)#012#9 0x000055e817e1f3e2 github.com/containers/podman/vendor/github.com/cyphar/filepath-securejoin/p… (podman + 0xd303e2)#012#10 0x000055e817e1f7f3 github.com/containers/podman/vendor/github.com/cyphar/filepath-securejoin/p… (podman + 0xd307f3)#012#11 0x000055e817e1e91c github.com/containers/podman/vendor/github.com/cyphar/filepath-securejoin/p… (podman + 0xd2f91c)#012#12 0x000055e817e1e358 github.com/containers/podman/vendor/github.com/cyphar/filepath-securejoin/p… (podman + 0xd2f358)#012#13 0x000055e81760ddcc sync.(*Once).doSlow (podman + 0x51edcc)#012#14 0x000055e81760dcf9 sync.(*Once).Do (
podman + 0x51ecf9)#012#15 0x000055e817e1e2c5 github.com/containers/podman/vendor/github.com/cyphar/filepath-securejoin/p… (podman + 0xd2f2c5)#012#16 0x000055e817e1f79a github.com/containers/podman/vendor/github.com/cyphar/filepath-securejoin/p… (podman + 0xd3079a)#012#17 0x000055e817e2634e github.com/containers/podman/vendor/github.com/opencontainers/selinux/go-se… (podman + 0xd3734e)#012#18 0x000055e817e26838 github.com/containers/podman/vendor/github.com/opencontainers/selinux/go-se… (podman + 0xd37838)#012#19 0x000055e817e255df github.com/containers/podman/vendor/github.com/opencontainers/selinux/go-se… (podman + 0xd365df)#012#20 0x000055e817e25873 github.com/containers/podman/vendor/github.com/opencontainers/selinux/go-se… (podman + 0xd36873)#012#21 0x000055
e81801df4b github.com/containers/podman/vendor/go.podman.io/common/pkg/config.defaultC… (podman + 0xf2ef4b)#012#22 0x000055e818021912 github.com/containers/podman/vendor/go.podman.io/common/pkg/config.newLocked (podman + 0xf32912)#012#23 0x000055e818021605 github.com/containers/podman/vendor/go.podman.io/common/pkg/config.New (podman + 0xf32605)#012#24 0x000055e818794fd3 github.com/containers/podman/cmd/podman/registry.newPodmanConfig (podman + 0x16a5fd3)#012#25 0x000055e81760ddcc sync.(*Once).doSlow (podman + 0x51edcc)#012#26 0x000055e8187b5c50 github.com/containers/podman/cmd/podman/common.init (podman + 0x16c6c50)#012#27 0x000055e8175d3a57 runtime.doInit1 (podman + 0x4e4a57)#012#28 0x000055e8175c3f90 runtime.main (podman + 0x4d4f90)#012#29 0x000055e817603ee1 runtime.goexit.abi0 (podman + 0x514ee1)#012ELF object binary architecture: AMD x86-64
Jul 22 04:32:17 jaws.cs.umd.edu setroubleshoot[522051]: SELinux is preventing /usr/bin/podman from using the nnp_transition access on a process. For complete SELinux messages run: sealert -l 3c7643bc-dd69-4695-b48c-7d780b62b6cf
== newhonors2 (1 distinct, 24 total) ==
Jul 22 04:13:03 newhonors2 dhcpcd[110250]: dhcpcd is not running [x24]
== outbound00.cs.umd.edu (3 distinct, 8 total) ==
Jul 22 04:06:49 outbound00.cs.umd.edu sshd-session[2514859]: error: maximum authentication attempts exceeded for root from 89.144.155.207 port 36459 ssh2 [preauth]
Jul 22 04:08:34 outbound00.cs.umd.edu krb5_child[2515118]: Preauthentication failed
Jul 22 04:09:09 outbound00.cs.umd.edu python3[2515361]: ldapdb [x6]
== outbound01.cs.umd.edu (1 distinct, 6 total) ==
Jul 22 04:13:06 outbound01.cs.umd.edu python3[542529]: ldapdb [x6]
== sentry-docker00.cs.umd.edu (38 distinct, 38 total) ==
Jul 22 04:16:05 sentry-docker00.cs.umd.edu systemd-udevd[971204]: Could not generate persistent MAC address for veth7e75935: No such file or directory
Jul 22 04:16:05 sentry-docker00.cs.umd.edu systemd-udevd[971205]: Could not generate persistent MAC address for vethc4f1f4d: No such file or directory
Jul 22 04:18:56 sentry-docker00.cs.umd.edu systemd-udevd[973193]: link_config: could not get ethtool features for veth592ed52
Jul 22 04:18:56 sentry-docker00.cs.umd.edu systemd-udevd[973193]: Could not set offload features of veth592ed52: No such device
Jul 22 04:18:57 sentry-docker00.cs.umd.edu systemd-udevd[973263]: Could not generate persistent MAC address for veth4e11082: No such file or directory
Jul 22 04:18:57 sentry-docker00.cs.umd.edu systemd-udevd[973264]: Could not generate persistent MAC address for vethe47d501: No such file or directory
Jul 22 04:18:57 sentry-docker00.cs.umd.edu systemd-udevd[973286]: Could not generate persistent MAC address for veth5e08749: No such file or directory
Jul 22 04:18:57 sentry-docker00.cs.umd.edu systemd-udevd[973287]: Could not generate persistent MAC address for vethf527e12: No such file or directory
Jul 22 04:18:57 sentry-docker00.cs.umd.edu systemd-udevd[973293]: Could not generate persistent MAC address for veth6cc15d5: No such file or directory
Jul 22 04:18:57 sentry-docker00.cs.umd.edu systemd-udevd[973294]: Could not generate persistent MAC address for vethcbee324: No such file or directory
Jul 22 04:18:57 sentry-docker00.cs.umd.edu systemd-udevd[973301]: Could not generate persistent MAC address for veth42fa8eb: No such file or directory
Jul 22 04:18:57 sentry-docker00.cs.umd.edu systemd-udevd[973317]: Could not generate persistent MAC address for vethadb5edc: No such file or directory
Jul 22 04:36:13 sentry-docker00.cs.umd.edu systemd-udevd[980613]: Could not generate persistent MAC address for veth4bdd846: No such file or directory
Jul 22 04:36:13 sentry-docker00.cs.umd.edu systemd-udevd[980614]: Could not generate persistent MAC address for vethf80834e: No such file or directory
Jul 22 04:39:05 sentry-docker00.cs.umd.edu systemd-udevd[982575]: link_config: could not get ethtool features for veth6cc15d5
Jul 22 04:39:05 sentry-docker00.cs.umd.edu systemd-udevd[982575]: Could not set offload features of veth6cc15d5: No such device
Jul 22 04:39:05 sentry-docker00.cs.umd.edu systemd-udevd[982626]: link_config: could not get ethtool features for vethadb5edc
Jul 22 04:39:05 sentry-docker00.cs.umd.edu systemd-udevd[982626]: Could not set offload features of vethadb5edc: No such device
Jul 22 04:39:05 sentry-docker00.cs.umd.edu systemd-udevd[982637]: Could not generate persistent MAC address for veth00b019e: No such file or directory
Jul 22 04:39:05 sentry-docker00.cs.umd.edu systemd-udevd[982638]: Could not generate persistent MAC address for vethba2a811: No such file or directory
Jul 22 04:39:05 sentry-docker00.cs.umd.edu systemd-udevd[982663]: Could not generate persistent MAC address for vethbf6e05e: No such file or directory
Jul 22 04:39:05 sentry-docker00.cs.umd.edu systemd-udevd[982664]: Could not generate persistent MAC address for veth5a28def: No such file or directory
Jul 22 04:39:05 sentry-docker00.cs.umd.edu systemd-udevd[982682]: Could not generate persistent MAC address for veth958f7e0: No such file or directory
Jul 22 04:39:05 sentry-docker00.cs.umd.edu systemd-udevd[982673]: Could not generate persistent MAC address for vethac0621e: No such file or directory
Jul 22 04:39:05 sentry-docker00.cs.umd.edu systemd-udevd[982691]: Could not generate persistent MAC address for vethec83a9b: No such file or directory
Jul 22 04:39:05 sentry-docker00.cs.umd.edu systemd-udevd[982692]: Could not generate persistent MAC address for vethd0dc8c4: No such file or directory
Jul 22 04:56:17 sentry-docker00.cs.umd.edu systemd-udevd[990073]: Could not generate persistent MAC address for vethf665014: No such file or directory
Jul 22 04:56:17 sentry-docker00.cs.umd.edu systemd-udevd[990074]: Could not generate persistent MAC address for vethb85e299: No such file or directory
Jul 22 04:59:13 sentry-docker00.cs.umd.edu systemd-udevd[992137]: link_config: could not get ethtool features for vethec83a9b
Jul 22 04:59:13 sentry-docker00.cs.umd.edu systemd-udevd[992137]: Could not set offload features of vethec83a9b: No such device
... 8 more distinct messages not shown
== smokeping-slave (1 distinct, 1 total) ==
Jul 22 04:15:02 smokeping-slave nologin[1101395]: Attempted login by UNKNOWN (UID: 65534) on UNKNOWN
== strawberry (4 distinct, 10 total) ==
Jul 22 04:09:44 strawberry udisksd[1067]: Error performing housekeeping for drive /org/freedesktop/UDisks2/drives/ST2000DM001_1CH164_W1E8J5KJ: Error updating SMART data: Error sending ATA command CHECK POWER MODE: Unexpected sense data returned:#0120000: 00 00 00 00 00 00 00 00 00 00 00 00 00 00 00 00 ................#0120010: 00 00 00 00 00 00 00 00 00 00 00 00 00 00 00 00 ................#012 (g-io-error-quark, 0) [x6]
Jul 22 04:15:04 strawberry nologin[2451775]: Attempted login by UNKNOWN (UID: 65534) on UNKNOWN
Jul 22 04:15:04 strawberry pipewire[2451774]: mod.jackdbus-detect: Failed to receive jackdbus reply: org.freedesktop.DBus.Error.ServiceUnknown: The name org.jackaudio.service was not provided by any .service files
Jul 22 04:34:42 strawberry smartd[5314]: Device: /dev/sda [SAT], failed to read SMART Attribute Data [x2]
== talkhosts9 (1 distinct, 2 total) ==
Jul 22 04:58:53 talkhosts9 setroubleshoot[2713739]: SELinux is preventing /usr/bin/lsof from getattr access on the unix_stream_socket unix_stream_socket. For complete SELinux messages run: sealert -l a6df89b3-c497-469c-8232-c4fde0508abf [x2]
1
0
Command: /usr/local/sbin/syslog-digest.py
Time : 0.4568s
Status : exited 0
Output :
Syslog digest — 2026-07-22 04:05 EDT
Processed 3,723 lines, filtered 3,157 (84%). 566 unknown (86 distinct) from 22 host(s).
== abuse (1 distinct, 346 total) ==
Jul 22 03:05:06 abuse rsyslogd[21745]: imjournal: open() failed for path: '/var/lib/rsyslog/imjournal.state.tmp': Input/output error [v8.2404.0 try https://www.rsyslog.com/e/2433 ] [x346]
== b0b02.cs.umd.edu (4 distinct, 5 total) ==
Jul 22 03:10:36 b0b02.cs.umd.edu rustdesk[1540850]: cannot open display:
Jul 22 03:39:30 b0b02.cs.umd.edu setroubleshoot[1547911]: SELinux is preventing /usr/bin/python3.9 from getattr access on the file /etc/authselect/nsswitch.conf. For complete SELinux messages run: sealert -l 9a1e2952-3fde-4937-a8ab-f7f59791a458 [x2]
Jul 22 03:39:32 b0b02.cs.umd.edu setroubleshoot[1547911]: SELinux is preventing /usr/bin/python3.9 from read access on the file /etc/authselect/nsswitch.conf. For complete SELinux messages run: sealert -l 97d74423-e027-4cd6-8810-ad80944900b5
Jul 22 03:39:35 b0b02.cs.umd.edu setroubleshoot[1547911]: SELinux is preventing /usr/bin/python3.9 from open access on the file /etc/authselect/nsswitch.conf. For complete SELinux messages run: sealert -l 4f253f6a-62d6-46dd-8eaf-0b4d29df41c6
== biggulp.cs.umd.edu (4 distinct, 4 total) ==
Jul 22 03:23:31 biggulp.cs.umd.edu sshd-session[3600290]: pam_access(sshd:auth): access denied for user `admin' from `34.156.189.82'
Jul 22 03:23:31 biggulp.cs.umd.edu krb5_child[3600292]: Client 'admin(a)UMD.EDU' not found in Kerberos database
Jul 22 03:23:31 biggulp.cs.umd.edu sshd-session[3600288]: error: PAM: System error for admin from 34.156.189.82
Jul 22 03:23:52 biggulp.cs.umd.edu sshd-session[3600326]: error: Protocol major versions differ: 2 vs. 1
== contest (1 distinct, 33 total) ==
Jul 22 03:06:10 contest goferd[994]: [ERROR][worker-0] gofer.messaging.adapter.connect:33 - connect: proton+amqps://satellite8.cs.umd.edu:5647, failed: Connection amqps://satellite8.cs.umd.edu:5647 disconnected: Condition('proton.pythonio', 'Connection refused to all addresses') [x33]
== csfw00a (1 distinct, 10 total) ==
Jul 22 03:16:51 csfw00a kernel: bnxt_en 0000:09:00.0 eth3: NIC Link is Down [x10]
== grafana (2 distinct, 2 total) ==
Jul 22 03:59:23 grafana systemd-resolved[787]: Using degraded feature set UDP instead of UDP+EDNS0 for DNS server 10.73.244.100.
Jul 22 03:59:39 grafana systemd-resolved[787]: Using degraded feature set TCP instead of UDP for DNS server 10.73.244.100.
== hackerman (1 distinct, 1 total) ==
Jul 22 03:19:01 hackerman gnome-software[2060381]: failed to commit changes to dconf: GDBus.Error:org.gtk.GDBus.UnmappedGError.Quark._g_2dfile_2derror_2dquark.Code2: Failed to create file “/adminhomes/sajith/.config/dconf/user.L5HCT3”: Permission denied
== idm00 (1 distinct, 1 total) ==
Jul 22 03:51:03 idm00 named[1455]: client @0x7f33157e2a78 10.73.240.42#50224: update '73.10.in-addr.arpa/IN' denied
== idmp0 (1 distinct, 1 total) ==
Jul 22 03:34:57 idmp0 named[5198]: client @0x7f98f4005288 10.73.240.43#49984: update '73.10.in-addr.arpa/IN' denied
== itmon02 (2 distinct, 47 total) ==
Jul 22 03:08:14 itmon02 sshd[1904]: error: beginning MaxStartups throttling [x46]
Jul 22 03:15:04 itmon02 (httpd)[2281818]: httpd.service: Referenced but unset environment variable evaluates to an empty string: OPTIONS
== kadath.cs.umd.edu (1 distinct, 1 total) ==
Jul 22 03:47:31 kadath.cs.umd.edu puppet-agent[2933563]: (Facter) invalid or malformed lldp data: MalformedDataError: no lldp interface data found
== krispykreme.cs.umd.edu (3 distinct, 3 total) ==
Jul 22 03:07:46 krispykreme.cs.umd.edu sshd-session[2083564]: pam_access(sshd:auth): access denied for user `admin' from `35.233.53.129'
Jul 22 03:07:47 krispykreme.cs.umd.edu krb5_child[2083566]: Client 'admin(a)UMD.EDU' not found in Kerberos database
Jul 22 03:07:47 krispykreme.cs.umd.edu sshd-session[2083562]: error: PAM: System error for admin from 35.233.53.129
== netbox (1 distinct, 1 total) ==
Jul 22 03:08:03 netbox (httpd)[3905883]: httpd.service: Referenced but unset environment variable evaluates to an empty string: OPTIONS
== netman.cs.umd.edu (3 distinct, 3 total) ==
Jul 22 03:55:14 netman.cs.umd.edu setroubleshoot[3109889]: SELinux is preventing /usr/bin/gpg from read access on the file gpg.conf. For complete SELinux messages run: sealert -l 019ad1da-a874-4814-8037-3b3e5f413ad2
Jul 22 03:55:14 netman.cs.umd.edu setroubleshoot[3109889]: SELinux is preventing /usr/bin/gpg from open access on the file /root/.gnupg/gpg.conf. For complete SELinux messages run: sealert -l cb54177e-d44c-46a1-b246-5c0bbb8343be
Jul 22 03:55:30 netman.cs.umd.edu setroubleshoot[3110568]: SELinux is preventing /usr/bin/gpg from getattr access on the file /root/.gnupg/gpg.conf. For complete SELinux messages run: sealert -l fbba2e30-b7ab-491c-9ec6-f553e9ef72af
== networkvm01.cs.umd.edu (10 distinct, 12 total) ==
Jul 22 03:06:49 networkvm01.cs.umd.edu setroubleshoot[938142]: SELinux is preventing /usr/bin/gpg from write access on the directory /(null). For complete SELinux messages run: sealert -l 8ead1354-ae8a-4a17-bb3f-146ebf6c892c
Jul 22 03:06:49 networkvm01.cs.umd.edu setroubleshoot[938142]: SELinux is preventing /usr/bin/gpg from add_name access on the directory /(null). For complete SELinux messages run: sealert -l f9b51e91-5dbc-455f-88c2-f0746a2f0f4c
Jul 22 03:06:50 networkvm01.cs.umd.edu setroubleshoot[938142]: SELinux is preventing /usr/bin/gpg from create access on the file /(null). For complete SELinux messages run: sealert -l af0a60e6-c449-4bdd-bfb8-c69b58472884 [x2]
Jul 22 03:06:50 networkvm01.cs.umd.edu setroubleshoot[938142]: SELinux is preventing /usr/bin/gpg from link access on the file /(null). For complete SELinux messages run: sealert -l 3df452f6-4d9e-4e38-946b-ea8e1edd356c [x2]
Jul 22 03:06:50 networkvm01.cs.umd.edu setroubleshoot[938142]: SELinux is preventing /usr/bin/gpg from remove_name access on the directory .#lk0x0000559c50457ed0.networkvm01.cs.umd.edu.938141x. For complete SELinux messages run: sealert -l fcac71c9-c7c0-45a9-9dc2-a8dcbeccfc75
Jul 22 03:06:50 networkvm01.cs.umd.edu setroubleshoot[938142]: SELinux is preventing /usr/bin/gpg from unlink access on the file .#lk0x0000559c50457ed0.networkvm01.cs.umd.edu.938141x. For complete SELinux messages run: sealert -l a672ebb7-fa69-419c-b1f0-fb386b8b48a6
Jul 22 03:06:50 networkvm01.cs.umd.edu setroubleshoot[938142]: SELinux is preventing /usr/bin/gpg from write access on the directory /(null). For complete SELinux messages run: sealert -l fec9104e-d27a-4fd4-9872-6b17088c2951
Jul 22 03:06:50 networkvm01.cs.umd.edu setroubleshoot[938142]: SELinux is preventing /usr/bin/gpg from add_name access on the directory /(null). For complete SELinux messages run: sealert -l 26718b2a-493d-457d-818c-244bd8d4ec9d
Jul 22 03:06:50 networkvm01.cs.umd.edu setroubleshoot[938142]: SELinux is preventing /usr/bin/gpg from remove_name access on the directory .#lk0x00005596b72b4ee0.networkvm01.cs.umd.edu.938159x. For complete SELinux messages run: sealert -l 80e6efe4-93f3-4219-8132-b2b52db1f517
Jul 22 03:06:50 networkvm01.cs.umd.edu setroubleshoot[938142]: SELinux is preventing /usr/bin/gpg from unlink access on the file .#lk0x00005596b72b4ee0.networkvm01.cs.umd.edu.938159x. For complete SELinux messages run: sealert -l a672ebb7-fa69-419c-b1f0-fb386b8b48a6
== newhonors2 (1 distinct, 24 total) ==
Jul 22 03:13:02 newhonors2 dhcpcd[107799]: dhcpcd is not running [x24]
== outbound00.cs.umd.edu (2 distinct, 8 total) ==
Jul 22 03:09:09 outbound00.cs.umd.edu python3[2500642]: ldapdb [x7]
Jul 22 03:24:26 outbound00.cs.umd.edu systemd[1]: Configuration file /usr/lib/systemd/system/authentication_milter.service is marked executable. Please remove executable permission bits. Proceeding anyway.
== outbound01.cs.umd.edu (1 distinct, 6 total) ==
Jul 22 03:13:06 outbound01.cs.umd.edu python3[528696]: ldapdb [x6]
== peach.cs.umd.edu (3 distinct, 3 total) ==
Jul 22 03:36:30 peach.cs.umd.edu systemd[1]: splunk.service: Stopping timed out. Terminating.
Jul 22 03:36:30 peach.cs.umd.edu systemd[1]: splunk.service: Control process exited, code=killed, status=15/TERM
Jul 22 03:36:36 peach.cs.umd.edu setroubleshoot[38748]: SELinux is preventing systemd from unlink access on the file splunkd.pid. For complete SELinux messages run: sealert -l ad9baf89-a69c-41a4-9dc1-608047e050d5
== sentry-docker00.cs.umd.edu (40 distinct, 40 total) ==
Jul 22 03:15:48 sentry-docker00.cs.umd.edu systemd-udevd[942878]: Could not generate persistent MAC address for veth8918f0d: No such file or directory
Jul 22 03:15:48 sentry-docker00.cs.umd.edu systemd-udevd[942879]: Could not generate persistent MAC address for vethf7f3591: No such file or directory
Jul 22 03:18:31 sentry-docker00.cs.umd.edu systemd-udevd[944847]: link_config: could not get ethtool features for veth41a40c8
Jul 22 03:18:31 sentry-docker00.cs.umd.edu systemd-udevd[944847]: Could not set offload features of veth41a40c8: No such device
Jul 22 03:18:32 sentry-docker00.cs.umd.edu systemd-udevd[944916]: Could not generate persistent MAC address for veth63901cd: No such file or directory
Jul 22 03:18:32 sentry-docker00.cs.umd.edu systemd-udevd[944917]: Could not generate persistent MAC address for vethb3abd2d: No such file or directory
Jul 22 03:18:32 sentry-docker00.cs.umd.edu systemd-udevd[944920]: Could not generate persistent MAC address for veth46f2a18: No such file or directory
Jul 22 03:18:32 sentry-docker00.cs.umd.edu systemd-udevd[944925]: Could not generate persistent MAC address for vethf7b5786: No such file or directory
Jul 22 03:18:32 sentry-docker00.cs.umd.edu systemd-udevd[944930]: Could not generate persistent MAC address for veth23fd9fa: No such file or directory
Jul 22 03:18:32 sentry-docker00.cs.umd.edu systemd-udevd[944939]: Could not generate persistent MAC address for veth82d4df9: No such file or directory
Jul 22 03:18:32 sentry-docker00.cs.umd.edu systemd-udevd[944946]: Could not generate persistent MAC address for veth77cba2a: No such file or directory
Jul 22 03:18:32 sentry-docker00.cs.umd.edu systemd-udevd[944947]: Could not generate persistent MAC address for veth7b75370: No such file or directory
Jul 22 03:35:52 sentry-docker00.cs.umd.edu systemd-udevd[952286]: link_config: could not get ethtool features for veth8918f0d
Jul 22 03:35:52 sentry-docker00.cs.umd.edu systemd-udevd[952286]: Could not set offload features of veth8918f0d: No such device
Jul 22 03:35:52 sentry-docker00.cs.umd.edu systemd-udevd[952306]: Could not generate persistent MAC address for veth59da410: No such file or directory
Jul 22 03:35:52 sentry-docker00.cs.umd.edu systemd-udevd[952307]: Could not generate persistent MAC address for veth32c8b69: No such file or directory
Jul 22 03:38:40 sentry-docker00.cs.umd.edu systemd-udevd[954287]: link_config: could not get ethtool features for veth46f2a18
Jul 22 03:38:40 sentry-docker00.cs.umd.edu systemd-udevd[954287]: Could not set offload features of veth46f2a18: No such device
Jul 22 03:38:40 sentry-docker00.cs.umd.edu systemd-udevd[954334]: Could not generate persistent MAC address for veth6b936fa: No such file or directory
Jul 22 03:38:40 sentry-docker00.cs.umd.edu systemd-udevd[954335]: Could not generate persistent MAC address for vethed16fb5: No such file or directory
Jul 22 03:38:40 sentry-docker00.cs.umd.edu systemd-udevd[954338]: Could not generate persistent MAC address for vethad79993: No such file or directory
Jul 22 03:38:40 sentry-docker00.cs.umd.edu systemd-udevd[954349]: Could not generate persistent MAC address for veth4e66f3c: No such file or directory
Jul 22 03:38:40 sentry-docker00.cs.umd.edu systemd-udevd[954342]: Could not generate persistent MAC address for vethdf8fdd1: No such file or directory
Jul 22 03:38:40 sentry-docker00.cs.umd.edu systemd-udevd[954340]: Could not generate persistent MAC address for vethe9539d7: No such file or directory
Jul 22 03:38:40 sentry-docker00.cs.umd.edu systemd-udevd[954340]: Could not generate persistent MAC address for vethfb52334: No such file or directory
Jul 22 03:38:40 sentry-docker00.cs.umd.edu systemd-udevd[954345]: Could not generate persistent MAC address for veth15e28e2: No such file or directory
Jul 22 03:56:00 sentry-docker00.cs.umd.edu systemd-udevd[961704]: link_config: could not get ethtool features for veth59da410
Jul 22 03:56:00 sentry-docker00.cs.umd.edu systemd-udevd[961704]: Could not set offload features of veth59da410: No such device
Jul 22 03:56:00 sentry-docker00.cs.umd.edu systemd-udevd[961720]: Could not generate persistent MAC address for vethbf3b331: No such file or directory
Jul 22 03:56:00 sentry-docker00.cs.umd.edu systemd-udevd[961721]: Could not generate persistent MAC address for vethf0157c7: No such file or directory
... 10 more distinct messages not shown
== strawberry (2 distinct, 8 total) ==
Jul 22 03:09:44 strawberry udisksd[1067]: Error performing housekeeping for drive /org/freedesktop/UDisks2/drives/ST2000DM001_1CH164_W1E8J5KJ: Error updating SMART data: Error sending ATA command CHECK POWER MODE: Unexpected sense data returned:#0120000: 00 00 00 00 00 00 00 00 00 00 00 00 00 00 00 00 ................#0120010: 00 00 00 00 00 00 00 00 00 00 00 00 00 00 00 00 ................#012 (g-io-error-quark, 0) [x6]
Jul 22 03:34:42 strawberry smartd[5314]: Device: /dev/sda [SAT], failed to read SMART Attribute Data [x2]
== submit26-b9-2 (1 distinct, 7 total) ==
Jul 22 03:09:38 submit26-b9-2 systemd[1]: user(a)1001.service: Main process exited, code=killed, status=9/KILL [x7]
1
0
Command: /usr/local/sbin/syslog-digest.py
Time : 0.5196s
Status : exited 0
Output :
Syslog digest — 2026-07-22 03:05 EDT
Processed 4,491 lines, filtered 3,707 (82%). 784 unknown (111 distinct) from 20 host(s).
== abuse (1 distinct, 346 total) ==
Jul 22 02:05:06 abuse rsyslogd[21745]: imjournal: open() failed for path: '/var/lib/rsyslog/imjournal.state.tmp': Input/output error [v8.2404.0 try https://www.rsyslog.com/e/2433 ] [x346]
== b0b02.cs.umd.edu (4 distinct, 5 total) ==
Jul 22 02:10:33 b0b02.cs.umd.edu rustdesk[1525783]: cannot open display:
Jul 22 02:39:25 b0b02.cs.umd.edu setroubleshoot[1532825]: SELinux is preventing /usr/bin/python3.9 from getattr access on the file /etc/authselect/nsswitch.conf. For complete SELinux messages run: sealert -l 9a1e2952-3fde-4937-a8ab-f7f59791a458 [x2]
Jul 22 02:39:28 b0b02.cs.umd.edu setroubleshoot[1532825]: SELinux is preventing /usr/bin/python3.9 from read access on the file /etc/authselect/nsswitch.conf. For complete SELinux messages run: sealert -l 97d74423-e027-4cd6-8810-ad80944900b5
Jul 22 02:39:31 b0b02.cs.umd.edu setroubleshoot[1532825]: SELinux is preventing /usr/bin/python3.9 from open access on the file /etc/authselect/nsswitch.conf. For complete SELinux messages run: sealert -l 4f253f6a-62d6-46dd-8eaf-0b4d29df41c6
== cheezit.cs.umd.edu (11 distinct, 13 total) ==
Jul 22 02:17:43 cheezit.cs.umd.edu setroubleshoot[536656]: failed to retrieve rpm info for path '/var/log/falconctl.log':
Jul 22 02:17:43 cheezit.cs.umd.edu setroubleshoot[536656]: SELinux is preventing /opt/CrowdStrike/falconctl18708 from append access on the file /var/log/falconctl.log. For complete SELinux messages run: sealert -l 63f66d53-fcfc-44da-a79e-c789b1ce2ce8
Jul 22 02:17:46 cheezit.cs.umd.edu setroubleshoot[536656]: SELinux is preventing /opt/CrowdStrike/falconctl18708 from write access on the file falconstore. For complete SELinux messages run: sealert -l 386506af-597f-4357-89de-bc382f369a6e
Jul 22 02:17:57 cheezit.cs.umd.edu setroubleshoot[537023]: failed to retrieve rpm info for path '/var/lib/sss/pipes/nss': [x2]
Jul 22 02:17:58 cheezit.cs.umd.edu setroubleshoot[537023]: SELinux is preventing /usr/bin/lsof from write access on the sock_file /var/lib/sss/pipes/nss. For complete SELinux messages run: sealert -l f570494d-54d2-4dac-97e2-28395659abf1 [x2]
Jul 22 02:17:58 cheezit.cs.umd.edu setroubleshoot[537023]: SELinux is preventing /usr/bin/lsof from write access on the sock_file socket. For complete SELinux messages run: sealert -l 9ff2383b-9e1d-44ff-b8ae-af91637450ae
Jul 22 02:18:38 cheezit.cs.umd.edu setroubleshoot[537459]: SELinux is preventing /usr/bin/python3.9 from read access on the file /etc/selinux/targeted/contexts/files/file_contexts.subs_dist. For complete SELinux messages run: sealert -l 679eb260-cf5d-4783-99f4-ce308edb3295
Jul 22 02:18:38 cheezit.cs.umd.edu setroubleshoot[537459]: SELinux is preventing /usr/bin/python3.9 from open access on the file /etc/selinux/targeted/contexts/files/file_contexts.subs_dist. For complete SELinux messages run: sealert -l 77caba8a-5cd0-4e18-b188-6e35c461772d
Jul 22 02:18:38 cheezit.cs.umd.edu setroubleshoot[537459]: SELinux is preventing /usr/bin/python3.9 from read access on the file /etc/selinux/targeted/contexts/files/file_contexts.subs. For complete SELinux messages run: sealert -l d9c6dd0d-0a34-4430-a5ff-e985c55cb064
Jul 22 02:18:38 cheezit.cs.umd.edu setroubleshoot[537459]: SELinux is preventing /usr/bin/python3.9 from open access on the file /etc/selinux/targeted/contexts/files/file_contexts.subs. For complete SELinux messages run: sealert -l 8edbce57-8212-4ac8-af50-3fe403231eda
Jul 22 02:18:38 cheezit.cs.umd.edu setroubleshoot[537459]: SELinux is preventing /usr/bin/python3.9 from map access on the file /etc/selinux/targeted/contexts/files/file_contexts.bin. For complete SELinux messages run: sealert -l 4a0cbe3b-6f49-4c7e-95c6-380f7aef806e
== contest (9 distinct, 44 total) ==
Jul 22 02:05:28 contest goferd[994]: [ERROR][worker-0] gofer.messaging.adapter.connect:33 - connect: proton+amqps://satellite8.cs.umd.edu:5647, failed: Connection amqps://satellite8.cs.umd.edu:5647 disconnected: Condition('proton.pythonio', 'Connection refused to all addresses') [x34]
Jul 22 02:17:20 contest setroubleshoot[867795]: SELinux is preventing /usr/libexec/platform-python3.6 from create access on the directory libdnf.iZIjMW. For complete SELinux messages run: sealert -l cb6b25c6-4765-4cf2-88a0-9b3b508e94e9
Jul 22 02:17:20 contest setroubleshoot[867795]: SELinux is preventing /usr/bin/gpgconf from add_name access on the directory repodata. For complete SELinux messages run: sealert -l 41cf7b1b-0f34-4609-98f2-b66e7825fef7
Jul 22 02:17:20 contest setroubleshoot[867795]: SELinux is preventing /usr/libexec/platform-python3.6 from create access on the file mirrorlist. For complete SELinux messages run: sealert -l fc20ff92-ea83-4f38-a24b-ddfd737a3141
Jul 22 02:17:20 contest setroubleshoot[867795]: SELinux is preventing /usr/libexec/platform-python3.6 from setattr access on the file repomd.xml. For complete SELinux messages run: sealert -l ac675631-fa35-4e93-adc9-b692b18e53e5 [x2]
Jul 22 02:17:20 contest setroubleshoot[867795]: SELinux is preventing /usr/libexec/platform-python3.6 from create access on the file repomd.xml.asc. For complete SELinux messages run: sealert -l fc20ff92-ea83-4f38-a24b-ddfd737a3141
Jul 22 02:17:21 contest setroubleshoot[867795]: SELinux is preventing /usr/libexec/platform-python3.6 from read access on the directory libdnf.iZIjMW. For complete SELinux messages run: sealert -l 45d103b6-0810-4890-a705-990118577ce8
Jul 22 02:17:21 contest setroubleshoot[867795]: SELinux is preventing /usr/libexec/platform-python3.6 from remove_name access on the directory repomd.xml. For complete SELinux messages run: sealert -l 7e499113-2fd7-4f67-bec6-3521efbe3637 [x2]
Jul 22 02:17:22 contest setroubleshoot[867795]: SELinux is preventing /usr/libexec/platform-python3.6 from rmdir access on the directory repodata. For complete SELinux messages run: sealert -l 3928930b-a1ed-448d-950b-0665ac2adef8
== csfw00a (1 distinct, 202 total) ==
Jul 22 02:05:29 csfw00a kernel: bnxt_en 0000:09:00.0 eth3: NIC Link is Down [x202]
== dojo (20 distinct, 27 total) ==
Jul 22 02:09:40 dojo systemd[1]: networkd-dispatcher.service: Got notification message from PID 476440, but reception only permitted for main PID 2295
Jul 22 02:09:40 dojo systemd[1]: networkd-dispatcher.service: Got notification message from PID 476463, but reception only permitted for main PID 2295
Jul 22 02:09:40 dojo systemd[1]: networkd-dispatcher.service: Got notification message from PID 476474, but reception only permitted for main PID 2295
Jul 22 02:09:40 dojo systemd[1]: networkd-dispatcher.service: Got notification message from PID 476488, but reception only permitted for main PID 2295
Jul 22 02:09:40 dojo systemd[1]: networkd-dispatcher.service: Got notification message from PID 476498, but reception only permitted for main PID 2295
Jul 22 02:09:47 dojo kernel: process '/tmp/92fb0e3e-2185-4015-8d1d-195c85de6bfd/lnxfwupg' started with executable stack
Jul 22 02:12:50 dojo systemd[1]: networkd-dispatcher.service: Got notification message from PID 490978, but reception only permitted for main PID 2295
Jul 22 02:12:50 dojo systemd[1]: networkd-dispatcher.service: Got notification message from PID 490982, but reception only permitted for main PID 2295
Jul 22 02:13:02 dojo networkctl[491005]: Interface "eth0" not found. [x3]
Jul 22 02:13:02 dojo systemd[1]: networkd-dispatcher.service: Got notification message from PID 491005, but reception only permitted for main PID 2295 [x2]
Jul 22 02:13:02 dojo systemd[1]: networkd-dispatcher.service: Got notification message from PID 491014, but reception only permitted for main PID 2295 [x2]
Jul 22 02:13:10 dojo systemd[1]: networkd-dispatcher.service: Got notification message from PID 491028, but reception only permitted for main PID 2295 [x2]
Jul 22 02:13:28 dojo kernel: sd 14:0:0:0: Power-on or device reset occurred
Jul 22 02:13:28 dojo kernel: sd 14:0:0:0: [sdi] No Caching mode page found
Jul 22 02:13:28 dojo kernel: sd 14:0:0:0: [sdi] Assuming drive cache: write through
Jul 22 02:18:19 dojo networkctl[491533]: Interface "vnet13" not found.
Jul 22 02:18:19 dojo systemd[1]: networkd-dispatcher.service: Got notification message from PID 491533, but reception only permitted for main PID 2295 [x2]
Jul 22 02:26:52 dojo systemd[1]: libvirtd.service: Found left-over process 2804 (dnsmasq) in control group while starting unit. Ignoring.
Jul 22 02:26:52 dojo systemd[1]: libvirtd.service: This usually indicates unclean termination of a previous run, or service implementation deficiencies. [x2]
Jul 22 02:26:52 dojo systemd[1]: libvirtd.service: Found left-over process 2805 (dnsmasq) in control group while starting unit. Ignoring.
== idm00 (1 distinct, 1 total) ==
Jul 22 02:51:02 idm00 named[1455]: client @0x7f33100f4c38 10.73.240.42#52823: update '73.10.in-addr.arpa/IN' denied
== idmp0 (1 distinct, 1 total) ==
Jul 22 02:34:57 idmp0 named[5198]: client @0x7f9904001258 10.73.240.43#60556: update '73.10.in-addr.arpa/IN' denied
== itmon02 (1 distinct, 35 total) ==
Jul 22 02:07:48 itmon02 sshd[1904]: error: beginning MaxStartups throttling [x35]
== jaws.cs.umd.edu (4 distinct, 4 total) ==
Jul 22 02:32:10 jaws.cs.umd.edu systemd-coredump[495348]: Process 495339 (podman) of user 981 dumped core.#012#012Stack trace of thread 495339:#012#0 0x0000559e375c946e internal/runtime/syscall/linux.Syscall6 (podman + 0x48b46e)#012#1 0x0000559e376a90a6 syscall.Syscall (podman + 0x56b0a6)#012#2 0x0000559e376a9c50 syscall.Syscall.abi0 (podman + 0x56bc50)#012#3 0x0000559e37813c2e github.com/containers/podman/vendor/golang.org/x/sys/unix.OpenTree (podman + 0x6d5c2e)#012#4 0x0000559e37e6cf4b github.com/containers/podman/vendor/github.com/cyphar/filepath-securejoin/p… (podman + 0xd2ef4b)#012#5 0x0000559e37e6ce54 github.com/containers/podman/vendor/github.com/cyphar/filepath-securejoin/p… (podman + 0xd2ee54)#012#6 0x0000559e3765cdcc sync.(*Once).doSlow (podman + 0x51edcc)#012#7 0x0000559e3765ccf9 sync.(*Once).Do (podman + 0x51ecf9)#012#8 0x0000559e37e6cdc5
github.com/containers/podman/vendor/github.com/cyphar/filepath-securejoin/p… (podman + 0xd2edc5)#012#9 0x0000559e37e6e3e2 github.com/containers/podman/vendor/github.com/cyphar/filepath-securejoin/p… (podman + 0xd303e2)#012#10 0x0000559e37e6e7f3 github.com/containers/podman/vendor/github.com/cyphar/filepath-securejoin/p… (podman + 0xd307f3)#012#11 0x0000559e37e6d91c github.com/containers/podman/vendor/github.com/cyphar/filepath-securejoin/p… (podman + 0xd2f91c)#012#12 0x0000559e37e6d358 github.com/containers/podman/vendor/github.com/cyphar/filepath-securejoin/p… (podman + 0xd2f358)#012#13 0x0000559e3765cdcc sync.(*Once).doSlow (podman + 0x51edcc)#012#14 0x0000559e3765ccf9 sync.(*Once).Do (
podman + 0x51ecf9)#012#15 0x0000559e37e6d2c5 github.com/containers/podman/vendor/github.com/cyphar/filepath-securejoin/p… (podman + 0xd2f2c5)#012#16 0x0000559e37e6e79a github.com/containers/podman/vendor/github.com/cyphar/filepath-securejoin/p… (podman + 0xd3079a)#012#17 0x0000559e37e7534e github.com/containers/podman/vendor/github.com/opencontainers/selinux/go-se… (podman + 0xd3734e)#012#18 0x0000559e37e75838 github.com/containers/podman/vendor/github.com/opencontainers/selinux/go-se… (podman + 0xd37838)#012#19 0x0000559e37e745df github.com/containers/podman/vendor/github.com/opencontainers/selinux/go-se… (podman + 0xd365df)#012#20 0x0000559e37e74873 github.com/containers/podman/vendor/github.com/opencontainers/selinux/go-se… (podman + 0xd36873)#012#21 0x000055
9e3806cf4b github.com/containers/podman/vendor/go.podman.io/common/pkg/config.defaultC… (podman + 0xf2ef4b)#012#22 0x0000559e38070912 github.com/containers/podman/vendor/go.podman.io/common/pkg/config.newLocked (podman + 0xf32912)#012#23 0x0000559e38070605 github.com/containers/podman/vendor/go.podman.io/common/pkg/config.New (podman + 0xf32605)#012#24 0x0000559e387e3fd3 github.com/containers/podman/cmd/podman/registry.newPodmanConfig (podman + 0x16a5fd3)#012#25 0x0000559e3765cdcc sync.(*Once).doSlow (podman + 0x51edcc)#012#26 0x0000559e38804c50 github.com/containers/podman/cmd/podman/common.init (podman + 0x16c6c50)#012#27 0x0000559e37622a57 runtime.doInit1 (podman + 0x4e4a57)#012#28 0x0000559e37612f90 runtime.main (podman + 0x4d4f90)#012#29 0x0000559e37652ee1 runtime.goexit.abi0 (podman + 0x514ee1)#012ELF object binary architecture: AMD x86-64
Jul 22 02:32:11 jaws.cs.umd.edu systemd-coredump[495367]: Process 495358 (podman) of user 981 dumped core.#012#012Stack trace of thread 495358:#012#0 0x000055707fff846e internal/runtime/syscall/linux.Syscall6 (podman + 0x48b46e)#012#1 0x00005570800d80a6 syscall.Syscall (podman + 0x56b0a6)#012#2 0x00005570800d8c50 syscall.Syscall.abi0 (podman + 0x56bc50)#012#3 0x0000557080242c2e github.com/containers/podman/vendor/golang.org/x/sys/unix.OpenTree (podman + 0x6d5c2e)#012#4 0x000055708089bf4b github.com/containers/podman/vendor/github.com/cyphar/filepath-securejoin/p… (podman + 0xd2ef4b)#012#5 0x000055708089be54 github.com/containers/podman/vendor/github.com/cyphar/filepath-securejoin/p… (podman + 0xd2ee54)#012#6 0x000055708008bdcc sync.(*Once).doSlow (podman + 0x51edcc)#012#7 0x000055708008bcf9 sync.(*Once).Do (podman + 0x51ecf9)#012#8 0x000055708089bdc5
github.com/containers/podman/vendor/github.com/cyphar/filepath-securejoin/p… (podman + 0xd2edc5)#012#9 0x000055708089d3e2 github.com/containers/podman/vendor/github.com/cyphar/filepath-securejoin/p… (podman + 0xd303e2)#012#10 0x000055708089d7f3 github.com/containers/podman/vendor/github.com/cyphar/filepath-securejoin/p… (podman + 0xd307f3)#012#11 0x000055708089c91c github.com/containers/podman/vendor/github.com/cyphar/filepath-securejoin/p… (podman + 0xd2f91c)#012#12 0x000055708089c358 github.com/containers/podman/vendor/github.com/cyphar/filepath-securejoin/p… (podman + 0xd2f358)#012#13 0x000055708008bdcc sync.(*Once).doSlow (podman + 0x51edcc)#012#14 0x000055708008bcf9 sync.(*Once).Do (
podman + 0x51ecf9)#012#15 0x000055708089c2c5 github.com/containers/podman/vendor/github.com/cyphar/filepath-securejoin/p… (podman + 0xd2f2c5)#012#16 0x000055708089d79a github.com/containers/podman/vendor/github.com/cyphar/filepath-securejoin/p… (podman + 0xd3079a)#012#17 0x00005570808a434e github.com/containers/podman/vendor/github.com/opencontainers/selinux/go-se… (podman + 0xd3734e)#012#18 0x00005570808a4838 github.com/containers/podman/vendor/github.com/opencontainers/selinux/go-se… (podman + 0xd37838)#012#19 0x00005570808a35df github.com/containers/podman/vendor/github.com/opencontainers/selinux/go-se… (podman + 0xd365df)#012#20 0x00005570808a3873 github.com/containers/podman/vendor/github.com/opencontainers/selinux/go-se… (podman + 0xd36873)#012#21 0x000055
7080a9bf4b github.com/containers/podman/vendor/go.podman.io/common/pkg/config.defaultC… (podman + 0xf2ef4b)#012#22 0x0000557080a9f912 github.com/containers/podman/vendor/go.podman.io/common/pkg/config.newLocked (podman + 0xf32912)#012#23 0x0000557080a9f605 github.com/containers/podman/vendor/go.podman.io/common/pkg/config.New (podman + 0xf32605)#012#24 0x0000557081212fd3 github.com/containers/podman/cmd/podman/registry.newPodmanConfig (podman + 0x16a5fd3)#012#25 0x000055708008bdcc sync.(*Once).doSlow (podman + 0x51edcc)#012#26 0x0000557081233c50 github.com/containers/podman/cmd/podman/common.init (podman + 0x16c6c50)#012#27 0x0000557080051a57 runtime.doInit1 (podman + 0x4e4a57)#012#28 0x0000557080041f90 runtime.main (podman + 0x4d4f90)#012#29 0x0000557080081ee1 runtime.goexit.abi0 (podman + 0x514ee1)#012ELF object binary architecture: AMD x86-64
Jul 22 02:32:12 jaws.cs.umd.edu setroubleshoot[495341]: SELinux is preventing /usr/bin/podman from using the nnp_transition access on a process. For complete SELinux messages run: sealert -l 3c7643bc-dd69-4695-b48c-7d780b62b6cf
Jul 22 02:32:12 jaws.cs.umd.edu systemd-coredump[495400]: Process 495382 (podman) of user 981 dumped core.#012#012Stack trace of thread 495382:#012#0 0x000056123b58e46e internal/runtime/syscall/linux.Syscall6 (podman + 0x48b46e)#012#1 0x000056123b66e0a6 syscall.Syscall (podman + 0x56b0a6)#012#2 0x000056123b66ec50 syscall.Syscall.abi0 (podman + 0x56bc50)#012#3 0x000056123b7d8c2e github.com/containers/podman/vendor/golang.org/x/sys/unix.OpenTree (podman + 0x6d5c2e)#012#4 0x000056123be31f4b github.com/containers/podman/vendor/github.com/cyphar/filepath-securejoin/p… (podman + 0xd2ef4b)#012#5 0x000056123be31e54 github.com/containers/podman/vendor/github.com/cyphar/filepath-securejoin/p… (podman + 0xd2ee54)#012#6 0x000056123b621dcc sync.(*Once).doSlow (podman + 0x51edcc)#012#7 0x000056123b621cf9 sync.(*Once).Do (podman + 0x51ecf9)#012#8 0x000056123be31dc5
github.com/containers/podman/vendor/github.com/cyphar/filepath-securejoin/p… (podman + 0xd2edc5)#012#9 0x000056123be333e2 github.com/containers/podman/vendor/github.com/cyphar/filepath-securejoin/p… (podman + 0xd303e2)#012#10 0x000056123be337f3 github.com/containers/podman/vendor/github.com/cyphar/filepath-securejoin/p… (podman + 0xd307f3)#012#11 0x000056123be3291c github.com/containers/podman/vendor/github.com/cyphar/filepath-securejoin/p… (podman + 0xd2f91c)#012#12 0x000056123be32358 github.com/containers/podman/vendor/github.com/cyphar/filepath-securejoin/p… (podman + 0xd2f358)#012#13 0x000056123b621dcc sync.(*Once).doSlow (podman + 0x51edcc)#012#14 0x000056123b621cf9 sync.(*Once).Do (
podman + 0x51ecf9)#012#15 0x000056123be322c5 github.com/containers/podman/vendor/github.com/cyphar/filepath-securejoin/p… (podman + 0xd2f2c5)#012#16 0x000056123be3379a github.com/containers/podman/vendor/github.com/cyphar/filepath-securejoin/p… (podman + 0xd3079a)#012#17 0x000056123be3a34e github.com/containers/podman/vendor/github.com/opencontainers/selinux/go-se… (podman + 0xd3734e)#012#18 0x000056123be3a838 github.com/containers/podman/vendor/github.com/opencontainers/selinux/go-se… (podman + 0xd37838)#012#19 0x000056123be395df github.com/containers/podman/vendor/github.com/opencontainers/selinux/go-se… (podman + 0xd365df)#012#20 0x000056123be39873 github.com/containers/podman/vendor/github.com/opencontainers/selinux/go-se… (podman + 0xd36873)#012#21 0x000056
123c031f4b github.com/containers/podman/vendor/go.podman.io/common/pkg/config.defaultC… (podman + 0xf2ef4b)#012#22 0x000056123c035912 github.com/containers/podman/vendor/go.podman.io/common/pkg/config.newLocked (podman + 0xf32912)#012#23 0x000056123c035605 github.com/containers/podman/vendor/go.podman.io/common/pkg/config.New (podman + 0xf32605)#012#24 0x000056123c7a8fd3 github.com/containers/podman/cmd/podman/registry.newPodmanConfig (podman + 0x16a5fd3)#012#25 0x000056123b621dcc sync.(*Once).doSlow (podman + 0x51edcc)#012#26 0x000056123c7c9c50 github.com/containers/podman/cmd/podman/common.init (podman + 0x16c6c50)#012#27 0x000056123b5e7a57 runtime.doInit1 (podman + 0x4e4a57)#012#28 0x000056123b5d7f90 runtime.main (podman + 0x4d4f90)#012#29 0x000056123b617ee1 runtime.goexit.abi0 (podman + 0x514ee1)#012ELF object binary architecture: AMD x86-64
== matrix (2 distinct, 3 total) ==
Jul 22 02:41:04 matrix krb5_child[3320072]: Client 'admin(a)UMD.EDU' not found in Kerberos database [x2]
Jul 22 02:41:05 matrix sshd[3320052]: error: PAM: Authentication failure for admin from 35.233.53.129
== mcstic (3 distinct, 6 total) ==
Jul 22 02:27:51 mcstic krb5_child[1470384]: Client 'admin(a)UMD.EDU' not found in Kerberos database [x4]
Jul 22 02:27:57 mcstic sshd[1470379]: error: PAM: Authentication failure for admin from 34.156.189.82
Jul 22 02:28:24 mcstic sshd[1470405]: error: Protocol major versions differ: 2 vs. 1
== newhonors2 (1 distinct, 24 total) ==
Jul 22 02:13:03 newhonors2 dhcpcd[105960]: dhcpcd is not running [x24]
== outbound00.cs.umd.edu (1 distinct, 6 total) ==
Jul 22 02:09:09 outbound00.cs.umd.edu python3[2486692]: ldapdb [x6]
== outbound01.cs.umd.edu (1 distinct, 6 total) ==
Jul 22 02:13:06 outbound01.cs.umd.edu python3[514825]: ldapdb [x6]
== sentry-docker00.cs.umd.edu (36 distinct, 36 total) ==
Jul 22 02:15:31 sentry-docker00.cs.umd.edu systemd-udevd[914307]: link_config: could not get ethtool features for vethf966242
Jul 22 02:15:31 sentry-docker00.cs.umd.edu systemd-udevd[914307]: Could not set offload features of vethf966242: No such device
Jul 22 02:15:31 sentry-docker00.cs.umd.edu systemd-udevd[914344]: Could not generate persistent MAC address for veth2c136b3: No such file or directory
Jul 22 02:15:31 sentry-docker00.cs.umd.edu systemd-udevd[914345]: Could not generate persistent MAC address for vethf1cc051: No such file or directory
Jul 22 02:18:07 sentry-docker00.cs.umd.edu systemd-udevd[915364]: link_config: could not get ethtool features for vethe81f79b
Jul 22 02:18:07 sentry-docker00.cs.umd.edu systemd-udevd[915364]: Could not set offload features of vethe81f79b: No such device
Jul 22 02:18:07 sentry-docker00.cs.umd.edu systemd-udevd[915387]: Could not generate persistent MAC address for veth0a87e84: No such file or directory
Jul 22 02:18:07 sentry-docker00.cs.umd.edu systemd-udevd[915388]: Could not generate persistent MAC address for veth8bd549c: No such file or directory
Jul 22 02:18:07 sentry-docker00.cs.umd.edu systemd-udevd[915392]: Could not generate persistent MAC address for veth91544b6: No such file or directory
Jul 22 02:18:07 sentry-docker00.cs.umd.edu systemd-udevd[915393]: Could not generate persistent MAC address for veth9017856: No such file or directory
Jul 22 02:18:07 sentry-docker00.cs.umd.edu systemd-udevd[915420]: Could not generate persistent MAC address for veth5c0887e: No such file or directory
Jul 22 02:18:07 sentry-docker00.cs.umd.edu systemd-udevd[915421]: Could not generate persistent MAC address for veth0595ed4: No such file or directory
Jul 22 02:18:07 sentry-docker00.cs.umd.edu systemd-udevd[915441]: Could not generate persistent MAC address for vetha787f78: No such file or directory
Jul 22 02:18:07 sentry-docker00.cs.umd.edu systemd-udevd[915447]: Could not generate persistent MAC address for veth20d0809: No such file or directory
Jul 22 02:35:39 sentry-docker00.cs.umd.edu systemd-udevd[923768]: Could not generate persistent MAC address for vethfd8713e: No such file or directory
Jul 22 02:35:39 sentry-docker00.cs.umd.edu systemd-udevd[923769]: Could not generate persistent MAC address for veth46a65c7: No such file or directory
Jul 22 02:38:15 sentry-docker00.cs.umd.edu systemd-udevd[925886]: Could not generate persistent MAC address for veth8a6dd3c: No such file or directory
Jul 22 02:38:15 sentry-docker00.cs.umd.edu systemd-udevd[925885]: Could not generate persistent MAC address for veth37e1115: No such file or directory
Jul 22 02:38:15 sentry-docker00.cs.umd.edu systemd-udevd[925886]: Could not generate persistent MAC address for veth4d4b3e8: No such file or directory
Jul 22 02:38:15 sentry-docker00.cs.umd.edu systemd-udevd[925889]: Could not generate persistent MAC address for vetha280bae: No such file or directory
Jul 22 02:38:15 sentry-docker00.cs.umd.edu systemd-udevd[925898]: Could not generate persistent MAC address for veth68f7bca: No such file or directory
Jul 22 02:38:15 sentry-docker00.cs.umd.edu systemd-udevd[925892]: Could not generate persistent MAC address for vethac87bd6: No such file or directory
Jul 22 02:38:15 sentry-docker00.cs.umd.edu systemd-udevd[925898]: Could not generate persistent MAC address for veth3a13a85: No such file or directory
Jul 22 02:38:15 sentry-docker00.cs.umd.edu systemd-udevd[925892]: Could not generate persistent MAC address for veth7220eb0: No such file or directory
Jul 22 02:55:44 sentry-docker00.cs.umd.edu systemd-udevd[933459]: Could not generate persistent MAC address for veth3d27520: No such file or directory
Jul 22 02:55:44 sentry-docker00.cs.umd.edu systemd-udevd[933460]: Could not generate persistent MAC address for veth238f08c: No such file or directory
Jul 22 02:58:23 sentry-docker00.cs.umd.edu systemd-udevd[935357]: link_config: could not get ethtool features for veth37e1115
Jul 22 02:58:23 sentry-docker00.cs.umd.edu systemd-udevd[935357]: Could not set offload features of veth37e1115: No such device
Jul 22 02:58:23 sentry-docker00.cs.umd.edu systemd-udevd[935422]: Could not generate persistent MAC address for veth3be745c: No such file or directory
Jul 22 02:58:23 sentry-docker00.cs.umd.edu systemd-udevd[935423]: Could not generate persistent MAC address for veth9e3d050: No such file or directory
... 6 more distinct messages not shown
== strawberry (2 distinct, 8 total) ==
Jul 22 02:09:44 strawberry udisksd[1067]: Error performing housekeeping for drive /org/freedesktop/UDisks2/drives/ST2000DM001_1CH164_W1E8J5KJ: Error updating SMART data: Error sending ATA command CHECK POWER MODE: Unexpected sense data returned:#0120000: 00 00 00 00 00 00 00 00 00 00 00 00 00 00 00 00 ................#0120010: 00 00 00 00 00 00 00 00 00 00 00 00 00 00 00 00 ................#012 (g-io-error-quark, 0) [x6]
Jul 22 02:34:42 strawberry smartd[5314]: Device: /dev/sda [SAT], failed to read SMART Attribute Data [x2]
== submit26-b9-2 (10 distinct, 15 total) ==
Jul 22 02:05:05 submit26-b9-2 systemd[1]: user(a)1001.service: Main process exited, code=killed, status=9/KILL [x6]
Jul 22 02:38:53 submit26-b9-2 setroubleshoot[190037]: SELinux is preventing /usr/bin/python3.9 from create access on the directory /(null). For complete SELinux messages run: sealert -l d506243c-d61e-48f3-b42a-4592c913deb0
Jul 22 02:38:53 submit26-b9-2 setroubleshoot[190037]: SELinux is preventing /usr/bin/python3.9 from add_name access on the directory /(null). For complete SELinux messages run: sealert -l 3b4752ac-1b9a-4af9-a05b-32e4c2eb13ab
Jul 22 02:38:53 submit26-b9-2 setroubleshoot[190037]: SELinux is preventing /usr/bin/python3.9 from create access on the file /(null). For complete SELinux messages run: sealert -l 29e5adbd-4381-4467-b40d-a2219101e096
Jul 22 02:38:53 submit26-b9-2 setroubleshoot[190037]: SELinux is preventing /usr/bin/python3.9 from open access on the file /tmp/libdnf.dh90OF/repodata/repomd.xml. For complete SELinux messages run: sealert -l 1b38f2ec-01ce-4343-8059-ba7494ecc5c4
Jul 22 02:38:53 submit26-b9-2 setroubleshoot[190037]: SELinux is preventing /usr/bin/python3.9 from setattr access on the file repomd.xml. For complete SELinux messages run: sealert -l e5f9af40-1f63-4924-b012-27ab2a7b2266
Jul 22 02:38:53 submit26-b9-2 setroubleshoot[190037]: SELinux is preventing /usr/bin/python3.9 from read access on the directory libdnf.dh90OF. For complete SELinux messages run: sealert -l 5c54db87-54a3-4a7c-97b4-b5c48d6c3543
Jul 22 02:38:53 submit26-b9-2 setroubleshoot[190037]: SELinux is preventing /usr/bin/python3.9 from remove_name access on the directory repomd.xml. For complete SELinux messages run: sealert -l 63cd60e1-1e61-4276-afea-dd8526ffe8b2
Jul 22 02:38:53 submit26-b9-2 setroubleshoot[190037]: SELinux is preventing /usr/bin/python3.9 from unlink access on the file repomd.xml. For complete SELinux messages run: sealert -l 81c7e9ec-e023-4c6d-b1ad-c02a242e655e
Jul 22 02:38:53 submit26-b9-2 setroubleshoot[190037]: SELinux is preventing /usr/bin/python3.9 from rmdir access on the directory repodata. For complete SELinux messages run: sealert -l 6ae9a597-e123-4d74-8eec-a8ebe0f5e4d0
== unknown (1 distinct, 1 total) ==
using-explainable-ai
== wraith (1 distinct, 1 total) ==
Jul 22 02:46:48 wraith kernel: workqueue: i915_hpd_poll_init_work [i915] hogged CPU for >10000us 16387 times, consider switching to WQ_UNBOUND
1
0
Command: /usr/local/sbin/syslog-digest.py
Time : 0.5286s
Status : exited 0
Output :
Syslog digest — 2026-07-22 02:05 EDT
Processed 4,651 lines, filtered 3,711 (79%). 940 unknown (152 distinct) from 24 host(s).
== abuse (1 distinct, 346 total) ==
Jul 22 01:05:06 abuse rsyslogd[21745]: imjournal: open() failed for path: '/var/lib/rsyslog/imjournal.state.tmp': Input/output error [v8.2404.0 try https://www.rsyslog.com/e/2433 ] [x346]
== b0b02.cs.umd.edu (4 distinct, 5 total) ==
Jul 22 01:10:30 b0b02.cs.umd.edu rustdesk[1510326]: cannot open display:
Jul 22 01:39:21 b0b02.cs.umd.edu setroubleshoot[1517713]: SELinux is preventing /usr/bin/python3.9 from getattr access on the file /etc/authselect/nsswitch.conf. For complete SELinux messages run: sealert -l 9a1e2952-3fde-4937-a8ab-f7f59791a458 [x2]
Jul 22 01:39:23 b0b02.cs.umd.edu setroubleshoot[1517713]: SELinux is preventing /usr/bin/python3.9 from read access on the file /etc/authselect/nsswitch.conf. For complete SELinux messages run: sealert -l 97d74423-e027-4cd6-8810-ad80944900b5
Jul 22 01:39:26 b0b02.cs.umd.edu setroubleshoot[1517713]: SELinux is preventing /usr/bin/python3.9 from open access on the file /etc/authselect/nsswitch.conf. For complete SELinux messages run: sealert -l 4f253f6a-62d6-46dd-8eaf-0b4d29df41c6
== cmsc436-0101-redis (3 distinct, 3 total) ==
Jul 22 01:34:01 cmsc436-0101-redis krb5_child[84918]: Client 'admin(a)UMD.EDU' not found in Kerberos database
Jul 22 01:34:03 cmsc436-0101-redis sshd-session[84914]: error: PAM: Authentication failure for admin from 34.53.216.124
Jul 22 01:34:53 cmsc436-0101-redis sshd-session[84932]: error: Protocol major versions differ: 2 vs. 1
== contest (1 distinct, 33 total) ==
Jul 22 01:06:33 contest goferd[994]: [ERROR][worker-0] gofer.messaging.adapter.connect:33 - connect: proton+amqps://satellite8.cs.umd.edu:5647, failed: Connection amqps://satellite8.cs.umd.edu:5647 disconnected: Condition('proton.pythonio', 'Connection refused to all addresses') [x33]
== csfw00a (2 distinct, 258 total) ==
Jul 22 01:05:03 csfw00a kernel: bnxt_en 0000:09:00.0 eth3: NIC Link is Down [x254]
Jul 22 01:55:26 csfw00a ospf6d[1477]: [EC 100663307] Could not send entire message [x4]
== dojo (48 distinct, 61 total) ==
Jul 22 01:07:11 dojo networkctl[464219]: Interface "vnet10" not found.
Jul 22 01:07:11 dojo systemd[1]: networkd-dispatcher.service: Got notification message from PID 464219, but reception only permitted for main PID 2295 [x2]
Jul 22 01:07:13 dojo networkctl[464319]: Interface "vnet11" not found.
Jul 22 01:07:13 dojo systemd[1]: networkd-dispatcher.service: Got notification message from PID 464319, but reception only permitted for main PID 2295 [x2]
Jul 22 01:07:18 dojo networkctl[464393]: Interface "vnet7" not found.
Jul 22 01:07:18 dojo systemd[1]: networkd-dispatcher.service: Got notification message from PID 464393, but reception only permitted for main PID 2295 [x2]
Jul 22 01:07:18 dojo networkctl[464412]: Interface "vnet0" not found.
Jul 22 01:07:18 dojo systemd[1]: networkd-dispatcher.service: Got notification message from PID 464412, but reception only permitted for main PID 2295 [x2]
Jul 22 01:09:27 dojo systemd[1]: networkd-dispatcher.service: Got notification message from PID 464499, but reception only permitted for main PID 2295
Jul 22 01:09:27 dojo systemd[1]: networkd-dispatcher.service: Got notification message from PID 464504, but reception only permitted for main PID 2295
Jul 22 01:09:42 dojo kernel: kauditd_printk_skb: 9 callbacks suppressed [x2]
Jul 22 01:11:05 dojo networkctl[465430]: Interface "vnet12" not found.
Jul 22 01:11:05 dojo systemd[1]: networkd-dispatcher.service: Got notification message from PID 465430, but reception only permitted for main PID 2295 [x2]
Jul 22 01:16:35 dojo systemd[1]: networkd-dispatcher.service: Got notification message from PID 465776, but reception only permitted for main PID 2295
Jul 22 01:16:35 dojo systemd[1]: networkd-dispatcher.service: Got notification message from PID 465781, but reception only permitted for main PID 2295
Jul 22 01:53:42 dojo falcon-sensor-bpf[2136]: CrowdStrike(4): Could not retrieve DisableProxy value: c0000225
Jul 22 01:53:42 dojo falcon-sensor-bpf[2136]: CrowdStrike(4): ConnectWithProxy: Unable to get application proxy host from CsConfig: c0000225
Jul 22 01:54:58 dojo systemd[1]: networkd-dispatcher.service: Got notification message from PID 471071, but reception only permitted for main PID 2295
Jul 22 01:54:58 dojo systemd[1]: networkd-dispatcher.service: Got notification message from PID 471088, but reception only permitted for main PID 2295
Jul 22 01:54:58 dojo systemd[1]: networkd-dispatcher.service: Got notification message from PID 471100, but reception only permitted for main PID 2295
Jul 22 01:54:58 dojo systemd[1]: networkd-dispatcher.service: Got notification message from PID 471115, but reception only permitted for main PID 2295
Jul 22 01:54:58 dojo systemd[1]: networkd-dispatcher.service: Got notification message from PID 471134, but reception only permitted for main PID 2295
Jul 22 01:55:09 dojo systemd[1]: networkd-dispatcher.service: Got notification message from PID 471481, but reception only permitted for main PID 2295
Jul 22 01:55:22 dojo systemd[1]: networkd-dispatcher.service: Got notification message from PID 471510, but reception only permitted for main PID 2295
Jul 22 01:55:22 dojo systemd[1]: networkd-dispatcher.service: Got notification message from PID 471519, but reception only permitted for main PID 2295
Jul 22 01:55:48 dojo networkctl[471538]: Interface "idrac" not found.
Jul 22 01:55:48 dojo systemd[1]: networkd-dispatcher.service: Got notification message from PID 471538, but reception only permitted for main PID 2295 [x2]
Jul 22 01:56:05 dojo systemd-udevd[1370]: Configuration file /etc/udev/rules.d/00-secupd-dell.rules is marked executable. Please remove executable permission bits. Proceeding anyway.
Jul 22 01:56:05 dojo systemd-udevd[1370]: /etc/udev/rules.d/00-secupd-dell.rules:1 Invalid value for OPTIONS key, ignoring: 'last_rule'
Jul 22 01:56:05 dojo systemd-udevd[1370]: /etc/udev/rules.d/00-secupd-dell.rules:1 The line has no effect, ignoring.
... 18 more distinct messages not shown
== hackerman (1 distinct, 1 total) ==
Jul 22 01:19:01 hackerman gnome-software[2060381]: failed to commit changes to dconf: GDBus.Error:org.gtk.GDBus.UnmappedGError.Quark._g_2dfile_2derror_2dquark.Code2: Failed to create file “/adminhomes/sajith/.config/dconf/user.GVUCT3”: Permission denied
== hazfs.cs.umd.edu (11 distinct, 66 total) ==
Jul 22 01:56:18 hazfs.cs.umd.edu snmpd[1431]: send response: Failure in sendto [x6]
Jul 22 01:56:18 hazfs.cs.umd.edu snmpd[1431]: -- NET-SNMP-EXTEND-MIB::nsExtendStatus."userweb" [x6]
Jul 22 01:56:18 hazfs.cs.umd.edu snmpd[1431]: -- NET-SNMP-EXTEND-MIB::nsExtendStatus."zfslist" [x6]
Jul 22 01:56:18 hazfs.cs.umd.edu snmpd[1431]: -- NET-SNMP-EXTEND-MIB::nsExtendStatus."userhome" [x6]
Jul 22 01:56:18 hazfs.cs.umd.edu snmpd[1431]: -- NET-SNMP-EXTEND-MIB::nsExtendOutput1Line."userweb" [x6]
Jul 22 01:56:18 hazfs.cs.umd.edu snmpd[1431]: -- NET-SNMP-EXTEND-MIB::nsExtendOutput1Line."zfslist" [x6]
Jul 22 01:56:18 hazfs.cs.umd.edu snmpd[1431]: -- NET-SNMP-EXTEND-MIB::nsExtendOutput1Line."userhome" [x6]
Jul 22 01:56:18 hazfs.cs.umd.edu snmpd[1431]: -- NET-SNMP-EXTEND-MIB::nsExtendOutputFull."userweb" [x6]
Jul 22 01:56:18 hazfs.cs.umd.edu snmpd[1431]: -- NET-SNMP-EXTEND-MIB::nsExtendOutputFull."zfslist" [x6]
Jul 22 01:56:18 hazfs.cs.umd.edu snmpd[1431]: -- NET-SNMP-EXTEND-MIB::nsExtendOutputFull."userhome" [x6]
Jul 22 01:56:18 hazfs.cs.umd.edu snmpd[1431]: -- NET-SNMP-EXTEND-MIB::nsExtendOutNumLines."userweb" [x6]
== idm00 (2 distinct, 2 total) ==
Jul 22 01:23:57 idm00 named[1455]: client @0x7f330c9bf848 10.73.245.12#62768: update '73.10.in-addr.arpa/IN' denied
Jul 22 01:51:02 idm00 named[1455]: client @0x7f330c9c15b8 10.73.240.42#56189: update '73.10.in-addr.arpa/IN' denied
== idmp0 (1 distinct, 1 total) ==
Jul 22 01:34:57 idmp0 named[5198]: client @0x7f9930012608 10.73.240.43#56310: update '73.10.in-addr.arpa/IN' denied
== inbound00.cs.umd.edu (2 distinct, 2 total) ==
Jul 22 01:49:30 inbound00.cs.umd.edu krb5_child[2492822]: Client 'admin(a)UMD.EDU' not found in Kerberos database
Jul 22 01:50:00 inbound00.cs.umd.edu sshd-session[2492837]: error: Protocol major versions differ: 2 vs. 1
== itmon02 (1 distinct, 35 total) ==
Jul 22 01:08:05 itmon02 sshd[1904]: error: beginning MaxStartups throttling [x35]
== krispykreme.cs.umd.edu (3 distinct, 4 total) ==
Jul 22 01:32:09 krispykreme.cs.umd.edu sshd-session[2058101]: pam_access(sshd:auth): access denied for user `admin' from `76.133.90.170' [x2]
Jul 22 01:32:09 krispykreme.cs.umd.edu krb5_child[2058103]: Client 'admin(a)UMD.EDU' not found in Kerberos database
Jul 22 01:32:09 krispykreme.cs.umd.edu sshd-session[2058095]: error: PAM: System error for admin from 76.133.90.170
== netman.cs.umd.edu (3 distinct, 6 total) ==
Jul 22 01:12:00 netman.cs.umd.edu krb5_child[3065431]: Client 'admin(a)UMD.EDU' not found in Kerberos database [x4]
Jul 22 01:12:04 netman.cs.umd.edu sshd[3065428]: error: PAM: Authentication failure for admin from 34.38.185.242
Jul 22 01:12:15 netman.cs.umd.edu sshd[3065458]: error: Protocol major versions differ: 2 vs. 1
== newhonors2 (1 distinct, 24 total) ==
Jul 22 01:13:03 newhonors2 dhcpcd[104116]: dhcpcd is not running [x24]
== outbound00.cs.umd.edu (1 distinct, 6 total) ==
Jul 22 01:09:08 outbound00.cs.umd.edu python3[2472886]: ldapdb [x6]
== outbound01.cs.umd.edu (1 distinct, 6 total) ==
Jul 22 01:13:06 outbound01.cs.umd.edu python3[500825]: ldapdb [x6]
== sebatinsky.cs.umd.edu (3 distinct, 3 total) ==
Jul 22 01:50:26 sebatinsky.cs.umd.edu setroubleshoot[2716884]: SELinux is preventing /usr/libexec/platform-python3.6 from add_name access on the directory .dbenv.lock. For complete SELinux messages run: sealert -l 26d5bc02-bfff-4827-a9f2-b991fef962b5
Jul 22 01:50:26 sebatinsky.cs.umd.edu setroubleshoot[2716884]: failed to retrieve rpm info for /var/lib/rpm/.dbenv.lock
Jul 22 01:50:28 sebatinsky.cs.umd.edu setroubleshoot[2716884]: SELinux is preventing rhsmcertd-worke from create access on the file /var/lib/rpm/.dbenv.lock. For complete SELinux messages run: sealert -l c2202c24-dc18-413b-8198-09e05919353b
== sentry-docker00.cs.umd.edu (40 distinct, 40 total) ==
Jul 22 01:15:10 sentry-docker00.cs.umd.edu systemd-udevd[885689]: link_config: could not get ethtool features for vetha5a46cb
Jul 22 01:15:10 sentry-docker00.cs.umd.edu systemd-udevd[885689]: Could not set offload features of vetha5a46cb: No such device
Jul 22 01:15:10 sentry-docker00.cs.umd.edu systemd-udevd[885707]: Could not generate persistent MAC address for veth936aaff: No such file or directory
Jul 22 01:15:10 sentry-docker00.cs.umd.edu systemd-udevd[885708]: Could not generate persistent MAC address for vethd3833ef: No such file or directory
Jul 22 01:17:42 sentry-docker00.cs.umd.edu systemd-udevd[886856]: link_config: could not get ethtool features for veth549806b
Jul 22 01:17:42 sentry-docker00.cs.umd.edu systemd-udevd[886856]: Could not set offload features of veth549806b: No such device
Jul 22 01:17:42 sentry-docker00.cs.umd.edu systemd-udevd[886906]: link_config: could not get ethtool features for vethecf68cf
Jul 22 01:17:42 sentry-docker00.cs.umd.edu systemd-udevd[886906]: Could not set offload features of vethecf68cf: No such device
Jul 22 01:17:42 sentry-docker00.cs.umd.edu systemd-udevd[886921]: Could not generate persistent MAC address for veth926db52: No such file or directory
Jul 22 01:17:42 sentry-docker00.cs.umd.edu systemd-udevd[886922]: Could not generate persistent MAC address for veth6834cac: No such file or directory
Jul 22 01:17:42 sentry-docker00.cs.umd.edu systemd-udevd[886925]: Could not generate persistent MAC address for veth8a034c0: No such file or directory
Jul 22 01:17:42 sentry-docker00.cs.umd.edu systemd-udevd[886926]: Could not generate persistent MAC address for veth87c4f50: No such file or directory
Jul 22 01:17:42 sentry-docker00.cs.umd.edu systemd-udevd[886947]: Could not generate persistent MAC address for veth64541f4: No such file or directory
Jul 22 01:17:42 sentry-docker00.cs.umd.edu systemd-udevd[886938]: Could not generate persistent MAC address for vethe721d55: No such file or directory
Jul 22 01:17:42 sentry-docker00.cs.umd.edu systemd-udevd[886931]: Could not generate persistent MAC address for veth640d6c1: No such file or directory
Jul 22 01:17:42 sentry-docker00.cs.umd.edu systemd-udevd[886947]: Could not generate persistent MAC address for veth5ad094c: No such file or directory
Jul 22 01:35:18 sentry-docker00.cs.umd.edu systemd-udevd[895420]: Could not generate persistent MAC address for veth7e953ae: No such file or directory
Jul 22 01:35:18 sentry-docker00.cs.umd.edu systemd-udevd[895421]: Could not generate persistent MAC address for veth34dffb2: No such file or directory
Jul 22 01:37:50 sentry-docker00.cs.umd.edu systemd-udevd[896257]: link_config: could not get ethtool features for veth640d6c1
Jul 22 01:37:50 sentry-docker00.cs.umd.edu systemd-udevd[896257]: Could not set offload features of veth640d6c1: No such device
Jul 22 01:37:50 sentry-docker00.cs.umd.edu systemd-udevd[896308]: link_config: could not get ethtool features for veth64541f4
Jul 22 01:37:50 sentry-docker00.cs.umd.edu systemd-udevd[896308]: Could not set offload features of veth64541f4: No such device
Jul 22 01:37:50 sentry-docker00.cs.umd.edu systemd-udevd[896324]: Could not generate persistent MAC address for veth9b50d7d: No such file or directory
Jul 22 01:37:50 sentry-docker00.cs.umd.edu systemd-udevd[896325]: Could not generate persistent MAC address for veth5249f1b: No such file or directory
Jul 22 01:37:50 sentry-docker00.cs.umd.edu systemd-udevd[896343]: Could not generate persistent MAC address for vetheffe243: No such file or directory
Jul 22 01:37:50 sentry-docker00.cs.umd.edu systemd-udevd[896344]: Could not generate persistent MAC address for veth92aaaa4: No such file or directory
Jul 22 01:37:50 sentry-docker00.cs.umd.edu systemd-udevd[896353]: Could not generate persistent MAC address for vethbd4cf33: No such file or directory
Jul 22 01:37:50 sentry-docker00.cs.umd.edu systemd-udevd[896352]: Could not generate persistent MAC address for veth69ba39c: No such file or directory
Jul 22 01:37:50 sentry-docker00.cs.umd.edu systemd-udevd[896392]: Could not generate persistent MAC address for veth7f6ae92: No such file or directory
Jul 22 01:37:50 sentry-docker00.cs.umd.edu systemd-udevd[896390]: Could not generate persistent MAC address for vethddaf046: No such file or directory
... 10 more distinct messages not shown
== strawberry (2 distinct, 8 total) ==
Jul 22 01:09:44 strawberry udisksd[1067]: Error performing housekeeping for drive /org/freedesktop/UDisks2/drives/ST2000DM001_1CH164_W1E8J5KJ: Error updating SMART data: Error sending ATA command CHECK POWER MODE: Unexpected sense data returned:#0120000: 00 00 00 00 00 00 00 00 00 00 00 00 00 00 00 00 ................#0120010: 00 00 00 00 00 00 00 00 00 00 00 00 00 00 00 00 ................#012 (g-io-error-quark, 0) [x6]
Jul 22 01:34:42 strawberry smartd[5314]: Device: /dev/sda [SAT], failed to read SMART Attribute Data [x2]
== submit26-b9-2 (1 distinct, 6 total) ==
Jul 22 01:13:07 submit26-b9-2 systemd[1]: user(a)1001.service: Main process exited, code=killed, status=9/KILL [x6]
== submit26-b9-3 (9 distinct, 9 total) ==
Jul 22 01:20:33 submit26-b9-3 setroubleshoot[498132]: SELinux is preventing /usr/bin/python3.9 from create access on the directory /(null). For complete SELinux messages run: sealert -l 5b912a44-22fd-4560-b201-2a4e289b73f5
Jul 22 01:20:33 submit26-b9-3 setroubleshoot[498132]: SELinux is preventing /usr/bin/python3.9 from add_name access on the directory /(null). For complete SELinux messages run: sealert -l 7f1df1e4-725e-4953-98eb-1079f908f543
Jul 22 01:20:33 submit26-b9-3 setroubleshoot[498132]: SELinux is preventing /usr/bin/python3.9 from create access on the file /(null). For complete SELinux messages run: sealert -l 40b8852a-f77b-44b4-affe-5f11fa33de43
Jul 22 01:20:33 submit26-b9-3 setroubleshoot[498132]: SELinux is preventing /usr/bin/python3.9 from open access on the file /tmp/libdnf.BuBVp8/repodata/repomd.xml. For complete SELinux messages run: sealert -l 45a8019e-f6b5-4baa-92c1-862594b40d46
Jul 22 01:20:33 submit26-b9-3 setroubleshoot[498132]: SELinux is preventing /usr/bin/python3.9 from setattr access on the file repomd.xml. For complete SELinux messages run: sealert -l e9f0bfff-7784-4126-baa4-2bb06da56591
Jul 22 01:20:33 submit26-b9-3 setroubleshoot[498132]: SELinux is preventing /usr/bin/python3.9 from read access on the directory libdnf.BuBVp8. For complete SELinux messages run: sealert -l 0b17cc3d-cdc6-4fe2-a11f-3892e7c41dc7
Jul 22 01:20:33 submit26-b9-3 setroubleshoot[498132]: SELinux is preventing /usr/bin/python3.9 from remove_name access on the directory repomd.xml. For complete SELinux messages run: sealert -l 10e38c64-b65f-4cdd-901e-4375652d9a42
Jul 22 01:20:33 submit26-b9-3 setroubleshoot[498132]: SELinux is preventing /usr/bin/python3.9 from unlink access on the file repomd.xml. For complete SELinux messages run: sealert -l 7fd9cf72-ef38-48e1-b6aa-b571b26a7b22
Jul 22 01:20:33 submit26-b9-3 setroubleshoot[498132]: SELinux is preventing /usr/bin/python3.9 from rmdir access on the directory repodata. For complete SELinux messages run: sealert -l b9b11116-89bd-4a3c-980c-1d422c5dcee4
== submit26-clnb9 (10 distinct, 14 total) ==
Jul 22 01:31:51 submit26-clnb9 setroubleshoot[1121125]: SELinux is preventing /usr/bin/python3.9 from create access on the directory /(null). For complete SELinux messages run: sealert -l 6783ed2b-5ae4-42b5-975a-4bf50eec4658 [x2]
Jul 22 01:31:51 submit26-clnb9 setroubleshoot[1121125]: SELinux is preventing /usr/bin/python3.9 from add_name access on the directory /(null). For complete SELinux messages run: sealert -l 9e7fa955-cc30-4804-ac8c-e1779e85946c [x2]
Jul 22 01:31:51 submit26-clnb9 setroubleshoot[1121125]: SELinux is preventing /usr/bin/python3.9 from create access on the file /(null). For complete SELinux messages run: sealert -l 69bfa6e3-089c-40ff-9563-fd30787d0774
Jul 22 01:31:51 submit26-clnb9 setroubleshoot[1121125]: SELinux is preventing /usr/bin/python3.9 from open access on the file /tmp/libdnf.mqi94R/repodata/repomd.xml. For complete SELinux messages run: sealert -l 001acdb5-31ef-4e52-b10b-90f467a89ddc
Jul 22 01:31:51 submit26-clnb9 setroubleshoot[1121125]: SELinux is preventing /usr/bin/python3.9 from setattr access on the file repomd.xml. For complete SELinux messages run: sealert -l edacddcf-16ed-4dc3-8d82-7c597d5dee23
Jul 22 01:31:51 submit26-clnb9 setroubleshoot[1121125]: SELinux is preventing /usr/bin/python3.9 from read access on the directory libdnf.mqi94R. For complete SELinux messages run: sealert -l 62b3782e-4730-4488-8178-94dafe9b552c
Jul 22 01:31:51 submit26-clnb9 setroubleshoot[1121125]: SELinux is preventing /usr/bin/python3.9 from remove_name access on the directory repomd.xml. For complete SELinux messages run: sealert -l 81cb3698-78f8-440a-8e3c-e5d1041e6b78 [x2]
Jul 22 01:31:51 submit26-clnb9 setroubleshoot[1121125]: SELinux is preventing /usr/bin/python3.9 from unlink access on the file repomd.xml. For complete SELinux messages run: sealert -l 792b472a-115c-4799-9805-fc7436f916b9
Jul 22 01:31:51 submit26-clnb9 setroubleshoot[1121125]: SELinux is preventing /usr/bin/python3.9 from rmdir access on the directory repodata. For complete SELinux messages run: sealert -l 15c83a86-837b-41e2-b662-b39cd4e361cb [x2]
Jul 22 01:31:51 submit26-clnb9 setroubleshoot[1121125]: SELinux is preventing /usr/bin/python3.9 from read access on the directory libdnf.4wI2Ny. For complete SELinux messages run: sealert -l 62b3782e-4730-4488-8178-94dafe9b552c
== tma-0 (1 distinct, 1 total) ==
Jul 22 02:01:13 tma-0 sshd[25494]: error: PAM: Authentication failure for admin from 124.216.53.34.bc.googleusercontent.com
1
0
Command: /usr/local/sbin/syslog-digest.py
Time : 0.5249s
Status : exited 0
Output :
Syslog digest — 2026-07-22 01:05 EDT
Processed 4,572 lines, filtered 3,737 (81%). 835 unknown (110 distinct) from 32 host(s).
== abuse (1 distinct, 348 total) ==
Jul 22 00:05:06 abuse rsyslogd[21745]: imjournal: open() failed for path: '/var/lib/rsyslog/imjournal.state.tmp': Input/output error [v8.2404.0 try https://www.rsyslog.com/e/2433 ] [x348]
== b0b02.cs.umd.edu (4 distinct, 5 total) ==
Jul 22 00:10:27 b0b02.cs.umd.edu rustdesk[1495185]: cannot open display:
Jul 22 00:39:16 b0b02.cs.umd.edu setroubleshoot[1502624]: SELinux is preventing /usr/bin/python3.9 from getattr access on the file /etc/authselect/nsswitch.conf. For complete SELinux messages run: sealert -l 9a1e2952-3fde-4937-a8ab-f7f59791a458 [x2]
Jul 22 00:39:19 b0b02.cs.umd.edu setroubleshoot[1502624]: SELinux is preventing /usr/bin/python3.9 from read access on the file /etc/authselect/nsswitch.conf. For complete SELinux messages run: sealert -l 97d74423-e027-4cd6-8810-ad80944900b5
Jul 22 00:39:22 b0b02.cs.umd.edu setroubleshoot[1502624]: SELinux is preventing /usr/bin/python3.9 from open access on the file /etc/authselect/nsswitch.conf. For complete SELinux messages run: sealert -l 4f253f6a-62d6-46dd-8eaf-0b4d29df41c6
== contest (1 distinct, 34 total) ==
Jul 22 00:05:51 contest goferd[994]: [ERROR][worker-0] gofer.messaging.adapter.connect:33 - connect: proton+amqps://satellite8.cs.umd.edu:5647, failed: Connection amqps://satellite8.cs.umd.edu:5647 disconnected: Condition('proton.pythonio', 'Connection refused to all addresses') [x34]
== csfw00a (1 distinct, 232 total) ==
Jul 22 00:04:47 csfw00a kernel: bnxt_en 0000:09:00.0 eth3: NIC Link is Down [x232]
== cskayako (2 distinct, 2 total) ==
Jul 22 00:28:37 cskayako setroubleshoot[50114]: SELinux is preventing /usr/bin/php from add_name access on the directory /var/www/html/(null). For complete SELinux messages run: sealert -l 5239c113-abc1-4953-a9c0-21d695a0d1bb
Jul 22 00:28:37 cskayako setroubleshoot[50114]: SELinux is preventing /usr/bin/php from create access on the file /var/www/html/(null). For complete SELinux messages run: sealert -l cacf8f36-45b0-4374-9a33-d15de767aae7
== dojo (12 distinct, 14 total) ==
Jul 22 00:24:12 dojo sshd[460443]: error: Protocol major versions differ: 2 vs. 1
Jul 22 00:27:35 dojo libvirtd[4764]: Guest agent is not responding: QEMU guest agent is not connected
Jul 22 00:27:39 dojo networkctl[460591]: Interface "vnet1" not found.
Jul 22 00:27:39 dojo systemd[1]: networkd-dispatcher.service: Got notification message from PID 460591, but reception only permitted for main PID 2295 [x2]
Jul 22 00:27:58 dojo systemd[1]: networkd-dispatcher.service: Got notification message from PID 460633, but reception only permitted for main PID 2295
Jul 22 00:27:58 dojo systemd[1]: networkd-dispatcher.service: Got notification message from PID 460638, but reception only permitted for main PID 2295
Jul 22 00:28:12 dojo kernel: kauditd_printk_skb: 6 callbacks suppressed
Jul 22 00:58:13 dojo networkctl[462517]: Interface "vnet9" not found.
Jul 22 00:58:13 dojo systemd[1]: networkd-dispatcher.service: Got notification message from PID 462517, but reception only permitted for main PID 2295 [x2]
Jul 22 00:58:17 dojo systemd[1]: networkd-dispatcher.service: Got notification message from PID 462583, but reception only permitted for main PID 2295
Jul 22 00:58:17 dojo systemd[1]: networkd-dispatcher.service: Got notification message from PID 462587, but reception only permitted for main PID 2295
Jul 22 00:58:32 dojo kernel: kauditd_printk_skb: 7 callbacks suppressed
== grades01.cs.umd.edu (3 distinct, 4 total) ==
Jul 22 00:10:13 grades01.cs.umd.edu systemd[1]: New main PID 20095 does not belong to service, and PID file is not owned by root. Refusing. [x2]
Jul 22 00:10:37 grades01.cs.umd.edu systemd[1]: Daemon never wrote its PID file. Failing.
Jul 22 00:10:52 grades01.cs.umd.edu systemd[1]: pmlogger.service: Supervising process 27613 which is not our child. We'll most likely not notice when it exits.
== grafana (1 distinct, 1 total) ==
Jul 22 00:59:02 grafana systemd[1]: httpd.service: Unit cannot be reloaded because it is inactive.
== idm00 (1 distinct, 1 total) ==
Jul 22 00:51:02 idm00 named[1455]: client @0x7f330c4618e8 10.73.240.42#62569: update '73.10.in-addr.arpa/IN' denied
== idmp0 (1 distinct, 1 total) ==
Jul 22 00:34:57 idmp0 named[5198]: client @0x7f991c00c058 10.73.240.43#58283: update '73.10.in-addr.arpa/IN' denied
== itmon00 (3 distinct, 4 total) ==
Jul 22 00:10:12 itmon00 systemd[1]: New main PID 18458 does not belong to service, and PID file is not owned by root. Refusing. [x2]
Jul 22 00:10:34 itmon00 systemd[1]: Daemon never wrote its PID file. Failing.
Jul 22 00:10:46 itmon00 systemd[1]: pmlogger.service: Supervising process 25564 which is not our child. We'll most likely not notice when it exits.
== itmon02 (1 distinct, 54 total) ==
Jul 22 00:08:04 itmon02 sshd[1904]: error: beginning MaxStartups throttling [x54]
== jaws.cs.umd.edu (4 distinct, 5 total) ==
Jul 22 00:32:08 jaws.cs.umd.edu systemd-coredump[469019]: Process 469008 (podman) of user 981 dumped core.#012#012Stack trace of thread 469008:#012#0 0x000055e816b3946e internal/runtime/syscall/linux.Syscall6 (podman + 0x48b46e)#012#1 0x000055e816c190a6 syscall.Syscall (podman + 0x56b0a6)#012#2 0x000055e816c19c50 syscall.Syscall.abi0 (podman + 0x56bc50)#012#3 0x000055e816d83c2e github.com/containers/podman/vendor/golang.org/x/sys/unix.OpenTree (podman + 0x6d5c2e)#012#4 0x000055e8173dcf4b github.com/containers/podman/vendor/github.com/cyphar/filepath-securejoin/p… (podman + 0xd2ef4b)#012#5 0x000055e8173dce54 github.com/containers/podman/vendor/github.com/cyphar/filepath-securejoin/p… (podman + 0xd2ee54)#012#6 0x000055e816bccdcc sync.(*Once).doSlow (podman + 0x51edcc)#012#7 0x000055e816bcccf9 sync.(*Once).Do (podman + 0x51ecf9)#012#8 0x000055e8173dcdc5
github.com/containers/podman/vendor/github.com/cyphar/filepath-securejoin/p… (podman + 0xd2edc5)#012#9 0x000055e8173de3e2 github.com/containers/podman/vendor/github.com/cyphar/filepath-securejoin/p… (podman + 0xd303e2)#012#10 0x000055e8173de7f3 github.com/containers/podman/vendor/github.com/cyphar/filepath-securejoin/p… (podman + 0xd307f3)#012#11 0x000055e8173dd91c github.com/containers/podman/vendor/github.com/cyphar/filepath-securejoin/p… (podman + 0xd2f91c)#012#12 0x000055e8173dd358 github.com/containers/podman/vendor/github.com/cyphar/filepath-securejoin/p… (podman + 0xd2f358)#012#13 0x000055e816bccdcc sync.(*Once).doSlow (podman + 0x51edcc)#012#14 0x000055e816bcccf9 sync.(*Once).Do (
podman + 0x51ecf9)#012#15 0x000055e8173dd2c5 github.com/containers/podman/vendor/github.com/cyphar/filepath-securejoin/p… (podman + 0xd2f2c5)#012#16 0x000055e8173de79a github.com/containers/podman/vendor/github.com/cyphar/filepath-securejoin/p… (podman + 0xd3079a)#012#17 0x000055e8173e534e github.com/containers/podman/vendor/github.com/opencontainers/selinux/go-se… (podman + 0xd3734e)#012#18 0x000055e8173e5838 github.com/containers/podman/vendor/github.com/opencontainers/selinux/go-se… (podman + 0xd37838)#012#19 0x000055e8173e45df github.com/containers/podman/vendor/github.com/opencontainers/selinux/go-se… (podman + 0xd365df)#012#20 0x000055e8173e4873 github.com/containers/podman/vendor/github.com/opencontainers/selinux/go-se… (podman + 0xd36873)#012#21 0x000055
e8175dcf4b github.com/containers/podman/vendor/go.podman.io/common/pkg/config.defaultC… (podman + 0xf2ef4b)#012#22 0x000055e8175e0912 github.com/containers/podman/vendor/go.podman.io/common/pkg/config.newLocked (podman + 0xf32912)#012#23 0x000055e8175e0605 github.com/containers/podman/vendor/go.podman.io/common/pkg/config.New (podman + 0xf32605)#012#24 0x000055e817d53fd3 github.com/containers/podman/cmd/podman/registry.newPodmanConfig (podman + 0x16a5fd3)#012#25 0x000055e816bccdcc sync.(*Once).doSlow (podman + 0x51edcc)#012#26 0x000055e817d74c50 github.com/containers/podman/cmd/podman/common.init (podman + 0x16c6c50)#012#27 0x000055e816b92a57 runtime.doInit1 (podman + 0x4e4a57)#012#28 0x000055e816b82f90 runtime.main (podman + 0x4d4f90)#012#29 0x000055e816bc2ee1 runtime.goexit.abi0 (podman + 0x514ee1)#012ELF object binary architecture: AMD x86-64
Jul 22 00:32:08 jaws.cs.umd.edu systemd-coredump[469036]: Process 469028 (podman) of user 981 dumped core.#012#012Stack trace of thread 469028:#012#0 0x000055f5405e046e internal/runtime/syscall/linux.Syscall6 (podman + 0x48b46e)#012#1 0x000055f5406c00a6 syscall.Syscall (podman + 0x56b0a6)#012#2 0x000055f5406c0c50 syscall.Syscall.abi0 (podman + 0x56bc50)#012#3 0x000055f54082ac2e github.com/containers/podman/vendor/golang.org/x/sys/unix.OpenTree (podman + 0x6d5c2e)#012#4 0x000055f540e83f4b github.com/containers/podman/vendor/github.com/cyphar/filepath-securejoin/p… (podman + 0xd2ef4b)#012#5 0x000055f540e83e54 github.com/containers/podman/vendor/github.com/cyphar/filepath-securejoin/p… (podman + 0xd2ee54)#012#6 0x000055f540673dcc sync.(*Once).doSlow (podman + 0x51edcc)#012#7 0x000055f540673cf9 sync.(*Once).Do (podman + 0x51ecf9)#012#8 0x000055f540e83dc5
github.com/containers/podman/vendor/github.com/cyphar/filepath-securejoin/p… (podman + 0xd2edc5)#012#9 0x000055f540e853e2 github.com/containers/podman/vendor/github.com/cyphar/filepath-securejoin/p… (podman + 0xd303e2)#012#10 0x000055f540e857f3 github.com/containers/podman/vendor/github.com/cyphar/filepath-securejoin/p… (podman + 0xd307f3)#012#11 0x000055f540e8491c github.com/containers/podman/vendor/github.com/cyphar/filepath-securejoin/p… (podman + 0xd2f91c)#012#12 0x000055f540e84358 github.com/containers/podman/vendor/github.com/cyphar/filepath-securejoin/p… (podman + 0xd2f358)#012#13 0x000055f540673dcc sync.(*Once).doSlow (podman + 0x51edcc)#012#14 0x000055f540673cf9 sync.(*Once).Do (
podman + 0x51ecf9)#012#15 0x000055f540e842c5 github.com/containers/podman/vendor/github.com/cyphar/filepath-securejoin/p… (podman + 0xd2f2c5)#012#16 0x000055f540e8579a github.com/containers/podman/vendor/github.com/cyphar/filepath-securejoin/p… (podman + 0xd3079a)#012#17 0x000055f540e8c34e github.com/containers/podman/vendor/github.com/opencontainers/selinux/go-se… (podman + 0xd3734e)#012#18 0x000055f540e8c838 github.com/containers/podman/vendor/github.com/opencontainers/selinux/go-se… (podman + 0xd37838)#012#19 0x000055f540e8b5df github.com/containers/podman/vendor/github.com/opencontainers/selinux/go-se… (podman + 0xd365df)#012#20 0x000055f540e8b873 github.com/containers/podman/vendor/github.com/opencontainers/selinux/go-se… (podman + 0xd36873)#012#21 0x000055
f541083f4b github.com/containers/podman/vendor/go.podman.io/common/pkg/config.defaultC… (podman + 0xf2ef4b)#012#22 0x000055f541087912 github.com/containers/podman/vendor/go.podman.io/common/pkg/config.newLocked (podman + 0xf32912)#012#23 0x000055f541087605 github.com/containers/podman/vendor/go.podman.io/common/pkg/config.New (podman + 0xf32605)#012#24 0x000055f5417fafd3 github.com/containers/podman/cmd/podman/registry.newPodmanConfig (podman + 0x16a5fd3)#012#25 0x000055f540673dcc sync.(*Once).doSlow (podman + 0x51edcc)#012#26 0x000055f54181bc50 github.com/containers/podman/cmd/podman/common.init (podman + 0x16c6c50)#012#27 0x000055f540639a57 runtime.doInit1 (podman + 0x4e4a57)#012#28 0x000055f540629f90 runtime.main (podman + 0x4d4f90)#012#29 0x000055f540669ee1 runtime.goexit.abi0 (podman + 0x514ee1)#012ELF object binary architecture: AMD x86-64
Jul 22 00:32:10 jaws.cs.umd.edu systemd-coredump[469057]: Process 469050 (podman) of user 981 dumped core.#012#012Stack trace of thread 469050:#012#0 0x0000559e05d5a46e internal/runtime/syscall/linux.Syscall6 (podman + 0x48b46e)#012#1 0x0000559e05e3a0a6 syscall.Syscall (podman + 0x56b0a6)#012#2 0x0000559e05e3ac50 syscall.Syscall.abi0 (podman + 0x56bc50)#012#3 0x0000559e05fa4c2e github.com/containers/podman/vendor/golang.org/x/sys/unix.OpenTree (podman + 0x6d5c2e)#012#4 0x0000559e065fdf4b github.com/containers/podman/vendor/github.com/cyphar/filepath-securejoin/p… (podman + 0xd2ef4b)#012#5 0x0000559e065fde54 github.com/containers/podman/vendor/github.com/cyphar/filepath-securejoin/p… (podman + 0xd2ee54)#012#6 0x0000559e05deddcc sync.(*Once).doSlow (podman + 0x51edcc)#012#7 0x0000559e05dedcf9 sync.(*Once).Do (podman + 0x51ecf9)#012#8 0x0000559e065fddc5
github.com/containers/podman/vendor/github.com/cyphar/filepath-securejoin/p… (podman + 0xd2edc5)#012#9 0x0000559e065ff3e2 github.com/containers/podman/vendor/github.com/cyphar/filepath-securejoin/p… (podman + 0xd303e2)#012#10 0x0000559e065ff7f3 github.com/containers/podman/vendor/github.com/cyphar/filepath-securejoin/p… (podman + 0xd307f3)#012#11 0x0000559e065fe91c github.com/containers/podman/vendor/github.com/cyphar/filepath-securejoin/p… (podman + 0xd2f91c)#012#12 0x0000559e065fe358 github.com/containers/podman/vendor/github.com/cyphar/filepath-securejoin/p… (podman + 0xd2f358)#012#13 0x0000559e05deddcc sync.(*Once).doSlow (podman + 0x51edcc)#012#14 0x0000559e05dedcf9 sync.(*Once).Do (
podman + 0x51ecf9)#012#15 0x0000559e065fe2c5 github.com/containers/podman/vendor/github.com/cyphar/filepath-securejoin/p… (podman + 0xd2f2c5)#012#16 0x0000559e065ff79a github.com/containers/podman/vendor/github.com/cyphar/filepath-securejoin/p… (podman + 0xd3079a)#012#17 0x0000559e0660634e github.com/containers/podman/vendor/github.com/opencontainers/selinux/go-se… (podman + 0xd3734e)#012#18 0x0000559e06606838 github.com/containers/podman/vendor/github.com/opencontainers/selinux/go-se… (podman + 0xd37838)#012#19 0x0000559e066055df github.com/containers/podman/vendor/github.com/opencontainers/selinux/go-se… (podman + 0xd365df)#012#20 0x0000559e06605873 github.com/containers/podman/vendor/github.com/opencontainers/selinux/go-se… (podman + 0xd36873)#012#21 0x000055
9e067fdf4b github.com/containers/podman/vendor/go.podman.io/common/pkg/config.defaultC… (podman + 0xf2ef4b)#012#22 0x0000559e06801912 github.com/containers/podman/vendor/go.podman.io/common/pkg/config.newLocked (podman + 0xf32912)#012#23 0x0000559e06801605 github.com/containers/podman/vendor/go.podman.io/common/pkg/config.New (podman + 0xf32605)#012#24 0x0000559e06f74fd3 github.com/containers/podman/cmd/podman/registry.newPodmanConfig (podman + 0x16a5fd3)#012#25 0x0000559e05deddcc sync.(*Once).doSlow (podman + 0x51edcc)#012#26 0x0000559e06f95c50 github.com/containers/podman/cmd/podman/common.init (podman + 0x16c6c50)#012#27 0x0000559e05db3a57 runtime.doInit1 (podman + 0x4e4a57)#012#28 0x0000559e05da3f90 runtime.main (podman + 0x4d4f90)#012#29 0x0000559e05de3ee1 runtime.goexit.abi0 (podman + 0x514ee1)#012ELF object binary architecture: AMD x86-64
Jul 22 00:32:10 jaws.cs.umd.edu setroubleshoot[469018]: SELinux is preventing /usr/bin/podman from using the nnp_transition access on a process. For complete SELinux messages run: sealert -l 3c7643bc-dd69-4695-b48c-7d780b62b6cf [x2]
== jubjub.cs.umd.edu (3 distinct, 4 total) ==
Jul 22 00:10:13 jubjub.cs.umd.edu systemd[1]: New main PID 1876374 does not belong to service, and PID file is not owned by root. Refusing. [x2]
Jul 22 00:10:31 jubjub.cs.umd.edu systemd[1]: Daemon never wrote its PID file. Failing.
Jul 22 00:10:40 jubjub.cs.umd.edu systemd[1]: pmlogger.service: Supervising process 1883907 which is not our child. We'll most likely not notice when it exits.
== mirrors.cs.umd.edu (3 distinct, 4 total) ==
Jul 22 00:10:12 mirrors.cs.umd.edu systemd[1]: New main PID 7550 does not belong to service, and PID file is not owned by root. Refusing. [x2]
Jul 22 00:10:31 mirrors.cs.umd.edu systemd[1]: Daemon never wrote its PID file. Failing.
Jul 22 00:10:44 mirrors.cs.umd.edu systemd[1]: pmlogger.service: Supervising process 14582 which is not our child. We'll most likely not notice when it exits.
== misty.cs.umd.edu (3 distinct, 4 total) ==
Jul 22 00:10:15 misty.cs.umd.edu systemd[1]: New main PID 10795 does not belong to service, and PID file is not owned by root. Refusing. [x2]
Jul 22 00:10:35 misty.cs.umd.edu systemd[1]: Daemon never wrote its PID file. Failing.
Jul 22 00:10:51 misty.cs.umd.edu systemd[1]: pmlogger.service: Supervising process 18571 which is not our child. We'll most likely not notice when it exits.
== newhonors2 (1 distinct, 24 total) ==
Jul 22 00:13:03 newhonors2 dhcpcd[102274]: dhcpcd is not running [x24]
== openrepo (1 distinct, 1 total) ==
Jul 22 00:10:27 openrepo (nin-node)[3635722]: munin-node.service: Referenced but unset environment variable evaluates to an empty string: DAEMON_ARGS
== outbound00.cs.umd.edu (1 distinct, 6 total) ==
Jul 22 00:09:09 outbound00.cs.umd.edu python3[2458520]: ldapdb [x6]
== outbound01.cs.umd.edu (1 distinct, 6 total) ==
Jul 22 00:13:06 outbound01.cs.umd.edu python3[487040]: ldapdb [x6]
== sentry-docker00.cs.umd.edu (36 distinct, 36 total) ==
Jul 22 00:14:53 sentry-docker00.cs.umd.edu systemd-udevd[857430]: Could not generate persistent MAC address for veth3d38c22: No such file or directory
Jul 22 00:14:53 sentry-docker00.cs.umd.edu systemd-udevd[857431]: Could not generate persistent MAC address for veth37a64bd: No such file or directory
Jul 22 00:17:17 sentry-docker00.cs.umd.edu systemd-udevd[858582]: link_config: could not get ethtool features for veth6c70c22
Jul 22 00:17:17 sentry-docker00.cs.umd.edu systemd-udevd[858582]: Could not set offload features of veth6c70c22: No such device
Jul 22 00:17:17 sentry-docker00.cs.umd.edu systemd-udevd[858604]: Could not generate persistent MAC address for veth3cfc27a: No such file or directory
Jul 22 00:17:17 sentry-docker00.cs.umd.edu systemd-udevd[858605]: Could not generate persistent MAC address for veth85b9927: No such file or directory
Jul 22 00:17:17 sentry-docker00.cs.umd.edu systemd-udevd[858608]: Could not generate persistent MAC address for vethec45e00: No such file or directory
Jul 22 00:17:17 sentry-docker00.cs.umd.edu systemd-udevd[858609]: Could not generate persistent MAC address for veth1d4111f: No such file or directory
Jul 22 00:17:17 sentry-docker00.cs.umd.edu systemd-udevd[858632]: Could not generate persistent MAC address for veth6d10fcb: No such file or directory
Jul 22 00:17:17 sentry-docker00.cs.umd.edu systemd-udevd[858633]: Could not generate persistent MAC address for veth7fcb004: No such file or directory
Jul 22 00:17:17 sentry-docker00.cs.umd.edu systemd-udevd[858651]: Could not generate persistent MAC address for veth5ffcf83: No such file or directory
Jul 22 00:17:17 sentry-docker00.cs.umd.edu systemd-udevd[858648]: Could not generate persistent MAC address for vethe16f0c1: No such file or directory
Jul 22 00:34:58 sentry-docker00.cs.umd.edu systemd-udevd[866840]: Could not generate persistent MAC address for veth7451a92: No such file or directory
Jul 22 00:34:58 sentry-docker00.cs.umd.edu systemd-udevd[866841]: Could not generate persistent MAC address for veth72d53ad: No such file or directory
Jul 22 00:37:25 sentry-docker00.cs.umd.edu systemd-udevd[867979]: link_config: could not get ethtool features for vethec45e00
Jul 22 00:37:25 sentry-docker00.cs.umd.edu systemd-udevd[867979]: Could not set offload features of vethec45e00: No such device
Jul 22 00:37:25 sentry-docker00.cs.umd.edu systemd-udevd[868000]: Could not generate persistent MAC address for vethe00660d: No such file or directory
Jul 22 00:37:25 sentry-docker00.cs.umd.edu systemd-udevd[868001]: Could not generate persistent MAC address for vethecf6d2c: No such file or directory
Jul 22 00:37:25 sentry-docker00.cs.umd.edu systemd-udevd[868004]: Could not generate persistent MAC address for veth3506b85: No such file or directory
Jul 22 00:37:25 sentry-docker00.cs.umd.edu systemd-udevd[868006]: Could not generate persistent MAC address for veth9c91e09: No such file or directory
Jul 22 00:37:25 sentry-docker00.cs.umd.edu systemd-udevd[868028]: Could not generate persistent MAC address for veth3382ce1: No such file or directory
Jul 22 00:37:25 sentry-docker00.cs.umd.edu systemd-udevd[868029]: Could not generate persistent MAC address for vetha19dfd0: No such file or directory
Jul 22 00:37:25 sentry-docker00.cs.umd.edu systemd-udevd[868054]: Could not generate persistent MAC address for vethc51e555: No such file or directory
Jul 22 00:37:25 sentry-docker00.cs.umd.edu systemd-udevd[868055]: Could not generate persistent MAC address for veth587d049: No such file or directory
Jul 22 00:55:06 sentry-docker00.cs.umd.edu systemd-udevd[876286]: Could not generate persistent MAC address for vetha5a46cb: No such file or directory
Jul 22 00:55:06 sentry-docker00.cs.umd.edu systemd-udevd[876287]: Could not generate persistent MAC address for vethfeec889: No such file or directory
Jul 22 00:57:33 sentry-docker00.cs.umd.edu systemd-udevd[877459]: link_config: could not get ethtool features for vethc51e555
Jul 22 00:57:33 sentry-docker00.cs.umd.edu systemd-udevd[877459]: Could not set offload features of vethc51e555: No such device
Jul 22 00:57:33 sentry-docker00.cs.umd.edu systemd-udevd[877485]: Could not generate persistent MAC address for veth549806b: No such file or directory
Jul 22 00:57:33 sentry-docker00.cs.umd.edu systemd-udevd[877486]: Could not generate persistent MAC address for veth102e9fb: No such file or directory
... 6 more distinct messages not shown
== soul (1 distinct, 1 total) ==
Jul 22 01:03:52 soul krb5_child[1141562]: Client 'admin(a)UMD.EDU' not found in Kerberos database
== strawberry (3 distinct, 9 total) ==
Jul 22 00:09:44 strawberry udisksd[1067]: Error performing housekeeping for drive /org/freedesktop/UDisks2/drives/ST2000DM001_1CH164_W1E8J5KJ: Error updating SMART data: Error sending ATA command CHECK POWER MODE: Unexpected sense data returned:#0120000: 00 00 00 00 00 00 00 00 00 00 00 00 00 00 00 00 ................#0120010: 00 00 00 00 00 00 00 00 00 00 00 00 00 00 00 00 ................#012 (g-io-error-quark, 0) [x6]
Jul 22 00:34:42 strawberry smartd[5314]: Device: /dev/sda [SAT], failed to read SMART Attribute Data [x2]
Jul 22 01:04:42 strawberry smartd[5314]: Device: /dev/sda [SAT], not capable of Offline or Self-Testing.
== submit10-cln25 (3 distinct, 4 total) ==
Jul 22 00:10:11 submit10-cln25 systemd: New main PID 10160 does not belong to service, and PID file is not owned by root. Refusing. [x2]
Jul 22 00:10:29 submit10-cln25 systemd: Daemon never wrote its PID file. Failing.
Jul 22 00:10:35 submit10-cln25 systemd: pmlogger.service: Supervising process 17055 which is not our child. We'll most likely not notice when it exits.
== submit26-b9-2 (1 distinct, 8 total) ==
Jul 22 00:05:07 submit26-b9-2 systemd[1]: user(a)1001.service: Main process exited, code=killed, status=9/KILL [x8]
== teaching-awards (1 distinct, 1 total) ==
Jul 22 00:58:25 teaching-awards krb5_child[980195]: Client 'admin(a)UMD.EDU' not found in Kerberos database
== tma-0 (3 distinct, 4 total) ==
Jul 22 00:10:13 tma-0 systemd[1]: New main PID 26783 does not belong to service, and PID file is not owned by root. Refusing. [x2]
Jul 22 00:10:30 tma-0 systemd[1]: Daemon never wrote its PID file. Failing.
Jul 22 00:10:38 tma-0 systemd[1]: pmlogger.service: Supervising process 2057 which is not our child. We'll most likely not notice when it exits.
== uffish.cs.umd.edu (3 distinct, 4 total) ==
Jul 22 00:10:13 uffish.cs.umd.edu systemd[1]: New main PID 1452594 does not belong to service, and PID file is not owned by root. Refusing. [x2]
Jul 22 00:10:35 uffish.cs.umd.edu systemd[1]: Daemon never wrote its PID file. Failing.
Jul 22 00:10:52 uffish.cs.umd.edu systemd[1]: pmlogger.service: Supervising process 1459895 which is not our child. We'll most likely not notice when it exits.
== updates00.cs.umd.edu (3 distinct, 4 total) ==
Jul 22 00:10:12 updates00.cs.umd.edu systemd[1]: New main PID 20135 does not belong to service, and PID file is not owned by root. Refusing. [x2]
Jul 22 00:10:30 updates00.cs.umd.edu systemd[1]: Daemon never wrote its PID file. Failing.
Jul 22 00:10:36 updates00.cs.umd.edu systemd[1]: pmlogger.service: Supervising process 27036 which is not our child. We'll most likely not notice when it exits.
== vacuum.cs.umd.edu (3 distinct, 4 total) ==
Jul 22 00:10:14 vacuum.cs.umd.edu systemd[1]: New main PID 27763 does not belong to service, and PID file is not owned by root. Refusing. [x2]
Jul 22 00:10:33 vacuum.cs.umd.edu systemd[1]: Daemon never wrote its PID file. Failing.
Jul 22 00:10:44 vacuum.cs.umd.edu systemd[1]: pmlogger.service: Supervising process 3160 which is not our child. We'll most likely not notice when it exits.
== whiffle.cs.umd.edu (3 distinct, 4 total) ==
Jul 22 00:10:13 whiffle.cs.umd.edu systemd[1]: New main PID 1330102 does not belong to service, and PID file is not owned by root. Refusing. [x2]
Jul 22 00:10:32 whiffle.cs.umd.edu systemd[1]: Daemon never wrote its PID file. Failing.
Jul 22 00:10:46 whiffle.cs.umd.edu systemd[1]: pmlogger.service: Supervising process 1337626 which is not our child. We'll most likely not notice when it exits.
== zebatinsky.cs.umd.edu (2 distinct, 2 total) ==
Jul 22 00:15:29 zebatinsky.cs.umd.edu setroubleshoot[2445935]: SELinux is preventing pdns/comm-main from name_bind access on the udp_socket port 11211. For complete SELinux messages run: sealert -l 80daecc8-6aad-42dd-9955-c16139a8830b
Jul 22 00:24:29 zebatinsky.cs.umd.edu setroubleshoot[2446717]: SELinux is preventing pdns/comm-main from name_bind access on the udp_socket port 16509. For complete SELinux messages run: sealert -l d9886900-6794-4791-81d0-2ebdb3459096
1
0
Command: /usr/local/sbin/syslog-digest.py
Time : 0.4895s
Status : exited 0
Output :
Syslog digest — 2026-07-22 00:05 EDT
Processed 4,448 lines, filtered 3,669 (82%). 779 unknown (67 distinct) from 24 host(s).
== abadi-computer (1 distinct, 1 total) ==
Jul 22 00:00:00 abadi-computer kernel: kauditd_printk_skb: 161 callbacks suppressed
== abuse (1 distinct, 347 total) ==
Jul 21 23:05:06 abuse rsyslogd[21745]: imjournal: open() failed for path: '/var/lib/rsyslog/imjournal.state.tmp': Input/output error [v8.2404.0 try https://www.rsyslog.com/e/2433 ] [x347]
== b0b02.cs.umd.edu (1 distinct, 1 total) ==
Jul 21 23:10:25 b0b02.cs.umd.edu rustdesk[1479528]: cannot open display:
== cmsc436-0101-redis (2 distinct, 2 total) ==
Jul 21 23:49:32 cmsc436-0101-redis krb5_child[81022]: Client 'admin(a)UMD.EDU' not found in Kerberos database
Jul 21 23:49:34 cmsc436-0101-redis sshd-session[81018]: error: PAM: Authentication failure for admin from 45.154.244.149
== contest (1 distinct, 34 total) ==
Jul 21 23:05:09 contest goferd[994]: [ERROR][worker-0] gofer.messaging.adapter.connect:33 - connect: proton+amqps://satellite8.cs.umd.edu:5647, failed: Connection amqps://satellite8.cs.umd.edu:5647 disconnected: Condition('proton.pythonio', 'Connection refused to all addresses') [x34]
== csfw00a (1 distinct, 234 total) ==
Jul 21 23:05:22 csfw00a kernel: bnxt_en 0000:09:00.0 eth3: NIC Link is Down [x234]
== hackerman (1 distinct, 1 total) ==
Jul 21 23:19:01 hackerman gnome-software[2060381]: failed to commit changes to dconf: GDBus.Error:org.gtk.GDBus.UnmappedGError.Quark._g_2dfile_2derror_2dquark.Code2: Failed to create file “/adminhomes/sajith/.config/dconf/user.WTLBT3”: Permission denied
== idm00 (1 distinct, 1 total) ==
Jul 21 23:51:02 idm00 named[1455]: client @0x7f3315b04908 10.73.240.42#59485: update '73.10.in-addr.arpa/IN' denied
== idmp0 (1 distinct, 1 total) ==
Jul 21 23:34:57 idmp0 named[5198]: client @0x7f991c03bb68 10.73.240.43#63161: update '73.10.in-addr.arpa/IN' denied
== inbound01.cs.umd.edu (1 distinct, 1 total) ==
Jul 21 23:52:18 inbound01.cs.umd.edu krb5_child[486512]: Client 'admin(a)UMD.EDU' not found in Kerberos database
== itmon02 (1 distinct, 51 total) ==
Jul 21 23:07:56 itmon02 sshd[1904]: error: beginning MaxStartups throttling [x51]
== matrix (1 distinct, 1 total) ==
Jul 22 00:00:38 matrix (nin-node)[3226909]: munin-node.service: Referenced but unset environment variable evaluates to an empty string: DAEMON_ARGS
== neo-gizmonic (1 distinct, 1 total) ==
Jul 22 00:00:14 neo-gizmonic (nin-node)[3211703]: munin-node.service: Referenced but unset environment variable evaluates to an empty string: DAEMON_ARGS
== neoavion (1 distinct, 1 total) ==
Jul 22 00:00:28 neoavion (nin-node)[918665]: munin-node.service: Referenced but unset environment variable evaluates to an empty string: DAEMON_ARGS
== netbox (1 distinct, 1 total) ==
Jul 22 00:04:21 netbox (httpd)[3887931]: httpd.service: Referenced but unset environment variable evaluates to an empty string: OPTIONS
== netman.cs.umd.edu (3 distinct, 3 total) ==
Jul 21 23:55:13 netman.cs.umd.edu setroubleshoot[3040469]: SELinux is preventing /usr/bin/gpg from read access on the file gpg.conf. For complete SELinux messages run: sealert -l 019ad1da-a874-4814-8037-3b3e5f413ad2
Jul 21 23:55:13 netman.cs.umd.edu setroubleshoot[3040469]: SELinux is preventing /usr/bin/gpg from open access on the file /root/.gnupg/gpg.conf. For complete SELinux messages run: sealert -l cb54177e-d44c-46a1-b246-5c0bbb8343be
Jul 21 23:55:13 netman.cs.umd.edu setroubleshoot[3040469]: SELinux is preventing /usr/bin/gpg from getattr access on the file /root/.gnupg/gpg.conf. For complete SELinux messages run: sealert -l fbba2e30-b7ab-491c-9ec6-f553e9ef72af
== newhonors.cs.umd.edu (1 distinct, 1 total) ==
Jul 21 23:44:32 newhonors.cs.umd.edu sshd[29087]: fatal: Unable to negotiate with 34.156.189.82 port 44596: no matching key exchange method found. Their offer: diffie-hellman-group1-sha1 [preauth]
== newhonors2 (2 distinct, 25 total) ==
Jul 21 23:13:02 newhonors2 dhcpcd[100144]: dhcpcd is not running [x24]
Jul 22 00:00:01 newhonors2 (nin-node)[101736]: munin-node.service: Referenced but unset environment variable evaluates to an empty string: DAEMON_ARGS
== outbound00.cs.umd.edu (2 distinct, 7 total) ==
Jul 21 23:09:09 outbound00.cs.umd.edu python3[2444491]: ldapdb [x6]
Jul 22 00:02:52 outbound00.cs.umd.edu krb5_child[2457141]: Client 'admin(a)UMD.EDU' not found in Kerberos database
== outbound01.cs.umd.edu (3 distinct, 8 total) ==
Jul 21 23:13:06 outbound01.cs.umd.edu python3[472424]: ldapdb [x6]
Jul 22 00:00:18 outbound01.cs.umd.edu krb5_child[483690]: Client 'admin(a)UMD.EDU' not found in Kerberos database
Jul 22 00:00:31 outbound01.cs.umd.edu sshd-session[483722]: error: Protocol major versions differ: 2 vs. 1
== sentry-docker00.cs.umd.edu (36 distinct, 36 total) ==
Jul 21 23:14:33 sentry-docker00.cs.umd.edu systemd-udevd[829099]: Could not generate persistent MAC address for veth137f9d8: No such file or directory
Jul 21 23:14:33 sentry-docker00.cs.umd.edu systemd-udevd[829100]: Could not generate persistent MAC address for veth24f39fe: No such file or directory
Jul 21 23:16:52 sentry-docker00.cs.umd.edu systemd-udevd[830207]: link_config: could not get ethtool features for vethc3ef51d
Jul 21 23:16:52 sentry-docker00.cs.umd.edu systemd-udevd[830207]: Could not set offload features of vethc3ef51d: No such device
Jul 21 23:16:52 sentry-docker00.cs.umd.edu systemd-udevd[830224]: Could not generate persistent MAC address for veth59b825e: No such file or directory
Jul 21 23:16:52 sentry-docker00.cs.umd.edu systemd-udevd[830225]: Could not generate persistent MAC address for veth3db7b91: No such file or directory
Jul 21 23:16:52 sentry-docker00.cs.umd.edu systemd-udevd[830250]: Could not generate persistent MAC address for veth9827d5d: No such file or directory
Jul 21 23:16:52 sentry-docker00.cs.umd.edu systemd-udevd[830251]: Could not generate persistent MAC address for vethed5c2d7: No such file or directory
Jul 21 23:16:52 sentry-docker00.cs.umd.edu systemd-udevd[830285]: Could not generate persistent MAC address for veth12e44f3: No such file or directory
Jul 21 23:16:52 sentry-docker00.cs.umd.edu systemd-udevd[830283]: Could not generate persistent MAC address for vethe6c0925: No such file or directory
Jul 21 23:16:52 sentry-docker00.cs.umd.edu systemd-udevd[830355]: Could not generate persistent MAC address for veth8c15d6b: No such file or directory
Jul 21 23:16:52 sentry-docker00.cs.umd.edu systemd-udevd[830361]: Could not generate persistent MAC address for veth6d910d9: No such file or directory
Jul 21 23:34:41 sentry-docker00.cs.umd.edu systemd-udevd[838601]: Could not generate persistent MAC address for veth6ed5673: No such file or directory
Jul 21 23:34:41 sentry-docker00.cs.umd.edu systemd-udevd[838602]: Could not generate persistent MAC address for veth50164a9: No such file or directory
Jul 21 23:37:00 sentry-docker00.cs.umd.edu systemd-udevd[839692]: link_config: could not get ethtool features for vethe6c0925
Jul 21 23:37:00 sentry-docker00.cs.umd.edu systemd-udevd[839692]: Could not set offload features of vethe6c0925: No such device
Jul 21 23:37:00 sentry-docker00.cs.umd.edu systemd-udevd[839717]: Could not generate persistent MAC address for vethcd9125d: No such file or directory
Jul 21 23:37:00 sentry-docker00.cs.umd.edu systemd-udevd[839718]: Could not generate persistent MAC address for veth6bef145: No such file or directory
Jul 21 23:37:00 sentry-docker00.cs.umd.edu systemd-udevd[839743]: Could not generate persistent MAC address for vethd0d724d: No such file or directory
Jul 21 23:37:00 sentry-docker00.cs.umd.edu systemd-udevd[839744]: Could not generate persistent MAC address for veth32eeaa5: No such file or directory
Jul 21 23:37:00 sentry-docker00.cs.umd.edu systemd-udevd[839755]: Could not generate persistent MAC address for veth82a9972: No such file or directory
Jul 21 23:37:00 sentry-docker00.cs.umd.edu systemd-udevd[839766]: Could not generate persistent MAC address for veth0079c0f: No such file or directory
Jul 21 23:37:00 sentry-docker00.cs.umd.edu systemd-udevd[839797]: Could not generate persistent MAC address for vetha18c05c: No such file or directory
Jul 21 23:37:00 sentry-docker00.cs.umd.edu systemd-udevd[839799]: Could not generate persistent MAC address for veth1bbbc45: No such file or directory
Jul 21 23:54:49 sentry-docker00.cs.umd.edu systemd-udevd[848045]: Could not generate persistent MAC address for vethfac0842: No such file or directory
Jul 21 23:54:49 sentry-docker00.cs.umd.edu systemd-udevd[848046]: Could not generate persistent MAC address for veth17bd9bf: No such file or directory
Jul 21 23:57:08 sentry-docker00.cs.umd.edu systemd-udevd[849155]: link_config: could not get ethtool features for vethd0d724d
Jul 21 23:57:08 sentry-docker00.cs.umd.edu systemd-udevd[849155]: Could not set offload features of vethd0d724d: No such device
Jul 21 23:57:09 sentry-docker00.cs.umd.edu systemd-udevd[849178]: Could not generate persistent MAC address for veth5495ccf: No such file or directory
Jul 21 23:57:09 sentry-docker00.cs.umd.edu systemd-udevd[849179]: Could not generate persistent MAC address for veth4faf364: No such file or directory
... 6 more distinct messages not shown
== strawberry (2 distinct, 8 total) ==
Jul 21 23:09:44 strawberry udisksd[1067]: Error performing housekeeping for drive /org/freedesktop/UDisks2/drives/ST2000DM001_1CH164_W1E8J5KJ: Error updating SMART data: Error sending ATA command CHECK POWER MODE: Unexpected sense data returned:#0120000: 00 00 00 00 00 00 00 00 00 00 00 00 00 00 00 00 ................#0120010: 00 00 00 00 00 00 00 00 00 00 00 00 00 00 00 00 ................#012 (g-io-error-quark, 0) [x6]
Jul 21 23:34:42 strawberry smartd[5314]: Device: /dev/sda [SAT], failed to read SMART Attribute Data [x2]
== submit26-b9-2 (1 distinct, 12 total) ==
Jul 21 23:08:07 submit26-b9-2 systemd[1]: user(a)1001.service: Main process exited, code=killed, status=9/KILL [x12]
== wraith (1 distinct, 1 total) ==
Jul 22 00:00:23 wraith (nin-node)[294678]: munin-node.service: Referenced but unset environment variable evaluates to an empty string: DAEMON_ARGS
1
0
Command: /usr/local/sbin/syslog-digest.py
Time : 0.5361s
Status : exited 0
Output :
Syslog digest — 2026-07-21 23:05 EDT
Processed 4,608 lines, filtered 3,740 (81%). 868 unknown (154 distinct) from 22 host(s).
== abuse (1 distinct, 346 total) ==
Jul 21 22:05:06 abuse rsyslogd[21745]: imjournal: open() failed for path: '/var/lib/rsyslog/imjournal.state.tmp': Input/output error [v8.2404.0 try https://www.rsyslog.com/e/2433 ] [x346]
== b0b02.cs.umd.edu (1 distinct, 1 total) ==
Jul 21 22:10:21 b0b02.cs.umd.edu rustdesk[1464464]: cannot open display:
== bac102 (70 distinct, 78 total) ==
Jul 21 22:28:36 bac102 systemd-resolved[895]: Using degraded feature set UDP instead of UDP+EDNS0 for DNS server fe80::21c:42ff:fe00:18%2.
Jul 21 22:29:07 bac102 systemd-resolved[895]: Using degraded feature set TCP instead of UDP for DNS server fe80::21c:42ff:fe00:18%2.
Jul 21 22:29:18 bac102 puppet-agent[174781]: (Facter) invalid or malformed lldp data: MalformedDataError: no lldp interface data found
Jul 21 22:29:27 bac102 gnome-software[10182]: Only 0 apps for recent list, hiding [x2]
Jul 21 22:29:27 bac102 gnome-software[10182]: Only 0 apps for curated list, hiding [x2]
Jul 21 22:29:36 bac102 packagekitd[175274]: Failed to get cache filename for firefox [x2]
Jul 21 22:29:36 bac102 packagekitd[175274]: Failed to get cache filename for libtiff
Jul 21 22:29:36 bac102 packagekitd[175274]: Failed to get cache filename for glibc-devel
Jul 21 22:29:36 bac102 packagekitd[175274]: Failed to get cache filename for kernel-headers
Jul 21 22:29:36 bac102 packagekitd[175274]: Failed to get cache filename for perf
Jul 21 22:29:36 bac102 packagekitd[175274]: Failed to get cache filename for python3-perf
Jul 21 22:29:36 bac102 packagekitd[175274]: Failed to get cache filename for cups-filesystem [x3]
Jul 21 22:29:36 bac102 packagekitd[175274]: Failed to get cache filename for libipa_hbac
Jul 21 22:29:36 bac102 packagekitd[175274]: Failed to get cache filename for libsss_autofs
Jul 21 22:29:36 bac102 packagekitd[175274]: Failed to get cache filename for libsss_certmap
Jul 21 22:29:36 bac102 packagekitd[175274]: Failed to get cache filename for libsss_idmap
Jul 21 22:29:36 bac102 packagekitd[175274]: Failed to get cache filename for libsss_nss_idmap
Jul 21 22:29:36 bac102 packagekitd[175274]: Failed to get cache filename for libsss_sudo
Jul 21 22:29:36 bac102 packagekitd[175274]: Failed to get cache filename for python3-libipa_hbac
Jul 21 22:29:36 bac102 packagekitd[175274]: Failed to get cache filename for python3-sss
Jul 21 22:29:36 bac102 packagekitd[175274]: Failed to get cache filename for python3-sss-murmur
Jul 21 22:29:36 bac102 packagekitd[175274]: Failed to get cache filename for python3-sssdconfig
Jul 21 22:29:36 bac102 packagekitd[175274]: Failed to get cache filename for glib2
Jul 21 22:29:36 bac102 packagekitd[175274]: Failed to get cache filename for c-ares
Jul 21 22:29:36 bac102 packagekitd[175274]: Failed to get cache filename for glibc
Jul 21 22:29:36 bac102 packagekitd[175274]: Failed to get cache filename for glibc-all-langpacks
Jul 21 22:29:36 bac102 packagekitd[175274]: Failed to get cache filename for glibc-common
Jul 21 22:29:36 bac102 packagekitd[175274]: Failed to get cache filename for glibc-gconv-extra
Jul 21 22:29:36 bac102 packagekitd[175274]: Failed to get cache filename for glibc-langpack-en
Jul 21 22:29:36 bac102 packagekitd[175274]: Failed to get cache filename for acl
... 40 more distinct messages not shown
== bale (1 distinct, 1 total) ==
Jul 21 22:05:39 bale setroubleshoot[236043]: SELinux is preventing /usr/bin/tar from using the fowner capability. For complete SELinux messages run: sealert -l 8f58859c-1c63-4aee-afff-7c8e1dd95f45
== contest (9 distinct, 41 total) ==
Jul 21 22:06:15 contest goferd[994]: [ERROR][worker-0] gofer.messaging.adapter.connect:33 - connect: proton+amqps://satellite8.cs.umd.edu:5647, failed: Connection amqps://satellite8.cs.umd.edu:5647 disconnected: Condition('proton.pythonio', 'Connection refused to all addresses') [x33]
Jul 21 22:17:19 contest setroubleshoot[858558]: SELinux is preventing /usr/libexec/platform-python3.6 from create access on the directory libdnf.HlQSpZ. For complete SELinux messages run: sealert -l cb6b25c6-4765-4cf2-88a0-9b3b508e94e9
Jul 21 22:17:19 contest setroubleshoot[858558]: SELinux is preventing /usr/bin/gpgconf from add_name access on the directory repodata. For complete SELinux messages run: sealert -l 41cf7b1b-0f34-4609-98f2-b66e7825fef7
Jul 21 22:17:19 contest setroubleshoot[858558]: SELinux is preventing /usr/libexec/platform-python3.6 from create access on the file mirrorlist. For complete SELinux messages run: sealert -l fc20ff92-ea83-4f38-a24b-ddfd737a3141
Jul 21 22:17:19 contest setroubleshoot[858558]: SELinux is preventing /usr/libexec/platform-python3.6 from setattr access on the file repomd.xml. For complete SELinux messages run: sealert -l ac675631-fa35-4e93-adc9-b692b18e53e5
Jul 21 22:17:20 contest setroubleshoot[858558]: SELinux is preventing /usr/libexec/platform-python3.6 from read access on the directory libdnf.HlQSpZ. For complete SELinux messages run: sealert -l 45d103b6-0810-4890-a705-990118577ce8
Jul 21 22:17:24 contest setroubleshoot[858558]: SELinux is preventing /usr/libexec/platform-python3.6 from remove_name access on the directory repomd.xml. For complete SELinux messages run: sealert -l 7e499113-2fd7-4f67-bec6-3521efbe3637
Jul 21 22:17:27 contest setroubleshoot[858558]: SELinux is preventing rhsmcertd-worke from unlink access on the file repomd.xml. For complete SELinux messages run: sealert -l 22835727-7fef-4cfb-b3b5-881f66888317
Jul 21 22:17:40 contest setroubleshoot[858608]: SELinux is preventing /usr/libexec/platform-python3.6 from rmdir access on the directory repodata. For complete SELinux messages run: sealert -l 3928930b-a1ed-448d-950b-0665ac2adef8
== csfw00a (1 distinct, 232 total) ==
Jul 21 22:05:30 csfw00a kernel: bnxt_en 0000:09:00.0 eth3: NIC Link is Down [x232]
== frabjous (2 distinct, 2 total) ==
Jul 21 23:04:31 frabjous krb5_child[861731]: Client 'admin(a)UMD.EDU' not found in Kerberos database
Jul 21 23:04:32 frabjous sshd-session[861725]: error: PAM: Authentication failure for admin from 34.22.231.32
== grafana (2 distinct, 2 total) ==
Jul 21 22:32:40 grafana SetroubleshootPrivileged.py[6582 failed to retrieve rpm info for path '/var/lib/selinux/targeted/active/modules/200/grafana':
Jul 21 22:32:40 grafana setroubleshoot[65820]: SELinux is preventing /usr/sbin/grafana from name_connect access on the tcp_socket port 636. For complete SELinux messages run: sealert -l 04b7a852-a8e2-466a-9560-d51f3f685e71
== idm00 (1 distinct, 1 total) ==
Jul 21 22:51:02 idm00 named[1455]: client @0x7f331036a618 10.73.240.42#51440: update '73.10.in-addr.arpa/IN' denied
== idmp0 (1 distinct, 1 total) ==
Jul 21 22:34:57 idmp0 named[5198]: client @0x7f9934045438 10.73.240.43#51784: update '73.10.in-addr.arpa/IN' denied
== itmon02 (1 distinct, 44 total) ==
Jul 21 22:08:05 itmon02 sshd[1904]: error: beginning MaxStartups throttling [x44]
== jaws.cs.umd.edu (4 distinct, 4 total) ==
Jul 21 22:32:05 jaws.cs.umd.edu systemd-coredump[442413]: Process 442397 (podman) of user 981 dumped core.#012#012Stack trace of thread 442397:#012#0 0x0000558b9b6a546e internal/runtime/syscall/linux.Syscall6 (podman + 0x48b46e)#012#1 0x0000558b9b7850a6 syscall.Syscall (podman + 0x56b0a6)#012#2 0x0000558b9b785c50 syscall.Syscall.abi0 (podman + 0x56bc50)#012#3 0x0000558b9b8efc2e github.com/containers/podman/vendor/golang.org/x/sys/unix.OpenTree (podman + 0x6d5c2e)#012#4 0x0000558b9bf48f4b github.com/containers/podman/vendor/github.com/cyphar/filepath-securejoin/p… (podman + 0xd2ef4b)#012#5 0x0000558b9bf48e54 github.com/containers/podman/vendor/github.com/cyphar/filepath-securejoin/p… (podman + 0xd2ee54)#012#6 0x0000558b9b738dcc sync.(*Once).doSlow (podman + 0x51edcc)#012#7 0x0000558b9b738cf9 sync.(*Once).Do (podman + 0x51ecf9)#012#8 0x0000558b9bf48dc5
github.com/containers/podman/vendor/github.com/cyphar/filepath-securejoin/p… (podman + 0xd2edc5)#012#9 0x0000558b9bf4a3e2 github.com/containers/podman/vendor/github.com/cyphar/filepath-securejoin/p… (podman + 0xd303e2)#012#10 0x0000558b9bf4a7f3 github.com/containers/podman/vendor/github.com/cyphar/filepath-securejoin/p… (podman + 0xd307f3)#012#11 0x0000558b9bf4991c github.com/containers/podman/vendor/github.com/cyphar/filepath-securejoin/p… (podman + 0xd2f91c)#012#12 0x0000558b9bf49358 github.com/containers/podman/vendor/github.com/cyphar/filepath-securejoin/p… (podman + 0xd2f358)#012#13 0x0000558b9b738dcc sync.(*Once).doSlow (podman + 0x51edcc)#012#14 0x0000558b9b738cf9 sync.(*Once).Do (
podman + 0x51ecf9)#012#15 0x0000558b9bf492c5 github.com/containers/podman/vendor/github.com/cyphar/filepath-securejoin/p… (podman + 0xd2f2c5)#012#16 0x0000558b9bf4a79a github.com/containers/podman/vendor/github.com/cyphar/filepath-securejoin/p… (podman + 0xd3079a)#012#17 0x0000558b9bf5134e github.com/containers/podman/vendor/github.com/opencontainers/selinux/go-se… (podman + 0xd3734e)#012#18 0x0000558b9bf51838 github.com/containers/podman/vendor/github.com/opencontainers/selinux/go-se… (podman + 0xd37838)#012#19 0x0000558b9bf505df github.com/containers/podman/vendor/github.com/opencontainers/selinux/go-se… (podman + 0xd365df)#012#20 0x0000558b9bf50873 github.com/containers/podman/vendor/github.com/opencontainers/selinux/go-se… (podman + 0xd36873)#012#21 0x000055
8b9c148f4b github.com/containers/podman/vendor/go.podman.io/common/pkg/config.defaultC… (podman + 0xf2ef4b)#012#22 0x0000558b9c14c912 github.com/containers/podman/vendor/go.podman.io/common/pkg/config.newLocked (podman + 0xf32912)#012#23 0x0000558b9c14c605 github.com/containers/podman/vendor/go.podman.io/common/pkg/config.New (podman + 0xf32605)#012#24 0x0000558b9c8bffd3 github.com/containers/podman/cmd/podman/registry.newPodmanConfig (podman + 0x16a5fd3)#012#25 0x0000558b9b738dcc sync.(*Once).doSlow (podman + 0x51edcc)#012#26 0x0000558b9c8e0c50 github.com/containers/podman/cmd/podman/common.init (podman + 0x16c6c50)#012#27 0x0000558b9b6fea57 runtime.doInit1 (podman + 0x4e4a57)#012#28 0x0000558b9b6eef90 runtime.main (podman + 0x4d4f90)#012#29 0x0000558b9b72eee1 runtime.goexit.abi0 (podman + 0x514ee1)#012ELF object binary architecture: AMD x86-64
Jul 21 22:32:06 jaws.cs.umd.edu systemd-coredump[442437]: Process 442429 (podman) of user 981 dumped core.#012#012Stack trace of thread 442429:#012#0 0x000055b438ad046e internal/runtime/syscall/linux.Syscall6 (podman + 0x48b46e)#012#1 0x000055b438bb00a6 syscall.Syscall (podman + 0x56b0a6)#012#2 0x000055b438bb0c50 syscall.Syscall.abi0 (podman + 0x56bc50)#012#3 0x000055b438d1ac2e github.com/containers/podman/vendor/golang.org/x/sys/unix.OpenTree (podman + 0x6d5c2e)#012#4 0x000055b439373f4b github.com/containers/podman/vendor/github.com/cyphar/filepath-securejoin/p… (podman + 0xd2ef4b)#012#5 0x000055b439373e54 github.com/containers/podman/vendor/github.com/cyphar/filepath-securejoin/p… (podman + 0xd2ee54)#012#6 0x000055b438b63dcc sync.(*Once).doSlow (podman + 0x51edcc)#012#7 0x000055b438b63cf9 sync.(*Once).Do (podman + 0x51ecf9)#012#8 0x000055b439373dc5
github.com/containers/podman/vendor/github.com/cyphar/filepath-securejoin/p… (podman + 0xd2edc5)#012#9 0x000055b4393753e2 github.com/containers/podman/vendor/github.com/cyphar/filepath-securejoin/p… (podman + 0xd303e2)#012#10 0x000055b4393757f3 github.com/containers/podman/vendor/github.com/cyphar/filepath-securejoin/p… (podman + 0xd307f3)#012#11 0x000055b43937491c github.com/containers/podman/vendor/github.com/cyphar/filepath-securejoin/p… (podman + 0xd2f91c)#012#12 0x000055b439374358 github.com/containers/podman/vendor/github.com/cyphar/filepath-securejoin/p… (podman + 0xd2f358)#012#13 0x000055b438b63dcc sync.(*Once).doSlow (podman + 0x51edcc)#012#14 0x000055b438b63cf9 sync.(*Once).Do (
podman + 0x51ecf9)#012#15 0x000055b4393742c5 github.com/containers/podman/vendor/github.com/cyphar/filepath-securejoin/p… (podman + 0xd2f2c5)#012#16 0x000055b43937579a github.com/containers/podman/vendor/github.com/cyphar/filepath-securejoin/p… (podman + 0xd3079a)#012#17 0x000055b43937c34e github.com/containers/podman/vendor/github.com/opencontainers/selinux/go-se… (podman + 0xd3734e)#012#18 0x000055b43937c838 github.com/containers/podman/vendor/github.com/opencontainers/selinux/go-se… (podman + 0xd37838)#012#19 0x000055b43937b5df github.com/containers/podman/vendor/github.com/opencontainers/selinux/go-se… (podman + 0xd365df)#012#20 0x000055b43937b873 github.com/containers/podman/vendor/github.com/opencontainers/selinux/go-se… (podman + 0xd36873)#012#21 0x000055
b439573f4b github.com/containers/podman/vendor/go.podman.io/common/pkg/config.defaultC… (podman + 0xf2ef4b)#012#22 0x000055b439577912 github.com/containers/podman/vendor/go.podman.io/common/pkg/config.newLocked (podman + 0xf32912)#012#23 0x000055b439577605 github.com/containers/podman/vendor/go.podman.io/common/pkg/config.New (podman + 0xf32605)#012#24 0x000055b439ceafd3 github.com/containers/podman/cmd/podman/registry.newPodmanConfig (podman + 0x16a5fd3)#012#25 0x000055b438b63dcc sync.(*Once).doSlow (podman + 0x51edcc)#012#26 0x000055b439d0bc50 github.com/containers/podman/cmd/podman/common.init (podman + 0x16c6c50)#012#27 0x000055b438b29a57 runtime.doInit1 (podman + 0x4e4a57)#012#28 0x000055b438b19f90 runtime.main (podman + 0x4d4f90)#012#29 0x000055b438b59ee1 runtime.goexit.abi0 (podman + 0x514ee1)#012ELF object binary architecture: AMD x86-64
Jul 21 22:32:08 jaws.cs.umd.edu setroubleshoot[442412]: SELinux is preventing /usr/bin/podman from using the nnp_transition access on a process. For complete SELinux messages run: sealert -l 3c7643bc-dd69-4695-b48c-7d780b62b6cf
Jul 21 22:32:08 jaws.cs.umd.edu systemd-coredump[442467]: Process 442451 (podman) of user 981 dumped core.#012#012Stack trace of thread 442451:#012#0 0x000055ef3411546e internal/runtime/syscall/linux.Syscall6 (podman + 0x48b46e)#012#1 0x000055ef341f50a6 syscall.Syscall (podman + 0x56b0a6)#012#2 0x000055ef341f5c50 syscall.Syscall.abi0 (podman + 0x56bc50)#012#3 0x000055ef3435fc2e github.com/containers/podman/vendor/golang.org/x/sys/unix.OpenTree (podman + 0x6d5c2e)#012#4 0x000055ef349b8f4b github.com/containers/podman/vendor/github.com/cyphar/filepath-securejoin/p… (podman + 0xd2ef4b)#012#5 0x000055ef349b8e54 github.com/containers/podman/vendor/github.com/cyphar/filepath-securejoin/p… (podman + 0xd2ee54)#012#6 0x000055ef341a8dcc sync.(*Once).doSlow (podman + 0x51edcc)#012#7 0x000055ef341a8cf9 sync.(*Once).Do (podman + 0x51ecf9)#012#8 0x000055ef349b8dc5
github.com/containers/podman/vendor/github.com/cyphar/filepath-securejoin/p… (podman + 0xd2edc5)#012#9 0x000055ef349ba3e2 github.com/containers/podman/vendor/github.com/cyphar/filepath-securejoin/p… (podman + 0xd303e2)#012#10 0x000055ef349ba7f3 github.com/containers/podman/vendor/github.com/cyphar/filepath-securejoin/p… (podman + 0xd307f3)#012#11 0x000055ef349b991c github.com/containers/podman/vendor/github.com/cyphar/filepath-securejoin/p… (podman + 0xd2f91c)#012#12 0x000055ef349b9358 github.com/containers/podman/vendor/github.com/cyphar/filepath-securejoin/p… (podman + 0xd2f358)#012#13 0x000055ef341a8dcc sync.(*Once).doSlow (podman + 0x51edcc)#012#14 0x000055ef341a8cf9 sync.(*Once).Do (
podman + 0x51ecf9)#012#15 0x000055ef349b92c5 github.com/containers/podman/vendor/github.com/cyphar/filepath-securejoin/p… (podman + 0xd2f2c5)#012#16 0x000055ef349ba79a github.com/containers/podman/vendor/github.com/cyphar/filepath-securejoin/p… (podman + 0xd3079a)#012#17 0x000055ef349c134e github.com/containers/podman/vendor/github.com/opencontainers/selinux/go-se… (podman + 0xd3734e)#012#18 0x000055ef349c1838 github.com/containers/podman/vendor/github.com/opencontainers/selinux/go-se… (podman + 0xd37838)#012#19 0x000055ef349c05df github.com/containers/podman/vendor/github.com/opencontainers/selinux/go-se… (podman + 0xd365df)#012#20 0x000055ef349c0873 github.com/containers/podman/vendor/github.com/opencontainers/selinux/go-se… (podman + 0xd36873)#012#21 0x000055
ef34bb8f4b github.com/containers/podman/vendor/go.podman.io/common/pkg/config.defaultC… (podman + 0xf2ef4b)#012#22 0x000055ef34bbc912 github.com/containers/podman/vendor/go.podman.io/common/pkg/config.newLocked (podman + 0xf32912)#012#23 0x000055ef34bbc605 github.com/containers/podman/vendor/go.podman.io/common/pkg/config.New (podman + 0xf32605)#012#24 0x000055ef3532ffd3 github.com/containers/podman/cmd/podman/registry.newPodmanConfig (podman + 0x16a5fd3)#012#25 0x000055ef341a8dcc sync.(*Once).doSlow (podman + 0x51edcc)#012#26 0x000055ef35350c50 github.com/containers/podman/cmd/podman/common.init (podman + 0x16c6c50)#012#27 0x000055ef3416ea57 runtime.doInit1 (podman + 0x4e4a57)#012#28 0x000055ef3415ef90 runtime.main (podman + 0x4d4f90)#012#29 0x000055ef3419eee1 runtime.goexit.abi0 (podman + 0x514ee1)#012ELF object binary architecture: AMD x86-64
== krispykreme.cs.umd.edu (1 distinct, 2 total) ==
Jul 21 22:32:17 krispykreme.cs.umd.edu sshd-session[2008129]: pam_access(sshd:auth): access denied for user `kaptchuk' from `108.51.225.194' [x2]
== netman.cs.umd.edu (1 distinct, 4 total) ==
Jul 21 22:36:57 netman.cs.umd.edu krb5_child[3019589]: Client 'admin(a)UMD.EDU' not found in Kerberos database [x4]
== newhonors2 (1 distinct, 24 total) ==
Jul 21 22:13:03 newhonors2 dhcpcd[98304]: dhcpcd is not running [x24]
== outbound00.cs.umd.edu (1 distinct, 6 total) ==
Jul 21 22:09:09 outbound00.cs.umd.edu python3[2430539]: ldapdb [x6]
== outbound01.cs.umd.edu (1 distinct, 6 total) ==
Jul 21 22:13:06 outbound01.cs.umd.edu python3[458639]: ldapdb [x6]
== sentry-docker00.cs.umd.edu (38 distinct, 38 total) ==
Jul 21 22:14:16 sentry-docker00.cs.umd.edu systemd-udevd[800715]: Could not generate persistent MAC address for veth89bcc93: No such file or directory
Jul 21 22:14:16 sentry-docker00.cs.umd.edu systemd-udevd[800716]: Could not generate persistent MAC address for veth653647a: No such file or directory
Jul 21 22:16:27 sentry-docker00.cs.umd.edu systemd-udevd[801731]: link_config: could not set ethtool features for vethcfd7983
Jul 21 22:16:27 sentry-docker00.cs.umd.edu systemd-udevd[801731]: Could not set offload features of vethcfd7983: Operation not permitted
Jul 21 22:16:27 sentry-docker00.cs.umd.edu systemd-udevd[801796]: Could not generate persistent MAC address for vethb0f607a: No such file or directory
Jul 21 22:16:27 sentry-docker00.cs.umd.edu systemd-udevd[801797]: Could not generate persistent MAC address for veth778b634: No such file or directory
Jul 21 22:16:27 sentry-docker00.cs.umd.edu systemd-udevd[801800]: Could not generate persistent MAC address for vethce163c1: No such file or directory
Jul 21 22:16:27 sentry-docker00.cs.umd.edu systemd-udevd[801801]: Could not generate persistent MAC address for veth9fff619: No such file or directory
Jul 21 22:16:27 sentry-docker00.cs.umd.edu systemd-udevd[801824]: Could not generate persistent MAC address for vetha26123b: No such file or directory
Jul 21 22:16:27 sentry-docker00.cs.umd.edu systemd-udevd[801825]: Could not generate persistent MAC address for vethe72b50d: No such file or directory
Jul 21 22:16:27 sentry-docker00.cs.umd.edu systemd-udevd[801850]: Could not generate persistent MAC address for veth5f5f712: No such file or directory
Jul 21 22:16:27 sentry-docker00.cs.umd.edu systemd-udevd[801851]: Could not generate persistent MAC address for veth1cebc1b: No such file or directory
Jul 21 22:34:20 sentry-docker00.cs.umd.edu systemd-udevd[810166]: Could not generate persistent MAC address for vethe0f4de2: No such file or directory
Jul 21 22:34:20 sentry-docker00.cs.umd.edu systemd-udevd[810167]: Could not generate persistent MAC address for veth9de1744: No such file or directory
Jul 21 22:36:35 sentry-docker00.cs.umd.edu systemd-udevd[811266]: link_config: could not get ethtool features for vetha26123b
Jul 21 22:36:35 sentry-docker00.cs.umd.edu systemd-udevd[811266]: Could not set offload features of vetha26123b: No such device
Jul 21 22:36:35 sentry-docker00.cs.umd.edu systemd-udevd[811288]: Could not generate persistent MAC address for veth2dc2bf4: No such file or directory
Jul 21 22:36:35 sentry-docker00.cs.umd.edu systemd-udevd[811289]: Could not generate persistent MAC address for veth4d6cc8d: No such file or directory
Jul 21 22:36:35 sentry-docker00.cs.umd.edu systemd-udevd[811292]: Could not generate persistent MAC address for veth914f680: No such file or directory
Jul 21 22:36:35 sentry-docker00.cs.umd.edu systemd-udevd[811293]: Could not generate persistent MAC address for veth08d5bc4: No such file or directory
Jul 21 22:36:35 sentry-docker00.cs.umd.edu systemd-udevd[811316]: Could not generate persistent MAC address for veth713908b: No such file or directory
Jul 21 22:36:35 sentry-docker00.cs.umd.edu systemd-udevd[811317]: Could not generate persistent MAC address for veth8e0995c: No such file or directory
Jul 21 22:36:35 sentry-docker00.cs.umd.edu systemd-udevd[811342]: Could not generate persistent MAC address for veth441db9e: No such file or directory
Jul 21 22:36:35 sentry-docker00.cs.umd.edu systemd-udevd[811343]: Could not generate persistent MAC address for vetheb3320d: No such file or directory
Jul 21 22:54:24 sentry-docker00.cs.umd.edu systemd-udevd[819622]: link_config: could not get ethtool features for vethe0f4de2
Jul 21 22:54:24 sentry-docker00.cs.umd.edu systemd-udevd[819622]: Could not set offload features of vethe0f4de2: No such device
Jul 21 22:54:24 sentry-docker00.cs.umd.edu systemd-udevd[819639]: Could not generate persistent MAC address for vethccf9ec7: No such file or directory
Jul 21 22:54:24 sentry-docker00.cs.umd.edu systemd-udevd[819640]: Could not generate persistent MAC address for vethb886c1d: No such file or directory
Jul 21 22:56:43 sentry-docker00.cs.umd.edu systemd-udevd[820778]: link_config: could not set ethtool features for veth713908b
Jul 21 22:56:43 sentry-docker00.cs.umd.edu systemd-udevd[820778]: Could not set offload features of veth713908b: Operation not permitted
... 8 more distinct messages not shown
== strawberry (2 distinct, 8 total) ==
Jul 21 22:09:44 strawberry udisksd[1067]: Error performing housekeeping for drive /org/freedesktop/UDisks2/drives/ST2000DM001_1CH164_W1E8J5KJ: Error updating SMART data: Error sending ATA command CHECK POWER MODE: Unexpected sense data returned:#0120000: 00 00 00 00 00 00 00 00 00 00 00 00 00 00 00 00 ................#0120010: 00 00 00 00 00 00 00 00 00 00 00 00 00 00 00 00 ................#012 (g-io-error-quark, 0) [x6]
Jul 21 22:34:42 strawberry smartd[5314]: Device: /dev/sda [SAT], failed to read SMART Attribute Data [x2]
== submit26-b9-2 (10 distinct, 21 total) ==
Jul 21 22:08:07 submit26-b9-2 systemd[1]: user(a)1001.service: Main process exited, code=killed, status=9/KILL [x12]
Jul 21 22:38:53 submit26-b9-2 setroubleshoot[162053]: SELinux is preventing /usr/bin/python3.9 from create access on the directory /(null). For complete SELinux messages run: sealert -l d506243c-d61e-48f3-b42a-4592c913deb0
Jul 21 22:38:53 submit26-b9-2 setroubleshoot[162053]: SELinux is preventing /usr/bin/python3.9 from add_name access on the directory /(null). For complete SELinux messages run: sealert -l 3b4752ac-1b9a-4af9-a05b-32e4c2eb13ab
Jul 21 22:38:53 submit26-b9-2 setroubleshoot[162053]: SELinux is preventing /usr/bin/python3.9 from create access on the file /(null). For complete SELinux messages run: sealert -l 29e5adbd-4381-4467-b40d-a2219101e096
Jul 21 22:38:53 submit26-b9-2 setroubleshoot[162053]: SELinux is preventing /usr/bin/python3.9 from open access on the file /tmp/libdnf.0BzN54/repodata/repomd.xml. For complete SELinux messages run: sealert -l 1b38f2ec-01ce-4343-8059-ba7494ecc5c4
Jul 21 22:38:53 submit26-b9-2 setroubleshoot[162053]: SELinux is preventing /usr/bin/python3.9 from setattr access on the file repomd.xml. For complete SELinux messages run: sealert -l e5f9af40-1f63-4924-b012-27ab2a7b2266
Jul 21 22:38:53 submit26-b9-2 setroubleshoot[162053]: SELinux is preventing /usr/bin/python3.9 from read access on the directory libdnf.0BzN54. For complete SELinux messages run: sealert -l 5c54db87-54a3-4a7c-97b4-b5c48d6c3543
Jul 21 22:38:53 submit26-b9-2 setroubleshoot[162053]: SELinux is preventing /usr/bin/python3.9 from remove_name access on the directory repomd.xml. For complete SELinux messages run: sealert -l 63cd60e1-1e61-4276-afea-dd8526ffe8b2
Jul 21 22:38:53 submit26-b9-2 setroubleshoot[162053]: SELinux is preventing /usr/bin/python3.9 from unlink access on the file repomd.xml. For complete SELinux messages run: sealert -l 81c7e9ec-e023-4c6d-b1ad-c02a242e655e
Jul 21 22:38:53 submit26-b9-2 setroubleshoot[162053]: SELinux is preventing /usr/bin/python3.9 from rmdir access on the directory repodata. For complete SELinux messages run: sealert -l 6ae9a597-e123-4d74-8eec-a8ebe0f5e4d0
== talkhosts9 (1 distinct, 2 total) ==
Jul 21 22:58:42 talkhosts9 setroubleshoot[2664343]: SELinux is preventing /usr/bin/lsof from getattr access on the unix_stream_socket unix_stream_socket. For complete SELinux messages run: sealert -l a6df89b3-c497-469c-8232-c4fde0508abf [x2]
== vacuum.cs.umd.edu (4 distinct, 4 total) ==
Jul 21 22:11:57 vacuum.cs.umd.edu abrt-hook-ccpp[29538]: Process 25051 (driver) of user 33 killed by SIGSEGV - dumping core
Jul 21 22:11:57 vacuum.cs.umd.edu abrt-server[29540]: Package 'amanda-backup_server' isn't signed with proper key
Jul 21 22:11:57 vacuum.cs.umd.edu abrt-server[29540]: 'post-create' on '/var/spool/abrt/ccpp-2026-07-21-22:11:57-25051' exited with 1
Jul 21 22:11:57 vacuum.cs.umd.edu abrt-server[29540]: Deleting problem directory '/var/spool/abrt/ccpp-2026-07-21-22:11:57-25051'
1
0
Command: /usr/local/sbin/syslog-digest.py
Time : 0.5008s
Status : exited 0
Output :
Syslog digest — 2026-07-21 22:05 EDT
Processed 4,431 lines, filtered 3,640 (82%). 791 unknown (86 distinct) from 20 host(s).
== abadi-computer (3 distinct, 5 total) ==
Jul 21 21:08:05 abadi-computer falcon-sensor-bpf[529]: CrowdStrike(4): Could not retrieve DisableProxy value: c0000225 [x2]
Jul 21 21:08:05 abadi-computer falcon-sensor-bpf[529]: CrowdStrike(4): ConnectWithProxy: Unable to get application proxy host from CsConfig: c0000225 [x2]
Jul 21 21:08:16 abadi-computer kernel: kauditd_printk_skb: 512 callbacks suppressed
== abuse (1 distinct, 347 total) ==
Jul 21 21:05:06 abuse rsyslogd[21745]: imjournal: open() failed for path: '/var/lib/rsyslog/imjournal.state.tmp': Input/output error [v8.2404.0 try https://www.rsyslog.com/e/2433 ] [x347]
== b0b02.cs.umd.edu (1 distinct, 1 total) ==
Jul 21 21:10:18 b0b02.cs.umd.edu rustdesk[1449255]: cannot open display:
== bac102 (10 distinct, 10 total) ==
Jul 21 20:01:14 bac102 puppet-agent[147547]: (/File[/opt/puppetlabs/puppet/cache/lib]) Failed to generate additional resources using 'eval_generate': Request to https://openvox08-cmp2.cs.umd.edu:8140/puppet/v3/file_metadatas/plugins?rec… timed out read operation after 54776.292 seconds
Jul 21 20:01:14 bac102 puppet-agent[147547]: (/File[/opt/puppetlabs/puppet/cache/lib]) Wrapped exception:
Jul 21 20:01:14 bac102 puppet-agent[147547]: (/File[/opt/puppetlabs/puppet/cache/lib]) Net::ReadTimeout with #<TCPSocket:(closed)>
Jul 21 20:01:30 bac102 puppet-agent[147547]: (Facter) invalid or malformed lldp data: MalformedDataError: no lldp interface data found
Jul 21 22:03:28 bac102 puppet-agent[147547]: Could not retrieve catalog from remote server: Request to https://openvox08-cmp0.cs.umd.edu:8140/puppet/v3/catalog/bac102.cs.umd.edu?… timed out read operation after 7314.048 seconds
Jul 21 22:03:28 bac102 puppet-agent[147547]: Wrapped exception:
Jul 21 22:03:28 bac102 puppet-agent[147547]: Net::ReadTimeout with #<TCPSocket:(closed)>
Jul 21 22:03:28 bac102 puppet-agent[147547]: Not using cache on failed catalog
Jul 21 22:03:28 bac102 puppet-agent[147547]: Could not retrieve catalog; skipping run
Jul 21 22:03:29 bac102 setroubleshoot[171336]: failed to retrieve rpm info for path '/etc/aliases.lmdb':
== biggulp.cs.umd.edu (3 distinct, 3 total) ==
Jul 21 21:44:48 biggulp.cs.umd.edu sshd-session[3543250]: pam_access(sshd:auth): access denied for user `admin' from `45.154.244.149'
Jul 21 21:44:48 biggulp.cs.umd.edu krb5_child[3543252]: Client 'admin(a)UMD.EDU' not found in Kerberos database
Jul 21 21:44:48 biggulp.cs.umd.edu sshd-session[3543248]: error: PAM: System error for admin from 45.154.244.149
== contest (1 distinct, 34 total) ==
Jul 21 21:05:33 contest goferd[994]: [ERROR][worker-0] gofer.messaging.adapter.connect:33 - connect: proton+amqps://satellite8.cs.umd.edu:5647, failed: Connection amqps://satellite8.cs.umd.edu:5647 disconnected: Condition('proton.pythonio', 'Connection refused to all addresses') [x34]
== csfw00a (1 distinct, 224 total) ==
Jul 21 21:04:41 csfw00a kernel: bnxt_en 0000:09:00.0 eth3: NIC Link is Down [x224]
== hackerman (1 distinct, 1 total) ==
Jul 21 21:19:01 hackerman gnome-software[2060381]: failed to commit changes to dconf: GDBus.Error:org.gtk.GDBus.UnmappedGError.Quark._g_2dfile_2derror_2dquark.Code2: Failed to create file “/adminhomes/sajith/.config/dconf/user.G8RDT3”: Permission denied
== idm00 (1 distinct, 1 total) ==
Jul 21 21:51:02 idm00 named[1455]: client @0x7f330c5f12a8 10.73.240.42#65256: update '73.10.in-addr.arpa/IN' denied
== idmp0 (1 distinct, 1 total) ==
Jul 21 21:34:57 idmp0 named[5198]: client @0x7f9930012608 10.73.240.43#59423: update '73.10.in-addr.arpa/IN' denied
== itmon02 (1 distinct, 44 total) ==
Jul 21 21:12:57 itmon02 sshd[1904]: error: beginning MaxStartups throttling [x44]
== netman.cs.umd.edu (1 distinct, 2 total) ==
Jul 21 21:47:50 netman.cs.umd.edu krb5_child[3005598]: Client 'admin(a)UMD.EDU' not found in Kerberos database [x2]
== newhonors2 (1 distinct, 24 total) ==
Jul 21 21:13:03 newhonors2 dhcpcd[96463]: dhcpcd is not running [x24]
== outbound00.cs.umd.edu (1 distinct, 6 total) ==
Jul 21 21:09:09 outbound00.cs.umd.edu python3[2416777]: ldapdb [x6]
== outbound01.cs.umd.edu (1 distinct, 6 total) ==
Jul 21 21:13:07 outbound01.cs.umd.edu python3[444666]: ldapdb [x6]
== sentry-docker00.cs.umd.edu (36 distinct, 36 total) ==
Jul 21 21:13:55 sentry-docker00.cs.umd.edu systemd-udevd[772336]: Could not generate persistent MAC address for vethdef62c2: No such file or directory
Jul 21 21:13:55 sentry-docker00.cs.umd.edu systemd-udevd[772337]: Could not generate persistent MAC address for vethc405070: No such file or directory
Jul 21 21:16:02 sentry-docker00.cs.umd.edu systemd-udevd[773355]: link_config: could not get ethtool features for veth88a6e37
Jul 21 21:16:02 sentry-docker00.cs.umd.edu systemd-udevd[773355]: Could not set offload features of veth88a6e37: No such device
Jul 21 21:16:02 sentry-docker00.cs.umd.edu systemd-udevd[773424]: Could not generate persistent MAC address for vethc7492f9: No such file or directory
Jul 21 21:16:02 sentry-docker00.cs.umd.edu systemd-udevd[773425]: Could not generate persistent MAC address for veth2f91b98: No such file or directory
Jul 21 21:16:02 sentry-docker00.cs.umd.edu systemd-udevd[773428]: Could not generate persistent MAC address for veth7359775: No such file or directory
Jul 21 21:16:02 sentry-docker00.cs.umd.edu systemd-udevd[773429]: Could not generate persistent MAC address for vethe796186: No such file or directory
Jul 21 21:16:02 sentry-docker00.cs.umd.edu systemd-udevd[773452]: Could not generate persistent MAC address for veth10e85e6: No such file or directory
Jul 21 21:16:02 sentry-docker00.cs.umd.edu systemd-udevd[773453]: Could not generate persistent MAC address for veth445a100: No such file or directory
Jul 21 21:16:02 sentry-docker00.cs.umd.edu systemd-udevd[773471]: Could not generate persistent MAC address for veth16ccf49: No such file or directory
Jul 21 21:16:02 sentry-docker00.cs.umd.edu systemd-udevd[773478]: Could not generate persistent MAC address for vethe51a428: No such file or directory
Jul 21 21:33:59 sentry-docker00.cs.umd.edu systemd-udevd[781736]: Could not generate persistent MAC address for veth501bc05: No such file or directory
Jul 21 21:33:59 sentry-docker00.cs.umd.edu systemd-udevd[781737]: Could not generate persistent MAC address for vethc1c9dc8: No such file or directory
Jul 21 21:36:10 sentry-docker00.cs.umd.edu systemd-udevd[782797]: link_config: could not get ethtool features for vethc7492f9
Jul 21 21:36:10 sentry-docker00.cs.umd.edu systemd-udevd[782797]: Could not set offload features of vethc7492f9: No such device
Jul 21 21:36:10 sentry-docker00.cs.umd.edu systemd-udevd[782829]: Could not generate persistent MAC address for veth9a8e42a: No such file or directory
Jul 21 21:36:10 sentry-docker00.cs.umd.edu systemd-udevd[782830]: Could not generate persistent MAC address for veth69f5aef: No such file or directory
Jul 21 21:36:10 sentry-docker00.cs.umd.edu systemd-udevd[782833]: Could not generate persistent MAC address for veth7232ab9: No such file or directory
Jul 21 21:36:10 sentry-docker00.cs.umd.edu systemd-udevd[782834]: Could not generate persistent MAC address for vethc999152: No such file or directory
Jul 21 21:36:10 sentry-docker00.cs.umd.edu systemd-udevd[782841]: Could not generate persistent MAC address for veth4cf9315: No such file or directory
Jul 21 21:36:10 sentry-docker00.cs.umd.edu systemd-udevd[782850]: Could not generate persistent MAC address for veth07676e8: No such file or directory
Jul 21 21:36:10 sentry-docker00.cs.umd.edu systemd-udevd[782841]: Could not generate persistent MAC address for veth7b4dd4b: No such file or directory
Jul 21 21:36:10 sentry-docker00.cs.umd.edu systemd-udevd[782838]: Could not generate persistent MAC address for vetha547466: No such file or directory
Jul 21 21:54:07 sentry-docker00.cs.umd.edu systemd-udevd[791221]: Could not generate persistent MAC address for veth1e30268: No such file or directory
Jul 21 21:54:07 sentry-docker00.cs.umd.edu systemd-udevd[791222]: Could not generate persistent MAC address for vethf576611: No such file or directory
Jul 21 21:56:19 sentry-docker00.cs.umd.edu systemd-udevd[792317]: link_config: could not get ethtool features for vetha547466
Jul 21 21:56:19 sentry-docker00.cs.umd.edu systemd-udevd[792317]: Could not set offload features of vetha547466: No such device
Jul 21 21:56:19 sentry-docker00.cs.umd.edu systemd-udevd[792331]: Could not generate persistent MAC address for veth3861087: No such file or directory
Jul 21 21:56:19 sentry-docker00.cs.umd.edu systemd-udevd[792332]: Could not generate persistent MAC address for vethad2a13c: No such file or directory
... 6 more distinct messages not shown
== strawberry (2 distinct, 8 total) ==
Jul 21 21:09:44 strawberry udisksd[1067]: Error performing housekeeping for drive /org/freedesktop/UDisks2/drives/ST2000DM001_1CH164_W1E8J5KJ: Error updating SMART data: Error sending ATA command CHECK POWER MODE: Unexpected sense data returned:#0120000: 00 00 00 00 00 00 00 00 00 00 00 00 00 00 00 00 ................#0120010: 00 00 00 00 00 00 00 00 00 00 00 00 00 00 00 00 ................#012 (g-io-error-quark, 0) [x6]
Jul 21 21:34:42 strawberry smartd[5314]: Device: /dev/sda [SAT], failed to read SMART Attribute Data [x2]
== submit26-b9-2 (1 distinct, 12 total) ==
Jul 21 21:08:06 submit26-b9-2 systemd[1]: user(a)1001.service: Main process exited, code=killed, status=9/KILL [x12]
== submit26-b9-3 (9 distinct, 12 total) ==
Jul 21 21:20:33 submit26-b9-3 setroubleshoot[494034]: SELinux is preventing /usr/bin/python3.9 from create access on the directory /(null). For complete SELinux messages run: sealert -l 5b912a44-22fd-4560-b201-2a4e289b73f5
Jul 21 21:20:33 submit26-b9-3 setroubleshoot[494034]: SELinux is preventing /usr/bin/python3.9 from add_name access on the directory /(null). For complete SELinux messages run: sealert -l 7f1df1e4-725e-4953-98eb-1079f908f543
Jul 21 21:20:33 submit26-b9-3 setroubleshoot[494034]: SELinux is preventing /usr/bin/python3.9 from create access on the file /(null). For complete SELinux messages run: sealert -l 40b8852a-f77b-44b4-affe-5f11fa33de43 [x2]
Jul 21 21:20:33 submit26-b9-3 setroubleshoot[494034]: SELinux is preventing /usr/bin/python3.9 from open access on the file /tmp/libdnf.iQ6mLv/repodata/repomd.xml. For complete SELinux messages run: sealert -l 45a8019e-f6b5-4baa-92c1-862594b40d46 [x2]
Jul 21 21:20:33 submit26-b9-3 setroubleshoot[494034]: SELinux is preventing /usr/bin/python3.9 from setattr access on the file repomd.xml. For complete SELinux messages run: sealert -l e9f0bfff-7784-4126-baa4-2bb06da56591 [x2]
Jul 21 21:20:33 submit26-b9-3 setroubleshoot[494034]: SELinux is preventing /usr/bin/python3.9 from read access on the directory libdnf.iQ6mLv. For complete SELinux messages run: sealert -l 0b17cc3d-cdc6-4fe2-a11f-3892e7c41dc7
Jul 21 21:20:33 submit26-b9-3 setroubleshoot[494034]: SELinux is preventing /usr/bin/python3.9 from remove_name access on the directory repomd.xml. For complete SELinux messages run: sealert -l 10e38c64-b65f-4cdd-901e-4375652d9a42
Jul 21 21:20:33 submit26-b9-3 setroubleshoot[494034]: SELinux is preventing /usr/bin/python3.9 from unlink access on the file repomd.xml. For complete SELinux messages run: sealert -l 7fd9cf72-ef38-48e1-b6aa-b571b26a7b22
Jul 21 21:20:33 submit26-b9-3 setroubleshoot[494034]: SELinux is preventing /usr/bin/python3.9 from rmdir access on the directory repodata. For complete SELinux messages run: sealert -l b9b11116-89bd-4a3c-980c-1d422c5dcee4
== submit26-clnb9 (10 distinct, 14 total) ==
Jul 21 21:31:51 submit26-clnb9 setroubleshoot[1112972]: SELinux is preventing /usr/bin/python3.9 from create access on the directory /(null). For complete SELinux messages run: sealert -l 6783ed2b-5ae4-42b5-975a-4bf50eec4658 [x2]
Jul 21 21:31:51 submit26-clnb9 setroubleshoot[1112972]: SELinux is preventing /usr/bin/python3.9 from add_name access on the directory /(null). For complete SELinux messages run: sealert -l 9e7fa955-cc30-4804-ac8c-e1779e85946c [x2]
Jul 21 21:31:51 submit26-clnb9 setroubleshoot[1112972]: SELinux is preventing /usr/bin/python3.9 from create access on the file /(null). For complete SELinux messages run: sealert -l 69bfa6e3-089c-40ff-9563-fd30787d0774
Jul 21 21:31:51 submit26-clnb9 setroubleshoot[1112972]: SELinux is preventing /usr/bin/python3.9 from open access on the file /tmp/libdnf.7Er5pc/repodata/repomd.xml. For complete SELinux messages run: sealert -l 001acdb5-31ef-4e52-b10b-90f467a89ddc
Jul 21 21:31:51 submit26-clnb9 setroubleshoot[1112972]: SELinux is preventing /usr/bin/python3.9 from setattr access on the file repomd.xml. For complete SELinux messages run: sealert -l edacddcf-16ed-4dc3-8d82-7c597d5dee23
Jul 21 21:31:51 submit26-clnb9 setroubleshoot[1112972]: SELinux is preventing /usr/bin/python3.9 from read access on the directory libdnf.7Er5pc. For complete SELinux messages run: sealert -l 62b3782e-4730-4488-8178-94dafe9b552c
Jul 21 21:31:51 submit26-clnb9 setroubleshoot[1112972]: SELinux is preventing /usr/bin/python3.9 from remove_name access on the directory repomd.xml. For complete SELinux messages run: sealert -l 81cb3698-78f8-440a-8e3c-e5d1041e6b78 [x2]
Jul 21 21:31:51 submit26-clnb9 setroubleshoot[1112972]: SELinux is preventing /usr/bin/python3.9 from unlink access on the file repomd.xml. For complete SELinux messages run: sealert -l 792b472a-115c-4799-9805-fc7436f916b9
Jul 21 21:31:51 submit26-clnb9 setroubleshoot[1112972]: SELinux is preventing /usr/bin/python3.9 from rmdir access on the directory repodata. For complete SELinux messages run: sealert -l 15c83a86-837b-41e2-b662-b39cd4e361cb [x2]
Jul 21 21:31:51 submit26-clnb9 setroubleshoot[1112972]: SELinux is preventing /usr/bin/python3.9 from read access on the directory libdnf.GYF68Q. For complete SELinux messages run: sealert -l 62b3782e-4730-4488-8178-94dafe9b552c
1
0
Command: /usr/local/sbin/syslog-digest.py
Time : 0.5382s
Status : exited 0
Output :
Syslog digest — 2026-07-21 21:05 EDT
Processed 5,087 lines, filtered 4,270 (83%). 817 unknown (69 distinct) from 17 host(s).
== abuse (1 distinct, 348 total) ==
Jul 21 20:05:06 abuse rsyslogd[21745]: imjournal: open() failed for path: '/var/lib/rsyslog/imjournal.state.tmp': Input/output error [v8.2404.0 try https://www.rsyslog.com/e/2433 ] [x348]
== b0b02.cs.umd.edu (1 distinct, 1 total) ==
Jul 21 20:10:14 b0b02.cs.umd.edu rustdesk[1434156]: cannot open display:
== biggulp.cs.umd.edu (1 distinct, 2 total) ==
Jul 21 21:02:26 biggulp.cs.umd.edu sshd-session[3536919]: pam_access(sshd:auth): access denied for user `kaptchuk' from `108.51.225.194' [x2]
== cheezit.cs.umd.edu (1 distinct, 1 total) ==
Jul 21 20:56:02 cheezit.cs.umd.edu sshd-session[462079]: pam_access(sshd:auth): access denied for user `egolub' from `108.28.255.142'
== contest (1 distinct, 33 total) ==
Jul 21 20:06:38 contest goferd[994]: [ERROR][worker-0] gofer.messaging.adapter.connect:33 - connect: proton+amqps://satellite8.cs.umd.edu:5647, failed: Connection amqps://satellite8.cs.umd.edu:5647 disconnected: Condition('proton.pythonio', 'Connection refused to all addresses') [x33]
== csfw00a (2 distinct, 278 total) ==
Jul 21 20:04:42 csfw00a kernel: bnxt_en 0000:09:00.0 eth3: NIC Link is Down [x274]
Jul 21 21:00:23 csfw00a ospf6d[1477]: [EC 100663307] Could not send entire message [x4]
== grosh (1 distinct, 9 total) ==
Jul 21 20:06:17 grosh kernel: snd_hda_codec_nvhdmi hdaudioC1D0: HDMI: pin NID 0x7 not registered [x9]
== idm00 (1 distinct, 1 total) ==
Jul 21 20:51:01 idm00 named[1455]: client @0x7f331036a618 10.73.240.42#53460: update '73.10.in-addr.arpa/IN' denied
== idmp0 (1 distinct, 1 total) ==
Jul 21 20:34:57 idmp0 named[5198]: client @0x7f990c000cc8 10.73.240.43#63813: update '73.10.in-addr.arpa/IN' denied
== itmon02 (1 distinct, 37 total) ==
Jul 21 20:07:58 itmon02 sshd[1904]: error: beginning MaxStartups throttling [x37]
== jaws.cs.umd.edu (4 distinct, 5 total) ==
Jul 21 20:32:03 jaws.cs.umd.edu systemd-coredump[415951]: Process 415935 (podman) of user 981 dumped core.#012#012Stack trace of thread 415935:#012#0 0x000055fd41bc946e internal/runtime/syscall/linux.Syscall6 (podman + 0x48b46e)#012#1 0x000055fd41ca90a6 syscall.Syscall (podman + 0x56b0a6)#012#2 0x000055fd41ca9c50 syscall.Syscall.abi0 (podman + 0x56bc50)#012#3 0x000055fd41e13c2e github.com/containers/podman/vendor/golang.org/x/sys/unix.OpenTree (podman + 0x6d5c2e)#012#4 0x000055fd4246cf4b github.com/containers/podman/vendor/github.com/cyphar/filepath-securejoin/p… (podman + 0xd2ef4b)#012#5 0x000055fd4246ce54 github.com/containers/podman/vendor/github.com/cyphar/filepath-securejoin/p… (podman + 0xd2ee54)#012#6 0x000055fd41c5cdcc sync.(*Once).doSlow (podman + 0x51edcc)#012#7 0x000055fd41c5ccf9 sync.(*Once).Do (podman + 0x51ecf9)#012#8 0x000055fd4246cdc5
github.com/containers/podman/vendor/github.com/cyphar/filepath-securejoin/p… (podman + 0xd2edc5)#012#9 0x000055fd4246e3e2 github.com/containers/podman/vendor/github.com/cyphar/filepath-securejoin/p… (podman + 0xd303e2)#012#10 0x000055fd4246e7f3 github.com/containers/podman/vendor/github.com/cyphar/filepath-securejoin/p… (podman + 0xd307f3)#012#11 0x000055fd4246d91c github.com/containers/podman/vendor/github.com/cyphar/filepath-securejoin/p… (podman + 0xd2f91c)#012#12 0x000055fd4246d358 github.com/containers/podman/vendor/github.com/cyphar/filepath-securejoin/p… (podman + 0xd2f358)#012#13 0x000055fd41c5cdcc sync.(*Once).doSlow (podman + 0x51edcc)#012#14 0x000055fd41c5ccf9 sync.(*Once).Do (
podman + 0x51ecf9)#012#15 0x000055fd4246d2c5 github.com/containers/podman/vendor/github.com/cyphar/filepath-securejoin/p… (podman + 0xd2f2c5)#012#16 0x000055fd4246e79a github.com/containers/podman/vendor/github.com/cyphar/filepath-securejoin/p… (podman + 0xd3079a)#012#17 0x000055fd4247534e github.com/containers/podman/vendor/github.com/opencontainers/selinux/go-se… (podman + 0xd3734e)#012#18 0x000055fd42475838 github.com/containers/podman/vendor/github.com/opencontainers/selinux/go-se… (podman + 0xd37838)#012#19 0x000055fd424745df github.com/containers/podman/vendor/github.com/opencontainers/selinux/go-se… (podman + 0xd365df)#012#20 0x000055fd42474873 github.com/containers/podman/vendor/github.com/opencontainers/selinux/go-se… (podman + 0xd36873)#012#21 0x000055
fd4266cf4b github.com/containers/podman/vendor/go.podman.io/common/pkg/config.defaultC… (podman + 0xf2ef4b)#012#22 0x000055fd42670912 github.com/containers/podman/vendor/go.podman.io/common/pkg/config.newLocked (podman + 0xf32912)#012#23 0x000055fd42670605 github.com/containers/podman/vendor/go.podman.io/common/pkg/config.New (podman + 0xf32605)#012#24 0x000055fd42de3fd3 github.com/containers/podman/cmd/podman/registry.newPodmanConfig (podman + 0x16a5fd3)#012#25 0x000055fd41c5cdcc sync.(*Once).doSlow (podman + 0x51edcc)#012#26 0x000055fd42e04c50 github.com/containers/podman/cmd/podman/common.init (podman + 0x16c6c50)#012#27 0x000055fd41c22a57 runtime.doInit1 (podman + 0x4e4a57)#012#28 0x000055fd41c12f90 runtime.main (podman + 0x4d4f90)#012#29 0x000055fd41c52ee1 runtime.goexit.abi0 (podman + 0x514ee1)#012ELF object binary architecture: AMD x86-64
Jul 21 20:32:04 jaws.cs.umd.edu systemd-coredump[416003]: Process 415978 (podman) of user 981 dumped core.#012#012Stack trace of thread 415978:#012#0 0x0000561e1c1b646e internal/runtime/syscall/linux.Syscall6 (podman + 0x48b46e)#012#1 0x0000561e1c2960a6 syscall.Syscall (podman + 0x56b0a6)#012#2 0x0000561e1c296c50 syscall.Syscall.abi0 (podman + 0x56bc50)#012#3 0x0000561e1c400c2e github.com/containers/podman/vendor/golang.org/x/sys/unix.OpenTree (podman + 0x6d5c2e)#012#4 0x0000561e1ca59f4b github.com/containers/podman/vendor/github.com/cyphar/filepath-securejoin/p… (podman + 0xd2ef4b)#012#5 0x0000561e1ca59e54 github.com/containers/podman/vendor/github.com/cyphar/filepath-securejoin/p… (podman + 0xd2ee54)#012#6 0x0000561e1c249dcc sync.(*Once).doSlow (podman + 0x51edcc)#012#7 0x0000561e1c249cf9 sync.(*Once).Do (podman + 0x51ecf9)#012#8 0x0000561e1ca59dc5
github.com/containers/podman/vendor/github.com/cyphar/filepath-securejoin/p… (podman + 0xd2edc5)#012#9 0x0000561e1ca5b3e2 github.com/containers/podman/vendor/github.com/cyphar/filepath-securejoin/p… (podman + 0xd303e2)#012#10 0x0000561e1ca5b7f3 github.com/containers/podman/vendor/github.com/cyphar/filepath-securejoin/p… (podman + 0xd307f3)#012#11 0x0000561e1ca5a91c github.com/containers/podman/vendor/github.com/cyphar/filepath-securejoin/p… (podman + 0xd2f91c)#012#12 0x0000561e1ca5a358 github.com/containers/podman/vendor/github.com/cyphar/filepath-securejoin/p… (podman + 0xd2f358)#012#13 0x0000561e1c249dcc sync.(*Once).doSlow (podman + 0x51edcc)#012#14 0x0000561e1c249cf9 sync.(*Once).Do (
podman + 0x51ecf9)#012#15 0x0000561e1ca5a2c5 github.com/containers/podman/vendor/github.com/cyphar/filepath-securejoin/p… (podman + 0xd2f2c5)#012#16 0x0000561e1ca5b79a github.com/containers/podman/vendor/github.com/cyphar/filepath-securejoin/p… (podman + 0xd3079a)#012#17 0x0000561e1ca6234e github.com/containers/podman/vendor/github.com/opencontainers/selinux/go-se… (podman + 0xd3734e)#012#18 0x0000561e1ca62838 github.com/containers/podman/vendor/github.com/opencontainers/selinux/go-se… (podman + 0xd37838)#012#19 0x0000561e1ca615df github.com/containers/podman/vendor/github.com/opencontainers/selinux/go-se… (podman + 0xd365df)#012#20 0x0000561e1ca61873 github.com/containers/podman/vendor/github.com/opencontainers/selinux/go-se… (podman + 0xd36873)#012#21 0x000056
1e1cc59f4b github.com/containers/podman/vendor/go.podman.io/common/pkg/config.defaultC… (podman + 0xf2ef4b)#012#22 0x0000561e1cc5d912 github.com/containers/podman/vendor/go.podman.io/common/pkg/config.newLocked (podman + 0xf32912)#012#23 0x0000561e1cc5d605 github.com/containers/podman/vendor/go.podman.io/common/pkg/config.New (podman + 0xf32605)#012#24 0x0000561e1d3d0fd3 github.com/containers/podman/cmd/podman/registry.newPodmanConfig (podman + 0x16a5fd3)#012#25 0x0000561e1c249dcc sync.(*Once).doSlow (podman + 0x51edcc)#012#26 0x0000561e1d3f1c50 github.com/containers/podman/cmd/podman/common.init (podman + 0x16c6c50)#012#27 0x0000561e1c20fa57 runtime.doInit1 (podman + 0x4e4a57)#012#28 0x0000561e1c1fff90 runtime.main (podman + 0x4d4f90)#012#29 0x0000561e1c23fee1 runtime.goexit.abi0 (podman + 0x514ee1)#012ELF object binary architecture: AMD x86-64
Jul 21 20:32:06 jaws.cs.umd.edu systemd-coredump[416042]: Process 416032 (podman) of user 981 dumped core.#012#012Stack trace of thread 416032:#012#0 0x00005586e36e946e internal/runtime/syscall/linux.Syscall6 (podman + 0x48b46e)#012#1 0x00005586e37c90a6 syscall.Syscall (podman + 0x56b0a6)#012#2 0x00005586e37c9c50 syscall.Syscall.abi0 (podman + 0x56bc50)#012#3 0x00005586e3933c2e github.com/containers/podman/vendor/golang.org/x/sys/unix.OpenTree (podman + 0x6d5c2e)#012#4 0x00005586e3f8cf4b github.com/containers/podman/vendor/github.com/cyphar/filepath-securejoin/p… (podman + 0xd2ef4b)#012#5 0x00005586e3f8ce54 github.com/containers/podman/vendor/github.com/cyphar/filepath-securejoin/p… (podman + 0xd2ee54)#012#6 0x00005586e377cdcc sync.(*Once).doSlow (podman + 0x51edcc)#012#7 0x00005586e377ccf9 sync.(*Once).Do (podman + 0x51ecf9)#012#8 0x00005586e3f8cdc5
github.com/containers/podman/vendor/github.com/cyphar/filepath-securejoin/p… (podman + 0xd2edc5)#012#9 0x00005586e3f8e3e2 github.com/containers/podman/vendor/github.com/cyphar/filepath-securejoin/p… (podman + 0xd303e2)#012#10 0x00005586e3f8e7f3 github.com/containers/podman/vendor/github.com/cyphar/filepath-securejoin/p… (podman + 0xd307f3)#012#11 0x00005586e3f8d91c github.com/containers/podman/vendor/github.com/cyphar/filepath-securejoin/p… (podman + 0xd2f91c)#012#12 0x00005586e3f8d358 github.com/containers/podman/vendor/github.com/cyphar/filepath-securejoin/p… (podman + 0xd2f358)#012#13 0x00005586e377cdcc sync.(*Once).doSlow (podman + 0x51edcc)#012#14 0x00005586e377ccf9 sync.(*Once).Do (
podman + 0x51ecf9)#012#15 0x00005586e3f8d2c5 github.com/containers/podman/vendor/github.com/cyphar/filepath-securejoin/p… (podman + 0xd2f2c5)#012#16 0x00005586e3f8e79a github.com/containers/podman/vendor/github.com/cyphar/filepath-securejoin/p… (podman + 0xd3079a)#012#17 0x00005586e3f9534e github.com/containers/podman/vendor/github.com/opencontainers/selinux/go-se… (podman + 0xd3734e)#012#18 0x00005586e3f95838 github.com/containers/podman/vendor/github.com/opencontainers/selinux/go-se… (podman + 0xd37838)#012#19 0x00005586e3f945df github.com/containers/podman/vendor/github.com/opencontainers/selinux/go-se… (podman + 0xd365df)#012#20 0x00005586e3f94873 github.com/containers/podman/vendor/github.com/opencontainers/selinux/go-se… (podman + 0xd36873)#012#21 0x000055
86e418cf4b github.com/containers/podman/vendor/go.podman.io/common/pkg/config.defaultC… (podman + 0xf2ef4b)#012#22 0x00005586e4190912 github.com/containers/podman/vendor/go.podman.io/common/pkg/config.newLocked (podman + 0xf32912)#012#23 0x00005586e4190605 github.com/containers/podman/vendor/go.podman.io/common/pkg/config.New (podman + 0xf32605)#012#24 0x00005586e4903fd3 github.com/containers/podman/cmd/podman/registry.newPodmanConfig (podman + 0x16a5fd3)#012#25 0x00005586e377cdcc sync.(*Once).doSlow (podman + 0x51edcc)#012#26 0x00005586e4924c50 github.com/containers/podman/cmd/podman/common.init (podman + 0x16c6c50)#012#27 0x00005586e3742a57 runtime.doInit1 (podman + 0x4e4a57)#012#28 0x00005586e3732f90 runtime.main (podman + 0x4d4f90)#012#29 0x00005586e3772ee1 runtime.goexit.abi0 (podman + 0x514ee1)#012ELF object binary architecture: AMD x86-64
Jul 21 20:32:06 jaws.cs.umd.edu setroubleshoot[415950]: SELinux is preventing /usr/bin/podman from using the nnp_transition access on a process. For complete SELinux messages run: sealert -l 3c7643bc-dd69-4695-b48c-7d780b62b6cf [x2]
== newhonors2 (1 distinct, 24 total) ==
Jul 21 20:13:02 newhonors2 dhcpcd[94620]: dhcpcd is not running [x24]
== outbound00.cs.umd.edu (1 distinct, 6 total) ==
Jul 21 20:09:08 outbound00.cs.umd.edu python3[2403002]: ldapdb [x6]
== outbound01.cs.umd.edu (2 distinct, 7 total) ==
Jul 21 20:05:54 outbound01.cs.umd.edu krb5_child[429569]: Preauthentication failed
Jul 21 20:13:06 outbound01.cs.umd.edu python3[430872]: ldapdb [x6]
== sentry-docker00.cs.umd.edu (40 distinct, 40 total) ==
Jul 21 20:13:38 sentry-docker00.cs.umd.edu systemd-udevd[744041]: Could not generate persistent MAC address for veth15412a2: No such file or directory
Jul 21 20:13:38 sentry-docker00.cs.umd.edu systemd-udevd[744042]: Could not generate persistent MAC address for veth974becd: No such file or directory
Jul 21 20:15:37 sentry-docker00.cs.umd.edu systemd-udevd[745044]: link_config: could not get ethtool features for vethb75c8d6
Jul 21 20:15:37 sentry-docker00.cs.umd.edu systemd-udevd[745044]: Could not set offload features of vethb75c8d6: No such device
Jul 21 20:15:37 sentry-docker00.cs.umd.edu systemd-udevd[745045]: link_config: could not get ethtool features for vethbf51c8b
Jul 21 20:15:37 sentry-docker00.cs.umd.edu systemd-udevd[745045]: Could not set offload features of vethbf51c8b: No such device
Jul 21 20:15:37 sentry-docker00.cs.umd.edu systemd-udevd[745072]: Could not generate persistent MAC address for veth4503a1d: No such file or directory
Jul 21 20:15:37 sentry-docker00.cs.umd.edu systemd-udevd[745073]: Could not generate persistent MAC address for vetheadb46c: No such file or directory
Jul 21 20:15:37 sentry-docker00.cs.umd.edu systemd-udevd[745091]: Could not generate persistent MAC address for veth323458c: No such file or directory
Jul 21 20:15:37 sentry-docker00.cs.umd.edu systemd-udevd[745080]: Could not generate persistent MAC address for veth0d69cd1: No such file or directory
Jul 21 20:15:37 sentry-docker00.cs.umd.edu systemd-udevd[745100]: Could not generate persistent MAC address for veth6a6c4e5: No such file or directory
Jul 21 20:15:37 sentry-docker00.cs.umd.edu systemd-udevd[745101]: Could not generate persistent MAC address for veth17bb044: No such file or directory
Jul 21 20:15:37 sentry-docker00.cs.umd.edu systemd-udevd[745148]: Could not generate persistent MAC address for veth76f5f71: No such file or directory
Jul 21 20:15:37 sentry-docker00.cs.umd.edu systemd-udevd[745154]: Could not generate persistent MAC address for vethb875f1c: No such file or directory
Jul 21 20:33:46 sentry-docker00.cs.umd.edu systemd-udevd[753493]: link_config: could not get ethtool features for veth15412a2
Jul 21 20:33:46 sentry-docker00.cs.umd.edu systemd-udevd[753493]: Could not set offload features of veth15412a2: No such device
Jul 21 20:33:46 sentry-docker00.cs.umd.edu systemd-udevd[753509]: Could not generate persistent MAC address for vethb776265: No such file or directory
Jul 21 20:33:46 sentry-docker00.cs.umd.edu systemd-udevd[753510]: Could not generate persistent MAC address for vethc08b311: No such file or directory
Jul 21 20:35:45 sentry-docker00.cs.umd.edu systemd-udevd[754498]: link_config: could not get ethtool features for veth323458c
Jul 21 20:35:45 sentry-docker00.cs.umd.edu systemd-udevd[754498]: Could not set offload features of veth323458c: No such device
Jul 21 20:35:45 sentry-docker00.cs.umd.edu systemd-udevd[754519]: Could not generate persistent MAC address for veth0ca57d1: No such file or directory
Jul 21 20:35:45 sentry-docker00.cs.umd.edu systemd-udevd[754520]: Could not generate persistent MAC address for veth5509ef0: No such file or directory
Jul 21 20:35:45 sentry-docker00.cs.umd.edu systemd-udevd[754538]: Could not generate persistent MAC address for veth72fa1e3: No such file or directory
Jul 21 20:35:45 sentry-docker00.cs.umd.edu systemd-udevd[754543]: Could not generate persistent MAC address for veth257ff06: No such file or directory
Jul 21 20:35:45 sentry-docker00.cs.umd.edu systemd-udevd[754547]: Could not generate persistent MAC address for vethb7779f0: No such file or directory
Jul 21 20:35:45 sentry-docker00.cs.umd.edu systemd-udevd[754548]: Could not generate persistent MAC address for vethfd0a734: No such file or directory
Jul 21 20:35:45 sentry-docker00.cs.umd.edu systemd-udevd[754573]: Could not generate persistent MAC address for veth0ee13c3: No such file or directory
Jul 21 20:35:45 sentry-docker00.cs.umd.edu systemd-udevd[754574]: Could not generate persistent MAC address for veth6c117b3: No such file or directory
Jul 21 20:53:51 sentry-docker00.cs.umd.edu systemd-udevd[762954]: Could not generate persistent MAC address for vethdb534a4: No such file or directory
Jul 21 20:53:51 sentry-docker00.cs.umd.edu systemd-udevd[762955]: Could not generate persistent MAC address for veth10f77ee: No such file or directory
... 10 more distinct messages not shown
== strawberry (2 distinct, 8 total) ==
Jul 21 20:09:44 strawberry udisksd[1067]: Error performing housekeeping for drive /org/freedesktop/UDisks2/drives/ST2000DM001_1CH164_W1E8J5KJ: Error updating SMART data: Error sending ATA command CHECK POWER MODE: Unexpected sense data returned:#0120000: 00 00 00 00 00 00 00 00 00 00 00 00 00 00 00 00 ................#0120010: 00 00 00 00 00 00 00 00 00 00 00 00 00 00 00 00 ................#012 (g-io-error-quark, 0) [x6]
Jul 21 20:34:42 strawberry smartd[5314]: Device: /dev/sda [SAT], failed to read SMART Attribute Data [x2]
== submit26-b9-2 (8 distinct, 16 total) ==
Jul 21 20:05:07 submit26-b9-2 systemd[1]: user(a)1001.service: Main process exited, code=killed, status=9/KILL [x9]
Jul 21 20:05:10 submit26-b9-2 systemd-coredump[139622]: Process 139619 (simavr) of user 1001 dumped core.
Jul 21 20:05:10 submit26-b9-2 systemd-coredump[139662]: Process 139659 (simavr) of user 1001 dumped core.
Jul 21 20:25:12 submit26-b9-2 systemd-coredump[142748]: Process 142745 (simavr) of user 1001 dumped core.
Jul 21 20:25:12 submit26-b9-2 systemd-coredump[142788]: Process 142785 (simavr) of user 1001 dumped core.
Jul 21 20:26:00 submit26-b9-2 systemd-coredump[142829]: Process 142826 (simavr) of user 1001 dumped core.
Jul 21 20:46:15 submit26-b9-2 systemd-coredump[146406]: Process 146403 (simavr) of user 1001 dumped core.
Jul 21 20:46:15 submit26-b9-2 systemd-coredump[146446]: Process 146443 (simavr) of user 1001 dumped core.
1
0
Command: /usr/local/sbin/syslog-digest.py
Time : 0.5336s
Status : exited 0
Output :
Syslog digest — 2026-07-21 20:05 EDT
Processed 4,685 lines, filtered 3,697 (78%). 988 unknown (165 distinct) from 53 host(s).
== abadi-computer (2 distinct, 2 total) ==
Jul 21 19:32:45 abadi-computer falcon-sensor-bpf[529]: CrowdStrike(4): Could not retrieve DisableProxy value: c0000225
Jul 21 19:32:45 abadi-computer falcon-sensor-bpf[529]: CrowdStrike(4): ConnectWithProxy: Unable to get application proxy host from CsConfig: c0000225
== abuse (1 distinct, 349 total) ==
Jul 21 19:05:06 abuse rsyslogd[21745]: imjournal: open() failed for path: '/var/lib/rsyslog/imjournal.state.tmp': Input/output error [v8.2404.0 try https://www.rsyslog.com/e/2433 ] [x349]
== ai-course (2 distinct, 2 total) ==
Jul 21 19:46:27 ai-course falcon-sensor-bpf[663]: CrowdStrike(4): Could not retrieve DisableProxy value: c0000225
Jul 21 19:46:27 ai-course falcon-sensor-bpf[663]: CrowdStrike(4): ConnectWithProxy: Unable to get application proxy host from CsConfig: c0000225
== b0b02.cs.umd.edu (1 distinct, 1 total) ==
Jul 21 19:10:11 b0b02.cs.umd.edu rustdesk[1418724]: cannot open display:
== bachata (10 distinct, 10 total) ==
Jul 21 19:35:11 bachata smbd[1668373]: [2026/07/21 19:35:11.223462, 0] ../../source3/smbd/smb2_service.c:117(chdir_current_service)
Jul 21 19:35:11 bachata smbd[1668373]: chdir_current_service: vfs_ChDir(/fs/junkfood/nelson) failed: Permission denied. Current token: uid=20608, gid=20608, 20 groups: 20608 319050000 25274 319000009 25057 30872 25195 30043 25038 15228 31006 15294 15206 15248 25025 30742 25200 319100011 30871 30736
Jul 21 19:35:11 bachata smbd[1668373]: [2026/07/21 19:35:11.225066, 0] ../../source3/smbd/smbXsrv_tcon.c:914(smbXsrv_tcon_disconnect)
Jul 21 19:35:11 bachata smbd[1668373]: smbXsrv_tcon_disconnect: disconnect(0x827d9a70, 'nelson'): chdir_current_service() failed: NT_STATUS_INTERNAL_ERROR
Jul 21 19:35:11 bachata smbd[1668373]: [2026/07/21 19:35:11.225345, 0] ../../source3/smbd/smbXsrv_tcon.c:1028(smbXsrv_tcon_disconnect_all)
Jul 21 19:35:11 bachata smbd[1668373]: smbXsrv_tcon_disconnect_all: count[1] errors[1] first[NT_STATUS_INTERNAL_ERROR]
Jul 21 19:35:11 bachata smbd[1668373]: [2026/07/21 19:35:11.225406, 0] ../../source3/smbd/smbXsrv_session.c:1900(smbXsrv_session_logoff)
Jul 21 19:35:11 bachata smbd[1668373]: smbXsrv_session_logoff: smbXsrv_session_logoff(0x53c802d8): smb2srv_tcon_disconnect_all() failed: NT_STATUS_INTERNAL_ERROR
Jul 21 19:35:11 bachata smbd[1668373]: [2026/07/21 19:35:11.225483, 0] ../../source3/smbd/smbXsrv_session.c:1728(smbXsrv_session_remove_channel_done)
Jul 21 19:35:11 bachata smbd[1668373]: smbXsrv_session_remove_channel_done: smbXsrv_session_logoff(1405616856) failed: NT_STATUS_INTERNAL_ERROR
== biggulp.cs.umd.edu (2 distinct, 2 total) ==
Jul 21 19:35:55 biggulp.cs.umd.edu falcon-sensor-bpf[834]: CrowdStrike(4): Could not retrieve DisableProxy value: c0000225
Jul 21 19:35:55 biggulp.cs.umd.edu falcon-sensor-bpf[834]: CrowdStrike(4): ConnectWithProxy: Unable to get application proxy host from CsConfig: c0000225
== bigtuna (2 distinct, 2 total) ==
Jul 21 19:34:49 bigtuna falcon-sensor-bpf[874]: CrowdStrike(4): Could not retrieve DisableProxy value: c0000225
Jul 21 19:34:49 bigtuna falcon-sensor-bpf[874]: CrowdStrike(4): ConnectWithProxy: Unable to get application proxy host from CsConfig: c0000225
== borealis (2 distinct, 2 total) ==
Jul 21 19:40:42 borealis falcon-sensor-bpf[921]: CrowdStrike(4): Could not retrieve DisableProxy value: c0000225
Jul 21 19:40:42 borealis falcon-sensor-bpf[921]: CrowdStrike(4): ConnectWithProxy: Unable to get application proxy host from CsConfig: c0000225
== borogove.cs.umd.edu (2 distinct, 2 total) ==
Jul 21 19:07:56 borogove.cs.umd.edu falcon-sensor-bpf[1394]: CrowdStrike(4): Could not retrieve DisableProxy value: c0000225
Jul 21 19:07:56 borogove.cs.umd.edu falcon-sensor-bpf[1394]: CrowdStrike(4): ConnectWithProxy: Unable to get application proxy host from CsConfig: c0000225
== cheezit.cs.umd.edu (9 distinct, 10 total) ==
Jul 21 19:22:55 cheezit.cs.umd.edu sshd-session[439761]: error: kex_protocol_error: type 20 seq 2 [preauth]
Jul 21 19:22:55 cheezit.cs.umd.edu sshd-session[439761]: error: kex_protocol_error: type 30 seq 3 [preauth]
Jul 21 19:22:56 cheezit.cs.umd.edu sshd-session[439761]: error: kex_protocol_error: type 20 seq 4 [preauth]
Jul 21 19:22:56 cheezit.cs.umd.edu sshd-session[439761]: error: kex_protocol_error: type 30 seq 5 [preauth]
Jul 21 19:22:58 cheezit.cs.umd.edu sshd-session[439761]: error: kex_protocol_error: type 20 seq 6 [preauth]
Jul 21 19:22:58 cheezit.cs.umd.edu sshd-session[439761]: error: kex_protocol_error: type 30 seq 7 [preauth]
Jul 21 19:26:19 cheezit.cs.umd.edu falcon-sensor-bpf[1347]: CrowdStrike(4): Could not retrieve DisableProxy value: c0000225
Jul 21 19:26:19 cheezit.cs.umd.edu falcon-sensor-bpf[1347]: CrowdStrike(4): ConnectWithProxy: Unable to get application proxy host from CsConfig: c0000225
Jul 21 19:42:06 cheezit.cs.umd.edu sshd-session[444563]: pam_access(sshd:auth): access denied for user `kaptchuk' from `108.51.225.194' [x2]
== contest (1 distinct, 34 total) ==
Jul 21 19:05:56 contest goferd[994]: [ERROR][worker-0] gofer.messaging.adapter.connect:33 - connect: proton+amqps://satellite8.cs.umd.edu:5647, failed: Connection amqps://satellite8.cs.umd.edu:5647 disconnected: Condition('proton.pythonio', 'Connection refused to all addresses') [x34]
== csfw00a (1 distinct, 276 total) ==
Jul 21 19:04:40 csfw00a kernel: bnxt_en 0000:09:00.0 eth3: NIC Link is Down [x276]
== cskayako (2 distinct, 2 total) ==
Jul 21 19:48:32 cskayako falcon-sensor-bpf[746]: CrowdStrike(4): Could not retrieve DisableProxy value: c0000225
Jul 21 19:48:32 cskayako falcon-sensor-bpf[746]: CrowdStrike(4): ConnectWithProxy: Unable to get application proxy host from CsConfig: c0000225
== defer (2 distinct, 2 total) ==
Jul 21 19:23:42 defer falcon-sensor-bpf[811]: CrowdStrike(4): Could not retrieve DisableProxy value: c0000225
Jul 21 19:23:42 defer falcon-sensor-bpf[811]: CrowdStrike(4): ConnectWithProxy: Unable to get application proxy host from CsConfig: c0000225
== dojo (2 distinct, 2 total) ==
Jul 21 19:21:25 dojo falcon-sensor-bpf[2136]: CrowdStrike(4): Could not retrieve DisableProxy value: c0000225
Jul 21 19:21:25 dojo falcon-sensor-bpf[2136]: CrowdStrike(4): ConnectWithProxy: Unable to get application proxy host from CsConfig: c0000225
== emaar (2 distinct, 2 total) ==
Jul 21 19:42:19 emaar falcon-sensor-bpf[971]: CrowdStrike(4): Could not retrieve DisableProxy value: c0000225
Jul 21 19:42:19 emaar falcon-sensor-bpf[971]: CrowdStrike(4): ConnectWithProxy: Unable to get application proxy host from CsConfig: c0000225
== frabjous (2 distinct, 2 total) ==
Jul 21 19:33:28 frabjous falcon-sensor-bpf[1357]: CrowdStrike(4): Could not retrieve DisableProxy value: c0000225
Jul 21 19:33:28 frabjous falcon-sensor-bpf[1357]: CrowdStrike(4): ConnectWithProxy: Unable to get application proxy host from CsConfig: c0000225
== frozone (2 distinct, 2 total) ==
Jul 21 19:41:30 frozone falcon-sensor-bpf[1052]: CrowdStrike(4): Could not retrieve DisableProxy value: c0000225
Jul 21 19:41:30 frozone falcon-sensor-bpf[1052]: CrowdStrike(4): ConnectWithProxy: Unable to get application proxy host from CsConfig: c0000225
== galahad.cs.umd.edu (2 distinct, 2 total) ==
Jul 21 19:21:02 galahad.cs.umd.edu falcon-sensor-bpf[970]: CrowdStrike(4): Could not retrieve DisableProxy value: c0000225
Jul 21 19:21:02 galahad.cs.umd.edu falcon-sensor-bpf[970]: CrowdStrike(4): ConnectWithProxy: Unable to get application proxy host from CsConfig: c0000225
== gle-omnibus00.cs.umd.edu (2 distinct, 2 total) ==
Jul 21 19:36:22 gle-omnibus00.cs.umd.edu falcon-sensor-bpf[974]: CrowdStrike(4): Could not retrieve DisableProxy value: c0000225
Jul 21 19:36:22 gle-omnibus00.cs.umd.edu falcon-sensor-bpf[974]: CrowdStrike(4): ConnectWithProxy: Unable to get application proxy host from CsConfig: c0000225
== grosh (3 distinct, 9 total) ==
Jul 21 19:25:52 grosh kernel: snd_hda_codec_nvhdmi hdaudioC1D0: HDMI: pin NID 0x7 not registered [x7]
Jul 21 19:46:17 grosh falcon-sensor-bpf[110450]: CrowdStrike(4): Could not retrieve DisableProxy value: c0000225
Jul 21 19:46:17 grosh falcon-sensor-bpf[110450]: CrowdStrike(4): ConnectWithProxy: Unable to get application proxy host from CsConfig: c0000225
== hackerman (2 distinct, 2 total) ==
Jul 21 19:42:23 hackerman falcon-sensor-bpf[896]: CrowdStrike(4): Could not retrieve DisableProxy value: c0000225
Jul 21 19:42:23 hackerman falcon-sensor-bpf[896]: CrowdStrike(4): ConnectWithProxy: Unable to get application proxy host from CsConfig: c0000225
== haproxy02.cs.umd.edu (2 distinct, 2 total) ==
Jul 21 19:29:03 haproxy02.cs.umd.edu falcon-sensor-bpf[990]: CrowdStrike(4): Could not retrieve DisableProxy value: c0000225
Jul 21 19:29:03 haproxy02.cs.umd.edu falcon-sensor-bpf[990]: CrowdStrike(4): ConnectWithProxy: Unable to get application proxy host from CsConfig: c0000225
== haproxy03.cs.umd.edu (2 distinct, 2 total) ==
Jul 21 19:21:57 haproxy03.cs.umd.edu falcon-sensor-bpf[1401]: CrowdStrike(4): Could not retrieve DisableProxy value: c0000225
Jul 21 19:21:57 haproxy03.cs.umd.edu falcon-sensor-bpf[1401]: CrowdStrike(4): ConnectWithProxy: Unable to get application proxy host from CsConfig: c0000225
== hasaraumd (2 distinct, 2 total) ==
Jul 21 19:15:42 hasaraumd falcon-sensor-bpf[730]: CrowdStrike(4): Could not retrieve DisableProxy value: c0000225
Jul 21 19:15:42 hasaraumd falcon-sensor-bpf[730]: CrowdStrike(4): ConnectWithProxy: Unable to get application proxy host from CsConfig: c0000225
== hazfs.cs.umd.edu (11 distinct, 66 total) ==
Jul 21 19:53:31 hazfs.cs.umd.edu snmpd[1431]: send response: Failure in sendto [x6]
Jul 21 19:53:31 hazfs.cs.umd.edu snmpd[1431]: -- NET-SNMP-EXTEND-MIB::nsExtendStatus."userweb" [x6]
Jul 21 19:53:31 hazfs.cs.umd.edu snmpd[1431]: -- NET-SNMP-EXTEND-MIB::nsExtendStatus."zfslist" [x6]
Jul 21 19:53:31 hazfs.cs.umd.edu snmpd[1431]: -- NET-SNMP-EXTEND-MIB::nsExtendStatus."userhome" [x6]
Jul 21 19:53:31 hazfs.cs.umd.edu snmpd[1431]: -- NET-SNMP-EXTEND-MIB::nsExtendOutput1Line."userweb" [x6]
Jul 21 19:53:31 hazfs.cs.umd.edu snmpd[1431]: -- NET-SNMP-EXTEND-MIB::nsExtendOutput1Line."zfslist" [x6]
Jul 21 19:53:31 hazfs.cs.umd.edu snmpd[1431]: -- NET-SNMP-EXTEND-MIB::nsExtendOutput1Line."userhome" [x6]
Jul 21 19:53:31 hazfs.cs.umd.edu snmpd[1431]: -- NET-SNMP-EXTEND-MIB::nsExtendOutputFull."userweb" [x6]
Jul 21 19:53:31 hazfs.cs.umd.edu snmpd[1431]: -- NET-SNMP-EXTEND-MIB::nsExtendOutputFull."zfslist" [x6]
Jul 21 19:53:31 hazfs.cs.umd.edu snmpd[1431]: -- NET-SNMP-EXTEND-MIB::nsExtendOutputFull."userhome" [x6]
Jul 21 19:53:31 hazfs.cs.umd.edu snmpd[1431]: -- NET-SNMP-EXTEND-MIB::nsExtendOutNumLines."userweb" [x6]
== hspc (2 distinct, 2 total) ==
Jul 21 19:33:30 hspc falcon-sensor-bpf[1008]: CrowdStrike(4): Could not retrieve DisableProxy value: c0000225
Jul 21 19:33:30 hspc falcon-sensor-bpf[1008]: CrowdStrike(4): ConnectWithProxy: Unable to get application proxy host from CsConfig: c0000225
== idm00 (1 distinct, 1 total) ==
Jul 21 19:51:01 idm00 named[1455]: client @0x7f3310245d88 10.73.240.42#50632: update '73.10.in-addr.arpa/IN' denied
== idmp0 (1 distinct, 1 total) ==
Jul 21 19:34:56 idmp0 named[5198]: client @0x7f992c02db48 10.73.240.43#56456: update '73.10.in-addr.arpa/IN' denied
== itmon02 (1 distinct, 56 total) ==
Jul 21 19:08:11 itmon02 sshd[1904]: error: beginning MaxStartups throttling [x56]
== jaws.cs.umd.edu (2 distinct, 2 total) ==
Jul 21 19:48:20 jaws.cs.umd.edu falcon-sensor-bpf[1195]: CrowdStrike(4): Could not retrieve DisableProxy value: c0000225
Jul 21 19:48:20 jaws.cs.umd.edu falcon-sensor-bpf[1195]: CrowdStrike(4): ConnectWithProxy: Unable to get application proxy host from CsConfig: c0000225
== kadath.cs.umd.edu (2 distinct, 2 total) ==
Jul 21 19:31:10 kadath.cs.umd.edu falcon-sensor-bpf[938]: CrowdStrike(4): Could not retrieve DisableProxy value: c0000225
Jul 21 19:31:10 kadath.cs.umd.edu falcon-sensor-bpf[938]: CrowdStrike(4): ConnectWithProxy: Unable to get application proxy host from CsConfig: c0000225
== krispykreme.cs.umd.edu (8 distinct, 8 total) ==
Jul 21 19:22:56 krispykreme.cs.umd.edu sshd-session[1956594]: error: kex_protocol_error: type 20 seq 2 [preauth]
Jul 21 19:22:56 krispykreme.cs.umd.edu sshd-session[1956594]: error: kex_protocol_error: type 30 seq 3 [preauth]
Jul 21 19:22:57 krispykreme.cs.umd.edu sshd-session[1956594]: error: kex_protocol_error: type 20 seq 4 [preauth]
Jul 21 19:22:57 krispykreme.cs.umd.edu sshd-session[1956594]: error: kex_protocol_error: type 30 seq 5 [preauth]
Jul 21 19:23:00 krispykreme.cs.umd.edu sshd-session[1956594]: error: kex_protocol_error: type 20 seq 6 [preauth]
Jul 21 19:23:00 krispykreme.cs.umd.edu sshd-session[1956594]: error: kex_protocol_error: type 30 seq 7 [preauth]
Jul 21 19:33:01 krispykreme.cs.umd.edu falcon-sensor-bpf[1296]: CrowdStrike(4): Could not retrieve DisableProxy value: c0000225
Jul 21 19:33:01 krispykreme.cs.umd.edu falcon-sensor-bpf[1296]: CrowdStrike(4): ConnectWithProxy: Unable to get application proxy host from CsConfig: c0000225
== mashie (2 distinct, 2 total) ==
Jul 21 19:19:23 mashie falcon-sensor-bpf[786]: CrowdStrike(4): Could not retrieve DisableProxy value: c0000225
Jul 21 19:19:23 mashie falcon-sensor-bpf[786]: CrowdStrike(4): ConnectWithProxy: Unable to get application proxy host from CsConfig: c0000225
== neodontcare.cs.umd.edu (2 distinct, 2 total) ==
Jul 21 19:33:33 neodontcare.cs.umd.edu falcon-sensor-bpf[950]: CrowdStrike(4): Could not retrieve DisableProxy value: c0000225
Jul 21 19:33:33 neodontcare.cs.umd.edu falcon-sensor-bpf[950]: CrowdStrike(4): ConnectWithProxy: Unable to get application proxy host from CsConfig: c0000225
== neograd (2 distinct, 2 total) ==
Jul 21 19:31:37 neograd falcon-sensor-bpf[697]: CrowdStrike(4): Could not retrieve DisableProxy value: c0000225
Jul 21 19:31:37 neograd falcon-sensor-bpf[697]: CrowdStrike(4): ConnectWithProxy: Unable to get application proxy host from CsConfig: c0000225
== netman.cs.umd.edu (5 distinct, 5 total) ==
Jul 21 19:22:51 netman.cs.umd.edu falcon-sensor-bpf[1129]: CrowdStrike(4): Could not retrieve DisableProxy value: c0000225
Jul 21 19:22:51 netman.cs.umd.edu falcon-sensor-bpf[1129]: CrowdStrike(4): ConnectWithProxy: Unable to get application proxy host from CsConfig: c0000225
Jul 21 19:55:13 netman.cs.umd.edu setroubleshoot[2974093]: SELinux is preventing /usr/bin/gpg from read access on the file gpg.conf. For complete SELinux messages run: sealert -l 019ad1da-a874-4814-8037-3b3e5f413ad2
Jul 21 19:55:14 netman.cs.umd.edu setroubleshoot[2974093]: SELinux is preventing /usr/bin/gpg from open access on the file /root/.gnupg/gpg.conf. For complete SELinux messages run: sealert -l cb54177e-d44c-46a1-b246-5c0bbb8343be
Jul 21 19:55:14 netman.cs.umd.edu setroubleshoot[2974093]: SELinux is preventing /usr/bin/gpg from getattr access on the file /root/.gnupg/gpg.conf. For complete SELinux messages run: sealert -l fbba2e30-b7ab-491c-9ec6-f553e9ef72af
== newhonors2 (1 distinct, 24 total) ==
Jul 21 19:13:03 newhonors2 dhcpcd[92774]: dhcpcd is not running [x24]
== nightingale (2 distinct, 2 total) ==
Jul 21 19:32:40 nightingale falcon-sensor-bpf[909]: CrowdStrike(4): Could not retrieve DisableProxy value: c0000225
Jul 21 19:32:40 nightingale falcon-sensor-bpf[909]: CrowdStrike(4): ConnectWithProxy: Unable to get application proxy host from CsConfig: c0000225
== orchids (2 distinct, 2 total) ==
Jul 21 19:27:14 orchids falcon-sensor-bpf[1103]: CrowdStrike(4): Could not retrieve DisableProxy value: c0000225
Jul 21 19:27:14 orchids falcon-sensor-bpf[1103]: CrowdStrike(4): ConnectWithProxy: Unable to get application proxy host from CsConfig: c0000225
== outbound00.cs.umd.edu (1 distinct, 6 total) ==
Jul 21 19:09:09 outbound00.cs.umd.edu python3[2389214]: ldapdb [x6]
== outbound01.cs.umd.edu (1 distinct, 6 total) ==
Jul 21 19:13:06 outbound01.cs.umd.edu python3[417013]: ldapdb [x6]
== quiss (2 distinct, 2 total) ==
Jul 21 19:21:36 quiss falcon-sensor-bpf[1564085]: CrowdStrike(4): Could not retrieve DisableProxy value: c0000225
Jul 21 19:21:36 quiss falcon-sensor-bpf[1564085]: CrowdStrike(4): ConnectWithProxy: Unable to get application proxy host from CsConfig: c0000225
== sentry-docker00.cs.umd.edu (36 distinct, 36 total) ==
Jul 21 19:13:25 sentry-docker00.cs.umd.edu systemd-udevd[715691]: Could not generate persistent MAC address for veth6485c00: No such file or directory
Jul 21 19:13:25 sentry-docker00.cs.umd.edu systemd-udevd[715692]: Could not generate persistent MAC address for vethcf60f15: No such file or directory
Jul 21 19:15:12 sentry-docker00.cs.umd.edu systemd-udevd[716365]: Could not generate persistent MAC address for vethbec479e: No such file or directory
Jul 21 19:15:12 sentry-docker00.cs.umd.edu systemd-udevd[716367]: Could not generate persistent MAC address for veth0abe677: No such file or directory
Jul 21 19:15:12 sentry-docker00.cs.umd.edu systemd-udevd[716438]: Could not generate persistent MAC address for veth37f9d4a: No such file or directory
Jul 21 19:15:12 sentry-docker00.cs.umd.edu systemd-udevd[716439]: Could not generate persistent MAC address for vethf821dd0: No such file or directory
Jul 21 19:15:12 sentry-docker00.cs.umd.edu systemd-udevd[716471]: Could not generate persistent MAC address for veth5c4b46d: No such file or directory
Jul 21 19:15:12 sentry-docker00.cs.umd.edu systemd-udevd[716472]: Could not generate persistent MAC address for vethc7195cd: No such file or directory
Jul 21 19:15:12 sentry-docker00.cs.umd.edu systemd-udevd[716533]: Could not generate persistent MAC address for veth9e54d53: No such file or directory
Jul 21 19:15:12 sentry-docker00.cs.umd.edu systemd-udevd[716534]: Could not generate persistent MAC address for veth6c95cf0: No such file or directory
Jul 21 19:33:29 sentry-docker00.cs.umd.edu systemd-udevd[725130]: link_config: could not get ethtool features for veth6485c00
Jul 21 19:33:29 sentry-docker00.cs.umd.edu systemd-udevd[725130]: Could not set offload features of veth6485c00: No such device
Jul 21 19:33:30 sentry-docker00.cs.umd.edu systemd-udevd[725140]: Could not generate persistent MAC address for veth5501ba4: No such file or directory
Jul 21 19:33:30 sentry-docker00.cs.umd.edu systemd-udevd[725141]: Could not generate persistent MAC address for vetha512be6: No such file or directory
Jul 21 19:35:20 sentry-docker00.cs.umd.edu systemd-udevd[726118]: link_config: could not get ethtool features for veth9e54d53
Jul 21 19:35:20 sentry-docker00.cs.umd.edu systemd-udevd[726118]: Could not set offload features of veth9e54d53: No such device
Jul 21 19:35:20 sentry-docker00.cs.umd.edu systemd-udevd[726149]: Could not generate persistent MAC address for vethf7600bf: No such file or directory
Jul 21 19:35:20 sentry-docker00.cs.umd.edu systemd-udevd[726150]: Could not generate persistent MAC address for veth98adcb7: No such file or directory
Jul 21 19:35:20 sentry-docker00.cs.umd.edu systemd-udevd[726153]: Could not generate persistent MAC address for vethf724193: No such file or directory
Jul 21 19:35:20 sentry-docker00.cs.umd.edu systemd-udevd[726154]: Could not generate persistent MAC address for veth0e83666: No such file or directory
Jul 21 19:35:20 sentry-docker00.cs.umd.edu systemd-udevd[726160]: Could not generate persistent MAC address for veth10ea399: No such file or directory
Jul 21 19:35:20 sentry-docker00.cs.umd.edu systemd-udevd[726157]: Could not generate persistent MAC address for vethe7023ad: No such file or directory
Jul 21 19:35:20 sentry-docker00.cs.umd.edu systemd-udevd[726179]: Could not generate persistent MAC address for vethfb8f54d: No such file or directory
Jul 21 19:35:20 sentry-docker00.cs.umd.edu systemd-udevd[726180]: Could not generate persistent MAC address for veth0df9430: No such file or directory
Jul 21 19:53:34 sentry-docker00.cs.umd.edu systemd-udevd[734613]: Could not generate persistent MAC address for veth9cc005b: No such file or directory
Jul 21 19:53:34 sentry-docker00.cs.umd.edu systemd-udevd[734614]: Could not generate persistent MAC address for vethffc07bc: No such file or directory
Jul 21 19:55:28 sentry-docker00.cs.umd.edu systemd-udevd[735601]: link_config: could not get ethtool features for vethf724193
Jul 21 19:55:28 sentry-docker00.cs.umd.edu systemd-udevd[735601]: Could not set offload features of vethf724193: No such device
Jul 21 19:55:29 sentry-docker00.cs.umd.edu systemd-udevd[735631]: Could not generate persistent MAC address for vethf9916dd: No such file or directory
Jul 21 19:55:29 sentry-docker00.cs.umd.edu systemd-udevd[735632]: Could not generate persistent MAC address for veth57ca7a2: No such file or directory
... 6 more distinct messages not shown
== strawberry (4 distinct, 10 total) ==
Jul 21 19:09:44 strawberry udisksd[1067]: Error performing housekeeping for drive /org/freedesktop/UDisks2/drives/ST2000DM001_1CH164_W1E8J5KJ: Error updating SMART data: Error sending ATA command CHECK POWER MODE: Unexpected sense data returned:#0120000: 00 00 00 00 00 00 00 00 00 00 00 00 00 00 00 00 ................#0120010: 00 00 00 00 00 00 00 00 00 00 00 00 00 00 00 00 ................#012 (g-io-error-quark, 0) [x6]
Jul 21 19:12:57 strawberry falcon-sensor-bpf[808]: CrowdStrike(4): Could not retrieve DisableProxy value: c0000225
Jul 21 19:12:57 strawberry falcon-sensor-bpf[808]: CrowdStrike(4): ConnectWithProxy: Unable to get application proxy host from CsConfig: c0000225
Jul 21 19:34:42 strawberry smartd[5314]: Device: /dev/sda [SAT], failed to read SMART Attribute Data [x2]
== stuckeys (2 distinct, 2 total) ==
Jul 21 19:32:38 stuckeys falcon-sensor-bpf[824199]: CrowdStrike(4): Could not retrieve DisableProxy value: c0000225
Jul 21 19:32:38 stuckeys falcon-sensor-bpf[824199]: CrowdStrike(4): ConnectWithProxy: Unable to get application proxy host from CsConfig: c0000225
== submit26-b9-2 (1 distinct, 12 total) ==
Jul 21 19:06:58 submit26-b9-2 systemd[1]: user(a)1001.service: Main process exited, code=killed, status=9/KILL [x12]
== talkhosts9 (2 distinct, 2 total) ==
Jul 21 19:21:26 talkhosts9 falcon-sensor-bpf[714]: CrowdStrike(4): Could not retrieve DisableProxy value: c0000225
Jul 21 19:21:26 talkhosts9 falcon-sensor-bpf[714]: CrowdStrike(4): ConnectWithProxy: Unable to get application proxy host from CsConfig: c0000225
== teaching-awards (2 distinct, 2 total) ==
Jul 21 19:31:03 teaching-awards falcon-sensor-bpf[782]: CrowdStrike(4): Could not retrieve DisableProxy value: c0000225
Jul 21 19:31:03 teaching-awards falcon-sensor-bpf[782]: CrowdStrike(4): ConnectWithProxy: Unable to get application proxy host from CsConfig: c0000225
== tulgey.cs.umd.edu (2 distinct, 2 total) ==
Jul 21 19:33:24 tulgey.cs.umd.edu falcon-sensor-bpf[1526]: CrowdStrike(4): Could not retrieve DisableProxy value: c0000225
Jul 21 19:33:24 tulgey.cs.umd.edu falcon-sensor-bpf[1526]: CrowdStrike(4): ConnectWithProxy: Unable to get application proxy host from CsConfig: c0000225
== tumtum.cs.umd.edu (2 distinct, 2 total) ==
Jul 21 19:36:00 tumtum.cs.umd.edu falcon-sensor-bpf[1362]: CrowdStrike(4): Could not retrieve DisableProxy value: c0000225
Jul 21 19:36:00 tumtum.cs.umd.edu falcon-sensor-bpf[1362]: CrowdStrike(4): ConnectWithProxy: Unable to get application proxy host from CsConfig: c0000225
== yogurt (2 distinct, 2 total) ==
Jul 21 19:24:31 yogurt falcon-sensor-bpf[950]: CrowdStrike(4): Could not retrieve DisableProxy value: c0000225
Jul 21 19:24:31 yogurt falcon-sensor-bpf[950]: CrowdStrike(4): ConnectWithProxy: Unable to get application proxy host from CsConfig: c0000225
== zwicker-computer (2 distinct, 2 total) ==
Jul 21 19:33:11 zwicker-computer falcon-sensor-bpf[718]: CrowdStrike(4): Could not retrieve DisableProxy value: c0000225
Jul 21 19:33:11 zwicker-computer falcon-sensor-bpf[718]: CrowdStrike(4): ConnectWithProxy: Unable to get application proxy host from CsConfig: c0000225
1
0