Command: /usr/local/sbin/syslog-digest.py
Time : 0.5495s
Status : exited 0
Output :
Syslog digest — 2026-07-31 09:05 EDT
Processed 4,964 lines, filtered 4,046 (81%). 918 unknown (137 distinct) from 22 host(s).
== abuse (1 distinct, 348 total) ==
Jul 31 08:05:06 abuse rsyslogd[21745]: imjournal: open() failed for path: '/var/lib/rsyslog/imjournal.state.tmp': Input/output error [v8.2404.0 try https://www.rsyslog.com/e/2433 ] [x348]
== b0b02.cs.umd.edu (4 distinct, 4 total) ==
Jul 31 08:16:23 b0b02.cs.umd.edu setroubleshoot[1329082]: SELinux is preventing /usr/bin/python3.9 from getattr access on the file /etc/authselect/nsswitch.conf. For complete SELinux messages run: sealert -l 9a1e2952-3fde-4937-a8ab-f7f59791a458
Jul 31 08:16:25 b0b02.cs.umd.edu setroubleshoot[1329082]: SELinux is preventing /usr/bin/python3.9 from read access on the file /etc/authselect/nsswitch.conf. For complete SELinux messages run: sealert -l 97d74423-e027-4cd6-8810-ad80944900b5
Jul 31 08:16:28 b0b02.cs.umd.edu setroubleshoot[1329082]: SELinux is preventing /usr/bin/python3.9 from open access on the file /etc/authselect/nsswitch.conf. For complete SELinux messages run: sealert -l 4f253f6a-62d6-46dd-8eaf-0b4d29df41c6
Jul 31 08:38:58 b0b02.cs.umd.edu rustdesk[1334677]: cannot open display:
== bachata (54 distinct, 116 total) ==
Jul 31 08:30:24 bachata setroubleshoot[2217487]: SELinux is preventing /usr/sbin/smbd from getattr access on the lnk_file /fs/junkfood/nelson/ClassRelated. For complete SELinux messages run: sealert -l fcd56e6d-4082-40d2-8d07-7512890e4b51 [x9]
Jul 31 08:30:24 bachata setroubleshoot[2217487]: SELinux is preventing /usr/sbin/smbd from read access on the lnk_file ClassRelated. For complete SELinux messages run: sealert -l 8052e635-6f2f-45b1-a983-55d5d837ba65 [x11]
Jul 31 08:30:24 bachata setroubleshoot[2217487]: SELinux is preventing /usr/sbin/smbd from getattr access on the file /fs/junkfood/nelson/VirtualDesktop/ClassRelated/cmsc216Summer2026/216_SUMMER_2026. For complete SELinux messages run: sealert -l 278fa2f7-7c6d-4613-8831-0c7902342a33
Jul 31 08:30:24 bachata setroubleshoot[2217487]: SELinux is preventing /usr/sbin/smbd from read access on the file 216_SUMMER_2026. For complete SELinux messages run: sealert -l a2f5acec-ed56-4193-b84b-9c355ad24121
Jul 31 08:30:31 bachata setroubleshoot[2217487]: SELinux is preventing /usr/sbin/smbd from open access on the file /fs/junkfood/nelson/VirtualDesktop/ClassRelated/cmsc216Summer2026/lectures/Week09/Libraries.pptx. For complete SELinux messages run: sealert -l 8c76b021-2297-4487-85d5-4a594e50093c
Jul 31 08:30:32 bachata setroubleshoot[2217487]: SELinux is preventing /usr/sbin/smbd from lock access on the file /fs/junkfood/nelson/VirtualDesktop/ClassRelated/cmsc216Summer2026/lectures/Week09/Libraries.pptx. For complete SELinux messages run: sealert -l 9436c1bd-99ad-43ff-b349-57e5bcc72374
Jul 31 08:30:33 bachata setroubleshoot[2217487]: failed to retrieve rpm info for path '/fs/wwwusers/nelson': [x6]
Jul 31 08:30:33 bachata setroubleshoot[2217487]: SELinux is preventing /usr/libexec/samba/samba-dcerpcd from ioctl access on the directory /fs/wwwusers/nelson. For complete SELinux messages run: sealert -l e6152378-fd71-4efe-8359-f1f27dbb4780 [x6]
Jul 31 08:30:33 bachata setroubleshoot[2217487]: SELinux is preventing /usr/libexec/samba/samba-dcerpcd from read access on the directory /fs/junkfood/nelson/VirtualDesktop/ClassRelated/cmsc216Summer2026/lectures/Week09. For complete SELinux messages run: sealert -l 3c121609-cda8-4152-9925-b75fe7db2d98 [x4]
Jul 31 08:30:35 bachata setroubleshoot[2217487]: SELinux is preventing /usr/sbin/smbd from write access on the directory /fs/junkfood/nelson/(null). For complete SELinux messages run: sealert -l 2eb8aca4-3542-458a-ba12-c410a98dfbba [x6]
Jul 31 08:30:35 bachata setroubleshoot[2217487]: SELinux is preventing /usr/sbin/smbd from add_name access on the directory /fs/junkfood/nelson/(null). For complete SELinux messages run: sealert -l 655dab10-bb1a-4409-bed5-1fa4cfbaac79 [x6]
Jul 31 08:30:35 bachata setroubleshoot[2217487]: SELinux is preventing /usr/sbin/smbd from create access on the file /fs/junkfood/nelson/(null). For complete SELinux messages run: sealert -l f15b4b59-4558-463e-8763-5c4dd3529b67 [x7]
Jul 31 08:30:35 bachata setroubleshoot[2217487]: SELinux is preventing /usr/sbin/smbd from write access on the file /fs/junkfood/nelson/VirtualDesktop/ClassRelated/cmsc216Summer2026/lectures/Week09/~$Libraries.pptx. For complete SELinux messages run: sealert -l b65b78cc-eac8-4ad4-8e05-6760b51a5f9d
Jul 31 08:30:36 bachata setroubleshoot[2217487]: SELinux is preventing /usr/sbin/smbd from setattr access on the file ~$Libraries.pptx. For complete SELinux messages run: sealert -l 2156271f-4021-4cff-92dd-85a8a157bdf3
Jul 31 08:30:45 bachata setroubleshoot[2217487]: SELinux is preventing /usr/sbin/smbd from getattr access on the file /fs/junkfood/nelson/VirtualDesktop/ClassRelated/cmsc216Summer2026/lectures/Week09/Signals.pptx. For complete SELinux messages run: sealert -l 278fa2f7-7c6d-4613-8831-0c7902342a33 [x2]
Jul 31 08:30:46 bachata setroubleshoot[2217487]: SELinux is preventing /usr/sbin/smbd from read access on the file Signals.pptx. For complete SELinux messages run: sealert -l a2f5acec-ed56-4193-b84b-9c355ad24121 [x2]
Jul 31 08:31:00 bachata setroubleshoot[2217543]: SELinux is preventing /usr/sbin/smbd from 'write, open' accesses on the file /fs/junkfood/nelson/VirtualDesktop/ClassRelated/cmsc216Summer2026/lectures/Week09/758D7C70.tmp. For complete SELinux messages run: sealert -l 43a9e709-b64d-4b2d-a7f8-3d23764a695d
Jul 31 08:31:00 bachata setroubleshoot[2217543]: SELinux is preventing /usr/sbin/smbd from setattr access on the file 758D7C70.tmp. For complete SELinux messages run: sealert -l 2156271f-4021-4cff-92dd-85a8a157bdf3
Jul 31 08:31:00 bachata setroubleshoot[2217543]: SELinux is preventing /usr/sbin/smbd from lock access on the file /fs/junkfood/nelson/VirtualDesktop/ClassRelated/cmsc216Summer2026/lectures/Week09/758D7C70.tmp. For complete SELinux messages run: sealert -l 9436c1bd-99ad-43ff-b349-57e5bcc72374
Jul 31 08:31:00 bachata setroubleshoot[2217543]: SELinux is preventing /usr/sbin/smbd from remove_name access on the directory /fs/junkfood/nelson/(null). For complete SELinux messages run: sealert -l 077f30cc-710e-488e-82a2-a9ec8c8689d6 [x5]
Jul 31 08:31:00 bachata setroubleshoot[2217543]: SELinux is preventing /usr/sbin/smbd from rename access on the file /fs/junkfood/nelson/(null). For complete SELinux messages run: sealert -l 1a3197c7-4297-401e-a373-37286429bdf6 [x5]
Jul 31 08:31:00 bachata setroubleshoot[2217543]: SELinux is preventing /usr/sbin/smbd from unlink access on the file 7EB3F1B1.tmp. For complete SELinux messages run: sealert -l 897be6c7-c4c0-4578-9bbf-fb4b01ebdc37
Jul 31 08:37:10 bachata setroubleshoot[2217660]: SELinux is preventing /usr/libexec/samba/samba-dcerpcd from 'read, write' accesses on the file /fs/junkfood/nelson/VirtualDesktop/ClassRelated/cmsc216Summer2026/lectures/Week09/~$Libraries.pptx. For complete SELinux messages run: sealert -l a4e63b17-faa3-4607-8d54-51b3e7cad80a [x3]
Jul 31 08:37:18 bachata setroubleshoot[2217660]: SELinux is preventing /usr/sbin/smbd from 'write, open' accesses on the file /fs/junkfood/nelson/VirtualDesktop/ClassRelated/cmsc216Summer2026/lectures/Week09/1F5FD129.tmp. For complete SELinux messages run: sealert -l 43a9e709-b64d-4b2d-a7f8-3d23764a695d
Jul 31 08:37:18 bachata setroubleshoot[2217660]: SELinux is preventing /usr/sbin/smbd from setattr access on the file 1F5FD129.tmp. For complete SELinux messages run: sealert -l 2156271f-4021-4cff-92dd-85a8a157bdf3
Jul 31 08:37:19 bachata setroubleshoot[2217660]: SELinux is preventing /usr/sbin/smbd from lock access on the file /fs/junkfood/nelson/VirtualDesktop/ClassRelated/cmsc216Summer2026/lectures/Week09/1F5FD129.tmp. For complete SELinux messages run: sealert -l 9436c1bd-99ad-43ff-b349-57e5bcc72374
Jul 31 08:37:19 bachata setroubleshoot[2217660]: SELinux is preventing /usr/sbin/smbd from unlink access on the file 3234F516.tmp. For complete SELinux messages run: sealert -l 897be6c7-c4c0-4578-9bbf-fb4b01ebdc37
Jul 31 08:40:29 bachata setroubleshoot[2217970]: SELinux is preventing /usr/sbin/smbd from 'read, write, open' accesses on the file /fs/junkfood/nelson/VirtualDesktop/ClassRelated/cmsc216Summer2026/lectures/Week09/C3F31994.tmp. For complete SELinux messages run: sealert -l 3b5cbb1c-6c6d-4f42-9814-23f503010e24
Jul 31 08:40:29 bachata setroubleshoot[2217970]: SELinux is preventing /usr/sbin/smbd from getattr access on the file /fs/junkfood/nelson/VirtualDesktop/ClassRelated/cmsc216Summer2026/lectures/Week09/C3F31994.tmp. For complete SELinux messages run: sealert -l 278fa2f7-7c6d-4613-8831-0c7902342a33
Jul 31 08:40:29 bachata setroubleshoot[2217970]: SELinux is preventing /usr/sbin/smbd from setattr access on the file C3F31994.tmp. For complete SELinux messages run: sealert -l 2156271f-4021-4cff-92dd-85a8a157bdf3
... 24 more distinct messages not shown
== biggulp.cs.umd.edu (1 distinct, 1 total) ==
Jul 31 08:58:19 biggulp.cs.umd.edu sshd-session[1785444]: error: send_error: write: Broken pipe
== contest (1 distinct, 33 total) ==
Jul 31 08:06:18 contest goferd[1007]: [ERROR][worker-0] gofer.messaging.adapter.connect:33 - connect: proton+amqps://satellite8.cs.umd.edu:5647, failed: Connection amqps://satellite8.cs.umd.edu:5647 disconnected: Condition('proton.pythonio', 'Connection refused to all addresses') [x33]
== csfw00a (1 distinct, 258 total) ==
Jul 31 08:05:36 csfw00a kernel: bnxt_en 0000:09:00.0 eth3: NIC Link is Down [x258]
== cskayako (2 distinct, 5 total) ==
Jul 31 08:59:17 cskayako setroubleshoot[1439235]: failed to retrieve rpm info for path '/var/www/html/__swift/logs/log.cache_31_Jul_2026_d7eca20d2c.txt': [x2]
Jul 31 08:59:18 cskayako setroubleshoot[1439235]: SELinux is preventing /usr/sbin/sendmail.postfix from append access on the file /var/www/html/__swift/logs/log.cache_31_Jul_2026_d7eca20d2c.txt. For complete SELinux messages run: sealert -l c566b62c-2773-4bf0-808b-10f832f1eafb [x3]
== emaar (1 distinct, 1 total) ==
Jul 31 08:43:21 emaar puppet-agent[2299760]: (Facter) invalid or malformed lldp data: MalformedDataError: no lldp interface data found
== hackerman (6 distinct, 11 total) ==
Jul 31 08:20:04 hackerman gnome-software[2060381]: can't reliably fixup error code 4 in domain g-io-error-quark: Not a directory [x4]
Jul 31 08:20:12 hackerman gnome-software[2060381]: Only 0 apps for recent list, hiding
Jul 31 08:20:28 hackerman gnome-software[2060381]: failed to commit changes to dconf: GDBus.Error:org.gtk.GDBus.UnmappedGError.Quark._g_2dfile_2derror_2dquark.Code2: Failed to create file “/adminhomes/sajith/.config/dconf/user.ZE6DT3”: Permission denied
Jul 31 08:20:28 hackerman packagekitd[2422526]: Failed to get cache filename for libreoffice [x2]
Jul 31 08:20:28 hackerman packagekitd[2422526]: Failed to get cache filename for kernel [x2]
Jul 31 08:20:37 hackerman packagekitd[2422526]: failed to parse public key for /etc/pki/rpm-gpg/RPM-GPG-KEY-PQC-redhat-release
== idm00 (1 distinct, 1 total) ==
Jul 31 08:51:13 idm00 named[1455]: client @0x7f33046c1f38 10.73.240.42#56881: update '73.10.in-addr.arpa/IN' denied
== idmp0 (1 distinct, 1 total) ==
Jul 31 08:36:02 idmp0 named[5198]: client @0x7f9928016ea8 10.73.240.43#50730: update '73.10.in-addr.arpa/IN' denied
== inbound01.cs.umd.edu (1 distinct, 1 total) ==
Jul 31 08:50:31 inbound01.cs.umd.edu krb5_child[3664770]: Client 'admin(a)UMD.EDU' not found in Kerberos database
== itmon02 (1 distinct, 29 total) ==
Jul 31 08:08:01 itmon02 sshd[1834]: error: beginning MaxStartups throttling [x29]
== munin (2 distinct, 8 total) ==
Jul 31 08:18:12 munin sudo[3702128]: pam_systemd(sudo:session): Failed to stat() runtime directory '/run/user/0': No such file or directory [x4]
Jul 31 08:18:12 munin sudo[3702128]: pam_systemd(sudo:session): Not setting $XDG_RUNTIME_DIR, as the directory is not in order. [x4]
== netman.cs.umd.edu (4 distinct, 5 total) ==
Jul 31 08:29:59 netman.cs.umd.edu setroubleshoot[3236810]: SELinux is preventing /usr/bin/gpg from read access on the file gpg.conf. For complete SELinux messages run: sealert -l 019ad1da-a874-4814-8037-3b3e5f413ad2
Jul 31 08:29:59 netman.cs.umd.edu setroubleshoot[3236810]: SELinux is preventing /usr/bin/gpg from open access on the file /root/.gnupg/gpg.conf. For complete SELinux messages run: sealert -l cb54177e-d44c-46a1-b246-5c0bbb8343be
Jul 31 08:30:05 netman.cs.umd.edu setroubleshoot[3236810]: SELinux is preventing /usr/bin/gpg from getattr access on the file /root/.gnupg/gpg.conf. For complete SELinux messages run: sealert -l fbba2e30-b7ab-491c-9ec6-f553e9ef72af
Jul 31 08:51:27 netman.cs.umd.edu krb5_child[3242543]: Client 'admin(a)UMD.EDU' not found in Kerberos database [x2]
== newhonors2 (1 distinct, 24 total) ==
Jul 31 08:13:02 newhonors2 dhcpcd[535111]: dhcpcd is not running [x24]
== outbound00.cs.umd.edu (1 distinct, 6 total) ==
Jul 31 08:09:09 outbound00.cs.umd.edu python3[1411299]: ldapdb [x6]
== outbound01.cs.umd.edu (2 distinct, 8 total) ==
Jul 31 08:13:06 outbound01.cs.umd.edu python3[3637820]: ldapdb [x6]
Jul 31 09:04:55 outbound01.cs.umd.edu cockpit-ws[3649896]: Received unexpected TLS connection; use cockpit-tls for TLS termination [x2]
== sentry-docker00.cs.umd.edu (40 distinct, 40 total) ==
Jul 31 08:09:13 sentry-docker00.cs.umd.edu systemd-udevd[3090008]: link_config: could not get ethtool features for veth3638d6b
Jul 31 08:09:13 sentry-docker00.cs.umd.edu systemd-udevd[3090008]: Could not set offload features of veth3638d6b: No such device
Jul 31 08:09:13 sentry-docker00.cs.umd.edu systemd-udevd[3090104]: Could not generate persistent MAC address for vethf61183c: No such file or directory
Jul 31 08:09:13 sentry-docker00.cs.umd.edu systemd-udevd[3090105]: Could not generate persistent MAC address for veth32ba81a: No such file or directory
Jul 31 08:09:13 sentry-docker00.cs.umd.edu systemd-udevd[3090131]: Could not generate persistent MAC address for veth2f68ae1: No such file or directory
Jul 31 08:09:13 sentry-docker00.cs.umd.edu systemd-udevd[3090130]: Could not generate persistent MAC address for veth5dbb892: No such file or directory
Jul 31 08:09:13 sentry-docker00.cs.umd.edu systemd-udevd[3090147]: Could not generate persistent MAC address for vethd51e0d5: No such file or directory
Jul 31 08:09:13 sentry-docker00.cs.umd.edu systemd-udevd[3090143]: Could not generate persistent MAC address for veth38e719c: No such file or directory
Jul 31 08:09:14 sentry-docker00.cs.umd.edu systemd-udevd[3090148]: Could not generate persistent MAC address for veth5bd47dc: No such file or directory
Jul 31 08:09:14 sentry-docker00.cs.umd.edu systemd-udevd[3090153]: Could not generate persistent MAC address for veth9dfec79: No such file or directory
Jul 31 08:14:00 sentry-docker00.cs.umd.edu systemd-udevd[3092167]: Could not generate persistent MAC address for vethc74a8e9: No such file or directory
Jul 31 08:14:00 sentry-docker00.cs.umd.edu systemd-udevd[3092168]: Could not generate persistent MAC address for veth56ec79a: No such file or directory
Jul 31 08:29:22 sentry-docker00.cs.umd.edu systemd-udevd[3099572]: link_config: could not get ethtool features for vethd51e0d5
Jul 31 08:29:22 sentry-docker00.cs.umd.edu systemd-udevd[3099572]: Could not set offload features of vethd51e0d5: No such device
Jul 31 08:29:22 sentry-docker00.cs.umd.edu systemd-udevd[3099596]: Could not generate persistent MAC address for veth81057b3: No such file or directory
Jul 31 08:29:22 sentry-docker00.cs.umd.edu systemd-udevd[3099597]: Could not generate persistent MAC address for veth99441e7: No such file or directory
Jul 31 08:29:22 sentry-docker00.cs.umd.edu systemd-udevd[3099600]: Could not generate persistent MAC address for vethd491321: No such file or directory
Jul 31 08:29:22 sentry-docker00.cs.umd.edu systemd-udevd[3099601]: Could not generate persistent MAC address for vetha16a05e: No such file or directory
Jul 31 08:29:22 sentry-docker00.cs.umd.edu systemd-udevd[3099622]: Could not generate persistent MAC address for veth0e00bba: No such file or directory
Jul 31 08:29:22 sentry-docker00.cs.umd.edu systemd-udevd[3099614]: Could not generate persistent MAC address for veth705cf2a: No such file or directory
Jul 31 08:29:22 sentry-docker00.cs.umd.edu systemd-udevd[3099622]: Could not generate persistent MAC address for vethe032303: No such file or directory
Jul 31 08:29:22 sentry-docker00.cs.umd.edu systemd-udevd[3099606]: Could not generate persistent MAC address for vethc392e5c: No such file or directory
Jul 31 08:34:04 sentry-docker00.cs.umd.edu systemd-udevd[3101563]: Could not generate persistent MAC address for vethdea7954: No such file or directory
Jul 31 08:34:04 sentry-docker00.cs.umd.edu systemd-udevd[3101564]: Could not generate persistent MAC address for vethf0c1992: No such file or directory
Jul 31 08:49:30 sentry-docker00.cs.umd.edu systemd-udevd[3108891]: link_config: could not get ethtool features for vethc392e5c
Jul 31 08:49:30 sentry-docker00.cs.umd.edu systemd-udevd[3108891]: Could not set offload features of vethc392e5c: No such device
Jul 31 08:49:30 sentry-docker00.cs.umd.edu systemd-udevd[3108965]: link_config: could not set ethtool features for vethd491321
Jul 31 08:49:30 sentry-docker00.cs.umd.edu systemd-udevd[3108965]: Could not set offload features of vethd491321: Operation not permitted
Jul 31 08:49:30 sentry-docker00.cs.umd.edu systemd-udevd[3108990]: Could not generate persistent MAC address for vetha576c40: No such file or directory
Jul 31 08:49:30 sentry-docker00.cs.umd.edu systemd-udevd[3108991]: Could not generate persistent MAC address for veth3192dbf: No such file or directory
... 10 more distinct messages not shown
== smokeping-slave (1 distinct, 1 total) ==
Jul 31 08:58:14 smokeping-slave nologin[305261]: Attempted login by UNKNOWN (UID: 65534) on UNKNOWN
== strawberry (2 distinct, 8 total) ==
Jul 31 08:09:44 strawberry udisksd[1067]: Error performing housekeeping for drive /org/freedesktop/UDisks2/drives/ST2000DM001_1CH164_W1E8J5KJ: Error updating SMART data: Error sending ATA command CHECK POWER MODE: Unexpected sense data returned:#0120000: 00 00 00 00 00 00 00 00 00 00 00 00 00 00 00 00 ................#0120010: 00 00 00 00 00 00 00 00 00 00 00 00 00 00 00 00 ................#012 (g-io-error-quark, 0) [x6]
Jul 31 08:34:42 strawberry smartd[5314]: Device: /dev/sda [SAT], failed to read SMART Attribute Data [x2]
== submit26-b9-4 (9 distinct, 9 total) ==
Jul 31 08:15:27 submit26-b9-4 setroubleshoot[705522]: SELinux is preventing /usr/bin/python3.9 from create access on the directory /(null). For complete SELinux messages run: sealert -l a4e66030-8621-4da9-bd27-5988bb1bf8ad
Jul 31 08:15:27 submit26-b9-4 setroubleshoot[705522]: SELinux is preventing /usr/bin/python3.9 from add_name access on the directory /(null). For complete SELinux messages run: sealert -l c055e37d-bbf5-4800-9083-d606f792c8c1
Jul 31 08:15:27 submit26-b9-4 setroubleshoot[705522]: SELinux is preventing /usr/bin/python3.9 from create access on the file /(null). For complete SELinux messages run: sealert -l e5bc3a56-6d6f-4776-954f-ddde1579648f
Jul 31 08:15:27 submit26-b9-4 setroubleshoot[705522]: SELinux is preventing /usr/bin/python3.9 from open access on the file /tmp/libdnf.y4o2ma/repodata/repomd.xml. For complete SELinux messages run: sealert -l a8ec5e1b-49f9-4fbc-a8ae-22e800f7abf2
Jul 31 08:15:27 submit26-b9-4 setroubleshoot[705522]: SELinux is preventing /usr/bin/python3.9 from setattr access on the file repomd.xml. For complete SELinux messages run: sealert -l 945db714-d0c0-4402-911e-932978b8b036
Jul 31 08:15:27 submit26-b9-4 setroubleshoot[705522]: SELinux is preventing /usr/bin/python3.9 from read access on the directory libdnf.y4o2ma. For complete SELinux messages run: sealert -l 463998a0-fb0d-463c-82b1-471135710a14
Jul 31 08:15:27 submit26-b9-4 setroubleshoot[705522]: SELinux is preventing /usr/bin/python3.9 from remove_name access on the directory repomd.xml. For complete SELinux messages run: sealert -l 473d2e21-15d8-407a-a9ee-2b842607fa00
Jul 31 08:15:27 submit26-b9-4 setroubleshoot[705522]: SELinux is preventing /usr/bin/python3.9 from unlink access on the file repomd.xml. For complete SELinux messages run: sealert -l 80c54d4f-bf4b-4501-addb-1627383587d0
Jul 31 08:15:27 submit26-b9-4 setroubleshoot[705522]: SELinux is preventing /usr/bin/python3.9 from rmdir access on the directory repodata. For complete SELinux messages run: sealert -l c63d3890-151e-49a0-83f0-3dfb69d051e5
1
0
Command: /usr/local/sbin/syslog-digest.py
Time : 0.5099s
Status : exited 0
Output :
Syslog digest — 2026-07-31 08:05 EDT
Processed 4,789 lines, filtered 3,939 (82%). 850 unknown (101 distinct) from 23 host(s).
== abadi-computer (1 distinct, 1 total) ==
Jul 31 07:49:43 abadi-computer kernel: kauditd_printk_skb: 2 callbacks suppressed
== abuse (1 distinct, 347 total) ==
Jul 31 07:05:06 abuse rsyslogd[21745]: imjournal: open() failed for path: '/var/lib/rsyslog/imjournal.state.tmp': Input/output error [v8.2404.0 try https://www.rsyslog.com/e/2433 ] [x347]
== b0b02.cs.umd.edu (4 distinct, 4 total) ==
Jul 31 07:16:18 b0b02.cs.umd.edu setroubleshoot[1313860]: SELinux is preventing /usr/bin/python3.9 from getattr access on the file /etc/authselect/nsswitch.conf. For complete SELinux messages run: sealert -l 9a1e2952-3fde-4937-a8ab-f7f59791a458
Jul 31 07:16:21 b0b02.cs.umd.edu setroubleshoot[1313860]: SELinux is preventing /usr/bin/python3.9 from read access on the file /etc/authselect/nsswitch.conf. For complete SELinux messages run: sealert -l 97d74423-e027-4cd6-8810-ad80944900b5
Jul 31 07:16:24 b0b02.cs.umd.edu setroubleshoot[1313860]: SELinux is preventing /usr/bin/python3.9 from open access on the file /etc/authselect/nsswitch.conf. For complete SELinux messages run: sealert -l 4f253f6a-62d6-46dd-8eaf-0b4d29df41c6
Jul 31 07:38:54 b0b02.cs.umd.edu rustdesk[1319405]: cannot open display:
== bac102 (3 distinct, 3 total) ==
Jul 31 07:24:20 bac102 gnome-software[14797]: Only 0 apps for curated list, hiding
Jul 31 07:24:20 bac102 gnome-software[14797]: Only 1 apps for recent list, hiding
Jul 31 07:24:28 bac102 packagekitd[77953]: Failed to get cache filename for openvox-agent
== bachata (5 distinct, 5 total) ==
Jul 31 07:39:39 bachata setroubleshoot[2215558]: SELinux is preventing /usr/sbin/smbd from read access on the lnk_file www. For complete SELinux messages run: sealert -l 8052e635-6f2f-45b1-a983-55d5d837ba65
Jul 31 08:01:28 bachata setroubleshoot[2216351]: SELinux is preventing /usr/sbin/smbd from getattr access on the lnk_file /fs/junkfood/nelson/ClassRelated. For complete SELinux messages run: sealert -l fcd56e6d-4082-40d2-8d07-7512890e4b51
Jul 31 08:01:28 bachata setroubleshoot[2216351]: SELinux is preventing /usr/sbin/smbd from read access on the lnk_file ClassRelated. For complete SELinux messages run: sealert -l 8052e635-6f2f-45b1-a983-55d5d837ba65
Jul 31 08:01:28 bachata setroubleshoot[2216351]: SELinux is preventing /usr/sbin/smbd from getattr access on the file /fs/junkfood/nelson/VirtualDesktop/ClassRelated/cmsc216Summer2026/216_SUMMER_2026. For complete SELinux messages run: sealert -l 278fa2f7-7c6d-4613-8831-0c7902342a33
Jul 31 08:01:28 bachata setroubleshoot[2216351]: SELinux is preventing /usr/sbin/smbd from read access on the file 216_SUMMER_2026. For complete SELinux messages run: sealert -l a2f5acec-ed56-4193-b84b-9c355ad24121
== cmsc436-0101-redis (5 distinct, 5 total) ==
Jul 31 07:56:34 cmsc436-0101-redis sshd-session[580292]: error: maximum authentication attempts exceeded for root from 39.77.131.203 port 47090 ssh2 [preauth]
Jul 31 07:56:40 cmsc436-0101-redis sshd-session[580294]: error: maximum authentication attempts exceeded for root from 39.77.131.203 port 47380 ssh2 [preauth]
Jul 31 07:56:46 cmsc436-0101-redis sshd-session[580296]: error: maximum authentication attempts exceeded for root from 39.77.131.203 port 47684 ssh2 [preauth]
Jul 31 07:56:57 cmsc436-0101-redis sshd-session[580300]: error: maximum authentication attempts exceeded for admin from 39.77.131.203 port 48194 ssh2 [preauth]
Jul 31 07:57:03 cmsc436-0101-redis sshd-session[580302]: error: maximum authentication attempts exceeded for admin from 39.77.131.203 port 48478 ssh2 [preauth]
== contest (1 distinct, 34 total) ==
Jul 31 07:05:36 contest goferd[1007]: [ERROR][worker-0] gofer.messaging.adapter.connect:33 - connect: proton+amqps://satellite8.cs.umd.edu:5647, failed: Connection amqps://satellite8.cs.umd.edu:5647 disconnected: Condition('proton.pythonio', 'Connection refused to all addresses') [x34]
== csfw00a (1 distinct, 232 total) ==
Jul 31 07:04:51 csfw00a kernel: bnxt_en 0000:09:00.0 eth3: NIC Link is Down [x232]
== dojo (2 distinct, 2 total) ==
Jul 31 07:38:05 dojo nologin[729215]: Attempted login by UNKNOWN (UID: 65534) on UNKNOWN
Jul 31 07:38:16 dojo puppet-agent[729216]: The current total number of fact values: 17073 exceeds the fact values limit: 10240
== hackerman (8 distinct, 13 total) ==
Jul 31 07:19:01 hackerman gnome-software[2060381]: failed to commit changes to dconf: GDBus.Error:org.gtk.GDBus.UnmappedGError.Quark._g_2dfile_2derror_2dquark.Code2: Failed to create file “/adminhomes/sajith/.config/dconf/user.AHNVS3”: Permission denied
Jul 31 07:20:04 hackerman gnome-software[2060381]: can't reliably fixup error code 4 in domain g-io-error-quark: Not a directory [x4]
Jul 31 07:20:13 hackerman gnome-software[2060381]: Only 0 apps for recent list, hiding
Jul 31 07:20:28 hackerman gnome-software[2060381]: failed to commit changes to dconf: GDBus.Error:org.gtk.GDBus.UnmappedGError.Quark._g_2dfile_2derror_2dquark.Code2: Failed to create file “/adminhomes/sajith/.config/dconf/user.9WK9S3”: Permission denied
Jul 31 07:20:29 hackerman packagekitd[2409785]: Failed to get cache filename for libreoffice [x2]
Jul 31 07:20:29 hackerman packagekitd[2409785]: Failed to get cache filename for kernel [x2]
Jul 31 07:20:38 hackerman packagekitd[2409785]: failed to parse public key for /etc/pki/rpm-gpg/RPM-GPG-KEY-PQC-redhat-release
Jul 31 07:37:22 hackerman systemd[1]: insights-client.service: Start request repeated too quickly.
== hazfs.cs.umd.edu (11 distinct, 66 total) ==
Jul 31 07:52:41 hazfs.cs.umd.edu snmpd[1431]: send response: Failure in sendto [x6]
Jul 31 07:52:41 hazfs.cs.umd.edu snmpd[1431]: -- NET-SNMP-EXTEND-MIB::nsExtendStatus."userweb" [x6]
Jul 31 07:52:41 hazfs.cs.umd.edu snmpd[1431]: -- NET-SNMP-EXTEND-MIB::nsExtendStatus."zfslist" [x6]
Jul 31 07:52:41 hazfs.cs.umd.edu snmpd[1431]: -- NET-SNMP-EXTEND-MIB::nsExtendStatus."userhome" [x6]
Jul 31 07:52:41 hazfs.cs.umd.edu snmpd[1431]: -- NET-SNMP-EXTEND-MIB::nsExtendOutput1Line."userweb" [x6]
Jul 31 07:52:41 hazfs.cs.umd.edu snmpd[1431]: -- NET-SNMP-EXTEND-MIB::nsExtendOutput1Line."zfslist" [x6]
Jul 31 07:52:41 hazfs.cs.umd.edu snmpd[1431]: -- NET-SNMP-EXTEND-MIB::nsExtendOutput1Line."userhome" [x6]
Jul 31 07:52:41 hazfs.cs.umd.edu snmpd[1431]: -- NET-SNMP-EXTEND-MIB::nsExtendOutputFull."userweb" [x6]
Jul 31 07:52:41 hazfs.cs.umd.edu snmpd[1431]: -- NET-SNMP-EXTEND-MIB::nsExtendOutputFull."zfslist" [x6]
Jul 31 07:52:41 hazfs.cs.umd.edu snmpd[1431]: -- NET-SNMP-EXTEND-MIB::nsExtendOutputFull."userhome" [x6]
Jul 31 07:52:41 hazfs.cs.umd.edu snmpd[1431]: -- NET-SNMP-EXTEND-MIB::nsExtendOutNumLines."userweb" [x6]
== idm00 (1 distinct, 1 total) ==
Jul 31 07:51:13 idm00 named[1455]: client @0x7f3304d076b8 10.73.240.42#50998: update '73.10.in-addr.arpa/IN' denied
== idmp0 (1 distinct, 1 total) ==
Jul 31 07:36:02 idmp0 named[5198]: client @0x7f99040313a8 10.73.240.43#64870: update '73.10.in-addr.arpa/IN' denied
== irb2156 (5 distinct, 5 total) ==
Jul 31 07:29:07 irb2156 systemd-resolved[3398]: Using degraded feature set TCP instead of UDP for DNS server 128.8.76.3.
Jul 31 07:36:06 irb2156 falcon-sensor-bpf[3727]: CrowdStrike(4): Could not retrieve DisableProxy value: c0000225
Jul 31 07:36:06 irb2156 falcon-sensor-bpf[3727]: CrowdStrike(4): ConnectWithProxy: Unable to get application proxy host from CsConfig: c0000225
Jul 31 07:37:23 irb2156 systemd-tmpfiles[154251]: Opening file "/tmp/org.chromium.Chromium.NW9a6h/SingletonSocket" failed, proceeding without lock: No such device or address
Jul 31 07:37:23 irb2156 systemd-tmpfiles[154251]: Opening file "/tmp/com.google.Chrome.jwL3jK/SingletonSocket" failed, proceeding without lock: No such device or address
== itmon02 (1 distinct, 34 total) ==
Jul 31 07:07:50 itmon02 sshd[1834]: error: beginning MaxStartups throttling [x34]
== munin (2 distinct, 8 total) ==
Jul 31 07:38:05 munin sudo[3688342]: pam_systemd(sudo:session): Failed to stat() runtime directory '/run/user/0': No such file or directory [x4]
Jul 31 07:38:05 munin sudo[3688342]: pam_systemd(sudo:session): Not setting $XDG_RUNTIME_DIR, as the directory is not in order. [x4]
== newhonors2 (1 distinct, 24 total) ==
Jul 31 07:13:03 newhonors2 dhcpcd[533287]: dhcpcd is not running [x24]
== outbound00.cs.umd.edu (1 distinct, 6 total) ==
Jul 31 07:09:09 outbound00.cs.umd.edu python3[1397482]: ldapdb [x6]
== outbound01.cs.umd.edu (1 distinct, 6 total) ==
Jul 31 07:13:06 outbound01.cs.umd.edu python3[3623991]: ldapdb [x6]
== sentry-docker00.cs.umd.edu (42 distinct, 42 total) ==
Jul 31 07:08:48 sentry-docker00.cs.umd.edu systemd-udevd[3061586]: link_config: could not get ethtool features for vethb5d5ba8
Jul 31 07:08:48 sentry-docker00.cs.umd.edu systemd-udevd[3061586]: Could not set offload features of vethb5d5ba8: No such device
Jul 31 07:08:49 sentry-docker00.cs.umd.edu systemd-udevd[3061661]: link_config: could not get ethtool features for veth3026ac0
Jul 31 07:08:49 sentry-docker00.cs.umd.edu systemd-udevd[3061661]: Could not set offload features of veth3026ac0: No such device
Jul 31 07:08:49 sentry-docker00.cs.umd.edu systemd-udevd[3061674]: Could not generate persistent MAC address for veth299c944: No such file or directory
Jul 31 07:08:49 sentry-docker00.cs.umd.edu systemd-udevd[3061675]: Could not generate persistent MAC address for veth23005d8: No such file or directory
Jul 31 07:08:49 sentry-docker00.cs.umd.edu systemd-udevd[3061700]: Could not generate persistent MAC address for vethb1a5190: No such file or directory
Jul 31 07:08:49 sentry-docker00.cs.umd.edu systemd-udevd[3061701]: Could not generate persistent MAC address for veth99164c0: No such file or directory
Jul 31 07:08:49 sentry-docker00.cs.umd.edu systemd-udevd[3061752]: Could not generate persistent MAC address for vethc687dce: No such file or directory
Jul 31 07:08:49 sentry-docker00.cs.umd.edu systemd-udevd[3061753]: Could not generate persistent MAC address for veth60b5eae: No such file or directory
Jul 31 07:08:49 sentry-docker00.cs.umd.edu systemd-udevd[3061849]: Could not generate persistent MAC address for vethd6ba2cc: No such file or directory
Jul 31 07:08:49 sentry-docker00.cs.umd.edu systemd-udevd[3061851]: Could not generate persistent MAC address for veth46f8789: No such file or directory
Jul 31 07:13:35 sentry-docker00.cs.umd.edu systemd-udevd[3063728]: link_config: could not get ethtool features for vethf5f898a
Jul 31 07:13:35 sentry-docker00.cs.umd.edu systemd-udevd[3063728]: Could not set offload features of vethf5f898a: No such device
Jul 31 07:13:35 sentry-docker00.cs.umd.edu systemd-udevd[3063746]: Could not generate persistent MAC address for veth9e307b7: No such file or directory
Jul 31 07:13:35 sentry-docker00.cs.umd.edu systemd-udevd[3063747]: Could not generate persistent MAC address for veth040fdd6: No such file or directory
Jul 31 07:28:57 sentry-docker00.cs.umd.edu systemd-udevd[3071207]: link_config: could not get ethtool features for vethd6ba2cc
Jul 31 07:28:57 sentry-docker00.cs.umd.edu systemd-udevd[3071207]: Could not set offload features of vethd6ba2cc: No such device
Jul 31 07:28:57 sentry-docker00.cs.umd.edu systemd-udevd[3071236]: Could not generate persistent MAC address for vethe7c5f5c: No such file or directory
Jul 31 07:28:57 sentry-docker00.cs.umd.edu systemd-udevd[3071237]: Could not generate persistent MAC address for vethc7727a8: No such file or directory
Jul 31 07:28:57 sentry-docker00.cs.umd.edu systemd-udevd[3071240]: Could not generate persistent MAC address for veth9582742: No such file or directory
Jul 31 07:28:57 sentry-docker00.cs.umd.edu systemd-udevd[3071241]: Could not generate persistent MAC address for veth5f33ef9: No such file or directory
Jul 31 07:28:57 sentry-docker00.cs.umd.edu systemd-udevd[3071247]: Could not generate persistent MAC address for veth8120861: No such file or directory
Jul 31 07:28:57 sentry-docker00.cs.umd.edu systemd-udevd[3071253]: Could not generate persistent MAC address for veth5239d59: No such file or directory
Jul 31 07:28:57 sentry-docker00.cs.umd.edu systemd-udevd[3071253]: Could not generate persistent MAC address for vethebc65ee: No such file or directory
Jul 31 07:28:57 sentry-docker00.cs.umd.edu systemd-udevd[3071247]: Could not generate persistent MAC address for vethabb8b07: No such file or directory
Jul 31 07:33:43 sentry-docker00.cs.umd.edu systemd-udevd[3073237]: Could not generate persistent MAC address for veth19b269d: No such file or directory
Jul 31 07:33:43 sentry-docker00.cs.umd.edu systemd-udevd[3073238]: Could not generate persistent MAC address for vetha551a35: No such file or directory
Jul 31 07:49:05 sentry-docker00.cs.umd.edu systemd-udevd[3080644]: link_config: could not get ethtool features for vethebc65ee
Jul 31 07:49:05 sentry-docker00.cs.umd.edu systemd-udevd[3080644]: Could not set offload features of vethebc65ee: No such device
... 12 more distinct messages not shown
== soul (1 distinct, 2 total) ==
Jul 31 07:06:11 soul krb5_child[2803107]: Preauthentication failed [x2]
== strawberry (2 distinct, 8 total) ==
Jul 31 07:09:44 strawberry udisksd[1067]: Error performing housekeeping for drive /org/freedesktop/UDisks2/drives/ST2000DM001_1CH164_W1E8J5KJ: Error updating SMART data: Error sending ATA command CHECK POWER MODE: Unexpected sense data returned:#0120000: 00 00 00 00 00 00 00 00 00 00 00 00 00 00 00 00 ................#0120010: 00 00 00 00 00 00 00 00 00 00 00 00 00 00 00 00 ................#012 (g-io-error-quark, 0) [x6]
Jul 31 07:34:42 strawberry smartd[5314]: Device: /dev/sda [SAT], failed to read SMART Attribute Data [x2]
== submit10-cln25 (1 distinct, 1 total) ==
Jul 31 07:37:00 submit10-cln25 systemd: Failed at step EXEC spawning /usr/local/bin/cronjob: No such file or directory
1
0
Command: /usr/local/sbin/syslog-digest.py
Time : 0.4959s
Status : exited 0
Output :
Syslog digest — 2026-07-31 07:05 EDT
Processed 4,138 lines, filtered 3,315 (80%). 823 unknown (123 distinct) from 23 host(s).
== abadi-computer (2 distinct, 2 total) ==
Jul 31 06:15:00 abadi-computer nologin[418960]: Attempted login by UNKNOWN (UID: 65534) on UNKNOWN
Jul 31 06:15:00 abadi-computer pipewire[418958]: mod.jackdbus-detect: Failed to receive jackdbus reply: org.freedesktop.DBus.Error.ServiceUnknown: The name org.jackaudio.service was not provided by any .service files
== abuse (1 distinct, 346 total) ==
Jul 31 06:05:06 abuse rsyslogd[21745]: imjournal: open() failed for path: '/var/lib/rsyslog/imjournal.state.tmp': Input/output error [v8.2404.0 try https://www.rsyslog.com/e/2433 ] [x346]
== alec.cs.umd.edu (3 distinct, 5 total) ==
Jul 31 06:05:06 alec.cs.umd.edu setroubleshoot[790099]: failed to retrieve rpm info for path '/run/netns/netns-9dfd0347-71eb-5698-085c-c769043aa5c3':
Jul 31 06:05:07 alec.cs.umd.edu sedispatch[1526]: AVC Message regarding setroubleshoot, ignoring message [x2]
Jul 31 06:05:07 alec.cs.umd.edu setroubleshoot[790099]: SELinux is preventing /usr/bin/df from getattr access on the file /run/netns/netns-9dfd0347-71eb-5698-085c-c769043aa5c3. For complete SELinux messages run: sealert -l 23f93208-3063-4aac-b78a-bb0fcb40740c [x2]
== b0b02.cs.umd.edu (4 distinct, 4 total) ==
Jul 31 06:16:13 b0b02.cs.umd.edu setroubleshoot[1297706]: SELinux is preventing /usr/bin/python3.9 from getattr access on the file /etc/authselect/nsswitch.conf. For complete SELinux messages run: sealert -l 9a1e2952-3fde-4937-a8ab-f7f59791a458
Jul 31 06:16:16 b0b02.cs.umd.edu setroubleshoot[1297706]: SELinux is preventing /usr/bin/python3.9 from read access on the file /etc/authselect/nsswitch.conf. For complete SELinux messages run: sealert -l 97d74423-e027-4cd6-8810-ad80944900b5
Jul 31 06:16:19 b0b02.cs.umd.edu setroubleshoot[1297706]: SELinux is preventing /usr/bin/python3.9 from open access on the file /etc/authselect/nsswitch.conf. For complete SELinux messages run: sealert -l 4f253f6a-62d6-46dd-8eaf-0b4d29df41c6
Jul 31 06:38:51 b0b02.cs.umd.edu rustdesk[1303264]: cannot open display:
== bac102 (1 distinct, 1 total) ==
Jul 31 06:46:18 bac102 systemd-resolved[902]: Using degraded feature set UDP instead of UDP+EDNS0 for DNS server 10.73.244.100.
== cheezit.cs.umd.edu (2 distinct, 2 total) ==
Jul 31 06:50:23 cheezit.cs.umd.edu sshd-session[3710414]: error: send_error: write: Connection reset by peer
Jul 31 06:50:44 cheezit.cs.umd.edu sshd-session[3710424]: error: send_error: write: Broken pipe
== contest (1 distinct, 33 total) ==
Jul 31 06:06:41 contest goferd[1007]: [ERROR][worker-0] gofer.messaging.adapter.connect:33 - connect: proton+amqps://satellite8.cs.umd.edu:5647, failed: Connection amqps://satellite8.cs.umd.edu:5647 disconnected: Condition('proton.pythonio', 'Connection refused to all addresses') [x33]
== csfw00a (1 distinct, 246 total) ==
Jul 31 06:05:03 csfw00a kernel: bnxt_en 0000:09:00.0 eth3: NIC Link is Down [x246]
== hackerman (7 distinct, 12 total) ==
Jul 31 06:20:04 hackerman gnome-software[2060381]: can't reliably fixup error code 4 in domain g-io-error-quark: Not a directory [x4]
Jul 31 06:20:12 hackerman gnome-software[2060381]: Only 0 apps for recent list, hiding
Jul 31 06:20:32 hackerman packagekitd[2396887]: Failed to get cache filename for openbao
Jul 31 06:20:32 hackerman packagekitd[2396887]: Failed to get cache filename for libreoffice [x2]
Jul 31 06:20:32 hackerman packagekitd[2396887]: Failed to get cache filename for kernel [x2]
Jul 31 06:20:36 hackerman gnome-software[2060381]: failed to commit changes to dconf: GDBus.Error:org.gtk.GDBus.UnmappedGError.Quark._g_2dfile_2derror_2dquark.Code2: Failed to create file “/adminhomes/sajith/.config/dconf/user.LBL4S3”: Permission denied
Jul 31 06:20:42 hackerman packagekitd[2396887]: failed to parse public key for /etc/pki/rpm-gpg/RPM-GPG-KEY-PQC-redhat-release
== idm00 (1 distinct, 1 total) ==
Jul 31 06:51:13 idm00 named[1455]: client @0x7f330432bc58 10.73.240.42#60883: update '73.10.in-addr.arpa/IN' denied
== idmp0 (1 distinct, 1 total) ==
Jul 31 06:36:02 idmp0 named[5198]: client @0x7f9910005288 10.73.240.43#64371: update '73.10.in-addr.arpa/IN' denied
== inbound00.cs.umd.edu (1 distinct, 1 total) ==
Jul 31 06:07:01 inbound00.cs.umd.edu systemd[1]: Configuration file /usr/lib/systemd/system/authentication_milter.service is marked executable. Please remove executable permission bits. Proceeding anyway.
== inbound01.cs.umd.edu (1 distinct, 1 total) ==
Jul 31 06:17:55 inbound01.cs.umd.edu systemd[1]: Configuration file /usr/lib/systemd/system/authentication_milter.service is marked executable. Please remove executable permission bits. Proceeding anyway.
== itmon02 (1 distinct, 28 total) ==
Jul 31 06:07:48 itmon02 sshd[1834]: error: beginning MaxStartups throttling [x28]
== neodontcare.cs.umd.edu (5 distinct, 6 total) ==
Jul 31 06:13:30 neodontcare.cs.umd.edu gnome-software[7556]: Only 0 apps for recent list, hiding
Jul 31 06:13:34 neodontcare.cs.umd.edu packagekitd[992552]: Failed to get cache filename for gnu-free-mono-fonts
Jul 31 06:13:34 neodontcare.cs.umd.edu packagekitd[992552]: Failed to get cache filename for gnu-free-serif-fonts
Jul 31 06:13:34 neodontcare.cs.umd.edu packagekitd[992552]: Failed to get cache filename for libreoffice [x2]
Jul 31 06:13:38 neodontcare.cs.umd.edu packagekitd[992552]: failed to parse public key for /etc/pki/rpm-gpg/RPM-GPG-KEY-PQC-redhat-release
== newhonors2 (39 distinct, 66 total) ==
Jul 31 06:13:03 newhonors2 dhcpcd[530542]: dhcpcd is not running [x28]
Jul 31 06:41:36 newhonors2 rsyslogd[531800]: imjournal: filecreatemode is not set, using default 0644 [v8.2312.0 try https://www.rsyslog.com/e/2186 ]
Jul 31 06:48:18 newhonors2 puppet-agent[532215]: Could not update: Execution of '/usr/bin/apt-get -q -y -o DPkg::Options::=--force-confold --force-yes install openvox-agent=8.27.0-1+ubuntu24.04' returned 100: Reading package lists...
Jul 31 06:48:18 newhonors2 puppet-agent[532215]: Building dependency tree...
Jul 31 06:48:18 newhonors2 puppet-agent[532215]: Reading state information...
Jul 31 06:48:18 newhonors2 puppet-agent[532215]: Package openvox-agent is not available, but is referred to by another package.
Jul 31 06:48:18 newhonors2 puppet-agent[532215]: This may mean that the package is missing, has been obsoleted, or
Jul 31 06:48:18 newhonors2 puppet-agent[532215]: is only available from another source
Jul 31 06:48:18 newhonors2 puppet-agent[532215]:
Jul 31 06:48:18 newhonors2 puppet-agent[532215]: W: --force-yes is deprecated, use one of the options starting with --allow instead.
Jul 31 06:48:18 newhonors2 puppet-agent[532215]: E: Version '8.27.0-1+ubuntu24.04' for 'openvox-agent' was not found
Jul 31 06:48:18 newhonors2 puppet-agent[532215]: (/Stage[main]/Puppet::Agent::Install/Package[openvox-agent]/ensure) change from '7.37.2-1+ubuntu24.04' to '8.27.0-1+ubuntu24.04' failed: Could not update: Execution of '/usr/bin/apt-get -q -y -o DPkg::Options::=--force-confold --force-yes install openvox-agent=8.27.0-1+ubuntu24.04' returned 100: Reading package lists...
Jul 31 06:48:18 newhonors2 puppet-agent[532215]: (/Stage[main]/Puppet::Agent::Install/Package[openvox-agent]/ensure) Building dependency tree...
Jul 31 06:48:18 newhonors2 puppet-agent[532215]: (/Stage[main]/Puppet::Agent::Install/Package[openvox-agent]/ensure) Reading state information...
Jul 31 06:48:18 newhonors2 puppet-agent[532215]: (/Stage[main]/Puppet::Agent::Install/Package[openvox-agent]/ensure) Package openvox-agent is not available, but is referred to by another package.
Jul 31 06:48:18 newhonors2 puppet-agent[532215]: (/Stage[main]/Puppet::Agent::Install/Package[openvox-agent]/ensure) This may mean that the package is missing, has been obsoleted, or
Jul 31 06:48:18 newhonors2 puppet-agent[532215]: (/Stage[main]/Puppet::Agent::Install/Package[openvox-agent]/ensure) is only available from another source
Jul 31 06:48:18 newhonors2 puppet-agent[532215]: (/Stage[main]/Puppet::Agent::Install/Package[openvox-agent]/ensure)
Jul 31 06:48:18 newhonors2 puppet-agent[532215]: (/Stage[main]/Puppet::Agent::Install/Package[openvox-agent]/ensure) W: --force-yes is deprecated, use one of the options starting with --allow instead.
Jul 31 06:48:18 newhonors2 puppet-agent[532215]: (/Stage[main]/Puppet::Agent::Install/Package[openvox-agent]/ensure) E: Version '8.27.0-1+ubuntu24.04' for 'openvox-agent' was not found
Jul 31 06:48:42 newhonors2 puppet-agent[532215]: (/Stage[main]/Puppet::Agent::Config/Puppet::Config::Agent[classfile]/Puppet::Config::Entry[agent_classfile]/Concat::Fragment[puppet.conf_agent]/Concat_fragment[puppet.conf_agent]) Skipping because of failed dependencies
Jul 31 06:48:42 newhonors2 puppet-agent[532215]: (/Stage[main]/Puppet::Agent::Config/Puppet::Config::Agent[classfile]/Puppet::Config::Entry[agent_classfile]/Concat::Fragment[puppet.conf_agent_end]/Concat_fragment[puppet.conf_agent_end]) Skipping because of failed dependencies
Jul 31 06:48:42 newhonors2 puppet-agent[532215]: (/Stage[main]/Puppet::Agent::Config/Puppet::Config::Agent[classfile]/Puppet::Config::Entry[agent_classfile]/Concat::Fragment[puppet.conf_agent_classfile]/Concat_fragment[puppet.conf_agent_classfile]) Skipping because of failed dependencies
Jul 31 06:48:42 newhonors2 puppet-agent[532215]: (/Stage[main]/Puppet::Agent::Config/Puppet::Config::Agent[default_schedules]/Puppet::Config::Entry[agent_default_schedules]/Concat::Fragment[puppet.conf_agent_default_schedules]/Concat_fragment[puppet.conf_agent_default_schedules]) Skipping because of failed dependencies
Jul 31 06:48:42 newhonors2 puppet-agent[532215]: (/Stage[main]/Puppet::Agent::Config/Puppet::Config::Agent[report]/Puppet::Config::Entry[agent_report]/Concat::Fragment[puppet.conf_agent_report]/Concat_fragment[puppet.conf_agent_report]) Skipping because of failed dependencies
Jul 31 06:48:42 newhonors2 puppet-agent[532215]: (/Stage[main]/Puppet::Agent::Config/Puppet::Config::Agent[masterport]/Puppet::Config::Entry[agent_masterport]/Concat::Fragment[puppet.conf_agent_masterport]/Concat_fragment[puppet.conf_agent_masterport]) Skipping because of failed dependencies
Jul 31 06:48:42 newhonors2 puppet-agent[532215]: (/Stage[main]/Puppet::Agent::Config/Puppet::Config::Agent[splay]/Puppet::Config::Entry[agent_splay]/Concat::Fragment[puppet.conf_agent_splay]/Concat_fragment[puppet.conf_agent_splay]) Skipping because of failed dependencies
Jul 31 06:48:42 newhonors2 puppet-agent[532215]: (/Stage[main]/Puppet::Agent::Config/Puppet::Config::Agent[splaylimit]/Puppet::Config::Entry[agent_splaylimit]/Concat::Fragment[puppet.conf_agent_splaylimit]/Concat_fragment[puppet.conf_agent_splaylimit]) Skipping because of failed dependencies
Jul 31 06:48:42 newhonors2 puppet-agent[532215]: (/Stage[main]/Puppet::Agent::Config/Puppet::Config::Agent[runinterval]/Puppet::Config::Entry[agent_runinterval]/Concat::Fragment[puppet.conf_agent_runinterval]/Concat_fragment[puppet.conf_agent_runinterval]) Skipping because of failed dependencies
Jul 31 06:48:42 newhonors2 puppet-agent[532215]: (/Stage[main]/Puppet::Agent::Config/Puppet::Config::Agent[noop]/Puppet::Config::Entry[agent_noop]/Concat::Fragment[puppet.conf_agent_noop]/Concat_fragment[puppet.conf_agent_noop]) Skipping because of failed dependencies
... 9 more distinct messages not shown
== orchids (5 distinct, 5 total) ==
Jul 31 06:11:31 orchids gnome-software[1516991]: Only 0 apps for recent list, hiding
Jul 31 06:11:39 orchids packagekitd[379085]: Failed to get cache filename for libreoffice
Jul 31 06:11:39 orchids packagekitd[379085]: Failed to get cache filename for openbao
Jul 31 06:11:39 orchids packagekitd[379085]: Failed to get cache filename for google-chrome-stable
Jul 31 06:11:45 orchids packagekitd[379085]: failed to parse public key for /etc/pki/rpm-gpg/RPM-GPG-KEY-PQC-redhat-release
== outbound00.cs.umd.edu (1 distinct, 6 total) ==
Jul 31 06:09:09 outbound00.cs.umd.edu python3[1383458]: ldapdb [x6]
== outbound01.cs.umd.edu (1 distinct, 6 total) ==
Jul 31 06:13:06 outbound01.cs.umd.edu python3[3610154]: ldapdb [x6]
== peach.cs.umd.edu (2 distinct, 2 total) ==
Jul 31 06:22:08 peach.cs.umd.edu setroubleshoot[1814099]: SELinux is preventing /usr/bin/qemu-ga from search access on the directory /var/lib/containers/storage/overlay. For complete SELinux messages run: sealert -l ba415951-a2c6-424e-b17d-305c5300b9f3
Jul 31 06:22:08 peach.cs.umd.edu setroubleshoot[1814099]: SELinux is preventing /usr/bin/qemu-ga from search access on the directory /var/lib/containers/storage/overlay. For complete SELinux messages run: sealert -l 6aeb0956-fcf2-462a-ae4d-439b912c16d0
== sentry-docker00.cs.umd.edu (38 distinct, 38 total) ==
Jul 31 06:08:23 sentry-docker00.cs.umd.edu systemd-udevd[3033364]: link_config: could not get ethtool features for veth9501df6
Jul 31 06:08:23 sentry-docker00.cs.umd.edu systemd-udevd[3033364]: Could not set offload features of veth9501df6: No such device
Jul 31 06:08:24 sentry-docker00.cs.umd.edu systemd-udevd[3033394]: Could not generate persistent MAC address for veth43bd2a3: No such file or directory
Jul 31 06:08:24 sentry-docker00.cs.umd.edu systemd-udevd[3033395]: Could not generate persistent MAC address for vethb48ad51: No such file or directory
Jul 31 06:08:24 sentry-docker00.cs.umd.edu systemd-udevd[3033398]: Could not generate persistent MAC address for veth36a9a73: No such file or directory
Jul 31 06:08:24 sentry-docker00.cs.umd.edu systemd-udevd[3033410]: Could not generate persistent MAC address for veth2f34243: No such file or directory
Jul 31 06:08:24 sentry-docker00.cs.umd.edu systemd-udevd[3033413]: Could not generate persistent MAC address for vethf6d0395: No such file or directory
Jul 31 06:08:24 sentry-docker00.cs.umd.edu systemd-udevd[3033401]: Could not generate persistent MAC address for veth304991b: No such file or directory
Jul 31 06:08:24 sentry-docker00.cs.umd.edu systemd-udevd[3033424]: Could not generate persistent MAC address for vetha4edb82: No such file or directory
Jul 31 06:08:24 sentry-docker00.cs.umd.edu systemd-udevd[3033425]: Could not generate persistent MAC address for vethefe6ec3: No such file or directory
Jul 31 06:13:10 sentry-docker00.cs.umd.edu systemd-udevd[3035392]: Could not generate persistent MAC address for vethc20725a: No such file or directory
Jul 31 06:13:10 sentry-docker00.cs.umd.edu systemd-udevd[3035393]: Could not generate persistent MAC address for veth13715ba: No such file or directory
Jul 31 06:28:32 sentry-docker00.cs.umd.edu systemd-udevd[3042779]: link_config: could not get ethtool features for vetha4edb82
Jul 31 06:28:32 sentry-docker00.cs.umd.edu systemd-udevd[3042779]: Could not set offload features of vetha4edb82: No such device
Jul 31 06:28:32 sentry-docker00.cs.umd.edu systemd-udevd[3042801]: Could not generate persistent MAC address for veth3a0a894: No such file or directory
Jul 31 06:28:32 sentry-docker00.cs.umd.edu systemd-udevd[3042802]: Could not generate persistent MAC address for veth4865a9d: No such file or directory
Jul 31 06:28:32 sentry-docker00.cs.umd.edu systemd-udevd[3042827]: Could not generate persistent MAC address for veth49efecd: No such file or directory
Jul 31 06:28:32 sentry-docker00.cs.umd.edu systemd-udevd[3042828]: Could not generate persistent MAC address for veth65a4602: No such file or directory
Jul 31 06:28:32 sentry-docker00.cs.umd.edu systemd-udevd[3042855]: Could not generate persistent MAC address for veth759792e: No such file or directory
Jul 31 06:28:32 sentry-docker00.cs.umd.edu systemd-udevd[3042845]: Could not generate persistent MAC address for vethc73cb50: No such file or directory
Jul 31 06:28:32 sentry-docker00.cs.umd.edu systemd-udevd[3042827]: Could not generate persistent MAC address for veth19b6a49: No such file or directory
Jul 31 06:28:32 sentry-docker00.cs.umd.edu systemd-udevd[3042849]: Could not generate persistent MAC address for vetheae0ebb: No such file or directory
Jul 31 06:33:18 sentry-docker00.cs.umd.edu systemd-udevd[3044798]: link_config: could not get ethtool features for vethc20725a
Jul 31 06:33:18 sentry-docker00.cs.umd.edu systemd-udevd[3044798]: Could not set offload features of vethc20725a: No such device
Jul 31 06:33:19 sentry-docker00.cs.umd.edu systemd-udevd[3044814]: Could not generate persistent MAC address for vethf1c54a3: No such file or directory
Jul 31 06:33:19 sentry-docker00.cs.umd.edu systemd-udevd[3044815]: Could not generate persistent MAC address for veth21beb41: No such file or directory
Jul 31 06:48:40 sentry-docker00.cs.umd.edu systemd-udevd[3052181]: link_config: could not get ethtool features for veth759792e
Jul 31 06:48:40 sentry-docker00.cs.umd.edu systemd-udevd[3052181]: Could not set offload features of veth759792e: No such device
Jul 31 06:48:40 sentry-docker00.cs.umd.edu systemd-udevd[3052258]: Could not generate persistent MAC address for veth35a9e3f: No such file or directory
Jul 31 06:48:40 sentry-docker00.cs.umd.edu systemd-udevd[3052259]: Could not generate persistent MAC address for vethf4092cb: No such file or directory
... 8 more distinct messages not shown
== strawberry (4 distinct, 10 total) ==
Jul 31 06:09:44 strawberry udisksd[1067]: Error performing housekeeping for drive /org/freedesktop/UDisks2/drives/ST2000DM001_1CH164_W1E8J5KJ: Error updating SMART data: Error sending ATA command CHECK POWER MODE: Unexpected sense data returned:#0120000: 00 00 00 00 00 00 00 00 00 00 00 00 00 00 00 00 ................#0120010: 00 00 00 00 00 00 00 00 00 00 00 00 00 00 00 00 ................#012 (g-io-error-quark, 0) [x6]
Jul 31 06:31:03 strawberry nologin[3218497]: Attempted login by UNKNOWN (UID: 65534) on UNKNOWN
Jul 31 06:31:03 strawberry pipewire[3218496]: mod.jackdbus-detect: Failed to receive jackdbus reply: org.freedesktop.DBus.Error.ServiceUnknown: The name org.jackaudio.service was not provided by any .service files
Jul 31 06:34:42 strawberry smartd[5314]: Device: /dev/sda [SAT], failed to read SMART Attribute Data [x2]
== tlsrpt (1 distinct, 1 total) ==
Jul 31 06:38:02 tlsrpt (httpd)[464415]: httpd.service: Referenced but unset environment variable evaluates to an empty string: OPTIONS
1
0
Command: /usr/local/sbin/syslog-digest.py
Time : 0.5070s
Status : exited 0
Output :
Syslog digest — 2026-07-31 06:05 EDT
Processed 4,385 lines, filtered 3,618 (82%). 767 unknown (110 distinct) from 23 host(s).
== abuse (1 distinct, 347 total) ==
Jul 31 05:05:06 abuse rsyslogd[21745]: imjournal: open() failed for path: '/var/lib/rsyslog/imjournal.state.tmp': Input/output error [v8.2404.0 try https://www.rsyslog.com/e/2433 ] [x347]
== alec.cs.umd.edu (3 distinct, 60 total) ==
Jul 31 05:05:06 alec.cs.umd.edu setroubleshoot[774839]: failed to retrieve rpm info for path '/run/netns/netns-9dfd0347-71eb-5698-085c-c769043aa5c3': [x12]
Jul 31 05:05:07 alec.cs.umd.edu sedispatch[1526]: AVC Message regarding setroubleshoot, ignoring message [x24]
Jul 31 05:05:07 alec.cs.umd.edu setroubleshoot[774839]: SELinux is preventing /usr/bin/df from getattr access on the file /run/netns/netns-9dfd0347-71eb-5698-085c-c769043aa5c3. For complete SELinux messages run: sealert -l 23f93208-3063-4aac-b78a-bb0fcb40740c [x24]
== b0b02.cs.umd.edu (4 distinct, 5 total) ==
Jul 31 05:16:09 b0b02.cs.umd.edu setroubleshoot[1282610]: SELinux is preventing /usr/bin/python3.9 from getattr access on the file /etc/authselect/nsswitch.conf. For complete SELinux messages run: sealert -l 9a1e2952-3fde-4937-a8ab-f7f59791a458 [x2]
Jul 31 05:16:12 b0b02.cs.umd.edu setroubleshoot[1282610]: SELinux is preventing /usr/bin/python3.9 from read access on the file /etc/authselect/nsswitch.conf. For complete SELinux messages run: sealert -l 97d74423-e027-4cd6-8810-ad80944900b5
Jul 31 05:16:15 b0b02.cs.umd.edu setroubleshoot[1282610]: SELinux is preventing /usr/bin/python3.9 from open access on the file /etc/authselect/nsswitch.conf. For complete SELinux messages run: sealert -l 4f253f6a-62d6-46dd-8eaf-0b4d29df41c6
Jul 31 05:38:48 b0b02.cs.umd.edu rustdesk[1288190]: cannot open display:
== bac102 (1 distinct, 1 total) ==
Jul 31 05:23:29 bac102 systemd-resolved[902]: Using degraded feature set UDP instead of UDP+EDNS0 for DNS server 10.73.244.11.
== contest (9 distinct, 44 total) ==
Jul 31 05:05:59 contest goferd[1007]: [ERROR][worker-0] gofer.messaging.adapter.connect:33 - connect: proton+amqps://satellite8.cs.umd.edu:5647, failed: Connection amqps://satellite8.cs.umd.edu:5647 disconnected: Condition('proton.pythonio', 'Connection refused to all addresses') [x34]
Jul 31 05:48:15 contest setroubleshoot[379252]: SELinux is preventing /usr/libexec/platform-python3.6 from create access on the directory libdnf.0Aului. For complete SELinux messages run: sealert -l cb6b25c6-4765-4cf2-88a0-9b3b508e94e9
Jul 31 05:48:15 contest setroubleshoot[379252]: SELinux is preventing /usr/bin/gpgconf from add_name access on the directory repodata. For complete SELinux messages run: sealert -l 41cf7b1b-0f34-4609-98f2-b66e7825fef7
Jul 31 05:48:15 contest setroubleshoot[379252]: SELinux is preventing /usr/libexec/platform-python3.6 from create access on the file mirrorlist. For complete SELinux messages run: sealert -l fc20ff92-ea83-4f38-a24b-ddfd737a3141
Jul 31 05:48:16 contest setroubleshoot[379252]: SELinux is preventing /usr/libexec/platform-python3.6 from setattr access on the file repomd.xml. For complete SELinux messages run: sealert -l ac675631-fa35-4e93-adc9-b692b18e53e5 [x2]
Jul 31 05:48:16 contest setroubleshoot[379252]: SELinux is preventing /usr/libexec/platform-python3.6 from create access on the file repomd.xml.asc. For complete SELinux messages run: sealert -l fc20ff92-ea83-4f38-a24b-ddfd737a3141
Jul 31 05:48:16 contest setroubleshoot[379252]: SELinux is preventing /usr/libexec/platform-python3.6 from read access on the directory libdnf.0Aului. For complete SELinux messages run: sealert -l 45d103b6-0810-4890-a705-990118577ce8
Jul 31 05:48:16 contest setroubleshoot[379252]: SELinux is preventing /usr/libexec/platform-python3.6 from remove_name access on the directory repomd.xml. For complete SELinux messages run: sealert -l 7e499113-2fd7-4f67-bec6-3521efbe3637 [x2]
Jul 31 05:48:18 contest setroubleshoot[379252]: SELinux is preventing /usr/libexec/platform-python3.6 from rmdir access on the directory repodata. For complete SELinux messages run: sealert -l 3928930b-a1ed-448d-950b-0665ac2adef8
== csfw00a (1 distinct, 120 total) ==
Jul 31 05:05:35 csfw00a kernel: bnxt_en 0000:09:00.0 eth3: NIC Link is Down [x120]
== grades01.cs.umd.edu (1 distinct, 1 total) ==
Jul 31 05:48:16 grades01.cs.umd.edu puppet-agent[10172]: The directory '/srv/grades' contains 2471 entries, which exceeds the default soft limit 1000 and may cause excessive resource consumption and degraded performance. To remove this warning set a value for `max_files` parameter or consider using an alternate method to manage large directory trees
== hackerman (1 distinct, 1 total) ==
Jul 31 05:19:01 hackerman gnome-software[2060381]: failed to commit changes to dconf: GDBus.Error:org.gtk.GDBus.UnmappedGError.Quark._g_2dfile_2derror_2dquark.Code2: Failed to create file “/adminhomes/sajith/.config/dconf/user.8H5US3”: Permission denied
== idm00 (1 distinct, 1 total) ==
Jul 31 05:51:13 idm00 named[1455]: client @0x7f330c5eb228 10.73.240.42#59752: update '73.10.in-addr.arpa/IN' denied
== idmp0 (1 distinct, 1 total) ==
Jul 31 05:36:02 idmp0 named[5198]: client @0x7f991c007ab8 10.73.240.43#53165: update '73.10.in-addr.arpa/IN' denied
== inbound01.cs.umd.edu (6 distinct, 17 total) ==
Jul 31 05:33:37 inbound01.cs.umd.edu sshd-session[3618103]: error: maximum authentication attempts exceeded for root from 14.171.196.239 port 36447 ssh2 [preauth]
Jul 31 05:34:03 inbound01.cs.umd.edu sshd-session[3618208]: error: maximum authentication attempts exceeded for root from 14.171.196.239 port 36770 ssh2 [preauth]
Jul 31 05:34:32 inbound01.cs.umd.edu sshd-session[3618248]: error: maximum authentication attempts exceeded for root from 14.171.196.239 port 37048 ssh2 [preauth]
Jul 31 05:34:53 inbound01.cs.umd.edu krb5_child[3618371]: Client 'admin(a)UMD.EDU' not found in Kerberos database [x12]
Jul 31 05:35:12 inbound01.cs.umd.edu sshd-session[3618364]: error: maximum authentication attempts exceeded for admin from 14.171.196.239 port 37483 ssh2 [preauth]
Jul 31 05:35:38 inbound01.cs.umd.edu sshd-session[3618388]: error: maximum authentication attempts exceeded for admin from 14.171.196.239 port 37793 ssh2 [preauth]
== itmon02 (1 distinct, 39 total) ==
Jul 31 05:07:58 itmon02 sshd[1834]: error: beginning MaxStartups throttling [x39]
== krispykreme.cs.umd.edu (1 distinct, 1 total) ==
Jul 31 05:17:35 krispykreme.cs.umd.edu sshd-session[1476469]: error: send_error: write: Broken pipe
== newhonors2 (1 distinct, 24 total) ==
Jul 31 05:13:03 newhonors2 dhcpcd[528685]: dhcpcd is not running [x24]
== outbound00.cs.umd.edu (1 distinct, 6 total) ==
Jul 31 05:09:09 outbound00.cs.umd.edu python3[1369573]: ldapdb [x6]
== outbound01.cs.umd.edu (2 distinct, 8 total) ==
Jul 31 05:08:13 outbound01.cs.umd.edu python3[3594279]: ldapdb [x7]
Jul 31 05:09:20 outbound01.cs.umd.edu systemd[1]: Configuration file /usr/lib/systemd/system/authentication_milter.service is marked executable. Please remove executable permission bits. Proceeding anyway.
== sentry-docker00.cs.umd.edu (40 distinct, 40 total) ==
Jul 31 05:07:58 sentry-docker00.cs.umd.edu systemd-udevd[3003907]: link_config: could not get ethtool features for vethe8a1855
Jul 31 05:07:58 sentry-docker00.cs.umd.edu systemd-udevd[3003907]: Could not set offload features of vethe8a1855: No such device
Jul 31 05:07:59 sentry-docker00.cs.umd.edu systemd-udevd[3003921]: Could not generate persistent MAC address for veth4d1653d: No such file or directory
Jul 31 05:07:59 sentry-docker00.cs.umd.edu systemd-udevd[3003922]: Could not generate persistent MAC address for vetha47504f: No such file or directory
Jul 31 05:07:59 sentry-docker00.cs.umd.edu systemd-udevd[3003947]: Could not generate persistent MAC address for veth7c4517f: No such file or directory
Jul 31 05:07:59 sentry-docker00.cs.umd.edu systemd-udevd[3003948]: Could not generate persistent MAC address for veth01fca96: No such file or directory
Jul 31 05:07:59 sentry-docker00.cs.umd.edu systemd-udevd[3004003]: Could not generate persistent MAC address for veth0ac5ba4: No such file or directory
Jul 31 05:07:59 sentry-docker00.cs.umd.edu systemd-udevd[3004004]: Could not generate persistent MAC address for veth9ded7d3: No such file or directory
Jul 31 05:07:59 sentry-docker00.cs.umd.edu systemd-udevd[3004059]: Could not generate persistent MAC address for veth579b5c3: No such file or directory
Jul 31 05:07:59 sentry-docker00.cs.umd.edu systemd-udevd[3004063]: Could not generate persistent MAC address for veth849e9b7: No such file or directory
Jul 31 05:12:45 sentry-docker00.cs.umd.edu systemd-udevd[3007002]: link_config: could not set ethtool features for veth626a56f
Jul 31 05:12:45 sentry-docker00.cs.umd.edu systemd-udevd[3007002]: Could not set offload features of veth626a56f: Operation not permitted
Jul 31 05:12:45 sentry-docker00.cs.umd.edu systemd-udevd[3007011]: Could not generate persistent MAC address for veth7146987: No such file or directory
Jul 31 05:12:45 sentry-docker00.cs.umd.edu systemd-udevd[3007012]: Could not generate persistent MAC address for vethb0e6fee: No such file or directory
Jul 31 05:28:07 sentry-docker00.cs.umd.edu systemd-udevd[3013731]: link_config: could not get ethtool features for veth7c4517f
Jul 31 05:28:07 sentry-docker00.cs.umd.edu systemd-udevd[3013731]: Could not set offload features of veth7c4517f: No such device
Jul 31 05:28:07 sentry-docker00.cs.umd.edu systemd-udevd[3013760]: Could not generate persistent MAC address for veth28a0445: No such file or directory
Jul 31 05:28:07 sentry-docker00.cs.umd.edu systemd-udevd[3013761]: Could not generate persistent MAC address for vethd4dbda9: No such file or directory
Jul 31 05:28:07 sentry-docker00.cs.umd.edu systemd-udevd[3013764]: Could not generate persistent MAC address for vethb18c4a6: No such file or directory
Jul 31 05:28:07 sentry-docker00.cs.umd.edu systemd-udevd[3013765]: Could not generate persistent MAC address for vethc8630c4: No such file or directory
Jul 31 05:28:07 sentry-docker00.cs.umd.edu systemd-udevd[3013788]: Could not generate persistent MAC address for vethc8f39aa: No such file or directory
Jul 31 05:28:07 sentry-docker00.cs.umd.edu systemd-udevd[3013789]: Could not generate persistent MAC address for veth6568ee5: No such file or directory
Jul 31 05:28:07 sentry-docker00.cs.umd.edu systemd-udevd[3013807]: Could not generate persistent MAC address for vetha9316e3: No such file or directory
Jul 31 05:28:07 sentry-docker00.cs.umd.edu systemd-udevd[3013804]: Could not generate persistent MAC address for veth19c379e: No such file or directory
Jul 31 05:32:54 sentry-docker00.cs.umd.edu systemd-udevd[3016523]: Could not generate persistent MAC address for veth0f44caa: No such file or directory
Jul 31 05:32:54 sentry-docker00.cs.umd.edu systemd-udevd[3016524]: Could not generate persistent MAC address for veth6f3532b: No such file or directory
Jul 31 05:48:15 sentry-docker00.cs.umd.edu systemd-udevd[3023862]: link_config: could not get ethtool features for vethc8f39aa
Jul 31 05:48:15 sentry-docker00.cs.umd.edu systemd-udevd[3023862]: Could not set offload features of vethc8f39aa: No such device
Jul 31 05:48:15 sentry-docker00.cs.umd.edu systemd-udevd[3023914]: Could not generate persistent MAC address for veth2770345: No such file or directory
Jul 31 05:48:15 sentry-docker00.cs.umd.edu systemd-udevd[3023915]: Could not generate persistent MAC address for veth8cae679: No such file or directory
... 10 more distinct messages not shown
== soul (1 distinct, 1 total) ==
Jul 31 05:47:43 soul krb5_child[2792292]: Client 'admin(a)UMD.EDU' not found in Kerberos database
== strawberry (2 distinct, 8 total) ==
Jul 31 05:09:44 strawberry udisksd[1067]: Error performing housekeeping for drive /org/freedesktop/UDisks2/drives/ST2000DM001_1CH164_W1E8J5KJ: Error updating SMART data: Error sending ATA command CHECK POWER MODE: Unexpected sense data returned:#0120000: 00 00 00 00 00 00 00 00 00 00 00 00 00 00 00 00 ................#0120010: 00 00 00 00 00 00 00 00 00 00 00 00 00 00 00 00 ................#012 (g-io-error-quark, 0) [x6]
Jul 31 05:34:42 strawberry smartd[5314]: Device: /dev/sda [SAT], failed to read SMART Attribute Data [x2]
== submit26-b9-2 (10 distinct, 14 total) ==
Jul 31 05:12:50 submit26-b9-2 setroubleshoot[696295]: SELinux is preventing /usr/bin/python3.9 from create access on the directory /(null). For complete SELinux messages run: sealert -l d506243c-d61e-48f3-b42a-4592c913deb0 [x2]
Jul 31 05:12:50 submit26-b9-2 setroubleshoot[696295]: SELinux is preventing /usr/bin/python3.9 from add_name access on the directory /(null). For complete SELinux messages run: sealert -l 3b4752ac-1b9a-4af9-a05b-32e4c2eb13ab [x2]
Jul 31 05:12:51 submit26-b9-2 setroubleshoot[696295]: SELinux is preventing /usr/bin/python3.9 from create access on the file /(null). For complete SELinux messages run: sealert -l 29e5adbd-4381-4467-b40d-a2219101e096
Jul 31 05:12:51 submit26-b9-2 setroubleshoot[696295]: SELinux is preventing /usr/bin/python3.9 from open access on the file /tmp/libdnf.r4XSW1/repodata/repomd.xml. For complete SELinux messages run: sealert -l 1b38f2ec-01ce-4343-8059-ba7494ecc5c4
Jul 31 05:12:51 submit26-b9-2 setroubleshoot[696295]: SELinux is preventing /usr/bin/python3.9 from setattr access on the file repomd.xml. For complete SELinux messages run: sealert -l e5f9af40-1f63-4924-b012-27ab2a7b2266
Jul 31 05:12:51 submit26-b9-2 setroubleshoot[696295]: SELinux is preventing /usr/bin/python3.9 from read access on the directory libdnf.r4XSW1. For complete SELinux messages run: sealert -l 5c54db87-54a3-4a7c-97b4-b5c48d6c3543
Jul 31 05:12:51 submit26-b9-2 setroubleshoot[696295]: SELinux is preventing /usr/bin/python3.9 from remove_name access on the directory repomd.xml. For complete SELinux messages run: sealert -l 63cd60e1-1e61-4276-afea-dd8526ffe8b2 [x2]
Jul 31 05:12:51 submit26-b9-2 setroubleshoot[696295]: SELinux is preventing /usr/bin/python3.9 from unlink access on the file repomd.xml. For complete SELinux messages run: sealert -l 81c7e9ec-e023-4c6d-b1ad-c02a242e655e
Jul 31 05:12:51 submit26-b9-2 setroubleshoot[696295]: SELinux is preventing /usr/bin/python3.9 from rmdir access on the directory repodata. For complete SELinux messages run: sealert -l 6ae9a597-e123-4d74-8eec-a8ebe0f5e4d0 [x2]
Jul 31 05:12:51 submit26-b9-2 setroubleshoot[696295]: SELinux is preventing /usr/bin/python3.9 from read access on the directory libdnf.V488IU. For complete SELinux messages run: sealert -l 5c54db87-54a3-4a7c-97b4-b5c48d6c3543
== submit26-b9-3 (10 distinct, 14 total) ==
Jul 31 05:20:37 submit26-b9-3 setroubleshoot[724060]: SELinux is preventing /usr/bin/python3.9 from create access on the directory /(null). For complete SELinux messages run: sealert -l 5b912a44-22fd-4560-b201-2a4e289b73f5 [x2]
Jul 31 05:20:37 submit26-b9-3 setroubleshoot[724060]: SELinux is preventing /usr/bin/python3.9 from add_name access on the directory /(null). For complete SELinux messages run: sealert -l 7f1df1e4-725e-4953-98eb-1079f908f543 [x2]
Jul 31 05:20:37 submit26-b9-3 setroubleshoot[724060]: SELinux is preventing /usr/bin/python3.9 from create access on the file /(null). For complete SELinux messages run: sealert -l 40b8852a-f77b-44b4-affe-5f11fa33de43
Jul 31 05:20:37 submit26-b9-3 setroubleshoot[724060]: SELinux is preventing /usr/bin/python3.9 from open access on the file /tmp/libdnf.i8gyZW/repodata/repomd.xml. For complete SELinux messages run: sealert -l 45a8019e-f6b5-4baa-92c1-862594b40d46
Jul 31 05:20:37 submit26-b9-3 setroubleshoot[724060]: SELinux is preventing /usr/bin/python3.9 from setattr access on the file repomd.xml. For complete SELinux messages run: sealert -l e9f0bfff-7784-4126-baa4-2bb06da56591
Jul 31 05:20:37 submit26-b9-3 setroubleshoot[724060]: SELinux is preventing /usr/bin/python3.9 from read access on the directory libdnf.i8gyZW. For complete SELinux messages run: sealert -l 0b17cc3d-cdc6-4fe2-a11f-3892e7c41dc7
Jul 31 05:20:37 submit26-b9-3 setroubleshoot[724060]: SELinux is preventing /usr/bin/python3.9 from remove_name access on the directory repomd.xml. For complete SELinux messages run: sealert -l 10e38c64-b65f-4cdd-901e-4375652d9a42 [x2]
Jul 31 05:20:37 submit26-b9-3 setroubleshoot[724060]: SELinux is preventing /usr/bin/python3.9 from unlink access on the file repomd.xml. For complete SELinux messages run: sealert -l 7fd9cf72-ef38-48e1-b6aa-b571b26a7b22
Jul 31 05:20:37 submit26-b9-3 setroubleshoot[724060]: SELinux is preventing /usr/bin/python3.9 from rmdir access on the directory repodata. For complete SELinux messages run: sealert -l b9b11116-89bd-4a3c-980c-1d422c5dcee4 [x2]
Jul 31 05:20:37 submit26-b9-3 setroubleshoot[724060]: SELinux is preventing /usr/bin/python3.9 from read access on the directory libdnf.qrRaOz. For complete SELinux messages run: sealert -l 0b17cc3d-cdc6-4fe2-a11f-3892e7c41dc7
== submit26-clnb9 (9 distinct, 11 total) ==
Jul 31 05:31:55 submit26-clnb9 setroubleshoot[1573672]: SELinux is preventing /usr/bin/python3.9 from create access on the directory /(null). For complete SELinux messages run: sealert -l 6783ed2b-5ae4-42b5-975a-4bf50eec4658 [x2]
Jul 31 05:31:55 submit26-clnb9 setroubleshoot[1573672]: SELinux is preventing /usr/bin/python3.9 from add_name access on the directory /(null). For complete SELinux messages run: sealert -l 9e7fa955-cc30-4804-ac8c-e1779e85946c [x2]
Jul 31 05:31:55 submit26-clnb9 setroubleshoot[1573672]: SELinux is preventing /usr/bin/python3.9 from create access on the file /(null). For complete SELinux messages run: sealert -l 69bfa6e3-089c-40ff-9563-fd30787d0774
Jul 31 05:31:55 submit26-clnb9 setroubleshoot[1573672]: SELinux is preventing /usr/bin/python3.9 from open access on the file /tmp/libdnf.2W4Sak/repodata/repomd.xml. For complete SELinux messages run: sealert -l 001acdb5-31ef-4e52-b10b-90f467a89ddc
Jul 31 05:31:55 submit26-clnb9 setroubleshoot[1573672]: SELinux is preventing /usr/bin/python3.9 from setattr access on the file repomd.xml. For complete SELinux messages run: sealert -l edacddcf-16ed-4dc3-8d82-7c597d5dee23
Jul 31 05:31:55 submit26-clnb9 setroubleshoot[1573672]: SELinux is preventing /usr/bin/python3.9 from read access on the directory libdnf.2W4Sak. For complete SELinux messages run: sealert -l 62b3782e-4730-4488-8178-94dafe9b552c
Jul 31 05:31:55 submit26-clnb9 setroubleshoot[1573672]: SELinux is preventing /usr/bin/python3.9 from remove_name access on the directory repomd.xml. For complete SELinux messages run: sealert -l 81cb3698-78f8-440a-8e3c-e5d1041e6b78
Jul 31 05:31:55 submit26-clnb9 setroubleshoot[1573672]: SELinux is preventing /usr/bin/python3.9 from unlink access on the file repomd.xml. For complete SELinux messages run: sealert -l 792b472a-115c-4799-9805-fc7436f916b9
Jul 31 05:31:55 submit26-clnb9 setroubleshoot[1573672]: SELinux is preventing /usr/bin/python3.9 from rmdir access on the directory repodata. For complete SELinux messages run: sealert -l 15c83a86-837b-41e2-b662-b39cd4e361cb
== updates00.cs.umd.edu (3 distinct, 3 total) ==
Jul 31 05:18:35 updates00.cs.umd.edu puppet-agent[4785]: Could not retrieve catalog from remote server: Error 500 on SERVER: Server Error: Function lookup() did not find a value for the name 'vault::kerberos' on node updates00.cs.umd.edu
Jul 31 05:18:35 updates00.cs.umd.edu puppet-agent[4785]: Not using cache on failed catalog
Jul 31 05:18:35 updates00.cs.umd.edu puppet-agent[4785]: Could not retrieve catalog; skipping run
1
0
Command: /usr/local/sbin/syslog-digest.py
Time : 0.5033s
Status : exited 0
Output :
Syslog digest — 2026-07-31 05:05 EDT
Processed 4,084 lines, filtered 3,261 (79%). 823 unknown (102 distinct) from 24 host(s).
== abadi-computer (2 distinct, 2 total) ==
Jul 31 04:15:00 abadi-computer nologin[408321]: Attempted login by UNKNOWN (UID: 65534) on UNKNOWN
Jul 31 04:15:00 abadi-computer pipewire[408320]: mod.jackdbus-detect: Failed to receive jackdbus reply: org.freedesktop.DBus.Error.ServiceUnknown: The name org.jackaudio.service was not provided by any .service files
== abuse (1 distinct, 346 total) ==
Jul 31 04:05:06 abuse rsyslogd[21745]: imjournal: open() failed for path: '/var/lib/rsyslog/imjournal.state.tmp': Input/output error [v8.2404.0 try https://www.rsyslog.com/e/2433 ] [x346]
== alec.cs.umd.edu (3 distinct, 60 total) ==
Jul 31 04:05:15 alec.cs.umd.edu setroubleshoot[759390]: failed to retrieve rpm info for path '/run/netns/netns-9dfd0347-71eb-5698-085c-c769043aa5c3': [x12]
Jul 31 04:05:16 alec.cs.umd.edu sedispatch[1526]: AVC Message regarding setroubleshoot, ignoring message [x24]
Jul 31 04:05:16 alec.cs.umd.edu setroubleshoot[759390]: SELinux is preventing /usr/bin/df from getattr access on the file /run/netns/netns-9dfd0347-71eb-5698-085c-c769043aa5c3. For complete SELinux messages run: sealert -l 23f93208-3063-4aac-b78a-bb0fcb40740c [x24]
== atif01.cs.umd.edu (6 distinct, 10 total) ==
Jul 31 04:50:32 atif01.cs.umd.edu sshd[57986]: error: maximum authentication attempts exceeded for root from 211.200.98.61 port 65476 ssh2 [preauth]
Jul 31 04:50:32 atif01.cs.umd.edu sshd[57986]: PAM service(sshd) ignoring max retries; 6 > 3 [x5]
Jul 31 04:50:48 atif01.cs.umd.edu sshd[58004]: error: maximum authentication attempts exceeded for root from 211.200.98.61 port 55287 ssh2 [preauth]
Jul 31 04:51:02 atif01.cs.umd.edu sshd[58014]: error: maximum authentication attempts exceeded for root from 211.200.98.61 port 61176 ssh2 [preauth]
Jul 31 04:51:17 atif01.cs.umd.edu sshd[58022]: error: maximum authentication attempts exceeded for root from 211.200.98.61 port 50013 ssh2 [preauth]
Jul 31 04:51:33 atif01.cs.umd.edu sshd[58032]: error: maximum authentication attempts exceeded for root from 211.200.98.61 port 55380 ssh2 [preauth]
== b0b02.cs.umd.edu (4 distinct, 5 total) ==
Jul 31 04:16:04 b0b02.cs.umd.edu setroubleshoot[1267443]: SELinux is preventing /usr/bin/python3.9 from getattr access on the file /etc/authselect/nsswitch.conf. For complete SELinux messages run: sealert -l 9a1e2952-3fde-4937-a8ab-f7f59791a458 [x2]
Jul 31 04:16:07 b0b02.cs.umd.edu setroubleshoot[1267443]: SELinux is preventing /usr/bin/python3.9 from read access on the file /etc/authselect/nsswitch.conf. For complete SELinux messages run: sealert -l 97d74423-e027-4cd6-8810-ad80944900b5
Jul 31 04:16:10 b0b02.cs.umd.edu setroubleshoot[1267443]: SELinux is preventing /usr/bin/python3.9 from open access on the file /etc/authselect/nsswitch.conf. For complete SELinux messages run: sealert -l 4f253f6a-62d6-46dd-8eaf-0b4d29df41c6
Jul 31 04:38:43 b0b02.cs.umd.edu rustdesk[1273050]: cannot open display:
== cheezit.cs.umd.edu (4 distinct, 4 total) ==
Jul 31 04:55:01 cheezit.cs.umd.edu sshd-session[3681355]: pam_access(sshd:auth): access denied for user `admin' from `34.77.183.14'
Jul 31 04:55:01 cheezit.cs.umd.edu krb5_child[3681357]: Client 'admin(a)UMD.EDU' not found in Kerberos database
Jul 31 04:55:01 cheezit.cs.umd.edu sshd-session[3681353]: error: PAM: System error for admin from 34.77.183.14
Jul 31 04:55:03 cheezit.cs.umd.edu sshd-session[3681362]: error: Protocol major versions differ: 2 vs. 1
== contest (1 distinct, 34 total) ==
Jul 31 04:05:18 contest goferd[1007]: [ERROR][worker-0] gofer.messaging.adapter.connect:33 - connect: proton+amqps://satellite8.cs.umd.edu:5647, failed: Connection amqps://satellite8.cs.umd.edu:5647 disconnected: Condition('proton.pythonio', 'Connection refused to all addresses') [x34]
== csfw00a (1 distinct, 208 total) ==
Jul 31 04:05:04 csfw00a kernel: bnxt_en 0000:09:00.0 eth3: NIC Link is Down [x208]
== dojo (1 distinct, 1 total) ==
Jul 31 04:15:24 dojo nologin[717591]: Attempted login by UNKNOWN (UID: 65534) on UNKNOWN
== forge00 (1 distinct, 1 total) ==
Jul 31 04:09:02 forge00 (httpd)[1203033]: httpd.service: Referenced but unset environment variable evaluates to an empty string: OPTIONS
== idm00 (1 distinct, 1 total) ==
Jul 31 04:51:13 idm00 named[1455]: client @0x7f330432fa18 10.73.240.42#51911: update '73.10.in-addr.arpa/IN' denied
== idmp0 (1 distinct, 1 total) ==
Jul 31 04:36:02 idmp0 named[5198]: client @0x7f98e88a64b8 10.73.240.43#64583: update '73.10.in-addr.arpa/IN' denied
== inbound01.cs.umd.edu (1 distinct, 1 total) ==
Jul 31 04:19:32 inbound01.cs.umd.edu krb5_child[3600352]: Client 'admin(a)UMD.EDU' not found in Kerberos database
== itmon02 (1 distinct, 31 total) ==
Jul 31 04:12:53 itmon02 sshd[1834]: error: beginning MaxStartups throttling [x31]
== matrix (11 distinct, 12 total) ==
Jul 31 04:23:11 matrix systemd[1]: networkd-dispatcher.service: Got notification message from PID 2474416, but reception only permitted for main PID 720
Jul 31 04:23:11 matrix systemd[1]: networkd-dispatcher.service: Got notification message from PID 2474427, but reception only permitted for main PID 720
Jul 31 04:23:19 matrix systemd[1]: networkd-dispatcher.service: Got notification message from PID 2474513, but reception only permitted for main PID 720
Jul 31 04:23:19 matrix systemd[1]: networkd-dispatcher.service: Got notification message from PID 2474519, but reception only permitted for main PID 720
Jul 31 04:23:19 matrix networkctl[2474530]: Interface "veth6c7bb34" not found.
Jul 31 04:23:19 matrix systemd[1]: networkd-dispatcher.service: Got notification message from PID 2474530, but reception only permitted for main PID 720 [x2]
Jul 31 04:23:19 matrix systemd[1]: networkd-dispatcher.service: Got notification message from PID 2474593, but reception only permitted for main PID 720
Jul 31 04:23:19 matrix systemd[1]: networkd-dispatcher.service: Got notification message from PID 2474604, but reception only permitted for main PID 720
Jul 31 04:23:29 matrix systemd[1]: networkd-dispatcher.service: Got notification message from PID 2474734, but reception only permitted for main PID 720
Jul 31 04:23:29 matrix systemd[1]: networkd-dispatcher.service: Got notification message from PID 2474739, but reception only permitted for main PID 720
Jul 31 04:23:29 matrix networkctl[2474750]: Interface "veth359af2a" not found.
== netman.cs.umd.edu (3 distinct, 6 total) ==
Jul 31 04:29:59 netman.cs.umd.edu setroubleshoot[3170835]: SELinux is preventing /usr/bin/gpg from read access on the file gpg.conf. For complete SELinux messages run: sealert -l 019ad1da-a874-4814-8037-3b3e5f413ad2 [x2]
Jul 31 04:29:59 netman.cs.umd.edu setroubleshoot[3170835]: SELinux is preventing /usr/bin/gpg from open access on the file /root/.gnupg/gpg.conf. For complete SELinux messages run: sealert -l cb54177e-d44c-46a1-b246-5c0bbb8343be [x2]
Jul 31 04:30:03 netman.cs.umd.edu setroubleshoot[3170835]: SELinux is preventing /usr/bin/gpg from getattr access on the file /root/.gnupg/gpg.conf. For complete SELinux messages run: sealert -l fbba2e30-b7ab-491c-9ec6-f553e9ef72af [x2]
== newhonors2 (1 distinct, 24 total) ==
Jul 31 04:13:02 newhonors2 dhcpcd[526185]: dhcpcd is not running [x24]
== outbound00.cs.umd.edu (1 distinct, 6 total) ==
Jul 31 04:09:09 outbound00.cs.umd.edu python3[1355657]: ldapdb [x6]
== outbound01.cs.umd.edu (1 distinct, 6 total) ==
Jul 31 04:13:06 outbound01.cs.umd.edu python3[3581214]: ldapdb [x6]
== sentry-docker00.cs.umd.edu (42 distinct, 42 total) ==
Jul 31 04:07:33 sentry-docker00.cs.umd.edu systemd-udevd[2975385]: link_config: could not get ethtool features for veth7ff7eac
Jul 31 04:07:33 sentry-docker00.cs.umd.edu systemd-udevd[2975385]: Could not set offload features of veth7ff7eac: No such device
Jul 31 04:07:33 sentry-docker00.cs.umd.edu systemd-udevd[2975461]: link_config: could not get ethtool features for veth8fc4e15
Jul 31 04:07:33 sentry-docker00.cs.umd.edu systemd-udevd[2975461]: Could not set offload features of veth8fc4e15: No such device
Jul 31 04:07:34 sentry-docker00.cs.umd.edu systemd-udevd[2975483]: Could not generate persistent MAC address for veth9baf099: No such file or directory
Jul 31 04:07:34 sentry-docker00.cs.umd.edu systemd-udevd[2975484]: Could not generate persistent MAC address for veth249531c: No such file or directory
Jul 31 04:07:34 sentry-docker00.cs.umd.edu systemd-udevd[2975487]: Could not generate persistent MAC address for veth0c68a6c: No such file or directory
Jul 31 04:07:34 sentry-docker00.cs.umd.edu systemd-udevd[2975488]: Could not generate persistent MAC address for vethf3caa22: No such file or directory
Jul 31 04:07:34 sentry-docker00.cs.umd.edu systemd-udevd[2975511]: Could not generate persistent MAC address for vethf51592e: No such file or directory
Jul 31 04:07:34 sentry-docker00.cs.umd.edu systemd-udevd[2975512]: Could not generate persistent MAC address for vethaa1c82a: No such file or directory
Jul 31 04:07:34 sentry-docker00.cs.umd.edu systemd-udevd[2975529]: Could not generate persistent MAC address for veth70f7519: No such file or directory
Jul 31 04:07:34 sentry-docker00.cs.umd.edu systemd-udevd[2975530]: Could not generate persistent MAC address for veth0d35018: No such file or directory
Jul 31 04:12:20 sentry-docker00.cs.umd.edu systemd-udevd[2978515]: link_config: could not get ethtool features for veth77c083d
Jul 31 04:12:20 sentry-docker00.cs.umd.edu systemd-udevd[2978515]: Could not set offload features of veth77c083d: No such device
Jul 31 04:12:20 sentry-docker00.cs.umd.edu systemd-udevd[2978524]: Could not generate persistent MAC address for veth6826cf2: No such file or directory
Jul 31 04:12:20 sentry-docker00.cs.umd.edu systemd-udevd[2978525]: Could not generate persistent MAC address for veth27c567d: No such file or directory
Jul 31 04:27:42 sentry-docker00.cs.umd.edu systemd-udevd[2985003]: link_config: could not get ethtool features for veth9baf099
Jul 31 04:27:42 sentry-docker00.cs.umd.edu systemd-udevd[2985003]: Could not set offload features of veth9baf099: No such device
Jul 31 04:27:42 sentry-docker00.cs.umd.edu systemd-udevd[2985033]: Could not generate persistent MAC address for vethfbd634f: No such file or directory
Jul 31 04:27:42 sentry-docker00.cs.umd.edu systemd-udevd[2985034]: Could not generate persistent MAC address for vetha217d44: No such file or directory
Jul 31 04:27:42 sentry-docker00.cs.umd.edu systemd-udevd[2985037]: Could not generate persistent MAC address for veth200e75b: No such file or directory
Jul 31 04:27:42 sentry-docker00.cs.umd.edu systemd-udevd[2985038]: Could not generate persistent MAC address for veth59c919c: No such file or directory
Jul 31 04:27:42 sentry-docker00.cs.umd.edu systemd-udevd[2985061]: Could not generate persistent MAC address for veth5e391dd: No such file or directory
Jul 31 04:27:42 sentry-docker00.cs.umd.edu systemd-udevd[2985062]: Could not generate persistent MAC address for veth551c0ec: No such file or directory
Jul 31 04:27:42 sentry-docker00.cs.umd.edu systemd-udevd[2985084]: Could not generate persistent MAC address for veth62b38b3: No such file or directory
Jul 31 04:27:42 sentry-docker00.cs.umd.edu systemd-udevd[2985080]: Could not generate persistent MAC address for veth275a0b3: No such file or directory
Jul 31 04:32:28 sentry-docker00.cs.umd.edu systemd-udevd[2988038]: link_config: could not get ethtool features for veth6826cf2
Jul 31 04:32:28 sentry-docker00.cs.umd.edu systemd-udevd[2988038]: Could not set offload features of veth6826cf2: No such device
Jul 31 04:32:29 sentry-docker00.cs.umd.edu systemd-udevd[2988047]: Could not generate persistent MAC address for veth3a06783: No such file or directory
Jul 31 04:32:29 sentry-docker00.cs.umd.edu systemd-udevd[2988048]: Could not generate persistent MAC address for vethb7194f6: No such file or directory
... 12 more distinct messages not shown
== smokeping-slave (1 distinct, 1 total) ==
Jul 31 04:15:23 smokeping-slave nologin[282460]: Attempted login by UNKNOWN (UID: 65534) on UNKNOWN
== strawberry (4 distinct, 10 total) ==
Jul 31 04:09:44 strawberry udisksd[1067]: Error performing housekeeping for drive /org/freedesktop/UDisks2/drives/ST2000DM001_1CH164_W1E8J5KJ: Error updating SMART data: Error sending ATA command CHECK POWER MODE: Unexpected sense data returned:#0120000: 00 00 00 00 00 00 00 00 00 00 00 00 00 00 00 00 ................#0120010: 00 00 00 00 00 00 00 00 00 00 00 00 00 00 00 00 ................#012 (g-io-error-quark, 0) [x6]
Jul 31 04:15:04 strawberry nologin[3210691]: Attempted login by UNKNOWN (UID: 65534) on UNKNOWN
Jul 31 04:15:04 strawberry pipewire[3210690]: mod.jackdbus-detect: Failed to receive jackdbus reply: org.freedesktop.DBus.Error.ServiceUnknown: The name org.jackaudio.service was not provided by any .service files
Jul 31 04:34:42 strawberry smartd[5314]: Device: /dev/sda [SAT], failed to read SMART Attribute Data [x2]
== submit26-b9-4 (9 distinct, 9 total) ==
Jul 31 04:16:11 submit26-b9-4 setroubleshoot[695799]: SELinux is preventing /usr/bin/python3.9 from create access on the directory /(null). For complete SELinux messages run: sealert -l a4e66030-8621-4da9-bd27-5988bb1bf8ad
Jul 31 04:16:11 submit26-b9-4 setroubleshoot[695799]: SELinux is preventing /usr/bin/python3.9 from add_name access on the directory /(null). For complete SELinux messages run: sealert -l c055e37d-bbf5-4800-9083-d606f792c8c1
Jul 31 04:16:11 submit26-b9-4 setroubleshoot[695799]: SELinux is preventing /usr/bin/python3.9 from create access on the file /(null). For complete SELinux messages run: sealert -l e5bc3a56-6d6f-4776-954f-ddde1579648f
Jul 31 04:16:11 submit26-b9-4 setroubleshoot[695799]: SELinux is preventing /usr/bin/python3.9 from open access on the file /tmp/libdnf.KlX5PB/repodata/repomd.xml. For complete SELinux messages run: sealert -l a8ec5e1b-49f9-4fbc-a8ae-22e800f7abf2
Jul 31 04:16:11 submit26-b9-4 setroubleshoot[695799]: SELinux is preventing /usr/bin/python3.9 from setattr access on the file repomd.xml. For complete SELinux messages run: sealert -l 945db714-d0c0-4402-911e-932978b8b036
Jul 31 04:16:12 submit26-b9-4 setroubleshoot[695799]: SELinux is preventing /usr/bin/python3.9 from read access on the directory libdnf.KlX5PB. For complete SELinux messages run: sealert -l 463998a0-fb0d-463c-82b1-471135710a14
Jul 31 04:16:12 submit26-b9-4 setroubleshoot[695799]: SELinux is preventing /usr/bin/python3.9 from remove_name access on the directory repomd.xml. For complete SELinux messages run: sealert -l 473d2e21-15d8-407a-a9ee-2b842607fa00
Jul 31 04:16:12 submit26-b9-4 setroubleshoot[695799]: SELinux is preventing /usr/bin/python3.9 from unlink access on the file repomd.xml. For complete SELinux messages run: sealert -l 80c54d4f-bf4b-4501-addb-1627383587d0
Jul 31 04:16:12 submit26-b9-4 setroubleshoot[695799]: SELinux is preventing /usr/bin/python3.9 from rmdir access on the directory repodata. For complete SELinux messages run: sealert -l c63d3890-151e-49a0-83f0-3dfb69d051e5
== talkhosts9 (1 distinct, 2 total) ==
Jul 31 05:04:50 talkhosts9 setroubleshoot[361226]: SELinux is preventing /usr/bin/lsof from getattr access on the unix_stream_socket unix_stream_socket. For complete SELinux messages run: sealert -l a6df89b3-c497-469c-8232-c4fde0508abf [x2]
1
0
Command: /usr/local/sbin/syslog-digest.py
Time : 0.5130s
Status : exited 0
Output :
Syslog digest — 2026-07-31 04:05 EDT
Processed 4,151 lines, filtered 3,302 (79%). 849 unknown (84 distinct) from 19 host(s).
== abuse (1 distinct, 346 total) ==
Jul 31 03:05:06 abuse rsyslogd[21745]: imjournal: open() failed for path: '/var/lib/rsyslog/imjournal.state.tmp': Input/output error [v8.2404.0 try https://www.rsyslog.com/e/2433 ] [x346]
== alec.cs.umd.edu (3 distinct, 60 total) ==
Jul 31 03:05:05 alec.cs.umd.edu setroubleshoot[744460]: failed to retrieve rpm info for path '/run/netns/netns-9dfd0347-71eb-5698-085c-c769043aa5c3': [x12]
Jul 31 03:05:06 alec.cs.umd.edu sedispatch[1526]: AVC Message regarding setroubleshoot, ignoring message [x24]
Jul 31 03:05:06 alec.cs.umd.edu setroubleshoot[744460]: SELinux is preventing /usr/bin/df from getattr access on the file /run/netns/netns-9dfd0347-71eb-5698-085c-c769043aa5c3. For complete SELinux messages run: sealert -l 23f93208-3063-4aac-b78a-bb0fcb40740c [x24]
== b0b02.cs.umd.edu (4 distinct, 5 total) ==
Jul 31 03:16:00 b0b02.cs.umd.edu setroubleshoot[1252109]: SELinux is preventing /usr/bin/python3.9 from getattr access on the file /etc/authselect/nsswitch.conf. For complete SELinux messages run: sealert -l 9a1e2952-3fde-4937-a8ab-f7f59791a458 [x2]
Jul 31 03:16:03 b0b02.cs.umd.edu setroubleshoot[1252109]: SELinux is preventing /usr/bin/python3.9 from read access on the file /etc/authselect/nsswitch.conf. For complete SELinux messages run: sealert -l 97d74423-e027-4cd6-8810-ad80944900b5
Jul 31 03:16:06 b0b02.cs.umd.edu setroubleshoot[1252109]: SELinux is preventing /usr/bin/python3.9 from open access on the file /etc/authselect/nsswitch.conf. For complete SELinux messages run: sealert -l 4f253f6a-62d6-46dd-8eaf-0b4d29df41c6
Jul 31 03:38:39 b0b02.cs.umd.edu rustdesk[1257705]: cannot open display:
== bac102 (7 distinct, 7 total) ==
Jul 31 03:33:43 bac102 systemd-resolved[902]: Using degraded feature set UDP instead of UDP+EDNS0 for DNS server fe80::21c:42ff:fe00:18%2.
Jul 31 03:34:14 bac102 systemd-resolved[902]: Using degraded feature set TCP instead of UDP for DNS server fe80::21c:42ff:fe00:18%2.
Jul 31 03:34:25 bac102 puppet-agent[55206]: (Facter) invalid or malformed lldp data: MalformedDataError: no lldp interface data found
Jul 31 03:34:45 bac102 systemd-resolved[902]: Using degraded feature set UDP instead of TCP for DNS server fe80::21c:42ff:fe00:18%2.
Jul 31 03:35:06 bac102 rpc.statd[57049]: Flags: TI-RPC
Jul 31 03:35:06 bac102 rpc.idmapd[57044]: Setting log level to 0
Jul 31 03:35:21 bac102 (da-udp.*)[57633]: amanda-udp-restart.service: Failed at step EXEC spawning /usr/bin/systemctl restart amanda-udp.*: No such file or directory
== biggulp.cs.umd.edu (3 distinct, 3 total) ==
Jul 31 03:28:10 biggulp.cs.umd.edu sshd-session[1729375]: pam_access(sshd:auth): access denied for user `admin' from `34.62.93.116'
Jul 31 03:28:11 biggulp.cs.umd.edu krb5_child[1729377]: Client 'admin(a)UMD.EDU' not found in Kerberos database
Jul 31 03:28:11 biggulp.cs.umd.edu sshd-session[1729373]: error: PAM: System error for admin from 34.62.93.116
== cheezit.cs.umd.edu (11 distinct, 13 total) ==
Jul 31 03:51:49 cheezit.cs.umd.edu setroubleshoot[3665639]: failed to retrieve rpm info for path '/var/log/falconctl.log':
Jul 31 03:51:50 cheezit.cs.umd.edu setroubleshoot[3665639]: SELinux is preventing /opt/CrowdStrike/falconctl18708 from append access on the file /var/log/falconctl.log. For complete SELinux messages run: sealert -l 63f66d53-fcfc-44da-a79e-c789b1ce2ce8
Jul 31 03:51:52 cheezit.cs.umd.edu setroubleshoot[3665639]: SELinux is preventing /opt/CrowdStrike/falconctl18708 from write access on the file falconstore. For complete SELinux messages run: sealert -l 386506af-597f-4357-89de-bc382f369a6e
Jul 31 03:52:03 cheezit.cs.umd.edu setroubleshoot[3666036]: failed to retrieve rpm info for path '/var/lib/sss/pipes/nss': [x2]
Jul 31 03:52:04 cheezit.cs.umd.edu setroubleshoot[3666036]: SELinux is preventing /usr/bin/lsof from write access on the sock_file /var/lib/sss/pipes/nss. For complete SELinux messages run: sealert -l f570494d-54d2-4dac-97e2-28395659abf1 [x2]
Jul 31 03:52:04 cheezit.cs.umd.edu setroubleshoot[3666036]: SELinux is preventing /usr/bin/lsof from write access on the sock_file socket. For complete SELinux messages run: sealert -l 9ff2383b-9e1d-44ff-b8ae-af91637450ae
Jul 31 03:52:44 cheezit.cs.umd.edu setroubleshoot[3666454]: SELinux is preventing /usr/bin/python3.9 from read access on the file /etc/selinux/targeted/contexts/files/file_contexts.subs_dist. For complete SELinux messages run: sealert -l 679eb260-cf5d-4783-99f4-ce308edb3295
Jul 31 03:52:44 cheezit.cs.umd.edu setroubleshoot[3666454]: SELinux is preventing /usr/bin/python3.9 from open access on the file /etc/selinux/targeted/contexts/files/file_contexts.subs_dist. For complete SELinux messages run: sealert -l 77caba8a-5cd0-4e18-b188-6e35c461772d
Jul 31 03:52:44 cheezit.cs.umd.edu setroubleshoot[3666454]: SELinux is preventing /usr/bin/python3.9 from read access on the file /etc/selinux/targeted/contexts/files/file_contexts.subs. For complete SELinux messages run: sealert -l d9c6dd0d-0a34-4430-a5ff-e985c55cb064
Jul 31 03:52:44 cheezit.cs.umd.edu setroubleshoot[3666454]: SELinux is preventing /usr/bin/python3.9 from open access on the file /etc/selinux/targeted/contexts/files/file_contexts.subs. For complete SELinux messages run: sealert -l 8edbce57-8212-4ac8-af50-3fe403231eda
Jul 31 03:52:44 cheezit.cs.umd.edu setroubleshoot[3666454]: SELinux is preventing /usr/bin/python3.9 from map access on the file /etc/selinux/targeted/contexts/files/file_contexts.bin. For complete SELinux messages run: sealert -l 4a0cbe3b-6f49-4c7e-95c6-380f7aef806e
== contest (1 distinct, 33 total) ==
Jul 31 03:06:23 contest goferd[1007]: [ERROR][worker-0] gofer.messaging.adapter.connect:33 - connect: proton+amqps://satellite8.cs.umd.edu:5647, failed: Connection amqps://satellite8.cs.umd.edu:5647 disconnected: Condition('proton.pythonio', 'Connection refused to all addresses') [x33]
== csfw00a (1 distinct, 252 total) ==
Jul 31 03:04:27 csfw00a kernel: bnxt_en 0000:09:00.0 eth3: NIC Link is Down [x252]
== hackerman (1 distinct, 1 total) ==
Jul 31 03:19:01 hackerman gnome-software[2060381]: failed to commit changes to dconf: GDBus.Error:org.gtk.GDBus.UnmappedGError.Quark._g_2dfile_2derror_2dquark.Code2: Failed to create file “/adminhomes/sajith/.config/dconf/user.57GWS3”: Permission denied
== idm00 (1 distinct, 1 total) ==
Jul 31 03:51:12 idm00 named[1455]: client @0x7f33041f95f8 10.73.240.42#53029: update '73.10.in-addr.arpa/IN' denied
== idmp0 (1 distinct, 1 total) ==
Jul 31 03:36:02 idmp0 named[5198]: client @0x7f98f4005288 10.73.240.43#64656: update '73.10.in-addr.arpa/IN' denied
== itmon02 (2 distinct, 39 total) ==
Jul 31 03:08:14 itmon02 sshd[1834]: error: beginning MaxStartups throttling [x38]
Jul 31 03:15:03 itmon02 (httpd)[4033250]: httpd.service: Referenced but unset environment variable evaluates to an empty string: OPTIONS
== kadath.cs.umd.edu (1 distinct, 1 total) ==
Jul 31 03:47:30 kadath.cs.umd.edu puppet-agent[888625]: (Facter) invalid or malformed lldp data: MalformedDataError: no lldp interface data found
== netbox (1 distinct, 1 total) ==
Jul 31 03:08:03 netbox (httpd)[1052442]: httpd.service: Referenced but unset environment variable evaluates to an empty string: OPTIONS
== newhonors2 (1 distinct, 24 total) ==
Jul 31 03:13:03 newhonors2 dhcpcd[524341]: dhcpcd is not running [x24]
== outbound00.cs.umd.edu (2 distinct, 8 total) ==
Jul 31 03:09:08 outbound00.cs.umd.edu python3[1340905]: ldapdb [x7]
Jul 31 03:24:39 outbound00.cs.umd.edu systemd[1]: Configuration file /usr/lib/systemd/system/authentication_milter.service is marked executable. Please remove executable permission bits. Proceeding anyway.
== outbound01.cs.umd.edu (1 distinct, 6 total) ==
Jul 31 03:13:06 outbound01.cs.umd.edu python3[3567338]: ldapdb [x6]
== sentry-docker00.cs.umd.edu (40 distinct, 40 total) ==
Jul 31 03:07:09 sentry-docker00.cs.umd.edu systemd-udevd[2947105]: link_config: could not get ethtool features for veth1a48b8b
Jul 31 03:07:09 sentry-docker00.cs.umd.edu systemd-udevd[2947105]: Could not set offload features of veth1a48b8b: No such device
Jul 31 03:07:09 sentry-docker00.cs.umd.edu systemd-udevd[2947122]: Could not generate persistent MAC address for veth6bc2ca4: No such file or directory
Jul 31 03:07:09 sentry-docker00.cs.umd.edu systemd-udevd[2947123]: Could not generate persistent MAC address for veth28f56be: No such file or directory
Jul 31 03:07:09 sentry-docker00.cs.umd.edu systemd-udevd[2947141]: Could not generate persistent MAC address for vethe36caee: No such file or directory
Jul 31 03:07:09 sentry-docker00.cs.umd.edu systemd-udevd[2947134]: Could not generate persistent MAC address for veth0cf3ee8: No such file or directory
Jul 31 03:07:09 sentry-docker00.cs.umd.edu systemd-udevd[2947150]: Could not generate persistent MAC address for vethb476ba6: No such file or directory
Jul 31 03:07:09 sentry-docker00.cs.umd.edu systemd-udevd[2947151]: Could not generate persistent MAC address for veth4fb2b84: No such file or directory
Jul 31 03:07:09 sentry-docker00.cs.umd.edu systemd-udevd[2947205]: Could not generate persistent MAC address for veth0346daa: No such file or directory
Jul 31 03:07:09 sentry-docker00.cs.umd.edu systemd-udevd[2947215]: Could not generate persistent MAC address for veth8c7305c: No such file or directory
Jul 31 03:11:59 sentry-docker00.cs.umd.edu systemd-udevd[2950211]: Could not generate persistent MAC address for veth3d42fdb: No such file or directory
Jul 31 03:11:59 sentry-docker00.cs.umd.edu systemd-udevd[2950212]: Could not generate persistent MAC address for veth9508b65: No such file or directory
Jul 31 03:27:17 sentry-docker00.cs.umd.edu systemd-udevd[2956582]: link_config: could not get ethtool features for vethe36caee
Jul 31 03:27:17 sentry-docker00.cs.umd.edu systemd-udevd[2956582]: Could not set offload features of vethe36caee: No such device
Jul 31 03:27:17 sentry-docker00.cs.umd.edu systemd-udevd[2956614]: Could not generate persistent MAC address for veth4cc0342: No such file or directory
Jul 31 03:27:17 sentry-docker00.cs.umd.edu systemd-udevd[2956615]: Could not generate persistent MAC address for veth6d480ea: No such file or directory
Jul 31 03:27:17 sentry-docker00.cs.umd.edu systemd-udevd[2956618]: Could not generate persistent MAC address for veth66d96b4: No such file or directory
Jul 31 03:27:17 sentry-docker00.cs.umd.edu systemd-udevd[2956619]: Could not generate persistent MAC address for veth13885b2: No such file or directory
Jul 31 03:27:17 sentry-docker00.cs.umd.edu systemd-udevd[2956619]: Could not generate persistent MAC address for veth3fae699: No such file or directory
Jul 31 03:27:17 sentry-docker00.cs.umd.edu systemd-udevd[2956624]: Could not generate persistent MAC address for veth780d25c: No such file or directory
Jul 31 03:27:17 sentry-docker00.cs.umd.edu systemd-udevd[2956624]: Could not generate persistent MAC address for vethc645f00: No such file or directory
Jul 31 03:27:17 sentry-docker00.cs.umd.edu systemd-udevd[2956620]: Could not generate persistent MAC address for veth4e2ce3f: No such file or directory
Jul 31 03:32:03 sentry-docker00.cs.umd.edu systemd-udevd[2959590]: link_config: could not get ethtool features for veth3d42fdb
Jul 31 03:32:03 sentry-docker00.cs.umd.edu systemd-udevd[2959590]: Could not set offload features of veth3d42fdb: No such device
Jul 31 03:32:04 sentry-docker00.cs.umd.edu systemd-udevd[2959624]: Could not generate persistent MAC address for veth56bd31a: No such file or directory
Jul 31 03:32:04 sentry-docker00.cs.umd.edu systemd-udevd[2959625]: Could not generate persistent MAC address for vethd7e839d: No such file or directory
Jul 31 03:47:25 sentry-docker00.cs.umd.edu systemd-udevd[2965960]: link_config: could not get ethtool features for veth4e2ce3f
Jul 31 03:47:25 sentry-docker00.cs.umd.edu systemd-udevd[2965960]: Could not set offload features of veth4e2ce3f: No such device
Jul 31 03:47:25 sentry-docker00.cs.umd.edu systemd-udevd[2965972]: link_config: could not set ethtool features for veth780d25c
Jul 31 03:47:25 sentry-docker00.cs.umd.edu systemd-udevd[2965972]: Could not set offload features of veth780d25c: Operation not permitted
... 10 more distinct messages not shown
== strawberry (2 distinct, 8 total) ==
Jul 31 03:09:44 strawberry udisksd[1067]: Error performing housekeeping for drive /org/freedesktop/UDisks2/drives/ST2000DM001_1CH164_W1E8J5KJ: Error updating SMART data: Error sending ATA command CHECK POWER MODE: Unexpected sense data returned:#0120000: 00 00 00 00 00 00 00 00 00 00 00 00 00 00 00 00 ................#0120010: 00 00 00 00 00 00 00 00 00 00 00 00 00 00 00 00 ................#012 (g-io-error-quark, 0) [x6]
Jul 31 03:34:42 strawberry smartd[5314]: Device: /dev/sda [SAT], failed to read SMART Attribute Data [x2]
1
0
Command: /usr/local/sbin/syslog-digest.py
Time : 0.5174s
Status : exited 0
Output :
Syslog digest — 2026-07-31 03:05 EDT
Processed 4,435 lines, filtered 3,600 (81%). 835 unknown (80 distinct) from 20 host(s).
== abuse (1 distinct, 347 total) ==
Jul 31 02:05:06 abuse rsyslogd[21745]: imjournal: open() failed for path: '/var/lib/rsyslog/imjournal.state.tmp': Input/output error [v8.2404.0 try https://www.rsyslog.com/e/2433 ] [x347]
== alec.cs.umd.edu (3 distinct, 58 total) ==
Jul 31 02:05:16 alec.cs.umd.edu setroubleshoot[729325]: failed to retrieve rpm info for path '/run/netns/netns-9dfd0347-71eb-5698-085c-c769043aa5c3': [x12]
Jul 31 02:05:17 alec.cs.umd.edu sedispatch[1526]: AVC Message regarding setroubleshoot, ignoring message [x22]
Jul 31 02:05:17 alec.cs.umd.edu setroubleshoot[729325]: SELinux is preventing /usr/bin/df from getattr access on the file /run/netns/netns-9dfd0347-71eb-5698-085c-c769043aa5c3. For complete SELinux messages run: sealert -l 23f93208-3063-4aac-b78a-bb0fcb40740c [x24]
== b0b02.cs.umd.edu (1 distinct, 1 total) ==
Jul 31 02:38:35 b0b02.cs.umd.edu rustdesk[1242637]: cannot open display:
== contest (1 distinct, 34 total) ==
Jul 31 02:05:41 contest goferd[1007]: [ERROR][worker-0] gofer.messaging.adapter.connect:33 - connect: proton+amqps://satellite8.cs.umd.edu:5647, failed: Connection amqps://satellite8.cs.umd.edu:5647 disconnected: Condition('proton.pythonio', 'Connection refused to all addresses') [x34]
== csfw00a (1 distinct, 244 total) ==
Jul 31 02:04:52 csfw00a kernel: bnxt_en 0000:09:00.0 eth3: NIC Link is Down [x244]
== dojo (1 distinct, 1 total) ==
Jul 31 02:36:13 dojo sshd[712289]: error: Protocol major versions differ: 2 vs. 1
== idm00 (1 distinct, 1 total) ==
Jul 31 02:51:12 idm00 named[1455]: client @0x7f330c44cc98 10.73.240.42#54620: update '73.10.in-addr.arpa/IN' denied
== idmp0 (1 distinct, 1 total) ==
Jul 31 02:36:02 idmp0 named[5198]: client @0x7f98e88b27f8 10.73.240.43#63772: update '73.10.in-addr.arpa/IN' denied
== inbound00.cs.umd.edu (2 distinct, 2 total) ==
Jul 31 02:05:16 inbound00.cs.umd.edu krb5_child[1358561]: Client 'admin(a)UMD.EDU' not found in Kerberos database
Jul 31 02:06:31 inbound00.cs.umd.edu sshd-session[1359087]: error: Protocol major versions differ: 2 vs. 1
== itmon02 (1 distinct, 39 total) ==
Jul 31 02:07:59 itmon02 sshd[1834]: error: beginning MaxStartups throttling [x39]
== matrix (3 distinct, 4 total) ==
Jul 31 02:43:14 matrix krb5_child[2416063]: Client 'admin(a)UMD.EDU' not found in Kerberos database [x2]
Jul 31 02:43:15 matrix sshd[2416053]: error: PAM: Authentication failure for admin from 34.62.230.66
Jul 31 02:43:28 matrix sshd[2416167]: error: Protocol major versions differ: 2 vs. 1
== netman.cs.umd.edu (1 distinct, 1 total) ==
Jul 31 02:30:47 netman.cs.umd.edu sshd[3138190]: error: PAM: Authentication failure for root from 211.228.114.53
== networkvm01.cs.umd.edu (9 distinct, 9 total) ==
Jul 31 02:28:55 networkvm01.cs.umd.edu setroubleshoot[1996851]: SELinux is preventing /usr/bin/gpg from write access on the directory /(null). For complete SELinux messages run: sealert -l 8ead1354-ae8a-4a17-bb3f-146ebf6c892c
Jul 31 02:28:55 networkvm01.cs.umd.edu setroubleshoot[1996851]: SELinux is preventing /usr/bin/gpg from add_name access on the directory /(null). For complete SELinux messages run: sealert -l f9b51e91-5dbc-455f-88c2-f0746a2f0f4c
Jul 31 02:28:55 networkvm01.cs.umd.edu setroubleshoot[1996851]: SELinux is preventing /usr/bin/gpg from create access on the file /(null). For complete SELinux messages run: sealert -l af0a60e6-c449-4bdd-bfb8-c69b58472884
Jul 31 02:28:55 networkvm01.cs.umd.edu setroubleshoot[1996851]: SELinux is preventing /usr/bin/gpg from link access on the file /(null). For complete SELinux messages run: sealert -l 3df452f6-4d9e-4e38-946b-ea8e1edd356c
Jul 31 02:28:55 networkvm01.cs.umd.edu setroubleshoot[1996851]: SELinux is preventing /usr/bin/gpg from remove_name access on the directory .#lk0x000056521bb55ed0.networkvm01.cs.umd.edu.1996850x. For complete SELinux messages run: sealert -l fcac71c9-c7c0-45a9-9dc2-a8dcbeccfc75
Jul 31 02:28:55 networkvm01.cs.umd.edu setroubleshoot[1996851]: SELinux is preventing /usr/bin/gpg from unlink access on the file .#lk0x000056521bb55ed0.networkvm01.cs.umd.edu.1996850x. For complete SELinux messages run: sealert -l a672ebb7-fa69-419c-b1f0-fb386b8b48a6
Jul 31 02:28:55 networkvm01.cs.umd.edu setroubleshoot[1996851]: SELinux is preventing /usr/bin/gpg from write access on the directory /(null). For complete SELinux messages run: sealert -l fec9104e-d27a-4fd4-9872-6b17088c2951
Jul 31 02:28:55 networkvm01.cs.umd.edu setroubleshoot[1996851]: SELinux is preventing /usr/bin/gpg from add_name access on the directory /(null). For complete SELinux messages run: sealert -l 26718b2a-493d-457d-818c-244bd8d4ec9d
Jul 31 02:28:55 networkvm01.cs.umd.edu setroubleshoot[1996851]: SELinux is preventing /usr/bin/gpg from remove_name access on the directory .#lk0x000056106c09eee0.networkvm01.cs.umd.edu.1996866x. For complete SELinux messages run: sealert -l 80e6efe4-93f3-4219-8132-b2b52db1f517
== newhonors.cs.umd.edu (4 distinct, 4 total) ==
Jul 31 02:14:40 newhonors.cs.umd.edu sshd[1154]: fatal: Unable to negotiate with 207.175.161.188 port 19642: no matching key exchange method found. Their offer: diffie-hellman-group1-sha1 [preauth]
Jul 31 02:14:50 newhonors.cs.umd.edu sshd[1157]: fatal: Unable to negotiate with 207.175.161.188 port 4496: no matching host key type found. Their offer: ssh-dss [preauth]
Jul 31 02:14:51 newhonors.cs.umd.edu sshd[1163]: fatal: Unable to negotiate with 207.175.161.188 port 4512: no matching host key type found. Their offer: ecdsa-sha2-nistp384 [preauth]
Jul 31 02:14:52 newhonors.cs.umd.edu sshd[1165]: fatal: Unable to negotiate with 207.175.161.188 port 4526: no matching host key type found. Their offer: ecdsa-sha2-nistp521 [preauth]
== newhonors2 (1 distinct, 24 total) ==
Jul 31 02:13:03 newhonors2 dhcpcd[522496]: dhcpcd is not running [x24]
== outbound00.cs.umd.edu (3 distinct, 8 total) ==
Jul 31 02:09:08 outbound00.cs.umd.edu python3[1326833]: ldapdb [x6]
Jul 31 02:42:33 outbound00.cs.umd.edu krb5_child[1334721]: Client 'admin(a)UMD.EDU' not found in Kerberos database
Jul 31 02:42:54 outbound00.cs.umd.edu sshd-session[1334794]: error: Protocol major versions differ: 2 vs. 1
== outbound01.cs.umd.edu (1 distinct, 6 total) ==
Jul 31 02:13:07 outbound01.cs.umd.edu python3[3553453]: ldapdb [x6]
== sebatinsky.cs.umd.edu (1 distinct, 1 total) ==
Jul 31 02:39:48 sebatinsky.cs.umd.edu kernel: hpet1: lost 1 rtc interrupts
== sentry-docker00.cs.umd.edu (42 distinct, 42 total) ==
Jul 31 02:06:44 sentry-docker00.cs.umd.edu systemd-udevd[2918282]: link_config: could not set ethtool features for vethe5226ff
Jul 31 02:06:44 sentry-docker00.cs.umd.edu systemd-udevd[2918282]: Could not set offload features of vethe5226ff: Operation not permitted
Jul 31 02:06:44 sentry-docker00.cs.umd.edu systemd-udevd[2918302]: Could not generate persistent MAC address for vetha0537bc: No such file or directory
Jul 31 02:06:44 sentry-docker00.cs.umd.edu systemd-udevd[2918303]: Could not generate persistent MAC address for veth0b1bb20: No such file or directory
Jul 31 02:06:44 sentry-docker00.cs.umd.edu systemd-udevd[2918306]: Could not generate persistent MAC address for vethbdbe200: No such file or directory
Jul 31 02:06:44 sentry-docker00.cs.umd.edu systemd-udevd[2918307]: Could not generate persistent MAC address for vethcd8a661: No such file or directory
Jul 31 02:06:44 sentry-docker00.cs.umd.edu systemd-udevd[2918317]: Could not generate persistent MAC address for veth1c67626: No such file or directory
Jul 31 02:06:44 sentry-docker00.cs.umd.edu systemd-udevd[2918320]: Could not generate persistent MAC address for veth12adf1a: No such file or directory
Jul 31 02:06:44 sentry-docker00.cs.umd.edu systemd-udevd[2918324]: Could not generate persistent MAC address for veth3d22272: No such file or directory
Jul 31 02:06:44 sentry-docker00.cs.umd.edu systemd-udevd[2918312]: Could not generate persistent MAC address for veth0a3134e: No such file or directory
Jul 31 02:11:38 sentry-docker00.cs.umd.edu systemd-udevd[2921359]: link_config: could not get ethtool features for vethc6ba8fd
Jul 31 02:11:38 sentry-docker00.cs.umd.edu systemd-udevd[2921359]: Could not set offload features of vethc6ba8fd: No such device
Jul 31 02:11:39 sentry-docker00.cs.umd.edu systemd-udevd[2921368]: Could not generate persistent MAC address for veth2bc8b51: No such file or directory
Jul 31 02:11:39 sentry-docker00.cs.umd.edu systemd-udevd[2921369]: Could not generate persistent MAC address for veth72494c8: No such file or directory
Jul 31 02:26:52 sentry-docker00.cs.umd.edu systemd-udevd[2927706]: link_config: could not get ethtool features for vethbdbe200
Jul 31 02:26:52 sentry-docker00.cs.umd.edu systemd-udevd[2927706]: Could not set offload features of vethbdbe200: No such device
Jul 31 02:26:52 sentry-docker00.cs.umd.edu systemd-udevd[2927754]: Could not generate persistent MAC address for veth31a55e7: No such file or directory
Jul 31 02:26:52 sentry-docker00.cs.umd.edu systemd-udevd[2927755]: Could not generate persistent MAC address for veth14f2cf6: No such file or directory
Jul 31 02:26:52 sentry-docker00.cs.umd.edu systemd-udevd[2927773]: Could not generate persistent MAC address for veth5325eaa: No such file or directory
Jul 31 02:26:52 sentry-docker00.cs.umd.edu systemd-udevd[2927767]: Could not generate persistent MAC address for vethe4b179d: No such file or directory
Jul 31 02:26:52 sentry-docker00.cs.umd.edu systemd-udevd[2927780]: Could not generate persistent MAC address for vethc5007ae: No such file or directory
Jul 31 02:26:52 sentry-docker00.cs.umd.edu systemd-udevd[2927760]: Could not generate persistent MAC address for veth4962e36: No such file or directory
Jul 31 02:26:52 sentry-docker00.cs.umd.edu systemd-udevd[2927768]: Could not generate persistent MAC address for vethaf5cb09: No such file or directory
Jul 31 02:26:52 sentry-docker00.cs.umd.edu systemd-udevd[2927770]: Could not generate persistent MAC address for veth7a0c260: No such file or directory
Jul 31 02:31:47 sentry-docker00.cs.umd.edu systemd-udevd[2930926]: link_config: could not get ethtool features for veth2bc8b51
Jul 31 02:31:47 sentry-docker00.cs.umd.edu systemd-udevd[2930926]: Could not set offload features of veth2bc8b51: No such device
Jul 31 02:31:47 sentry-docker00.cs.umd.edu systemd-udevd[2930945]: Could not generate persistent MAC address for veth8395537: No such file or directory
Jul 31 02:31:47 sentry-docker00.cs.umd.edu systemd-udevd[2930946]: Could not generate persistent MAC address for veth1033647: No such file or directory
Jul 31 02:47:00 sentry-docker00.cs.umd.edu systemd-udevd[2937414]: link_config: could not get ethtool features for vethc5007ae
Jul 31 02:47:00 sentry-docker00.cs.umd.edu systemd-udevd[2937414]: Could not set offload features of vethc5007ae: No such device
... 12 more distinct messages not shown
== strawberry (2 distinct, 8 total) ==
Jul 31 02:09:44 strawberry udisksd[1067]: Error performing housekeeping for drive /org/freedesktop/UDisks2/drives/ST2000DM001_1CH164_W1E8J5KJ: Error updating SMART data: Error sending ATA command CHECK POWER MODE: Unexpected sense data returned:#0120000: 00 00 00 00 00 00 00 00 00 00 00 00 00 00 00 00 ................#0120010: 00 00 00 00 00 00 00 00 00 00 00 00 00 00 00 00 ................#012 (g-io-error-quark, 0) [x6]
Jul 31 02:34:42 strawberry smartd[5314]: Device: /dev/sda [SAT], failed to read SMART Attribute Data [x2]
1
0
Command: /usr/local/sbin/syslog-digest.py
Time : 0.5331s
Status : exited 0
Output :
Syslog digest — 2026-07-31 02:05 EDT
Processed 4,286 lines, filtered 3,331 (77%). 955 unknown (123 distinct) from 24 host(s).
== abuse (1 distinct, 346 total) ==
Jul 31 01:05:06 abuse rsyslogd[21745]: imjournal: open() failed for path: '/var/lib/rsyslog/imjournal.state.tmp': Input/output error [v8.2404.0 try https://www.rsyslog.com/e/2433 ] [x346]
== alec.cs.umd.edu (3 distinct, 61 total) ==
Jul 31 01:05:23 alec.cs.umd.edu setroubleshoot[714366]: failed to retrieve rpm info for path '/run/netns/netns-9dfd0347-71eb-5698-085c-c769043aa5c3': [x12]
Jul 31 01:05:23 alec.cs.umd.edu sedispatch[1526]: AVC Message regarding setroubleshoot, ignoring message [x24]
Jul 31 01:05:23 alec.cs.umd.edu setroubleshoot[714366]: SELinux is preventing /usr/bin/df from getattr access on the file /run/netns/netns-9dfd0347-71eb-5698-085c-c769043aa5c3. For complete SELinux messages run: sealert -l 23f93208-3063-4aac-b78a-bb0fcb40740c [x25]
== b0b02.cs.umd.edu (1 distinct, 1 total) ==
Jul 31 01:38:31 b0b02.cs.umd.edu rustdesk[1227497]: cannot open display:
== contest (9 distinct, 41 total) ==
Jul 31 01:06:46 contest goferd[1007]: [ERROR][worker-0] gofer.messaging.adapter.connect:33 - connect: proton+amqps://satellite8.cs.umd.edu:5647, failed: Connection amqps://satellite8.cs.umd.edu:5647 disconnected: Condition('proton.pythonio', 'Connection refused to all addresses') [x33]
Jul 31 01:48:15 contest setroubleshoot[370083]: SELinux is preventing /usr/libexec/platform-python3.6 from create access on the directory libdnf.ZdIr96. For complete SELinux messages run: sealert -l cb6b25c6-4765-4cf2-88a0-9b3b508e94e9
Jul 31 01:48:15 contest setroubleshoot[370083]: SELinux is preventing /usr/bin/gpgconf from add_name access on the directory repodata. For complete SELinux messages run: sealert -l 41cf7b1b-0f34-4609-98f2-b66e7825fef7
Jul 31 01:48:15 contest setroubleshoot[370083]: SELinux is preventing /usr/libexec/platform-python3.6 from create access on the file mirrorlist. For complete SELinux messages run: sealert -l fc20ff92-ea83-4f38-a24b-ddfd737a3141
Jul 31 01:48:16 contest setroubleshoot[370083]: SELinux is preventing /usr/libexec/platform-python3.6 from setattr access on the file repomd.xml. For complete SELinux messages run: sealert -l ac675631-fa35-4e93-adc9-b692b18e53e5
Jul 31 01:48:16 contest setroubleshoot[370083]: SELinux is preventing /usr/libexec/platform-python3.6 from read access on the directory libdnf.ZdIr96. For complete SELinux messages run: sealert -l 45d103b6-0810-4890-a705-990118577ce8
Jul 31 01:48:20 contest setroubleshoot[370083]: SELinux is preventing /usr/libexec/platform-python3.6 from remove_name access on the directory repomd.xml. For complete SELinux messages run: sealert -l 7e499113-2fd7-4f67-bec6-3521efbe3637
Jul 31 01:48:23 contest setroubleshoot[370083]: SELinux is preventing rhsmcertd-worke from unlink access on the file repomd.xml. For complete SELinux messages run: sealert -l 22835727-7fef-4cfb-b3b5-881f66888317
Jul 31 01:48:36 contest setroubleshoot[370135]: SELinux is preventing /usr/libexec/platform-python3.6 from rmdir access on the directory repodata. For complete SELinux messages run: sealert -l 3928930b-a1ed-448d-950b-0665ac2adef8
== csfw00a (2 distinct, 256 total) ==
Jul 31 01:04:52 csfw00a kernel: bnxt_en 0000:09:00.0 eth3: NIC Link is Down [x248]
Jul 31 01:09:22 csfw00a ospf6d[1477]: [EC 100663307] Could not send entire message [x8]
== hackerman (1 distinct, 1 total) ==
Jul 31 01:19:01 hackerman gnome-software[2060381]: failed to commit changes to dconf: GDBus.Error:org.gtk.GDBus.UnmappedGError.Quark._g_2dfile_2derror_2dquark.Code2: Failed to create file “/adminhomes/sajith/.config/dconf/user.MM3US3”: Permission denied
== hazfs.cs.umd.edu (11 distinct, 66 total) ==
Jul 31 01:51:21 hazfs.cs.umd.edu snmpd[1431]: send response: Failure in sendto [x6]
Jul 31 01:51:21 hazfs.cs.umd.edu snmpd[1431]: -- NET-SNMP-EXTEND-MIB::nsExtendStatus."userweb" [x6]
Jul 31 01:51:21 hazfs.cs.umd.edu snmpd[1431]: -- NET-SNMP-EXTEND-MIB::nsExtendStatus."zfslist" [x6]
Jul 31 01:51:21 hazfs.cs.umd.edu snmpd[1431]: -- NET-SNMP-EXTEND-MIB::nsExtendStatus."userhome" [x6]
Jul 31 01:51:21 hazfs.cs.umd.edu snmpd[1431]: -- NET-SNMP-EXTEND-MIB::nsExtendOutput1Line."userweb" [x6]
Jul 31 01:51:21 hazfs.cs.umd.edu snmpd[1431]: -- NET-SNMP-EXTEND-MIB::nsExtendOutput1Line."zfslist" [x6]
Jul 31 01:51:21 hazfs.cs.umd.edu snmpd[1431]: -- NET-SNMP-EXTEND-MIB::nsExtendOutput1Line."userhome" [x6]
Jul 31 01:51:21 hazfs.cs.umd.edu snmpd[1431]: -- NET-SNMP-EXTEND-MIB::nsExtendOutputFull."userweb" [x6]
Jul 31 01:51:21 hazfs.cs.umd.edu snmpd[1431]: -- NET-SNMP-EXTEND-MIB::nsExtendOutputFull."zfslist" [x6]
Jul 31 01:51:21 hazfs.cs.umd.edu snmpd[1431]: -- NET-SNMP-EXTEND-MIB::nsExtendOutputFull."userhome" [x6]
Jul 31 01:51:21 hazfs.cs.umd.edu snmpd[1431]: -- NET-SNMP-EXTEND-MIB::nsExtendOutNumLines."userweb" [x6]
== idm00 (1 distinct, 1 total) ==
Jul 31 01:51:12 idm00 named[1455]: client @0x7f331587f1d8 10.73.240.42#50279: update '73.10.in-addr.arpa/IN' denied
== idmp0 (2 distinct, 2 total) ==
Jul 31 01:24:04 idmp0 named[5198]: client @0x7f992002e6d8 10.73.245.12#55144: update '73.10.in-addr.arpa/IN' denied
Jul 31 01:36:02 idmp0 named[5198]: client @0x7f99300523f8 10.73.240.43#57038: update '73.10.in-addr.arpa/IN' denied
== inbound01.cs.umd.edu (3 distinct, 6 total) ==
Jul 31 01:26:01 inbound01.cs.umd.edu krb5_child[3560277]: Client 'admin(a)UMD.EDU' not found in Kerberos database
Jul 31 02:02:11 inbound01.cs.umd.edu cockpit-ws[3568460]: Received unexpected TLS connection; use cockpit-tls for TLS termination [x3]
Jul 31 02:03:57 inbound01.cs.umd.edu sshd-session[3569001]: error: Protocol major versions differ: 2 vs. 1 [x2]
== irb2156 (3 distinct, 3 total) ==
Jul 31 01:34:45 irb2156 cosmic-greeter[4753]: Failed to create watcher for com.system76.CosmicTk
Jul 31 01:34:45 irb2156 cosmic-greeter[4753]: Failed to create watcher for com.system76.CosmicTheme.Mode
Jul 31 01:34:45 irb2156 cosmic-greeter[4753]: Failed to create watcher for com.system76.CosmicTheme.Dark
== itmon02 (1 distinct, 44 total) ==
Jul 31 01:07:48 itmon02 sshd[1834]: error: beginning MaxStartups throttling [x44]
== krispykreme.cs.umd.edu (4 distinct, 4 total) ==
Jul 31 01:06:07 krispykreme.cs.umd.edu sshd-session[1408658]: pam_access(sshd:auth): access denied for user `admin' from `34.140.157.205'
Jul 31 01:06:07 krispykreme.cs.umd.edu krb5_child[1408660]: Client 'admin(a)UMD.EDU' not found in Kerberos database
Jul 31 01:06:07 krispykreme.cs.umd.edu sshd-session[1408656]: error: PAM: System error for admin from 34.140.157.205
Jul 31 01:06:12 krispykreme.cs.umd.edu sshd-session[1408662]: error: Protocol major versions differ: 2 vs. 1
== netman.cs.umd.edu (3 distinct, 6 total) ==
Jul 31 01:55:23 netman.cs.umd.edu krb5_child[3125814]: Client 'admin(a)UMD.EDU' not found in Kerberos database [x4]
Jul 31 01:55:28 netman.cs.umd.edu sshd[3125811]: error: PAM: Authentication failure for admin from 34.77.183.14
Jul 31 01:56:43 netman.cs.umd.edu sshd[3126344]: error: Protocol major versions differ: 2 vs. 1
== newhonors2 (1 distinct, 24 total) ==
Jul 31 01:13:03 newhonors2 dhcpcd[520671]: dhcpcd is not running [x24]
== outbound00.cs.umd.edu (1 distinct, 6 total) ==
Jul 31 01:09:09 outbound00.cs.umd.edu python3[1312995]: ldapdb [x6]
== outbound01.cs.umd.edu (1 distinct, 6 total) ==
Jul 31 01:13:06 outbound01.cs.umd.edu python3[3539423]: ldapdb [x6]
== peach.cs.umd.edu (2 distinct, 2 total) ==
Jul 31 02:02:08 peach.cs.umd.edu setroubleshoot[1781784]: SELinux is preventing /usr/bin/qemu-ga from search access on the directory /var/lib/containers/storage/overlay. For complete SELinux messages run: sealert -l ba415951-a2c6-424e-b17d-305c5300b9f3
Jul 31 02:02:08 peach.cs.umd.edu setroubleshoot[1781784]: SELinux is preventing /usr/bin/qemu-ga from search access on the directory /var/lib/containers/storage/overlay. For complete SELinux messages run: sealert -l 6aeb0956-fcf2-462a-ae4d-439b912c16d0
== sentry-docker00.cs.umd.edu (42 distinct, 42 total) ==
Jul 31 01:06:19 sentry-docker00.cs.umd.edu systemd-udevd[2889727]: link_config: could not get ethtool features for veth3f4f1a2
Jul 31 01:06:19 sentry-docker00.cs.umd.edu systemd-udevd[2889727]: Could not set offload features of veth3f4f1a2: No such device
Jul 31 01:06:19 sentry-docker00.cs.umd.edu systemd-udevd[2889753]: Could not generate persistent MAC address for veth766b0c7: No such file or directory
Jul 31 01:06:19 sentry-docker00.cs.umd.edu systemd-udevd[2889754]: Could not generate persistent MAC address for veth37e1695: No such file or directory
Jul 31 01:06:19 sentry-docker00.cs.umd.edu systemd-udevd[2889757]: Could not generate persistent MAC address for veth291aaed: No such file or directory
Jul 31 01:06:19 sentry-docker00.cs.umd.edu systemd-udevd[2889758]: Could not generate persistent MAC address for veth2eb6c5c: No such file or directory
Jul 31 01:06:19 sentry-docker00.cs.umd.edu systemd-udevd[2889781]: Could not generate persistent MAC address for vethdc8c36b: No such file or directory
Jul 31 01:06:19 sentry-docker00.cs.umd.edu systemd-udevd[2889782]: Could not generate persistent MAC address for veth0f4fbc4: No such file or directory
Jul 31 01:06:19 sentry-docker00.cs.umd.edu systemd-udevd[2889800]: Could not generate persistent MAC address for vetha4d6646: No such file or directory
Jul 31 01:06:19 sentry-docker00.cs.umd.edu systemd-udevd[2889796]: Could not generate persistent MAC address for vethfd39e82: No such file or directory
Jul 31 01:11:13 sentry-docker00.cs.umd.edu systemd-udevd[2892775]: link_config: could not get ethtool features for vethb763bbb
Jul 31 01:11:13 sentry-docker00.cs.umd.edu systemd-udevd[2892775]: Could not set offload features of vethb763bbb: No such device
Jul 31 01:11:14 sentry-docker00.cs.umd.edu systemd-udevd[2892791]: Could not generate persistent MAC address for vethb4b5fd4: No such file or directory
Jul 31 01:11:14 sentry-docker00.cs.umd.edu systemd-udevd[2892792]: Could not generate persistent MAC address for vethdef985b: No such file or directory
Jul 31 01:26:27 sentry-docker00.cs.umd.edu systemd-udevd[2899380]: link_config: could not get ethtool features for vetha4d6646
Jul 31 01:26:27 sentry-docker00.cs.umd.edu systemd-udevd[2899380]: Could not set offload features of vetha4d6646: No such device
Jul 31 01:26:27 sentry-docker00.cs.umd.edu systemd-udevd[2899408]: Could not generate persistent MAC address for veth9c43a45: No such file or directory
Jul 31 01:26:27 sentry-docker00.cs.umd.edu systemd-udevd[2899409]: Could not generate persistent MAC address for veth709ff3a: No such file or directory
Jul 31 01:26:27 sentry-docker00.cs.umd.edu systemd-udevd[2899412]: Could not generate persistent MAC address for vetha8c89ce: No such file or directory
Jul 31 01:26:27 sentry-docker00.cs.umd.edu systemd-udevd[2899413]: Could not generate persistent MAC address for veth612922d: No such file or directory
Jul 31 01:26:27 sentry-docker00.cs.umd.edu systemd-udevd[2899431]: Could not generate persistent MAC address for vethe128178: No such file or directory
Jul 31 01:26:27 sentry-docker00.cs.umd.edu systemd-udevd[2899422]: Could not generate persistent MAC address for veth5ac0797: No such file or directory
Jul 31 01:26:27 sentry-docker00.cs.umd.edu systemd-udevd[2899438]: Could not generate persistent MAC address for vethcd1fc4e: No such file or directory
Jul 31 01:26:27 sentry-docker00.cs.umd.edu systemd-udevd[2899440]: Could not generate persistent MAC address for vethf39c945: No such file or directory
Jul 31 01:31:22 sentry-docker00.cs.umd.edu systemd-udevd[2902481]: link_config: could not get ethtool features for vethb4b5fd4
Jul 31 01:31:22 sentry-docker00.cs.umd.edu systemd-udevd[2902481]: Could not set offload features of vethb4b5fd4: No such device
Jul 31 01:31:22 sentry-docker00.cs.umd.edu systemd-udevd[2902490]: Could not generate persistent MAC address for veth58557a7: No such file or directory
Jul 31 01:31:22 sentry-docker00.cs.umd.edu systemd-udevd[2902491]: Could not generate persistent MAC address for veth9c791ab: No such file or directory
Jul 31 01:46:35 sentry-docker00.cs.umd.edu systemd-udevd[2908757]: link_config: could not get ethtool features for vethe128178
Jul 31 01:46:35 sentry-docker00.cs.umd.edu systemd-udevd[2908757]: Could not set offload features of vethe128178: No such device
... 12 more distinct messages not shown
== strawberry (2 distinct, 8 total) ==
Jul 31 01:09:44 strawberry udisksd[1067]: Error performing housekeeping for drive /org/freedesktop/UDisks2/drives/ST2000DM001_1CH164_W1E8J5KJ: Error updating SMART data: Error sending ATA command CHECK POWER MODE: Unexpected sense data returned:#0120000: 00 00 00 00 00 00 00 00 00 00 00 00 00 00 00 00 ................#0120010: 00 00 00 00 00 00 00 00 00 00 00 00 00 00 00 00 ................#012 (g-io-error-quark, 0) [x6]
Jul 31 01:34:42 strawberry smartd[5314]: Device: /dev/sda [SAT], failed to read SMART Attribute Data [x2]
== submit26-b9-2 (9 distinct, 9 total) ==
Jul 31 01:12:50 submit26-b9-2 setroubleshoot[686484]: SELinux is preventing /usr/bin/python3.9 from create access on the directory /(null). For complete SELinux messages run: sealert -l d506243c-d61e-48f3-b42a-4592c913deb0
Jul 31 01:12:50 submit26-b9-2 setroubleshoot[686484]: SELinux is preventing /usr/bin/python3.9 from add_name access on the directory /(null). For complete SELinux messages run: sealert -l 3b4752ac-1b9a-4af9-a05b-32e4c2eb13ab
Jul 31 01:12:50 submit26-b9-2 setroubleshoot[686484]: SELinux is preventing /usr/bin/python3.9 from create access on the file /(null). For complete SELinux messages run: sealert -l 29e5adbd-4381-4467-b40d-a2219101e096
Jul 31 01:12:50 submit26-b9-2 setroubleshoot[686484]: SELinux is preventing /usr/bin/python3.9 from open access on the file /tmp/libdnf.lzUFMI/repodata/repomd.xml. For complete SELinux messages run: sealert -l 1b38f2ec-01ce-4343-8059-ba7494ecc5c4
Jul 31 01:12:50 submit26-b9-2 setroubleshoot[686484]: SELinux is preventing /usr/bin/python3.9 from setattr access on the file repomd.xml. For complete SELinux messages run: sealert -l e5f9af40-1f63-4924-b012-27ab2a7b2266
Jul 31 01:12:50 submit26-b9-2 setroubleshoot[686484]: SELinux is preventing /usr/bin/python3.9 from read access on the directory libdnf.lzUFMI. For complete SELinux messages run: sealert -l 5c54db87-54a3-4a7c-97b4-b5c48d6c3543
Jul 31 01:12:51 submit26-b9-2 setroubleshoot[686484]: SELinux is preventing /usr/bin/python3.9 from remove_name access on the directory repomd.xml. For complete SELinux messages run: sealert -l 63cd60e1-1e61-4276-afea-dd8526ffe8b2
Jul 31 01:12:51 submit26-b9-2 setroubleshoot[686484]: SELinux is preventing /usr/bin/python3.9 from unlink access on the file repomd.xml. For complete SELinux messages run: sealert -l 81c7e9ec-e023-4c6d-b1ad-c02a242e655e
Jul 31 01:12:51 submit26-b9-2 setroubleshoot[686484]: SELinux is preventing /usr/bin/python3.9 from rmdir access on the directory repodata. For complete SELinux messages run: sealert -l 6ae9a597-e123-4d74-8eec-a8ebe0f5e4d0
== submit26-b9-3 (9 distinct, 9 total) ==
Jul 31 01:20:37 submit26-b9-3 setroubleshoot[719851]: SELinux is preventing /usr/bin/python3.9 from create access on the directory /(null). For complete SELinux messages run: sealert -l 5b912a44-22fd-4560-b201-2a4e289b73f5
Jul 31 01:20:37 submit26-b9-3 setroubleshoot[719851]: SELinux is preventing /usr/bin/python3.9 from add_name access on the directory /(null). For complete SELinux messages run: sealert -l 7f1df1e4-725e-4953-98eb-1079f908f543
Jul 31 01:20:37 submit26-b9-3 setroubleshoot[719851]: SELinux is preventing /usr/bin/python3.9 from create access on the file /(null). For complete SELinux messages run: sealert -l 40b8852a-f77b-44b4-affe-5f11fa33de43
Jul 31 01:20:37 submit26-b9-3 setroubleshoot[719851]: SELinux is preventing /usr/bin/python3.9 from open access on the file /tmp/libdnf.Fo5POm/repodata/repomd.xml. For complete SELinux messages run: sealert -l 45a8019e-f6b5-4baa-92c1-862594b40d46
Jul 31 01:20:37 submit26-b9-3 setroubleshoot[719851]: SELinux is preventing /usr/bin/python3.9 from setattr access on the file repomd.xml. For complete SELinux messages run: sealert -l e9f0bfff-7784-4126-baa4-2bb06da56591
Jul 31 01:20:37 submit26-b9-3 setroubleshoot[719851]: SELinux is preventing /usr/bin/python3.9 from read access on the directory libdnf.Fo5POm. For complete SELinux messages run: sealert -l 0b17cc3d-cdc6-4fe2-a11f-3892e7c41dc7
Jul 31 01:20:37 submit26-b9-3 setroubleshoot[719851]: SELinux is preventing /usr/bin/python3.9 from remove_name access on the directory repomd.xml. For complete SELinux messages run: sealert -l 10e38c64-b65f-4cdd-901e-4375652d9a42
Jul 31 01:20:37 submit26-b9-3 setroubleshoot[719851]: SELinux is preventing /usr/bin/python3.9 from unlink access on the file repomd.xml. For complete SELinux messages run: sealert -l 7fd9cf72-ef38-48e1-b6aa-b571b26a7b22
Jul 31 01:20:37 submit26-b9-3 setroubleshoot[719851]: SELinux is preventing /usr/bin/python3.9 from rmdir access on the directory repodata. For complete SELinux messages run: sealert -l b9b11116-89bd-4a3c-980c-1d422c5dcee4
== submit26-clnb9 (9 distinct, 9 total) ==
Jul 31 01:31:55 submit26-clnb9 setroubleshoot[1565392]: SELinux is preventing /usr/bin/python3.9 from create access on the directory /(null). For complete SELinux messages run: sealert -l 6783ed2b-5ae4-42b5-975a-4bf50eec4658
Jul 31 01:31:55 submit26-clnb9 setroubleshoot[1565392]: SELinux is preventing /usr/bin/python3.9 from add_name access on the directory /(null). For complete SELinux messages run: sealert -l 9e7fa955-cc30-4804-ac8c-e1779e85946c
Jul 31 01:31:55 submit26-clnb9 setroubleshoot[1565392]: SELinux is preventing /usr/bin/python3.9 from create access on the file /(null). For complete SELinux messages run: sealert -l 69bfa6e3-089c-40ff-9563-fd30787d0774
Jul 31 01:31:55 submit26-clnb9 setroubleshoot[1565392]: SELinux is preventing /usr/bin/python3.9 from open access on the file /tmp/libdnf.6RIuyx/repodata/repomd.xml. For complete SELinux messages run: sealert -l 001acdb5-31ef-4e52-b10b-90f467a89ddc
Jul 31 01:31:55 submit26-clnb9 setroubleshoot[1565392]: SELinux is preventing /usr/bin/python3.9 from setattr access on the file repomd.xml. For complete SELinux messages run: sealert -l edacddcf-16ed-4dc3-8d82-7c597d5dee23
Jul 31 01:31:55 submit26-clnb9 setroubleshoot[1565392]: SELinux is preventing /usr/bin/python3.9 from read access on the directory libdnf.6RIuyx. For complete SELinux messages run: sealert -l 62b3782e-4730-4488-8178-94dafe9b552c
Jul 31 01:31:55 submit26-clnb9 setroubleshoot[1565392]: SELinux is preventing /usr/bin/python3.9 from remove_name access on the directory repomd.xml. For complete SELinux messages run: sealert -l 81cb3698-78f8-440a-8e3c-e5d1041e6b78
Jul 31 01:31:55 submit26-clnb9 setroubleshoot[1565392]: SELinux is preventing /usr/bin/python3.9 from unlink access on the file repomd.xml. For complete SELinux messages run: sealert -l 792b472a-115c-4799-9805-fc7436f916b9
Jul 31 01:31:55 submit26-clnb9 setroubleshoot[1565392]: SELinux is preventing /usr/bin/python3.9 from rmdir access on the directory repodata. For complete SELinux messages run: sealert -l 15c83a86-837b-41e2-b662-b39cd4e361cb
== teaching-awards (2 distinct, 2 total) ==
Jul 31 01:07:31 teaching-awards krb5_child[1629573]: Client 'admin(a)UMD.EDU' not found in Kerberos database
Jul 31 01:07:43 teaching-awards sshd-session[1629582]: error: Protocol major versions differ: 2 vs. 1
1
0
Command: /usr/local/sbin/syslog-digest.py
Time : 0.7558s
Status : exited 0
Output :
Syslog digest — 2026-07-31 01:05 EDT
Processed 9,968 lines, filtered 8,922 (89%). 1,046 unknown (195 distinct) from 33 host(s).
== abuse (1 distinct, 347 total) ==
Jul 31 00:05:06 abuse rsyslogd[21745]: imjournal: open() failed for path: '/var/lib/rsyslog/imjournal.state.tmp': Input/output error [v8.2404.0 try https://www.rsyslog.com/e/2433 ] [x347]
== alec.cs.umd.edu (3 distinct, 60 total) ==
Jul 31 00:05:04 alec.cs.umd.edu setroubleshoot[699506]: failed to retrieve rpm info for path '/run/netns/netns-9dfd0347-71eb-5698-085c-c769043aa5c3': [x12]
Jul 31 00:05:05 alec.cs.umd.edu sedispatch[1526]: AVC Message regarding setroubleshoot, ignoring message [x24]
Jul 31 00:05:05 alec.cs.umd.edu setroubleshoot[699506]: SELinux is preventing /usr/bin/df from getattr access on the file /run/netns/netns-9dfd0347-71eb-5698-085c-c769043aa5c3. For complete SELinux messages run: sealert -l 23f93208-3063-4aac-b78a-bb0fcb40740c [x24]
== atif01.cs.umd.edu (43 distinct, 81 total) ==
Jul 31 00:05:06 atif01.cs.umd.edu sshd[52610]: error: maximum authentication attempts exceeded for root from 85.185.54.139 port 31325 ssh2 [preauth]
Jul 31 00:05:06 atif01.cs.umd.edu sshd[52610]: PAM service(sshd) ignoring max retries; 6 > 3 [x39]
Jul 31 00:05:21 atif01.cs.umd.edu sshd[52618]: error: maximum authentication attempts exceeded for root from 85.185.54.139 port 49471 ssh2 [preauth]
Jul 31 00:05:35 atif01.cs.umd.edu sshd[52636]: error: maximum authentication attempts exceeded for root from 85.185.54.139 port 6369 ssh2 [preauth]
Jul 31 00:05:49 atif01.cs.umd.edu sshd[52646]: error: maximum authentication attempts exceeded for root from 85.185.54.139 port 59883 ssh2 [preauth]
Jul 31 00:06:03 atif01.cs.umd.edu sshd[52654]: error: maximum authentication attempts exceeded for root from 85.185.54.139 port 49262 ssh2 [preauth]
Jul 31 00:06:17 atif01.cs.umd.edu sshd[52666]: error: maximum authentication attempts exceeded for root from 85.185.54.139 port 54050 ssh2 [preauth]
Jul 31 00:06:35 atif01.cs.umd.edu sshd[52682]: error: maximum authentication attempts exceeded for root from 85.185.54.139 port 20143 ssh2 [preauth]
Jul 31 00:06:51 atif01.cs.umd.edu sshd[52693]: error: maximum authentication attempts exceeded for root from 85.185.54.139 port 50336 ssh2 [preauth]
Jul 31 00:07:06 atif01.cs.umd.edu sshd[52709]: error: maximum authentication attempts exceeded for root from 85.185.54.139 port 55109 ssh2 [preauth]
Jul 31 00:07:21 atif01.cs.umd.edu sshd[52719]: error: maximum authentication attempts exceeded for root from 85.185.54.139 port 60863 ssh2 [preauth]
Jul 31 00:07:37 atif01.cs.umd.edu sshd[52737]: error: maximum authentication attempts exceeded for root from 85.185.54.139 port 50242 ssh2 [preauth]
Jul 31 00:07:52 atif01.cs.umd.edu sshd[52745]: error: maximum authentication attempts exceeded for root from 85.185.54.139 port 55136 ssh2 [preauth]
Jul 31 00:08:08 atif01.cs.umd.edu sshd[52755]: error: maximum authentication attempts exceeded for root from 85.185.54.139 port 61289 ssh2 [preauth]
Jul 31 00:08:26 atif01.cs.umd.edu sshd[52763]: error: maximum authentication attempts exceeded for root from 85.185.54.139 port 50580 ssh2 [preauth]
Jul 31 00:08:40 atif01.cs.umd.edu sshd[52781]: error: maximum authentication attempts exceeded for root from 85.185.54.139 port 19309 ssh2 [preauth]
Jul 31 00:08:55 atif01.cs.umd.edu sshd[52791]: error: maximum authentication attempts exceeded for root from 85.185.54.139 port 62445 ssh2 [preauth]
Jul 31 00:09:09 atif01.cs.umd.edu sshd[52799]: error: maximum authentication attempts exceeded for root from 85.185.54.139 port 26391 ssh2 [preauth]
Jul 31 00:09:24 atif01.cs.umd.edu sshd[52809]: error: maximum authentication attempts exceeded for root from 85.185.54.139 port 30141 ssh2 [preauth]
Jul 31 00:09:38 atif01.cs.umd.edu sshd[52825]: error: maximum authentication attempts exceeded for root from 85.185.54.139 port 62610 ssh2 [preauth]
Jul 31 00:09:52 atif01.cs.umd.edu sshd[52835]: error: maximum authentication attempts exceeded for root from 85.185.54.139 port 51624 ssh2 [preauth]
Jul 31 00:10:05 atif01.cs.umd.edu sshd[52843]: error: maximum authentication attempts exceeded for root from 85.185.54.139 port 56312 ssh2 [preauth]
Jul 31 00:10:19 atif01.cs.umd.edu sshd[52862]: error: maximum authentication attempts exceeded for root from 85.185.54.139 port 62347 ssh2 [preauth]
Jul 31 00:10:33 atif01.cs.umd.edu sshd[52878]: error: maximum authentication attempts exceeded for root from 85.185.54.139 port 15721 ssh2 [preauth]
Jul 31 00:10:48 atif01.cs.umd.edu sshd[52888]: error: maximum authentication attempts exceeded for root from 85.185.54.139 port 19679 ssh2 [preauth]
Jul 31 00:11:02 atif01.cs.umd.edu sshd[52898]: error: maximum authentication attempts exceeded for root from 85.185.54.139 port 62622 ssh2 [preauth]
Jul 31 00:11:16 atif01.cs.umd.edu sshd[52906]: error: maximum authentication attempts exceeded for root from 85.185.54.139 port 51676 ssh2 [preauth]
Jul 31 00:11:30 atif01.cs.umd.edu sshd[52924]: error: maximum authentication attempts exceeded for root from 85.185.54.139 port 56362 ssh2 [preauth]
Jul 31 00:11:45 atif01.cs.umd.edu sshd[52932]: error: maximum authentication attempts exceeded for root from 85.185.54.139 port 62937 ssh2 [preauth]
Jul 31 00:11:59 atif01.cs.umd.edu sshd[52950]: error: maximum authentication attempts exceeded for root from 85.185.54.139 port 5465 ssh2 [preauth]
... 13 more distinct messages not shown
== b0b02.cs.umd.edu (1 distinct, 1 total) ==
Jul 31 00:38:27 b0b02.cs.umd.edu rustdesk[1212451]: cannot open display:
== bachata (10 distinct, 10 total) ==
Jul 31 00:30:56 bachata smbd[2187323]: [2026/07/31 00:30:56.121230, 0] ../../source3/smbd/smb2_service.c:117(chdir_current_service)
Jul 31 00:30:56 bachata smbd[2187323]: chdir_current_service: vfs_ChDir(/fs/junkfood/mount) failed: Permission denied. Current token: uid=11255, gid=11255, 12 groups: 11255 319000009 25038 15294 15229 755 25030 25025 30880 25029 770 15026
Jul 31 00:30:56 bachata smbd[2187323]: [2026/07/31 00:30:56.122030, 0] ../../source3/smbd/smbXsrv_tcon.c:914(smbXsrv_tcon_disconnect)
Jul 31 00:30:56 bachata smbd[2187323]: smbXsrv_tcon_disconnect: disconnect(0x4ed2e88d, 'mount'): chdir_current_service() failed: NT_STATUS_INTERNAL_ERROR
Jul 31 00:30:56 bachata smbd[2187323]: [2026/07/31 00:30:56.122232, 0] ../../source3/smbd/smbXsrv_tcon.c:1028(smbXsrv_tcon_disconnect_all)
Jul 31 00:30:56 bachata smbd[2187323]: smbXsrv_tcon_disconnect_all: count[2] errors[1] first[NT_STATUS_INTERNAL_ERROR]
Jul 31 00:30:56 bachata smbd[2187323]: [2026/07/31 00:30:56.122304, 0] ../../source3/smbd/smbXsrv_session.c:1900(smbXsrv_session_logoff)
Jul 31 00:30:56 bachata smbd[2187323]: smbXsrv_session_logoff: smbXsrv_session_logoff(0xf9257bf0): smb2srv_tcon_disconnect_all() failed: NT_STATUS_INTERNAL_ERROR
Jul 31 00:30:56 bachata smbd[2187323]: [2026/07/31 00:30:56.122379, 0] ../../source3/smbd/smbXsrv_session.c:1728(smbXsrv_session_remove_channel_done)
Jul 31 00:30:56 bachata smbd[2187323]: smbXsrv_session_remove_channel_done: smbXsrv_session_logoff(4179983344) failed: NT_STATUS_INTERNAL_ERROR
== contest (1 distinct, 34 total) ==
Jul 31 00:06:05 contest goferd[1007]: [ERROR][worker-0] gofer.messaging.adapter.connect:33 - connect: proton+amqps://satellite8.cs.umd.edu:5647, failed: Connection amqps://satellite8.cs.umd.edu:5647 disconnected: Condition('proton.pythonio', 'Connection refused to all addresses') [x34]
== csfw00a (1 distinct, 230 total) ==
Jul 31 00:04:33 csfw00a kernel: bnxt_en 0000:09:00.0 eth3: NIC Link is Down [x230]
== cskayako (2 distinct, 2 total) ==
Jul 31 00:06:40 cskayako setroubleshoot[1381457]: SELinux is preventing /usr/bin/php from add_name access on the directory /var/www/html/(null). For complete SELinux messages run: sealert -l 5239c113-abc1-4953-a9c0-21d695a0d1bb
Jul 31 00:06:40 cskayako setroubleshoot[1381457]: SELinux is preventing /usr/bin/php from create access on the file /var/www/html/(null). For complete SELinux messages run: sealert -l cacf8f36-45b0-4374-9a33-d15de767aae7
== frabjous (6 distinct, 16 total) ==
Jul 31 00:05:36 frabjous krb5_child[2278996]: Client 'admin(a)UMD.EDU' not found in Kerberos database [x7]
Jul 31 00:05:38 frabjous sshd-session[2278991]: error: PAM: Authentication failure for admin from 171.231.191.7
Jul 31 00:08:08 frabjous sshd-session[2279568]: error: PAM: Authentication failure for root from 171.231.191.7
Jul 31 00:25:40 frabjous sshd-session[2281409]: error: PAM: Authentication failure for admin from 171.231.191.101 [x4]
Jul 31 00:27:50 frabjous sshd-session[2281970]: error: PAM: Authentication failure for root from 171.231.191.101
Jul 31 00:40:41 frabjous sshd-session[2283378]: error: PAM: Authentication failure for admin from 116.110.17.78 [x2]
== grades01.cs.umd.edu (3 distinct, 4 total) ==
Jul 31 00:10:13 grades01.cs.umd.edu systemd[1]: New main PID 2607 does not belong to service, and PID file is not owned by root. Refusing. [x2]
Jul 31 00:10:38 grades01.cs.umd.edu systemd[1]: Daemon never wrote its PID file. Failing.
Jul 31 00:10:52 grades01.cs.umd.edu systemd[1]: pmlogger.service: Supervising process 9880 which is not our child. We'll most likely not notice when it exits.
== idm00 (1 distinct, 1 total) ==
Jul 31 00:51:12 idm00 named[1455]: client @0x7f330432fa18 10.73.240.42#52561: update '73.10.in-addr.arpa/IN' denied
== idmp0 (1 distinct, 1 total) ==
Jul 31 00:36:02 idmp0 named[5198]: client @0x7f990801f168 10.73.240.43#65193: update '73.10.in-addr.arpa/IN' denied
== itmon02 (1 distinct, 52 total) ==
Jul 31 00:08:10 itmon02 sshd[1834]: error: beginning MaxStartups throttling [x52]
== jubjub.cs.umd.edu (3 distinct, 4 total) ==
Jul 31 00:10:12 jubjub.cs.umd.edu systemd[1]: New main PID 456461 does not belong to service, and PID file is not owned by root. Refusing. [x2]
Jul 31 00:10:31 jubjub.cs.umd.edu systemd[1]: Daemon never wrote its PID file. Failing.
Jul 31 00:10:39 jubjub.cs.umd.edu systemd[1]: pmlogger.service: Supervising process 463967 which is not our child. We'll most likely not notice when it exits.
== mcstic (3 distinct, 6 total) ==
Jul 31 00:33:34 mcstic krb5_child[1894244]: No credentials cache found (filename: /tmp/krb5cc_14705_cPekIT)
Jul 31 00:44:15 mcstic krb5_child[1894791]: Client 'admin(a)UMD.EDU' not found in Kerberos database [x4]
Jul 31 00:44:19 mcstic sshd[1894786]: error: PAM: Authentication failure for admin from 34.76.133.51
== mirrors.cs.umd.edu (3 distinct, 4 total) ==
Jul 31 00:10:12 mirrors.cs.umd.edu systemd[1]: New main PID 3752 does not belong to service, and PID file is not owned by root. Refusing. [x2]
Jul 31 00:10:30 mirrors.cs.umd.edu systemd[1]: Daemon never wrote its PID file. Failing.
Jul 31 00:10:43 mirrors.cs.umd.edu systemd[1]: pmlogger.service: Supervising process 10794 which is not our child. We'll most likely not notice when it exits.
== misty.cs.umd.edu (3 distinct, 4 total) ==
Jul 31 00:10:15 misty.cs.umd.edu systemd[1]: New main PID 19156 does not belong to service, and PID file is not owned by root. Refusing. [x2]
Jul 31 00:10:35 misty.cs.umd.edu systemd[1]: Daemon never wrote its PID file. Failing.
Jul 31 00:10:51 misty.cs.umd.edu systemd[1]: pmlogger.service: Supervising process 26947 which is not our child. We'll most likely not notice when it exits.
== netman.cs.umd.edu (4 distinct, 21 total) ==
Jul 31 00:05:54 netman.cs.umd.edu krb5_child[3095180]: Client 'admin(a)UMD.EDU' not found in Kerberos database [x18]
Jul 31 00:29:59 netman.cs.umd.edu setroubleshoot[3102203]: SELinux is preventing /usr/bin/gpg from read access on the file gpg.conf. For complete SELinux messages run: sealert -l 019ad1da-a874-4814-8037-3b3e5f413ad2
Jul 31 00:30:00 netman.cs.umd.edu setroubleshoot[3102203]: SELinux is preventing /usr/bin/gpg from open access on the file /root/.gnupg/gpg.conf. For complete SELinux messages run: sealert -l cb54177e-d44c-46a1-b246-5c0bbb8343be
Jul 31 00:30:02 netman.cs.umd.edu setroubleshoot[3102203]: SELinux is preventing /usr/bin/gpg from getattr access on the file /root/.gnupg/gpg.conf. For complete SELinux messages run: sealert -l fbba2e30-b7ab-491c-9ec6-f553e9ef72af
== newhonors2 (1 distinct, 24 total) ==
Jul 31 00:13:02 newhonors2 dhcpcd[518819]: dhcpcd is not running [x24]
== openrepo (1 distinct, 1 total) ==
Jul 31 00:53:15 openrepo (nin-node)[622559]: munin-node.service: Referenced but unset environment variable evaluates to an empty string: DAEMON_ARGS
== outbound00.cs.umd.edu (2 distinct, 15 total) ==
Jul 31 00:05:12 outbound00.cs.umd.edu krb5_child[1297186]: Client 'admin(a)UMD.EDU' not found in Kerberos database [x9]
Jul 31 00:09:09 outbound00.cs.umd.edu python3[1298020]: ldapdb [x6]
== outbound01.cs.umd.edu (3 distinct, 8 total) ==
Jul 31 00:13:06 outbound01.cs.umd.edu python3[3524855]: ldapdb [x6]
Jul 31 00:13:28 outbound01.cs.umd.edu krb5_child[3524958]: Client 'admin(a)UMD.EDU' not found in Kerberos database
Jul 31 00:15:50 outbound01.cs.umd.edu sshd-session[3525755]: error: Protocol major versions differ: 2 vs. 1
== sentry-docker00.cs.umd.edu (42 distinct, 42 total) ==
Jul 31 00:05:54 sentry-docker00.cs.umd.edu systemd-udevd[2861208]: link_config: could not get ethtool features for veth8713572
Jul 31 00:05:54 sentry-docker00.cs.umd.edu systemd-udevd[2861208]: Could not set offload features of veth8713572: No such device
Jul 31 00:05:54 sentry-docker00.cs.umd.edu systemd-udevd[2861250]: link_config: could not get ethtool features for veth33a99ac
Jul 31 00:05:54 sentry-docker00.cs.umd.edu systemd-udevd[2861250]: Could not set offload features of veth33a99ac: No such device
Jul 31 00:05:54 sentry-docker00.cs.umd.edu systemd-udevd[2861291]: Could not generate persistent MAC address for veth453e585: No such file or directory
Jul 31 00:05:54 sentry-docker00.cs.umd.edu systemd-udevd[2861292]: Could not generate persistent MAC address for veth1c44812: No such file or directory
Jul 31 00:05:54 sentry-docker00.cs.umd.edu systemd-udevd[2861295]: Could not generate persistent MAC address for veth253bfb3: No such file or directory
Jul 31 00:05:54 sentry-docker00.cs.umd.edu systemd-udevd[2861296]: Could not generate persistent MAC address for vethf47262b: No such file or directory
Jul 31 00:05:54 sentry-docker00.cs.umd.edu systemd-udevd[2861318]: Could not generate persistent MAC address for veth3c29d8d: No such file or directory
Jul 31 00:05:54 sentry-docker00.cs.umd.edu systemd-udevd[2861300]: Could not generate persistent MAC address for veth32be8d6: No such file or directory
Jul 31 00:05:54 sentry-docker00.cs.umd.edu systemd-udevd[2861321]: Could not generate persistent MAC address for veth4e20351: No such file or directory
Jul 31 00:05:54 sentry-docker00.cs.umd.edu systemd-udevd[2861322]: Could not generate persistent MAC address for veth9c78a69: No such file or directory
Jul 31 00:10:49 sentry-docker00.cs.umd.edu systemd-udevd[2864388]: Could not generate persistent MAC address for veth8ef12dc: No such file or directory
Jul 31 00:10:49 sentry-docker00.cs.umd.edu systemd-udevd[2864389]: Could not generate persistent MAC address for veth6066963: No such file or directory
Jul 31 00:26:02 sentry-docker00.cs.umd.edu systemd-udevd[2870737]: link_config: could not get ethtool features for veth253bfb3
Jul 31 00:26:02 sentry-docker00.cs.umd.edu systemd-udevd[2870737]: Could not set offload features of veth253bfb3: No such device
Jul 31 00:26:02 sentry-docker00.cs.umd.edu systemd-udevd[2870752]: Could not generate persistent MAC address for veth22aec32: No such file or directory
Jul 31 00:26:02 sentry-docker00.cs.umd.edu systemd-udevd[2870753]: Could not generate persistent MAC address for veth5461ee4: No such file or directory
Jul 31 00:26:02 sentry-docker00.cs.umd.edu systemd-udevd[2870811]: Could not generate persistent MAC address for veth61c0651: No such file or directory
Jul 31 00:26:02 sentry-docker00.cs.umd.edu systemd-udevd[2870812]: Could not generate persistent MAC address for vethfbe3e90: No such file or directory
Jul 31 00:26:02 sentry-docker00.cs.umd.edu systemd-udevd[2870854]: Could not generate persistent MAC address for veth5e039c3: No such file or directory
Jul 31 00:26:02 sentry-docker00.cs.umd.edu systemd-udevd[2870855]: Could not generate persistent MAC address for veth2f0fed2: No such file or directory
Jul 31 00:26:02 sentry-docker00.cs.umd.edu systemd-udevd[2870903]: Could not generate persistent MAC address for vethed5ace2: No such file or directory
Jul 31 00:26:02 sentry-docker00.cs.umd.edu systemd-udevd[2870902]: Could not generate persistent MAC address for veth3085523: No such file or directory
Jul 31 00:30:57 sentry-docker00.cs.umd.edu systemd-udevd[2873866]: link_config: could not get ethtool features for veth8ef12dc
Jul 31 00:30:57 sentry-docker00.cs.umd.edu systemd-udevd[2873866]: Could not set offload features of veth8ef12dc: No such device
Jul 31 00:30:57 sentry-docker00.cs.umd.edu systemd-udevd[2873875]: Could not generate persistent MAC address for vethf551a78: No such file or directory
Jul 31 00:30:57 sentry-docker00.cs.umd.edu systemd-udevd[2873876]: Could not generate persistent MAC address for veth9296b03: No such file or directory
Jul 31 00:46:10 sentry-docker00.cs.umd.edu systemd-udevd[2880181]: link_config: could not get ethtool features for veth61c0651
Jul 31 00:46:10 sentry-docker00.cs.umd.edu systemd-udevd[2880181]: Could not set offload features of veth61c0651: No such device
... 12 more distinct messages not shown
== soul (1 distinct, 6 total) ==
Jul 31 00:06:45 soul krb5_child[2750111]: Client 'admin(a)UMD.EDU' not found in Kerberos database [x6]
== strawberry (3 distinct, 9 total) ==
Jul 31 00:09:44 strawberry udisksd[1067]: Error performing housekeeping for drive /org/freedesktop/UDisks2/drives/ST2000DM001_1CH164_W1E8J5KJ: Error updating SMART data: Error sending ATA command CHECK POWER MODE: Unexpected sense data returned:#0120000: 00 00 00 00 00 00 00 00 00 00 00 00 00 00 00 00 ................#0120010: 00 00 00 00 00 00 00 00 00 00 00 00 00 00 00 00 ................#012 (g-io-error-quark, 0) [x6]
Jul 31 00:34:42 strawberry smartd[5314]: Device: /dev/sda [SAT], failed to read SMART Attribute Data [x2]
Jul 31 01:04:42 strawberry smartd[5314]: Device: /dev/sda [SAT], not capable of Offline or Self-Testing.
== submit10-cln25 (3 distinct, 4 total) ==
Jul 31 00:10:11 submit10-cln25 systemd: New main PID 30870 does not belong to service, and PID file is not owned by root. Refusing. [x2]
Jul 31 00:10:30 submit10-cln25 systemd: Daemon never wrote its PID file. Failing.
Jul 31 00:10:36 submit10-cln25 systemd: pmlogger.service: Supervising process 5407 which is not our child. We'll most likely not notice when it exits.
== submit26-b9-2 (24 distinct, 26 total) ==
Jul 31 00:05:06 submit26-b9-2 systemd[1]: user(a)1001.service: Main process exited, code=killed, status=9/KILL [x3]
Jul 31 00:05:07 submit26-b9-2 systemd-coredump[682854]: Process 682851 (d8sh) of user 1001 dumped core.#012#012Stack trace of thread 682851:#012#0 0x000000000040144c execute (d8sh + 0x144c)#012#1 0x00000000004035d3 yyparse (d8sh + 0x35d3)#012#2 0x000000000040156c main (d8sh + 0x156c)#012#3 0x00007fdfa8a2a610 __libc_start_call_main (libc.so.6 + 0x2a610)#012#4 0x00007fdfa8a2a6c0 __libc_start_main@@GLIBC_2.34 (libc.so.6 + 0x2a6c0)#012#5 0x0000000000401225 _start (d8sh + 0x1225)#012ELF object binary architecture: AMD x86-64
Jul 31 00:05:07 submit26-b9-2 systemd-coredump[682865]: Process 682862 (d8sh) of user 1001 dumped core.#012#012Stack trace of thread 682862:#012#0 0x000000000040144c execute (d8sh + 0x144c)#012#1 0x00000000004035d3 yyparse (d8sh + 0x35d3)#012#2 0x000000000040156c main (d8sh + 0x156c)#012#3 0x00007fb5d3c2a610 __libc_start_call_main (libc.so.6 + 0x2a610)#012#4 0x00007fb5d3c2a6c0 __libc_start_main@@GLIBC_2.34 (libc.so.6 + 0x2a6c0)#012#5 0x0000000000401225 _start (d8sh + 0x1225)#012ELF object binary architecture: AMD x86-64
Jul 31 00:05:07 submit26-b9-2 systemd-coredump[682875]: Process 682872 (d8sh) of user 1001 dumped core.#012#012Stack trace of thread 682872:#012#0 0x000000000040144c execute (d8sh + 0x144c)#012#1 0x00000000004035d3 yyparse (d8sh + 0x35d3)#012#2 0x000000000040156c main (d8sh + 0x156c)#012#3 0x00007fdc65c2a610 __libc_start_call_main (libc.so.6 + 0x2a610)#012#4 0x00007fdc65c2a6c0 __libc_start_main@@GLIBC_2.34 (libc.so.6 + 0x2a6c0)#012#5 0x0000000000401225 _start (d8sh + 0x1225)#012ELF object binary architecture: AMD x86-64
Jul 31 00:05:08 submit26-b9-2 systemd-coredump[682901]: Process 682898 (d8sh) of user 1001 dumped core.#012#012Stack trace of thread 682898:#012#0 0x000000000040144c execute (d8sh + 0x144c)#012#1 0x00000000004035d3 yyparse (d8sh + 0x35d3)#012#2 0x000000000040156c main (d8sh + 0x156c)#012#3 0x00007ff49262a610 __libc_start_call_main (libc.so.6 + 0x2a610)#012#4 0x00007ff49262a6c0 __libc_start_main@@GLIBC_2.34 (libc.so.6 + 0x2a6c0)#012#5 0x0000000000401225 _start (d8sh + 0x1225)#012ELF object binary architecture: AMD x86-64
Jul 31 00:05:08 submit26-b9-2 systemd-coredump[682911]: Process 682909 (d8sh) of user 1001 dumped core.#012#012Stack trace of thread 682909:#012#0 0x000000000040144c execute (d8sh + 0x144c)#012#1 0x0000000000401340 execute (d8sh + 0x1340)#012#2 0x00000000004035d3 yyparse (d8sh + 0x35d3)#012#3 0x000000000040156c main (d8sh + 0x156c)#012#4 0x00007f141f22a610 __libc_start_call_main (libc.so.6 + 0x2a610)#012#5 0x00007f141f22a6c0 __libc_start_main@@GLIBC_2.34 (libc.so.6 + 0x2a6c0)#012#6 0x0000000000401225 _start (d8sh + 0x1225)#012ELF object binary architecture: AMD x86-64
Jul 31 00:05:08 submit26-b9-2 systemd-coredump[682928]: Process 682925 (d8sh) of user 1001 dumped core.#012#012Stack trace of thread 682925:#012#0 0x000000000040144c execute (d8sh + 0x144c)#012#1 0x00000000004035d3 yyparse (d8sh + 0x35d3)#012#2 0x000000000040156c main (d8sh + 0x156c)#012#3 0x00007f67ea02a610 __libc_start_call_main (libc.so.6 + 0x2a610)#012#4 0x00007f67ea02a6c0 __libc_start_main@@GLIBC_2.34 (libc.so.6 + 0x2a6c0)#012#5 0x0000000000401225 _start (d8sh + 0x1225)#012ELF object binary architecture: AMD x86-64
Jul 31 00:05:08 submit26-b9-2 systemd-coredump[682938]: Process 682935 (d8sh) of user 1001 dumped core.#012#012Stack trace of thread 682935:#012#0 0x000000000040144c execute (d8sh + 0x144c)#012#1 0x00000000004035d3 yyparse (d8sh + 0x35d3)#012#2 0x000000000040156c main (d8sh + 0x156c)#012#3 0x00007ffaaa42a610 __libc_start_call_main (libc.so.6 + 0x2a610)#012#4 0x00007ffaaa42a6c0 __libc_start_main@@GLIBC_2.34 (libc.so.6 + 0x2a6c0)#012#5 0x0000000000401225 _start (d8sh + 0x1225)#012ELF object binary architecture: AMD x86-64
Jul 31 00:05:09 submit26-b9-2 systemd-coredump[682948]: Process 682945 (d8sh) of user 1001 dumped core.#012#012Stack trace of thread 682945:#012#0 0x000000000040144c execute (d8sh + 0x144c)#012#1 0x00000000004035d3 yyparse (d8sh + 0x35d3)#012#2 0x000000000040156c main (d8sh + 0x156c)#012#3 0x00007f3d53e2a610 __libc_start_call_main (libc.so.6 + 0x2a610)#012#4 0x00007f3d53e2a6c0 __libc_start_main@@GLIBC_2.34 (libc.so.6 + 0x2a6c0)#012#5 0x0000000000401225 _start (d8sh + 0x1225)#012ELF object binary architecture: AMD x86-64
Jul 31 00:05:09 submit26-b9-2 systemd-coredump[682958]: Process 682955 (d8sh) of user 1001 dumped core.#012#012Stack trace of thread 682955:#012#0 0x000000000040144c execute (d8sh + 0x144c)#012#1 0x00000000004035d3 yyparse (d8sh + 0x35d3)#012#2 0x000000000040156c main (d8sh + 0x156c)#012#3 0x00007f521a62a610 __libc_start_call_main (libc.so.6 + 0x2a610)#012#4 0x00007f521a62a6c0 __libc_start_main@@GLIBC_2.34 (libc.so.6 + 0x2a6c0)#012#5 0x0000000000401225 _start (d8sh + 0x1225)#012ELF object binary architecture: AMD x86-64
Jul 31 00:05:09 submit26-b9-2 systemd-coredump[682968]: Process 682965 (d8sh) of user 1001 dumped core.#012#012Stack trace of thread 682965:#012#0 0x000000000040144c execute (d8sh + 0x144c)#012#1 0x00000000004035d3 yyparse (d8sh + 0x35d3)#012#2 0x000000000040156c main (d8sh + 0x156c)#012#3 0x00007f8446c2a610 __libc_start_call_main (libc.so.6 + 0x2a610)#012#4 0x00007f8446c2a6c0 __libc_start_main@@GLIBC_2.34 (libc.so.6 + 0x2a6c0)#012#5 0x0000000000401225 _start (d8sh + 0x1225)#012ELF object binary architecture: AMD x86-64
Jul 31 00:05:09 submit26-b9-2 systemd-coredump[682983]: Process 682980 (d8sh) of user 1001 dumped core.#012#012Stack trace of thread 682980:#012#0 0x000000000040144c execute (d8sh + 0x144c)#012#1 0x00000000004035d3 yyparse (d8sh + 0x35d3)#012#2 0x000000000040156c main (d8sh + 0x156c)#012#3 0x00007fc59b22a610 __libc_start_call_main (libc.so.6 + 0x2a610)#012#4 0x00007fc59b22a6c0 __libc_start_main@@GLIBC_2.34 (libc.so.6 + 0x2a6c0)#012#5 0x0000000000401225 _start (d8sh + 0x1225)#012ELF object binary architecture: AMD x86-64
Jul 31 00:05:10 submit26-b9-2 systemd-coredump[683012]: Process 683009 (d8sh) of user 1001 dumped core.#012#012Stack trace of thread 683009:#012#0 0x000000000040144c execute (d8sh + 0x144c)#012#1 0x00000000004035d3 yyparse (d8sh + 0x35d3)#012#2 0x000000000040156c main (d8sh + 0x156c)#012#3 0x00007fab0722a610 __libc_start_call_main (libc.so.6 + 0x2a610)#012#4 0x00007fab0722a6c0 __libc_start_main@@GLIBC_2.34 (libc.so.6 + 0x2a6c0)#012#5 0x0000000000401225 _start (d8sh + 0x1225)#012ELF object binary architecture: AMD x86-64
Jul 31 00:05:10 submit26-b9-2 systemd-coredump[683023]: Process 683020 (d8sh) of user 1001 dumped core.#012#012Stack trace of thread 683020:#012#0 0x000000000040144c execute (d8sh + 0x144c)#012#1 0x00000000004035d3 yyparse (d8sh + 0x35d3)#012#2 0x000000000040156c main (d8sh + 0x156c)#012#3 0x00007ff83f02a610 __libc_start_call_main (libc.so.6 + 0x2a610)#012#4 0x00007ff83f02a6c0 __libc_start_main@@GLIBC_2.34 (libc.so.6 + 0x2a6c0)#012#5 0x0000000000401225 _start (d8sh + 0x1225)#012ELF object binary architecture: AMD x86-64
Jul 31 00:05:10 submit26-b9-2 systemd-coredump[683034]: Process 683030 (d8sh) of user 1001 dumped core.#012#012Stack trace of thread 683030:#012#0 0x000000000040144c execute (d8sh + 0x144c)#012#1 0x000000000040131e execute (d8sh + 0x131e)#012#2 0x00000000004035d3 yyparse (d8sh + 0x35d3)#012#3 0x000000000040156c main (d8sh + 0x156c)#012#4 0x00007f9cf942a610 __libc_start_call_main (libc.so.6 + 0x2a610)#012#5 0x00007f9cf942a6c0 __libc_start_main@@GLIBC_2.34 (libc.so.6 + 0x2a6c0)#012#6 0x0000000000401225 _start (d8sh + 0x1225)#012ELF object binary architecture: AMD x86-64
Jul 31 00:05:11 submit26-b9-2 systemd-coredump[683058]: Process 683055 (d8sh) of user 1001 dumped core.#012#012Stack trace of thread 683055:#012#0 0x000000000040144c execute (d8sh + 0x144c)#012#1 0x00000000004035d3 yyparse (d8sh + 0x35d3)#012#2 0x000000000040156c main (d8sh + 0x156c)#012#3 0x00007fe4bdc2a610 __libc_start_call_main (libc.so.6 + 0x2a610)#012#4 0x00007fe4bdc2a6c0 __libc_start_main@@GLIBC_2.34 (libc.so.6 + 0x2a6c0)#012#5 0x0000000000401225 _start (d8sh + 0x1225)#012ELF object binary architecture: AMD x86-64
Jul 31 00:05:11 submit26-b9-2 systemd-coredump[683068]: Process 683065 (d8sh) of user 1001 dumped core.#012#012Stack trace of thread 683065:#012#0 0x000000000040144c execute (d8sh + 0x144c)#012#1 0x00000000004035d3 yyparse (d8sh + 0x35d3)#012#2 0x000000000040156c main (d8sh + 0x156c)#012#3 0x00007fcd04a2a610 __libc_start_call_main (libc.so.6 + 0x2a610)#012#4 0x00007fcd04a2a6c0 __libc_start_main@@GLIBC_2.34 (libc.so.6 + 0x2a6c0)#012#5 0x0000000000401225 _start (d8sh + 0x1225)#012ELF object binary architecture: AMD x86-64
Jul 31 00:05:11 submit26-b9-2 systemd-coredump[683083]: Process 683080 (d8sh) of user 1001 dumped core.#012#012Stack trace of thread 683080:#012#0 0x000000000040144c execute (d8sh + 0x144c)#012#1 0x00000000004035d3 yyparse (d8sh + 0x35d3)#012#2 0x000000000040156c main (d8sh + 0x156c)#012#3 0x00007f89e1a2a610 __libc_start_call_main (libc.so.6 + 0x2a610)#012#4 0x00007f89e1a2a6c0 __libc_start_main@@GLIBC_2.34 (libc.so.6 + 0x2a6c0)#012#5 0x0000000000401225 _start (d8sh + 0x1225)#012ELF object binary architecture: AMD x86-64
Jul 31 00:05:11 submit26-b9-2 systemd-coredump[683093]: Process 683090 (d8sh) of user 1001 dumped core.#012#012Stack trace of thread 683090:#012#0 0x000000000040144c execute (d8sh + 0x144c)#012#1 0x00000000004035d3 yyparse (d8sh + 0x35d3)#012#2 0x000000000040156c main (d8sh + 0x156c)#012#3 0x00007fe5fbc2a610 __libc_start_call_main (libc.so.6 + 0x2a610)#012#4 0x00007fe5fbc2a6c0 __libc_start_main@@GLIBC_2.34 (libc.so.6 + 0x2a6c0)#012#5 0x0000000000401225 _start (d8sh + 0x1225)#012ELF object binary architecture: AMD x86-64
Jul 31 00:05:12 submit26-b9-2 systemd-coredump[683126]: Process 683123 (d8sh) of user 1001 dumped core.#012#012Stack trace of thread 683123:#012#0 0x000000000040144c execute (d8sh + 0x144c)#012#1 0x00000000004035d3 yyparse (d8sh + 0x35d3)#012#2 0x000000000040156c main (d8sh + 0x156c)#012#3 0x00007f848402a610 __libc_start_call_main (libc.so.6 + 0x2a610)#012#4 0x00007f848402a6c0 __libc_start_main@@GLIBC_2.34 (libc.so.6 + 0x2a6c0)#012#5 0x0000000000401225 _start (d8sh + 0x1225)#012ELF object binary architecture: AMD x86-64
Jul 31 00:05:12 submit26-b9-2 systemd-coredump[683137]: Process 683134 (d8sh) of user 1001 dumped core.#012#012Stack trace of thread 683134:#012#0 0x000000000040144c execute (d8sh + 0x144c)#012#1 0x0000000000401340 execute (d8sh + 0x1340)#012#2 0x00000000004035d3 yyparse (d8sh + 0x35d3)#012#3 0x000000000040156c main (d8sh + 0x156c)#012#4 0x00007f1e1d42a610 __libc_start_call_main (libc.so.6 + 0x2a610)#012#5 0x00007f1e1d42a6c0 __libc_start_main@@GLIBC_2.34 (libc.so.6 + 0x2a6c0)#012#6 0x0000000000401225 _start (d8sh + 0x1225)#012ELF object binary architecture: AMD x86-64
Jul 31 00:05:12 submit26-b9-2 kernel: show_signal_msg: 10 callbacks suppressed
Jul 31 00:05:12 submit26-b9-2 systemd-coredump[683148]: Process 683145 (d8sh) of user 1001 dumped core.#012#012Stack trace of thread 683145:#012#0 0x000000000040144c execute (d8sh + 0x144c)#012#1 0x00000000004035d3 yyparse (d8sh + 0x35d3)#012#2 0x000000000040156c main (d8sh + 0x156c)#012#3 0x00007fa4d182a610 __libc_start_call_main (libc.so.6 + 0x2a610)#012#4 0x00007fa4d182a6c0 __libc_start_main@@GLIBC_2.34 (libc.so.6 + 0x2a6c0)#012#5 0x0000000000401225 _start (d8sh + 0x1225)#012ELF object binary architecture: AMD x86-64
Jul 31 00:05:12 submit26-b9-2 systemd-coredump[683159]: Process 683156 (d8sh) of user 1001 dumped core.#012#012Stack trace of thread 683156:#012#0 0x000000000040144c execute (d8sh + 0x144c)#012#1 0x00000000004035d3 yyparse (d8sh + 0x35d3)#012#2 0x000000000040156c main (d8sh + 0x156c)#012#3 0x00007f63fae2a610 __libc_start_call_main (libc.so.6 + 0x2a610)#012#4 0x00007f63fae2a6c0 __libc_start_main@@GLIBC_2.34 (libc.so.6 + 0x2a6c0)#012#5 0x0000000000401225 _start (d8sh + 0x1225)#012ELF object binary architecture: AMD x86-64
== submit26-b9-4 (10 distinct, 13 total) ==
Jul 31 00:13:06 submit26-b9-4 systemd[1]: user(a)1001.service: Main process exited, code=killed, status=9/KILL [x4]
Jul 31 00:15:27 submit26-b9-4 setroubleshoot[685009]: SELinux is preventing /usr/bin/python3.9 from create access on the directory /(null). For complete SELinux messages run: sealert -l a4e66030-8621-4da9-bd27-5988bb1bf8ad
Jul 31 00:15:27 submit26-b9-4 setroubleshoot[685009]: SELinux is preventing /usr/bin/python3.9 from add_name access on the directory /(null). For complete SELinux messages run: sealert -l c055e37d-bbf5-4800-9083-d606f792c8c1
Jul 31 00:15:27 submit26-b9-4 setroubleshoot[685009]: SELinux is preventing /usr/bin/python3.9 from create access on the file /(null). For complete SELinux messages run: sealert -l e5bc3a56-6d6f-4776-954f-ddde1579648f
Jul 31 00:15:27 submit26-b9-4 setroubleshoot[685009]: SELinux is preventing /usr/bin/python3.9 from open access on the file /tmp/libdnf.Jp14bN/repodata/repomd.xml. For complete SELinux messages run: sealert -l a8ec5e1b-49f9-4fbc-a8ae-22e800f7abf2
Jul 31 00:15:27 submit26-b9-4 setroubleshoot[685009]: SELinux is preventing /usr/bin/python3.9 from setattr access on the file repomd.xml. For complete SELinux messages run: sealert -l 945db714-d0c0-4402-911e-932978b8b036
Jul 31 00:15:27 submit26-b9-4 setroubleshoot[685009]: SELinux is preventing /usr/bin/python3.9 from read access on the directory libdnf.Jp14bN. For complete SELinux messages run: sealert -l 463998a0-fb0d-463c-82b1-471135710a14
Jul 31 00:15:27 submit26-b9-4 setroubleshoot[685009]: SELinux is preventing /usr/bin/python3.9 from remove_name access on the directory repomd.xml. For complete SELinux messages run: sealert -l 473d2e21-15d8-407a-a9ee-2b842607fa00
Jul 31 00:15:27 submit26-b9-4 setroubleshoot[685009]: SELinux is preventing /usr/bin/python3.9 from unlink access on the file repomd.xml. For complete SELinux messages run: sealert -l 80c54d4f-bf4b-4501-addb-1627383587d0
Jul 31 00:15:27 submit26-b9-4 setroubleshoot[685009]: SELinux is preventing /usr/bin/python3.9 from rmdir access on the directory repodata. For complete SELinux messages run: sealert -l c63d3890-151e-49a0-83f0-3dfb69d051e5
== tma-0 (3 distinct, 4 total) ==
Jul 31 00:10:13 tma-0 systemd[1]: New main PID 27713 does not belong to service, and PID file is not owned by root. Refusing. [x2]
Jul 31 00:10:30 tma-0 systemd[1]: Daemon never wrote its PID file. Failing.
Jul 31 00:10:38 tma-0 systemd[1]: pmlogger.service: Supervising process 3017 which is not our child. We'll most likely not notice when it exits.
== uffish.cs.umd.edu (3 distinct, 4 total) ==
Jul 31 00:10:13 uffish.cs.umd.edu systemd[1]: New main PID 4060206 does not belong to service, and PID file is not owned by root. Refusing. [x2]
Jul 31 00:10:35 uffish.cs.umd.edu systemd[1]: Daemon never wrote its PID file. Failing.
Jul 31 00:10:53 uffish.cs.umd.edu systemd[1]: pmlogger.service: Supervising process 4067800 which is not our child. We'll most likely not notice when it exits.
== updates00.cs.umd.edu (3 distinct, 4 total) ==
Jul 31 00:10:17 updates00.cs.umd.edu systemd[1]: New main PID 5938 does not belong to service, and PID file is not owned by root. Refusing. [x2]
Jul 31 00:10:35 updates00.cs.umd.edu systemd[1]: Daemon never wrote its PID file. Failing.
Jul 31 00:10:41 updates00.cs.umd.edu systemd[1]: pmlogger.service: Supervising process 12935 which is not our child. We'll most likely not notice when it exits.
== vacuum.cs.umd.edu (3 distinct, 4 total) ==
Jul 31 00:10:15 vacuum.cs.umd.edu systemd[1]: New main PID 23056 does not belong to service, and PID file is not owned by root. Refusing. [x2]
Jul 31 00:10:33 vacuum.cs.umd.edu systemd[1]: Daemon never wrote its PID file. Failing.
Jul 31 00:10:45 vacuum.cs.umd.edu systemd[1]: pmlogger.service: Supervising process 30693 which is not our child. We'll most likely not notice when it exits.
== whiffle.cs.umd.edu (3 distinct, 4 total) ==
Jul 31 00:10:14 whiffle.cs.umd.edu systemd[1]: New main PID 3883748 does not belong to service, and PID file is not owned by root. Refusing. [x2]
Jul 31 00:10:40 whiffle.cs.umd.edu systemd[1]: Daemon never wrote its PID file. Failing.
Jul 31 00:10:53 whiffle.cs.umd.edu systemd[1]: pmlogger.service: Supervising process 3891033 which is not our child. We'll most likely not notice when it exits.
1
0
Command: /usr/local/sbin/syslog-digest.py
Time : 0.7758s
Status : exited 0
Output :
Syslog digest — 2026-07-31 00:05 EDT
Processed 5,581 lines, filtered 4,305 (77%). 1,276 unknown (410 distinct) from 58 host(s).
== abadi-computer (2 distinct, 2 total) ==
Jul 30 23:34:29 abadi-computer falcon-sensor-bpf[529]: CrowdStrike(4): Could not retrieve DisableProxy value: c0000225
Jul 30 23:34:29 abadi-computer falcon-sensor-bpf[529]: CrowdStrike(4): ConnectWithProxy: Unable to get application proxy host from CsConfig: c0000225
== abuse (1 distinct, 348 total) ==
Jul 30 23:05:06 abuse rsyslogd[21745]: imjournal: open() failed for path: '/var/lib/rsyslog/imjournal.state.tmp': Input/output error [v8.2404.0 try https://www.rsyslog.com/e/2433 ] [x348]
== ai-course (2 distinct, 2 total) ==
Jul 30 23:17:46 ai-course falcon-sensor-bpf[1913210]: CrowdStrike(4): Could not retrieve DisableProxy value: c0000225
Jul 30 23:17:46 ai-course falcon-sensor-bpf[1913210]: CrowdStrike(4): ConnectWithProxy: Unable to get application proxy host from CsConfig: c0000225
== alec.cs.umd.edu (3 distinct, 61 total) ==
Jul 30 23:05:32 alec.cs.umd.edu setroubleshoot[684390]: failed to retrieve rpm info for path '/run/netns/netns-9dfd0347-71eb-5698-085c-c769043aa5c3': [x12]
Jul 30 23:05:33 alec.cs.umd.edu sedispatch[1526]: AVC Message regarding setroubleshoot, ignoring message [x24]
Jul 30 23:05:33 alec.cs.umd.edu setroubleshoot[684390]: SELinux is preventing /usr/bin/df from getattr access on the file /run/netns/netns-9dfd0347-71eb-5698-085c-c769043aa5c3. For complete SELinux messages run: sealert -l 23f93208-3063-4aac-b78a-bb0fcb40740c [x25]
== atif01.cs.umd.edu (78 distinct, 152 total) ==
Jul 30 23:42:54 atif01.cs.umd.edu kernel: net_ratelimit: 14 callbacks suppressed
Jul 30 23:43:13 atif01.cs.umd.edu kernel: net_ratelimit: 10 callbacks suppressed
Jul 30 23:46:24 atif01.cs.umd.edu sshd[51619]: error: maximum authentication attempts exceeded for root from 85.185.54.139 port 12101 ssh2 [preauth]
Jul 30 23:46:24 atif01.cs.umd.edu sshd[51619]: PAM service(sshd) ignoring max retries; 6 > 3 [x75]
Jul 30 23:46:38 atif01.cs.umd.edu sshd[51635]: error: maximum authentication attempts exceeded for root from 85.185.54.139 port 57900 ssh2 [preauth]
Jul 30 23:46:52 atif01.cs.umd.edu sshd[51653]: error: maximum authentication attempts exceeded for root from 85.185.54.139 port 18171 ssh2 [preauth]
Jul 30 23:47:06 atif01.cs.umd.edu sshd[51661]: error: maximum authentication attempts exceeded for root from 85.185.54.139 port 52196 ssh2 [preauth]
Jul 30 23:47:22 atif01.cs.umd.edu sshd[51671]: error: maximum authentication attempts exceeded for root from 85.185.54.139 port 26593 ssh2 [preauth]
Jul 30 23:47:38 atif01.cs.umd.edu sshd[51689]: error: maximum authentication attempts exceeded for root from 85.185.54.139 port 29649 ssh2 [preauth]
Jul 30 23:47:53 atif01.cs.umd.edu sshd[51697]: error: maximum authentication attempts exceeded for root from 85.185.54.139 port 52550 ssh2 [preauth]
Jul 30 23:48:09 atif01.cs.umd.edu sshd[51709]: error: maximum authentication attempts exceeded for root from 85.185.54.139 port 5377 ssh2 [preauth]
Jul 30 23:48:25 atif01.cs.umd.edu sshd[51719]: error: maximum authentication attempts exceeded for root from 85.185.54.139 port 64194 ssh2 [preauth]
Jul 30 23:48:41 atif01.cs.umd.edu sshd[51737]: error: maximum authentication attempts exceeded for root from 85.185.54.139 port 52788 ssh2 [preauth]
Jul 30 23:48:57 atif01.cs.umd.edu sshd[51746]: error: maximum authentication attempts exceeded for root from 85.185.54.139 port 16653 ssh2 [preauth]
Jul 30 23:49:12 atif01.cs.umd.edu sshd[51756]: error: maximum authentication attempts exceeded for root from 85.185.54.139 port 64638 ssh2 [preauth]
Jul 30 23:49:28 atif01.cs.umd.edu sshd[51766]: error: maximum authentication attempts exceeded for root from 85.185.54.139 port 23951 ssh2 [preauth]
Jul 30 23:49:42 atif01.cs.umd.edu sshd[51782]: error: maximum authentication attempts exceeded for root from 85.185.54.139 port 58174 ssh2 [preauth]
Jul 30 23:49:58 atif01.cs.umd.edu sshd[51792]: error: maximum authentication attempts exceeded for root from 85.185.54.139 port 64408 ssh2 [preauth]
Jul 30 23:50:12 atif01.cs.umd.edu sshd[51802]: error: maximum authentication attempts exceeded for root from 85.185.54.139 port 53154 ssh2 [preauth]
Jul 30 23:50:27 atif01.cs.umd.edu sshd[51821]: error: maximum authentication attempts exceeded for root from 85.185.54.139 port 57622 ssh2 [preauth]
Jul 30 23:50:43 atif01.cs.umd.edu sshd[51842]: error: maximum authentication attempts exceeded for root from 85.185.54.139 port 64858 ssh2 [preauth]
Jul 30 23:51:00 atif01.cs.umd.edu sshd[51850]: error: maximum authentication attempts exceeded for root from 85.185.54.139 port 14057 ssh2 [preauth]
Jul 30 23:51:14 atif01.cs.umd.edu sshd[51863]: error: maximum authentication attempts exceeded for root from 85.185.54.139 port 59146 ssh2 [preauth]
Jul 30 23:51:28 atif01.cs.umd.edu sshd[51879]: error: maximum authentication attempts exceeded for root from 85.185.54.139 port 49270 ssh2 [preauth]
Jul 30 23:51:41 atif01.cs.umd.edu sshd[51889]: error: maximum authentication attempts exceeded for root from 85.185.54.139 port 25581 ssh2 [preauth]
Jul 30 23:51:55 atif01.cs.umd.edu sshd[51905]: error: maximum authentication attempts exceeded for root from 85.185.54.139 port 58946 ssh2 [preauth]
Jul 30 23:52:09 atif01.cs.umd.edu sshd[51915]: error: maximum authentication attempts exceeded for root from 85.185.54.139 port 32131 ssh2 [preauth]
Jul 30 23:52:23 atif01.cs.umd.edu sshd[51925]: error: maximum authentication attempts exceeded for root from 85.185.54.139 port 53356 ssh2 [preauth]
Jul 30 23:52:38 atif01.cs.umd.edu sshd[51941]: error: maximum authentication attempts exceeded for root from 85.185.54.139 port 58484 ssh2 [preauth]
Jul 30 23:52:51 atif01.cs.umd.edu sshd[51954]: error: maximum authentication attempts exceeded for root from 85.185.54.139 port 65004 ssh2 [preauth]
... 48 more distinct messages not shown
== b0b02.cs.umd.edu (1 distinct, 1 total) ==
Jul 30 23:38:23 b0b02.cs.umd.edu rustdesk[1196461]: cannot open display:
== bac102 (1 distinct, 1 total) ==
Jul 30 23:44:22 bac102 systemd-resolved[902]: Using degraded feature set UDP instead of UDP+EDNS0 for DNS server 10.73.244.100.
== biggulp.cs.umd.edu (3 distinct, 3 total) ==
Jul 30 23:21:29 biggulp.cs.umd.edu falcon-sensor-bpf[834]: CrowdStrike(4): Could not retrieve DisableProxy value: c0000225
Jul 30 23:21:29 biggulp.cs.umd.edu falcon-sensor-bpf[834]: CrowdStrike(4): ConnectWithProxy: Unable to get application proxy host from CsConfig: c0000225
Jul 31 00:01:22 biggulp.cs.umd.edu sshd-session[1695147]: pam_access(sshd:auth): access denied for user `larry' from `71.191.93.172'
== bigtuna (2 distinct, 2 total) ==
Jul 30 23:31:10 bigtuna falcon-sensor-bpf[874]: CrowdStrike(4): Could not retrieve DisableProxy value: c0000225
Jul 30 23:31:10 bigtuna falcon-sensor-bpf[874]: CrowdStrike(4): ConnectWithProxy: Unable to get application proxy host from CsConfig: c0000225
== borealis (2 distinct, 2 total) ==
Jul 30 23:38:24 borealis falcon-sensor-bpf[921]: CrowdStrike(4): Could not retrieve DisableProxy value: c0000225
Jul 30 23:38:24 borealis falcon-sensor-bpf[921]: CrowdStrike(4): ConnectWithProxy: Unable to get application proxy host from CsConfig: c0000225
== borogove.cs.umd.edu (2 distinct, 2 total) ==
Jul 30 23:24:37 borogove.cs.umd.edu falcon-sensor-bpf[1394]: CrowdStrike(4): Could not retrieve DisableProxy value: c0000225
Jul 30 23:24:37 borogove.cs.umd.edu falcon-sensor-bpf[1394]: CrowdStrike(4): ConnectWithProxy: Unable to get application proxy host from CsConfig: c0000225
== cheezit.cs.umd.edu (3 distinct, 3 total) ==
Jul 30 23:15:12 cheezit.cs.umd.edu sshd-session[3598791]: error: send_error: write: Connection reset by peer
Jul 30 23:30:21 cheezit.cs.umd.edu falcon-sensor-bpf[1347]: CrowdStrike(4): Could not retrieve DisableProxy value: c0000225
Jul 30 23:30:21 cheezit.cs.umd.edu falcon-sensor-bpf[1347]: CrowdStrike(4): ConnectWithProxy: Unable to get application proxy host from CsConfig: c0000225
== contest (1 distinct, 34 total) ==
Jul 30 23:05:23 contest goferd[1007]: [ERROR][worker-0] gofer.messaging.adapter.connect:33 - connect: proton+amqps://satellite8.cs.umd.edu:5647, failed: Connection amqps://satellite8.cs.umd.edu:5647 disconnected: Condition('proton.pythonio', 'Connection refused to all addresses') [x34]
== csfw00a (1 distinct, 254 total) ==
Jul 30 23:04:36 csfw00a kernel: bnxt_en 0000:09:00.0 eth3: NIC Link is Down [x254]
== cskayako (2 distinct, 2 total) ==
Jul 30 23:11:18 cskayako falcon-sensor-bpf[746]: CrowdStrike(4): Could not retrieve DisableProxy value: c0000225
Jul 30 23:11:18 cskayako falcon-sensor-bpf[746]: CrowdStrike(4): ConnectWithProxy: Unable to get application proxy host from CsConfig: c0000225
== defer (2 distinct, 2 total) ==
Jul 30 23:21:20 defer falcon-sensor-bpf[811]: CrowdStrike(4): Could not retrieve DisableProxy value: c0000225
Jul 30 23:21:20 defer falcon-sensor-bpf[811]: CrowdStrike(4): ConnectWithProxy: Unable to get application proxy host from CsConfig: c0000225
== dojo (2 distinct, 2 total) ==
Jul 30 23:36:02 dojo falcon-sensor-bpf[505751]: CrowdStrike(4): Could not retrieve DisableProxy value: c0000225
Jul 30 23:36:02 dojo falcon-sensor-bpf[505751]: CrowdStrike(4): ConnectWithProxy: Unable to get application proxy host from CsConfig: c0000225
== emaar (2 distinct, 2 total) ==
Jul 30 23:28:42 emaar falcon-sensor-bpf[971]: CrowdStrike(4): Could not retrieve DisableProxy value: c0000225
Jul 30 23:28:42 emaar falcon-sensor-bpf[971]: CrowdStrike(4): ConnectWithProxy: Unable to get application proxy host from CsConfig: c0000225
== frabjous (2 distinct, 2 total) ==
Jul 30 23:36:21 frabjous falcon-sensor-bpf[1357]: CrowdStrike(4): Could not retrieve DisableProxy value: c0000225
Jul 30 23:36:21 frabjous falcon-sensor-bpf[1357]: CrowdStrike(4): ConnectWithProxy: Unable to get application proxy host from CsConfig: c0000225
== frozone (2 distinct, 2 total) ==
Jul 30 23:29:25 frozone falcon-sensor-bpf[1052]: CrowdStrike(4): Could not retrieve DisableProxy value: c0000225
Jul 30 23:29:25 frozone falcon-sensor-bpf[1052]: CrowdStrike(4): ConnectWithProxy: Unable to get application proxy host from CsConfig: c0000225
== galahad.cs.umd.edu (2 distinct, 2 total) ==
Jul 30 23:28:31 galahad.cs.umd.edu falcon-sensor-bpf[970]: CrowdStrike(4): Could not retrieve DisableProxy value: c0000225
Jul 30 23:28:31 galahad.cs.umd.edu falcon-sensor-bpf[970]: CrowdStrike(4): ConnectWithProxy: Unable to get application proxy host from CsConfig: c0000225
== gle-omnibus00.cs.umd.edu (2 distinct, 2 total) ==
Jul 30 23:23:08 gle-omnibus00.cs.umd.edu falcon-sensor-bpf[974]: CrowdStrike(4): Could not retrieve DisableProxy value: c0000225
Jul 30 23:23:08 gle-omnibus00.cs.umd.edu falcon-sensor-bpf[974]: CrowdStrike(4): ConnectWithProxy: Unable to get application proxy host from CsConfig: c0000225
== hackerman (9 distinct, 14 total) ==
Jul 30 23:19:01 hackerman gnome-software[2060381]: failed to commit changes to dconf: GDBus.Error:org.gtk.GDBus.UnmappedGError.Quark._g_2dfile_2derror_2dquark.Code2: Failed to create file “/adminhomes/sajith/.config/dconf/user.MOBUS3”: Permission denied
Jul 30 23:20:04 hackerman gnome-software[2060381]: can't reliably fixup error code 4 in domain g-io-error-quark: Not a directory [x4]
Jul 30 23:20:12 hackerman gnome-software[2060381]: Only 0 apps for recent list, hiding
Jul 30 23:20:29 hackerman gnome-software[2060381]: failed to commit changes to dconf: GDBus.Error:org.gtk.GDBus.UnmappedGError.Quark._g_2dfile_2derror_2dquark.Code2: Failed to create file “/adminhomes/sajith/.config/dconf/user.BXJBT3”: Permission denied
Jul 30 23:20:29 hackerman packagekitd[2307281]: Failed to get cache filename for libreoffice [x2]
Jul 30 23:20:29 hackerman packagekitd[2307281]: Failed to get cache filename for kernel [x2]
Jul 30 23:20:38 hackerman packagekitd[2307281]: failed to parse public key for /etc/pki/rpm-gpg/RPM-GPG-KEY-PQC-redhat-release
Jul 30 23:33:08 hackerman falcon-sensor-bpf[896]: CrowdStrike(4): Could not retrieve DisableProxy value: c0000225
Jul 30 23:33:08 hackerman falcon-sensor-bpf[896]: CrowdStrike(4): ConnectWithProxy: Unable to get application proxy host from CsConfig: c0000225
== haproxy02.cs.umd.edu (2 distinct, 2 total) ==
Jul 30 23:19:51 haproxy02.cs.umd.edu falcon-sensor-bpf[990]: CrowdStrike(4): Could not retrieve DisableProxy value: c0000225
Jul 30 23:19:51 haproxy02.cs.umd.edu falcon-sensor-bpf[990]: CrowdStrike(4): ConnectWithProxy: Unable to get application proxy host from CsConfig: c0000225
== haproxy03.cs.umd.edu (2 distinct, 2 total) ==
Jul 30 23:39:04 haproxy03.cs.umd.edu falcon-sensor-bpf[1401]: CrowdStrike(4): Could not retrieve DisableProxy value: c0000225
Jul 30 23:39:04 haproxy03.cs.umd.edu falcon-sensor-bpf[1401]: CrowdStrike(4): ConnectWithProxy: Unable to get application proxy host from CsConfig: c0000225
== hasaraumd (2 distinct, 2 total) ==
Jul 30 23:28:23 hasaraumd falcon-sensor-bpf[730]: CrowdStrike(4): Could not retrieve DisableProxy value: c0000225
Jul 30 23:28:23 hasaraumd falcon-sensor-bpf[730]: CrowdStrike(4): ConnectWithProxy: Unable to get application proxy host from CsConfig: c0000225
== hspc (2 distinct, 2 total) ==
Jul 30 23:33:53 hspc falcon-sensor-bpf[1008]: CrowdStrike(4): Could not retrieve DisableProxy value: c0000225
Jul 30 23:33:53 hspc falcon-sensor-bpf[1008]: CrowdStrike(4): ConnectWithProxy: Unable to get application proxy host from CsConfig: c0000225
== idm00 (1 distinct, 1 total) ==
Jul 30 23:51:12 idm00 named[1455]: client @0x7f33155af458 10.73.240.42#56180: update '73.10.in-addr.arpa/IN' denied
== idmp0 (1 distinct, 1 total) ==
Jul 30 23:36:02 idmp0 named[5198]: client @0x7f98e88b27f8 10.73.240.43#56935: update '73.10.in-addr.arpa/IN' denied
== irb2156 (2 distinct, 2 total) ==
Jul 30 23:27:21 irb2156 falcon-sensor-bpf[3727]: CrowdStrike(4): Could not retrieve DisableProxy value: c0000225
Jul 30 23:27:21 irb2156 falcon-sensor-bpf[3727]: CrowdStrike(4): ConnectWithProxy: Unable to get application proxy host from CsConfig: c0000225
== itmon02 (1 distinct, 34 total) ==
Jul 30 23:13:01 itmon02 sshd[1834]: error: beginning MaxStartups throttling [x34]
== jaws.cs.umd.edu (2 distinct, 2 total) ==
Jul 30 23:18:46 jaws.cs.umd.edu falcon-sensor-bpf[1195]: CrowdStrike(4): Could not retrieve DisableProxy value: c0000225
Jul 30 23:18:46 jaws.cs.umd.edu falcon-sensor-bpf[1195]: CrowdStrike(4): ConnectWithProxy: Unable to get application proxy host from CsConfig: c0000225
== kadath.cs.umd.edu (2 distinct, 2 total) ==
Jul 30 23:14:56 kadath.cs.umd.edu falcon-sensor-bpf[938]: CrowdStrike(4): Could not retrieve DisableProxy value: c0000225
Jul 30 23:14:56 kadath.cs.umd.edu falcon-sensor-bpf[938]: CrowdStrike(4): ConnectWithProxy: Unable to get application proxy host from CsConfig: c0000225
== krispykreme.cs.umd.edu (2 distinct, 2 total) ==
Jul 30 23:28:15 krispykreme.cs.umd.edu falcon-sensor-bpf[1296]: CrowdStrike(4): Could not retrieve DisableProxy value: c0000225
Jul 30 23:28:15 krispykreme.cs.umd.edu falcon-sensor-bpf[1296]: CrowdStrike(4): ConnectWithProxy: Unable to get application proxy host from CsConfig: c0000225
== mashie (2 distinct, 2 total) ==
Jul 30 23:21:50 mashie falcon-sensor-bpf[786]: CrowdStrike(4): Could not retrieve DisableProxy value: c0000225
Jul 30 23:21:50 mashie falcon-sensor-bpf[786]: CrowdStrike(4): ConnectWithProxy: Unable to get application proxy host from CsConfig: c0000225
== matrix (1 distinct, 1 total) ==
Jul 31 00:00:02 matrix (nin-node)[2320895]: munin-node.service: Referenced but unset environment variable evaluates to an empty string: DAEMON_ARGS
== neo-gizmonic (1 distinct, 1 total) ==
Jul 31 00:00:17 neo-gizmonic (nin-node)[59338]: munin-node.service: Referenced but unset environment variable evaluates to an empty string: DAEMON_ARGS
== neoavion (1 distinct, 1 total) ==
Jul 31 00:00:28 neoavion (nin-node)[2597001]: munin-node.service: Referenced but unset environment variable evaluates to an empty string: DAEMON_ARGS
== neodontcare.cs.umd.edu (2 distinct, 2 total) ==
Jul 30 23:37:44 neodontcare.cs.umd.edu falcon-sensor-bpf[950]: CrowdStrike(4): Could not retrieve DisableProxy value: c0000225
Jul 30 23:37:44 neodontcare.cs.umd.edu falcon-sensor-bpf[950]: CrowdStrike(4): ConnectWithProxy: Unable to get application proxy host from CsConfig: c0000225
== neograd (2 distinct, 2 total) ==
Jul 30 23:39:43 neograd falcon-sensor-bpf[697]: CrowdStrike(4): Could not retrieve DisableProxy value: c0000225
Jul 30 23:39:43 neograd falcon-sensor-bpf[697]: CrowdStrike(4): ConnectWithProxy: Unable to get application proxy host from CsConfig: c0000225
== netman.cs.umd.edu (3 distinct, 3 total) ==
Jul 30 23:19:11 netman.cs.umd.edu falcon-sensor-bpf[1129]: CrowdStrike(4): Could not retrieve DisableProxy value: c0000225
Jul 30 23:19:11 netman.cs.umd.edu falcon-sensor-bpf[1129]: CrowdStrike(4): ConnectWithProxy: Unable to get application proxy host from CsConfig: c0000225
Jul 30 23:52:22 netman.cs.umd.edu sshd[3090681]: error: PAM: Authentication failure for root from 14.153.241.162
== newhonors2 (2 distinct, 25 total) ==
Jul 30 23:13:03 newhonors2 dhcpcd[516773]: dhcpcd is not running [x24]
Jul 31 00:00:02 newhonors2 (nin-node)[518289]: munin-node.service: Referenced but unset environment variable evaluates to an empty string: DAEMON_ARGS
== nightingale (2 distinct, 2 total) ==
Jul 30 23:29:34 nightingale falcon-sensor-bpf[905]: CrowdStrike(4): Could not retrieve DisableProxy value: c0000225
Jul 30 23:29:34 nightingale falcon-sensor-bpf[905]: CrowdStrike(4): ConnectWithProxy: Unable to get application proxy host from CsConfig: c0000225
== orchids (3 distinct, 3 total) ==
Jul 30 23:24:53 orchids falcon-sensor-bpf[1099]: CrowdStrike(4): Could not retrieve DisableProxy value: c0000225
Jul 30 23:24:53 orchids falcon-sensor-bpf[1099]: CrowdStrike(4): ConnectWithProxy: Unable to get application proxy host from CsConfig: c0000225
Jul 31 00:00:01 orchids setroubleshoot[193073]: SELinux is preventing /opt/zoom/zoom from execmod access on the file /memfd:JITCode:QtQml (deleted). For complete SELinux messages run: sealert -l d2a5013b-cf74-44be-8505-892db15d8aa4
== outbound00.cs.umd.edu (1 distinct, 6 total) ==
Jul 30 23:09:09 outbound00.cs.umd.edu python3[1283934]: ldapdb [x6]
== outbound01.cs.umd.edu (2 distinct, 7 total) ==
Jul 30 23:13:07 outbound01.cs.umd.edu python3[3510076]: ldapdb [x6]
Jul 30 23:30:20 outbound01.cs.umd.edu cockpit-ws[3514201]: /usr/share/cockpit/static/login.js/favicon.ico: Failed to open file “/usr/share/cockpit/static/login.js/favicon.ico”: open() failed: Not a directory
== sentry-docker00.cs.umd.edu (40 distinct, 40 total) ==
Jul 30 23:05:29 sentry-docker00.cs.umd.edu systemd-udevd[2832603]: link_config: could not get ethtool features for veth60a9c8e
Jul 30 23:05:29 sentry-docker00.cs.umd.edu systemd-udevd[2832603]: Could not set offload features of veth60a9c8e: No such device
Jul 30 23:05:29 sentry-docker00.cs.umd.edu systemd-udevd[2832717]: Could not generate persistent MAC address for veth47625b2: No such file or directory
Jul 30 23:05:29 sentry-docker00.cs.umd.edu systemd-udevd[2832718]: Could not generate persistent MAC address for veth5b47eee: No such file or directory
Jul 30 23:05:29 sentry-docker00.cs.umd.edu systemd-udevd[2832721]: Could not generate persistent MAC address for veth29a1e24: No such file or directory
Jul 30 23:05:29 sentry-docker00.cs.umd.edu systemd-udevd[2832722]: Could not generate persistent MAC address for veth46cd42b: No such file or directory
Jul 30 23:05:29 sentry-docker00.cs.umd.edu systemd-udevd[2832732]: Could not generate persistent MAC address for veth2ba5b36: No such file or directory
Jul 30 23:05:29 sentry-docker00.cs.umd.edu systemd-udevd[2832743]: Could not generate persistent MAC address for vethdaf5639: No such file or directory
Jul 30 23:05:29 sentry-docker00.cs.umd.edu systemd-udevd[2832732]: Could not generate persistent MAC address for veth836fa27: No such file or directory
Jul 30 23:05:29 sentry-docker00.cs.umd.edu systemd-udevd[2832725]: Could not generate persistent MAC address for vethe50b93a: No such file or directory
Jul 30 23:10:24 sentry-docker00.cs.umd.edu systemd-udevd[2835637]: Could not generate persistent MAC address for veth30f4d1c: No such file or directory
Jul 30 23:10:24 sentry-docker00.cs.umd.edu systemd-udevd[2835638]: Could not generate persistent MAC address for veth2854c52: No such file or directory
Jul 30 23:25:37 sentry-docker00.cs.umd.edu systemd-udevd[2842249]: link_config: could not get ethtool features for veth2ba5b36
Jul 30 23:25:37 sentry-docker00.cs.umd.edu systemd-udevd[2842249]: Could not set offload features of veth2ba5b36: No such device
Jul 30 23:25:37 sentry-docker00.cs.umd.edu systemd-udevd[2842273]: Could not generate persistent MAC address for veth939d94f: No such file or directory
Jul 30 23:25:37 sentry-docker00.cs.umd.edu systemd-udevd[2842274]: Could not generate persistent MAC address for vethaa27b03: No such file or directory
Jul 30 23:25:37 sentry-docker00.cs.umd.edu systemd-udevd[2842277]: Could not generate persistent MAC address for veth9ef106f: No such file or directory
Jul 30 23:25:37 sentry-docker00.cs.umd.edu systemd-udevd[2842278]: Could not generate persistent MAC address for veth7da0f2a: No such file or directory
Jul 30 23:25:37 sentry-docker00.cs.umd.edu systemd-udevd[2842301]: Could not generate persistent MAC address for veth1144de6: No such file or directory
Jul 30 23:25:37 sentry-docker00.cs.umd.edu systemd-udevd[2842303]: Could not generate persistent MAC address for veth9b39672: No such file or directory
Jul 30 23:25:37 sentry-docker00.cs.umd.edu systemd-udevd[2842320]: Could not generate persistent MAC address for veth8c48088: No such file or directory
Jul 30 23:25:37 sentry-docker00.cs.umd.edu systemd-udevd[2842307]: Could not generate persistent MAC address for vethabdafbe: No such file or directory
Jul 30 23:30:32 sentry-docker00.cs.umd.edu systemd-udevd[2845333]: link_config: could not get ethtool features for veth30f4d1c
Jul 30 23:30:32 sentry-docker00.cs.umd.edu systemd-udevd[2845333]: Could not set offload features of veth30f4d1c: No such device
Jul 30 23:30:32 sentry-docker00.cs.umd.edu systemd-udevd[2845351]: Could not generate persistent MAC address for veth41535cc: No such file or directory
Jul 30 23:30:32 sentry-docker00.cs.umd.edu systemd-udevd[2845352]: Could not generate persistent MAC address for vethb73119e: No such file or directory
Jul 30 23:45:45 sentry-docker00.cs.umd.edu systemd-udevd[2851686]: link_config: could not get ethtool features for veth8c48088
Jul 30 23:45:45 sentry-docker00.cs.umd.edu systemd-udevd[2851686]: Could not set offload features of veth8c48088: No such device
Jul 30 23:45:45 sentry-docker00.cs.umd.edu systemd-udevd[2851785]: Could not generate persistent MAC address for veth8713572: No such file or directory
Jul 30 23:45:45 sentry-docker00.cs.umd.edu systemd-udevd[2851786]: Could not generate persistent MAC address for veth2586b70: No such file or directory
... 10 more distinct messages not shown
== soul (1 distinct, 1 total) ==
Jul 30 23:58:49 soul krb5_child[2748875]: Client 'admin(a)UMD.EDU' not found in Kerberos database
== strawberry (4 distinct, 10 total) ==
Jul 30 23:09:44 strawberry udisksd[1067]: Error performing housekeeping for drive /org/freedesktop/UDisks2/drives/ST2000DM001_1CH164_W1E8J5KJ: Error updating SMART data: Error sending ATA command CHECK POWER MODE: Unexpected sense data returned:#0120000: 00 00 00 00 00 00 00 00 00 00 00 00 00 00 00 00 ................#0120010: 00 00 00 00 00 00 00 00 00 00 00 00 00 00 00 00 ................#012 (g-io-error-quark, 0) [x6]
Jul 30 23:22:56 strawberry falcon-sensor-bpf[808]: CrowdStrike(4): Could not retrieve DisableProxy value: c0000225
Jul 30 23:22:56 strawberry falcon-sensor-bpf[808]: CrowdStrike(4): ConnectWithProxy: Unable to get application proxy host from CsConfig: c0000225
Jul 30 23:34:42 strawberry smartd[5314]: Device: /dev/sda [SAT], failed to read SMART Attribute Data [x2]
== stuckeys (2 distinct, 2 total) ==
Jul 30 23:19:05 stuckeys falcon-sensor-bpf[824199]: CrowdStrike(4): Could not retrieve DisableProxy value: c0000225
Jul 30 23:19:05 stuckeys falcon-sensor-bpf[824199]: CrowdStrike(4): ConnectWithProxy: Unable to get application proxy host from CsConfig: c0000225
== submit26-b9-2 (69 distinct, 80 total) ==
Jul 30 23:06:03 submit26-b9-2 systemd[1]: user(a)1001.service: Main process exited, code=killed, status=9/KILL [x10]
Jul 30 23:10:09 submit26-b9-2 kernel: show_signal_msg: 12 callbacks suppressed
Jul 30 23:10:10 submit26-b9-2 systemd-coredump[675425]: Process 675422 (d8sh) of user 1001 dumped core.#012#012Stack trace of thread 675422:#012#0 0x0000000000401391 run_command (d8sh + 0x1391)#012#1 0x0000000000401470 execute (d8sh + 0x1470)#012#2 0x000000000040357c yyparse (d8sh + 0x357c)#012#3 0x0000000000401515 main (d8sh + 0x1515)#012#4 0x00007f0734a2a610 __libc_start_call_main (libc.so.6 + 0x2a610)#012#5 0x00007f0734a2a6c0 __libc_start_main@@GLIBC_2.34 (libc.so.6 + 0x2a6c0)#012#6 0x0000000000401225 _start (d8sh + 0x1225)#012ELF object binary architecture: AMD x86-64
Jul 30 23:10:10 submit26-b9-2 systemd-coredump[675437]: Process 675433 (d8sh) of user 1001 dumped core.#012#012Stack trace of thread 675433:#012#0 0x0000000000401391 run_command (d8sh + 0x1391)#012#1 0x0000000000401470 execute (d8sh + 0x1470)#012#2 0x000000000040357c yyparse (d8sh + 0x357c)#012#3 0x0000000000401515 main (d8sh + 0x1515)#012#4 0x00007fcca802a610 __libc_start_call_main (libc.so.6 + 0x2a610)#012#5 0x00007fcca802a6c0 __libc_start_main@@GLIBC_2.34 (libc.so.6 + 0x2a6c0)#012#6 0x0000000000401225 _start (d8sh + 0x1225)#012ELF object binary architecture: AMD x86-64
Jul 30 23:10:10 submit26-b9-2 systemd-coredump[675447]: Process 675444 (d8sh) of user 1001 dumped core.#012#012Stack trace of thread 675444:#012#0 0x0000000000401391 run_command (d8sh + 0x1391)#012#1 0x0000000000401470 execute (d8sh + 0x1470)#012#2 0x000000000040357c yyparse (d8sh + 0x357c)#012#3 0x0000000000401515 main (d8sh + 0x1515)#012#4 0x00007fd36282a610 __libc_start_call_main (libc.so.6 + 0x2a610)#012#5 0x00007fd36282a6c0 __libc_start_main@@GLIBC_2.34 (libc.so.6 + 0x2a6c0)#012#6 0x0000000000401225 _start (d8sh + 0x1225)#012ELF object binary architecture: AMD x86-64
Jul 30 23:10:10 submit26-b9-2 systemd-coredump[675473]: Process 675470 (d8sh) of user 1001 dumped core.#012#012Stack trace of thread 675470:#012#0 0x0000000000401391 run_command (d8sh + 0x1391)#012#1 0x0000000000401470 execute (d8sh + 0x1470)#012#2 0x000000000040357c yyparse (d8sh + 0x357c)#012#3 0x0000000000401515 main (d8sh + 0x1515)#012#4 0x00007f4cfaa2a610 __libc_start_call_main (libc.so.6 + 0x2a610)#012#5 0x00007f4cfaa2a6c0 __libc_start_main@@GLIBC_2.34 (libc.so.6 + 0x2a6c0)#012#6 0x0000000000401225 _start (d8sh + 0x1225)#012ELF object binary architecture: AMD x86-64
Jul 30 23:10:11 submit26-b9-2 systemd-coredump[675484]: Process 675481 (d8sh) of user 1001 dumped core.#012#012Stack trace of thread 675481:#012#0 0x0000000000401391 run_command (d8sh + 0x1391)#012#1 0x0000000000401470 execute (d8sh + 0x1470)#012#2 0x000000000040145c execute (d8sh + 0x145c)#012#3 0x000000000040357c yyparse (d8sh + 0x357c)#012#4 0x0000000000401515 main (d8sh + 0x1515)#012#5 0x00007f0e8ba2a610 __libc_start_call_main (libc.so.6 + 0x2a610)#012#6 0x00007f0e8ba2a6c0 __libc_start_main@@GLIBC_2.34 (libc.so.6 + 0x2a6c0)#012#7 0x0000000000401225 _start (d8sh + 0x1225)#012ELF object binary architecture: AMD x86-64
Jul 30 23:10:11 submit26-b9-2 systemd-coredump[675500]: Process 675497 (d8sh) of user 1001 dumped core.#012#012Stack trace of thread 675497:#012#0 0x0000000000401391 run_command (d8sh + 0x1391)#012#1 0x0000000000401470 execute (d8sh + 0x1470)#012#2 0x000000000040357c yyparse (d8sh + 0x357c)#012#3 0x0000000000401515 main (d8sh + 0x1515)#012#4 0x00007f7d8b02a610 __libc_start_call_main (libc.so.6 + 0x2a610)#012#5 0x00007f7d8b02a6c0 __libc_start_main@@GLIBC_2.34 (libc.so.6 + 0x2a6c0)#012#6 0x0000000000401225 _start (d8sh + 0x1225)#012ELF object binary architecture: AMD x86-64
Jul 30 23:10:11 submit26-b9-2 systemd-coredump[675511]: Process 675507 (d8sh) of user 1001 dumped core.#012#012Stack trace of thread 675507:#012#0 0x0000000000401391 run_command (d8sh + 0x1391)#012#1 0x0000000000401470 execute (d8sh + 0x1470)#012#2 0x000000000040357c yyparse (d8sh + 0x357c)#012#3 0x0000000000401515 main (d8sh + 0x1515)#012#4 0x00007f3e9982a610 __libc_start_call_main (libc.so.6 + 0x2a610)#012#5 0x00007f3e9982a6c0 __libc_start_main@@GLIBC_2.34 (libc.so.6 + 0x2a6c0)#012#6 0x0000000000401225 _start (d8sh + 0x1225)#012ELF object binary architecture: AMD x86-64
Jul 30 23:10:11 submit26-b9-2 systemd-coredump[675521]: Process 675518 (d8sh) of user 1001 dumped core.#012#012Stack trace of thread 675518:#012#0 0x0000000000401391 run_command (d8sh + 0x1391)#012#1 0x0000000000401470 execute (d8sh + 0x1470)#012#2 0x000000000040357c yyparse (d8sh + 0x357c)#012#3 0x0000000000401515 main (d8sh + 0x1515)#012#4 0x00007f08b502a610 __libc_start_call_main (libc.so.6 + 0x2a610)#012#5 0x00007f08b502a6c0 __libc_start_main@@GLIBC_2.34 (libc.so.6 + 0x2a6c0)#012#6 0x0000000000401225 _start (d8sh + 0x1225)#012ELF object binary architecture: AMD x86-64
Jul 30 23:10:12 submit26-b9-2 systemd-coredump[675531]: Process 675528 (d8sh) of user 1001 dumped core.#012#012Stack trace of thread 675528:#012#0 0x0000000000401391 run_command (d8sh + 0x1391)#012#1 0x0000000000401470 execute (d8sh + 0x1470)#012#2 0x000000000040357c yyparse (d8sh + 0x357c)#012#3 0x0000000000401515 main (d8sh + 0x1515)#012#4 0x00007f544d02a610 __libc_start_call_main (libc.so.6 + 0x2a610)#012#5 0x00007f544d02a6c0 __libc_start_main@@GLIBC_2.34 (libc.so.6 + 0x2a6c0)#012#6 0x0000000000401225 _start (d8sh + 0x1225)#012ELF object binary architecture: AMD x86-64
Jul 30 23:10:12 submit26-b9-2 systemd-coredump[675541]: Process 675538 (d8sh) of user 1001 dumped core.#012#012Stack trace of thread 675538:#012#0 0x0000000000401391 run_command (d8sh + 0x1391)#012#1 0x0000000000401470 execute (d8sh + 0x1470)#012#2 0x000000000040357c yyparse (d8sh + 0x357c)#012#3 0x0000000000401515 main (d8sh + 0x1515)#012#4 0x00007fa07002a610 __libc_start_call_main (libc.so.6 + 0x2a610)#012#5 0x00007fa07002a6c0 __libc_start_main@@GLIBC_2.34 (libc.so.6 + 0x2a6c0)#012#6 0x0000000000401225 _start (d8sh + 0x1225)#012ELF object binary architecture: AMD x86-64
Jul 30 23:10:12 submit26-b9-2 systemd-coredump[675556]: Process 675553 (d8sh) of user 1001 dumped core.#012#012Stack trace of thread 675553:#012#0 0x0000000000401391 run_command (d8sh + 0x1391)#012#1 0x0000000000401470 execute (d8sh + 0x1470)#012#2 0x000000000040357c yyparse (d8sh + 0x357c)#012#3 0x0000000000401515 main (d8sh + 0x1515)#012#4 0x00007f858322a610 __libc_start_call_main (libc.so.6 + 0x2a610)#012#5 0x00007f858322a6c0 __libc_start_main@@GLIBC_2.34 (libc.so.6 + 0x2a6c0)#012#6 0x0000000000401225 _start (d8sh + 0x1225)#012ELF object binary architecture: AMD x86-64
Jul 30 23:10:12 submit26-b9-2 systemd-coredump[675584]: Process 675581 (d8sh) of user 1001 dumped core.#012#012Stack trace of thread 675581:#012#0 0x0000000000401391 run_command (d8sh + 0x1391)#012#1 0x0000000000401470 execute (d8sh + 0x1470)#012#2 0x000000000040357c yyparse (d8sh + 0x357c)#012#3 0x0000000000401515 main (d8sh + 0x1515)#012#4 0x00007f369622a610 __libc_start_call_main (libc.so.6 + 0x2a610)#012#5 0x00007f369622a6c0 __libc_start_main@@GLIBC_2.34 (libc.so.6 + 0x2a6c0)#012#6 0x0000000000401225 _start (d8sh + 0x1225)#012ELF object binary architecture: AMD x86-64
Jul 30 23:10:13 submit26-b9-2 systemd-coredump[675595]: Process 675592 (d8sh) of user 1001 dumped core.#012#012Stack trace of thread 675592:#012#0 0x0000000000401391 run_command (d8sh + 0x1391)#012#1 0x0000000000401470 execute (d8sh + 0x1470)#012#2 0x000000000040357c yyparse (d8sh + 0x357c)#012#3 0x0000000000401515 main (d8sh + 0x1515)#012#4 0x00007fecde62a610 __libc_start_call_main (libc.so.6 + 0x2a610)#012#5 0x00007fecde62a6c0 __libc_start_main@@GLIBC_2.34 (libc.so.6 + 0x2a6c0)#012#6 0x0000000000401225 _start (d8sh + 0x1225)#012ELF object binary architecture: AMD x86-64
Jul 30 23:10:13 submit26-b9-2 systemd-coredump[675605]: Process 675602 (d8sh) of user 1001 dumped core.#012#012Stack trace of thread 675602:#012#0 0x0000000000401391 run_command (d8sh + 0x1391)#012#1 0x0000000000401470 execute (d8sh + 0x1470)#012#2 0x0000000000401443 execute (d8sh + 0x1443)#012#3 0x000000000040357c yyparse (d8sh + 0x357c)#012#4 0x0000000000401515 main (d8sh + 0x1515)#012#5 0x00007f77fb82a610 __libc_start_call_main (libc.so.6 + 0x2a610)#012#6 0x00007f77fb82a6c0 __libc_start_main@@GLIBC_2.34 (libc.so.6 + 0x2a6c0)#012#7 0x0000000000401225 _start (d8sh + 0x1225)#012ELF object binary architecture: AMD x86-64
Jul 30 23:10:13 submit26-b9-2 systemd-coredump[675629]: Process 675626 (d8sh) of user 1001 dumped core.#012#012Stack trace of thread 675626:#012#0 0x0000000000401391 run_command (d8sh + 0x1391)#012#1 0x0000000000401470 execute (d8sh + 0x1470)#012#2 0x000000000040357c yyparse (d8sh + 0x357c)#012#3 0x0000000000401515 main (d8sh + 0x1515)#012#4 0x00007fb58582a610 __libc_start_call_main (libc.so.6 + 0x2a610)#012#5 0x00007fb58582a6c0 __libc_start_main@@GLIBC_2.34 (libc.so.6 + 0x2a6c0)#012#6 0x0000000000401225 _start (d8sh + 0x1225)#012ELF object binary architecture: AMD x86-64
Jul 30 23:10:13 submit26-b9-2 systemd-coredump[675639]: Process 675636 (d8sh) of user 1001 dumped core.#012#012Stack trace of thread 675636:#012#0 0x0000000000401391 run_command (d8sh + 0x1391)#012#1 0x0000000000401470 execute (d8sh + 0x1470)#012#2 0x000000000040357c yyparse (d8sh + 0x357c)#012#3 0x0000000000401515 main (d8sh + 0x1515)#012#4 0x00007f1da842a610 __libc_start_call_main (libc.so.6 + 0x2a610)#012#5 0x00007f1da842a6c0 __libc_start_main@@GLIBC_2.34 (libc.so.6 + 0x2a6c0)#012#6 0x0000000000401225 _start (d8sh + 0x1225)#012ELF object binary architecture: AMD x86-64
Jul 30 23:10:14 submit26-b9-2 systemd-coredump[675654]: Process 675651 (d8sh) of user 1001 dumped core.#012#012Stack trace of thread 675651:#012#0 0x0000000000401391 run_command (d8sh + 0x1391)#012#1 0x0000000000401470 execute (d8sh + 0x1470)#012#2 0x000000000040357c yyparse (d8sh + 0x357c)#012#3 0x0000000000401515 main (d8sh + 0x1515)#012#4 0x00007fb7a2e2a610 __libc_start_call_main (libc.so.6 + 0x2a610)#012#5 0x00007fb7a2e2a6c0 __libc_start_main@@GLIBC_2.34 (libc.so.6 + 0x2a6c0)#012#6 0x0000000000401225 _start (d8sh + 0x1225)#012ELF object binary architecture: AMD x86-64
Jul 30 23:10:14 submit26-b9-2 systemd-coredump[675664]: Process 675661 (d8sh) of user 1001 dumped core.#012#012Stack trace of thread 675661:#012#0 0x0000000000401391 run_command (d8sh + 0x1391)#012#1 0x0000000000401470 execute (d8sh + 0x1470)#012#2 0x000000000040357c yyparse (d8sh + 0x357c)#012#3 0x0000000000401515 main (d8sh + 0x1515)#012#4 0x00007f022742a610 __libc_start_call_main (libc.so.6 + 0x2a610)#012#5 0x00007f022742a6c0 __libc_start_main@@GLIBC_2.34 (libc.so.6 + 0x2a6c0)#012#6 0x0000000000401225 _start (d8sh + 0x1225)#012ELF object binary architecture: AMD x86-64
Jul 30 23:10:14 submit26-b9-2 systemd-coredump[675697]: Process 675694 (d8sh) of user 1001 dumped core.#012#012Stack trace of thread 675694:#012#0 0x0000000000401391 run_command (d8sh + 0x1391)#012#1 0x0000000000401470 execute (d8sh + 0x1470)#012#2 0x000000000040357c yyparse (d8sh + 0x357c)#012#3 0x0000000000401515 main (d8sh + 0x1515)#012#4 0x00007feb59a2a610 __libc_start_call_main (libc.so.6 + 0x2a610)#012#5 0x00007feb59a2a6c0 __libc_start_main@@GLIBC_2.34 (libc.so.6 + 0x2a6c0)#012#6 0x0000000000401225 _start (d8sh + 0x1225)#012ELF object binary architecture: AMD x86-64
Jul 30 23:10:14 submit26-b9-2 systemd-coredump[675708]: Process 675705 (d8sh) of user 1001 dumped core.#012#012Stack trace of thread 675705:#012#0 0x0000000000401391 run_command (d8sh + 0x1391)#012#1 0x0000000000401470 execute (d8sh + 0x1470)#012#2 0x000000000040145c execute (d8sh + 0x145c)#012#3 0x000000000040357c yyparse (d8sh + 0x357c)#012#4 0x0000000000401515 main (d8sh + 0x1515)#012#5 0x00007fa77982a610 __libc_start_call_main (libc.so.6 + 0x2a610)#012#6 0x00007fa77982a6c0 __libc_start_main@@GLIBC_2.34 (libc.so.6 + 0x2a6c0)#012#7 0x0000000000401225 _start (d8sh + 0x1225)#012ELF object binary architecture: AMD x86-64
Jul 30 23:10:15 submit26-b9-2 systemd-coredump[675720]: Process 675717 (d8sh) of user 1001 dumped core.#012#012Stack trace of thread 675717:#012#0 0x0000000000401391 run_command (d8sh + 0x1391)#012#1 0x0000000000401470 execute (d8sh + 0x1470)#012#2 0x000000000040357c yyparse (d8sh + 0x357c)#012#3 0x0000000000401515 main (d8sh + 0x1515)#012#4 0x00007f831b02a610 __libc_start_call_main (libc.so.6 + 0x2a610)#012#5 0x00007f831b02a6c0 __libc_start_main@@GLIBC_2.34 (libc.so.6 + 0x2a6c0)#012#6 0x0000000000401225 _start (d8sh + 0x1225)#012ELF object binary architecture: AMD x86-64
Jul 30 23:10:15 submit26-b9-2 kernel: show_signal_msg: 11 callbacks suppressed [x3]
Jul 30 23:10:15 submit26-b9-2 systemd-coredump[675730]: Process 675727 (d8sh) of user 1001 dumped core.#012#012Stack trace of thread 675727:#012#0 0x0000000000401391 run_command (d8sh + 0x1391)#012#1 0x0000000000401470 execute (d8sh + 0x1470)#012#2 0x000000000040357c yyparse (d8sh + 0x357c)#012#3 0x0000000000401515 main (d8sh + 0x1515)#012#4 0x00007f3d0882a610 __libc_start_call_main (libc.so.6 + 0x2a610)#012#5 0x00007f3d0882a6c0 __libc_start_main@@GLIBC_2.34 (libc.so.6 + 0x2a6c0)#012#6 0x0000000000401225 _start (d8sh + 0x1225)#012ELF object binary architecture: AMD x86-64
Jul 30 23:33:08 submit26-b9-2 systemd-coredump[677803]: Process 677800 (d8sh) of user 1001 dumped core.#012#012Stack trace of thread 677800:#012#0 0x0000000000401391 run_command (d8sh + 0x1391)#012#1 0x0000000000401470 execute (d8sh + 0x1470)#012#2 0x000000000040357c yyparse (d8sh + 0x357c)#012#3 0x0000000000401515 main (d8sh + 0x1515)#012#4 0x00007f6c0c82a610 __libc_start_call_main (libc.so.6 + 0x2a610)#012#5 0x00007f6c0c82a6c0 __libc_start_main@@GLIBC_2.34 (libc.so.6 + 0x2a6c0)#012#6 0x0000000000401225 _start (d8sh + 0x1225)#012ELF object binary architecture: AMD x86-64
Jul 30 23:33:08 submit26-b9-2 systemd-coredump[677815]: Process 677811 (d8sh) of user 1001 dumped core.#012#012Stack trace of thread 677811:#012#0 0x0000000000401391 run_command (d8sh + 0x1391)#012#1 0x0000000000401470 execute (d8sh + 0x1470)#012#2 0x000000000040357c yyparse (d8sh + 0x357c)#012#3 0x0000000000401515 main (d8sh + 0x1515)#012#4 0x00007f8d8942a610 __libc_start_call_main (libc.so.6 + 0x2a610)#012#5 0x00007f8d8942a6c0 __libc_start_main@@GLIBC_2.34 (libc.so.6 + 0x2a6c0)#012#6 0x0000000000401225 _start (d8sh + 0x1225)#012ELF object binary architecture: AMD x86-64
Jul 30 23:33:08 submit26-b9-2 systemd-coredump[677825]: Process 677822 (d8sh) of user 1001 dumped core.#012#012Stack trace of thread 677822:#012#0 0x0000000000401391 run_command (d8sh + 0x1391)#012#1 0x0000000000401470 execute (d8sh + 0x1470)#012#2 0x000000000040357c yyparse (d8sh + 0x357c)#012#3 0x0000000000401515 main (d8sh + 0x1515)#012#4 0x00007f698882a610 __libc_start_call_main (libc.so.6 + 0x2a610)#012#5 0x00007f698882a6c0 __libc_start_main@@GLIBC_2.34 (libc.so.6 + 0x2a6c0)#012#6 0x0000000000401225 _start (d8sh + 0x1225)#012ELF object binary architecture: AMD x86-64
Jul 30 23:33:08 submit26-b9-2 systemd-coredump[677851]: Process 677848 (d8sh) of user 1001 dumped core.#012#012Stack trace of thread 677848:#012#0 0x0000000000401391 run_command (d8sh + 0x1391)#012#1 0x0000000000401470 execute (d8sh + 0x1470)#012#2 0x000000000040357c yyparse (d8sh + 0x357c)#012#3 0x0000000000401515 main (d8sh + 0x1515)#012#4 0x00007eff02c2a610 __libc_start_call_main (libc.so.6 + 0x2a610)#012#5 0x00007eff02c2a6c0 __libc_start_main@@GLIBC_2.34 (libc.so.6 + 0x2a6c0)#012#6 0x0000000000401225 _start (d8sh + 0x1225)#012ELF object binary architecture: AMD x86-64
Jul 30 23:33:09 submit26-b9-2 systemd-coredump[677863]: Process 677860 (d8sh) of user 1001 dumped core.#012#012Stack trace of thread 677860:#012#0 0x0000000000401391 run_command (d8sh + 0x1391)#012#1 0x0000000000401470 execute (d8sh + 0x1470)#012#2 0x000000000040145c execute (d8sh + 0x145c)#012#3 0x000000000040357c yyparse (d8sh + 0x357c)#012#4 0x0000000000401515 main (d8sh + 0x1515)#012#5 0x00007f429702a610 __libc_start_call_main (libc.so.6 + 0x2a610)#012#6 0x00007f429702a6c0 __libc_start_main@@GLIBC_2.34 (libc.so.6 + 0x2a6c0)#012#7 0x0000000000401225 _start (d8sh + 0x1225)#012ELF object binary architecture: AMD x86-64
... 39 more distinct messages not shown
== submit26-b9-4 (113 distinct, 126 total) ==
Jul 30 23:06:44 submit26-b9-4 systemd[1]: user(a)1001.service: Main process exited, code=killed, status=9/KILL [x11]
Jul 30 23:16:55 submit26-b9-4 kernel: show_signal_msg: 4 callbacks suppressed
Jul 30 23:16:55 submit26-b9-4 systemd-coredump[676979]: Process 676976 (d8sh) of user 1001 dumped core.#012#012Stack trace of thread 676976:#012#0 0x000000000040132a execute_leaf (d8sh + 0x132a)#012#1 0x00000000004015e3 execute (d8sh + 0x15e3)#012#2 0x00000000004037a8 yyparse (d8sh + 0x37a8)#012#3 0x0000000000401741 main (d8sh + 0x1741)#012#4 0x00007f07ce22a610 __libc_start_call_main (libc.so.6 + 0x2a610)#012#5 0x00007f07ce22a6c0 __libc_start_main@@GLIBC_2.34 (libc.so.6 + 0x2a6c0)#012#6 0x0000000000401255 _start (d8sh + 0x1255)#012ELF object binary architecture: AMD x86-64
Jul 30 23:16:55 submit26-b9-4 systemd-coredump[676988]: Process 676985 (d8sh) of user 1001 dumped core.#012#012Stack trace of thread 676985:#012#0 0x000000000040132a execute_leaf (d8sh + 0x132a)#012#1 0x00000000004015e3 execute (d8sh + 0x15e3)#012#2 0x00000000004037a8 yyparse (d8sh + 0x37a8)#012#3 0x0000000000401741 main (d8sh + 0x1741)#012#4 0x00007f146862a610 __libc_start_call_main (libc.so.6 + 0x2a610)#012#5 0x00007f146862a6c0 __libc_start_main@@GLIBC_2.34 (libc.so.6 + 0x2a6c0)#012#6 0x0000000000401255 _start (d8sh + 0x1255)#012ELF object binary architecture: AMD x86-64
Jul 30 23:16:55 submit26-b9-4 systemd-coredump[676996]: Process 676994 (d8sh) of user 1001 dumped core.#012#012Stack trace of thread 676994:#012#0 0x000000000040132a execute_leaf (d8sh + 0x132a)#012#1 0x00000000004015e3 execute (d8sh + 0x15e3)#012#2 0x00000000004037a8 yyparse (d8sh + 0x37a8)#012#3 0x0000000000401741 main (d8sh + 0x1741)#012#4 0x00007f6fdf62a610 __libc_start_call_main (libc.so.6 + 0x2a610)#012#5 0x00007f6fdf62a6c0 __libc_start_main@@GLIBC_2.34 (libc.so.6 + 0x2a6c0)#012#6 0x0000000000401255 _start (d8sh + 0x1255)#012ELF object binary architecture: AMD x86-64
Jul 30 23:16:56 submit26-b9-4 systemd-coredump[677022]: Process 677019 (d8sh) of user 1001 dumped core.#012#012Stack trace of thread 677019:#012#0 0x000000000040132a execute_leaf (d8sh + 0x132a)#012#1 0x00000000004015e3 execute (d8sh + 0x15e3)#012#2 0x00000000004037a8 yyparse (d8sh + 0x37a8)#012#3 0x0000000000401741 main (d8sh + 0x1741)#012#4 0x00007fc22b62a610 __libc_start_call_main (libc.so.6 + 0x2a610)#012#5 0x00007fc22b62a6c0 __libc_start_main@@GLIBC_2.34 (libc.so.6 + 0x2a6c0)#012#6 0x0000000000401255 _start (d8sh + 0x1255)#012ELF object binary architecture: AMD x86-64
Jul 30 23:16:56 submit26-b9-4 systemd-coredump[677031]: Process 677028 (d8sh) of user 1001 dumped core.#012#012Stack trace of thread 677028:#012#0 0x000000000040132a execute_leaf (d8sh + 0x132a)#012#1 0x00000000004015e3 execute (d8sh + 0x15e3)#012#2 0x00000000004015d0 execute (d8sh + 0x15d0)#012#3 0x00000000004037a8 yyparse (d8sh + 0x37a8)#012#4 0x0000000000401741 main (d8sh + 0x1741)#012#5 0x00007ff38f22a610 __libc_start_call_main (libc.so.6 + 0x2a610)#012#6 0x00007ff38f22a6c0 __libc_start_main@@GLIBC_2.34 (libc.so.6 + 0x2a6c0)#012#7 0x0000000000401255 _start (d8sh + 0x1255)#012ELF object binary architecture: AMD x86-64
Jul 30 23:16:56 submit26-b9-4 systemd-coredump[677046]: Process 677043 (d8sh) of user 1001 dumped core.#012#012Stack trace of thread 677043:#012#0 0x000000000040132a execute_leaf (d8sh + 0x132a)#012#1 0x00000000004015e3 execute (d8sh + 0x15e3)#012#2 0x00000000004037a8 yyparse (d8sh + 0x37a8)#012#3 0x0000000000401741 main (d8sh + 0x1741)#012#4 0x00007f7fa2a2a610 __libc_start_call_main (libc.so.6 + 0x2a610)#012#5 0x00007f7fa2a2a6c0 __libc_start_main@@GLIBC_2.34 (libc.so.6 + 0x2a6c0)#012#6 0x0000000000401255 _start (d8sh + 0x1255)#012ELF object binary architecture: AMD x86-64
Jul 30 23:16:56 submit26-b9-4 systemd-coredump[677055]: Process 677052 (d8sh) of user 1001 dumped core.#012#012Stack trace of thread 677052:#012#0 0x000000000040132a execute_leaf (d8sh + 0x132a)#012#1 0x00000000004015e3 execute (d8sh + 0x15e3)#012#2 0x00000000004037a8 yyparse (d8sh + 0x37a8)#012#3 0x0000000000401741 main (d8sh + 0x1741)#012#4 0x00007ff3d2c2a610 __libc_start_call_main (libc.so.6 + 0x2a610)#012#5 0x00007ff3d2c2a6c0 __libc_start_main@@GLIBC_2.34 (libc.so.6 + 0x2a6c0)#012#6 0x0000000000401255 _start (d8sh + 0x1255)#012ELF object binary architecture: AMD x86-64
Jul 30 23:16:56 submit26-b9-4 systemd-coredump[677064]: Process 677061 (d8sh) of user 1001 dumped core.#012#012Stack trace of thread 677061:#012#0 0x000000000040132a execute_leaf (d8sh + 0x132a)#012#1 0x00000000004015e3 execute (d8sh + 0x15e3)#012#2 0x00000000004037a8 yyparse (d8sh + 0x37a8)#012#3 0x0000000000401741 main (d8sh + 0x1741)#012#4 0x00007f88fa42a610 __libc_start_call_main (libc.so.6 + 0x2a610)#012#5 0x00007f88fa42a6c0 __libc_start_main@@GLIBC_2.34 (libc.so.6 + 0x2a6c0)#012#6 0x0000000000401255 _start (d8sh + 0x1255)#012ELF object binary architecture: AMD x86-64
Jul 30 23:16:56 submit26-b9-4 systemd-coredump[677073]: Process 677070 (d8sh) of user 1001 dumped core.#012#012Stack trace of thread 677070:#012#0 0x000000000040132a execute_leaf (d8sh + 0x132a)#012#1 0x00000000004015e3 execute (d8sh + 0x15e3)#012#2 0x00000000004037a8 yyparse (d8sh + 0x37a8)#012#3 0x0000000000401741 main (d8sh + 0x1741)#012#4 0x00007f64be22a610 __libc_start_call_main (libc.so.6 + 0x2a610)#012#5 0x00007f64be22a6c0 __libc_start_main@@GLIBC_2.34 (libc.so.6 + 0x2a6c0)#012#6 0x0000000000401255 _start (d8sh + 0x1255)#012ELF object binary architecture: AMD x86-64
Jul 30 23:16:57 submit26-b9-4 systemd-coredump[677083]: Process 677080 (d8sh) of user 1001 dumped core.#012#012Stack trace of thread 677080:#012#0 0x000000000040132a execute_leaf (d8sh + 0x132a)#012#1 0x00000000004015e3 execute (d8sh + 0x15e3)#012#2 0x00000000004037a8 yyparse (d8sh + 0x37a8)#012#3 0x0000000000401741 main (d8sh + 0x1741)#012#4 0x00007fd35882a610 __libc_start_call_main (libc.so.6 + 0x2a610)#012#5 0x00007fd35882a6c0 __libc_start_main@@GLIBC_2.34 (libc.so.6 + 0x2a6c0)#012#6 0x0000000000401255 _start (d8sh + 0x1255)#012ELF object binary architecture: AMD x86-64
Jul 30 23:16:57 submit26-b9-4 systemd-coredump[677098]: Process 677095 (d8sh) of user 1001 dumped core.#012#012Stack trace of thread 677095:#012#0 0x000000000040132a execute_leaf (d8sh + 0x132a)#012#1 0x00000000004015e3 execute (d8sh + 0x15e3)#012#2 0x00000000004037a8 yyparse (d8sh + 0x37a8)#012#3 0x0000000000401741 main (d8sh + 0x1741)#012#4 0x00007f2dbbc2a610 __libc_start_call_main (libc.so.6 + 0x2a610)#012#5 0x00007f2dbbc2a6c0 __libc_start_main@@GLIBC_2.34 (libc.so.6 + 0x2a6c0)#012#6 0x0000000000401255 _start (d8sh + 0x1255)#012ELF object binary architecture: AMD x86-64
Jul 30 23:16:57 submit26-b9-4 systemd-coredump[677125]: Process 677122 (d8sh) of user 1001 dumped core.#012#012Stack trace of thread 677122:#012#0 0x000000000040132a execute_leaf (d8sh + 0x132a)#012#1 0x00000000004015e3 execute (d8sh + 0x15e3)#012#2 0x00000000004037a8 yyparse (d8sh + 0x37a8)#012#3 0x0000000000401741 main (d8sh + 0x1741)#012#4 0x00007f573082a610 __libc_start_call_main (libc.so.6 + 0x2a610)#012#5 0x00007f573082a6c0 __libc_start_main@@GLIBC_2.34 (libc.so.6 + 0x2a6c0)#012#6 0x0000000000401255 _start (d8sh + 0x1255)#012ELF object binary architecture: AMD x86-64
Jul 30 23:16:57 submit26-b9-4 systemd-coredump[677134]: Process 677131 (d8sh) of user 1001 dumped core.#012#012Stack trace of thread 677131:#012#0 0x000000000040132a execute_leaf (d8sh + 0x132a)#012#1 0x00000000004015e3 execute (d8sh + 0x15e3)#012#2 0x00000000004037a8 yyparse (d8sh + 0x37a8)#012#3 0x0000000000401741 main (d8sh + 0x1741)#012#4 0x00007f1e8e02a610 __libc_start_call_main (libc.so.6 + 0x2a610)#012#5 0x00007f1e8e02a6c0 __libc_start_main@@GLIBC_2.34 (libc.so.6 + 0x2a6c0)#012#6 0x0000000000401255 _start (d8sh + 0x1255)#012ELF object binary architecture: AMD x86-64
Jul 30 23:16:57 submit26-b9-4 systemd-coredump[677143]: Process 677140 (d8sh) of user 1001 dumped core.#012#012Stack trace of thread 677140:#012#0 0x000000000040132a execute_leaf (d8sh + 0x132a)#012#1 0x00000000004015e3 execute (d8sh + 0x15e3)#012#2 0x00000000004015b7 execute (d8sh + 0x15b7)#012#3 0x00000000004037a8 yyparse (d8sh + 0x37a8)#012#4 0x0000000000401741 main (d8sh + 0x1741)#012#5 0x00007fa2f122a610 __libc_start_call_main (libc.so.6 + 0x2a610)#012#6 0x00007fa2f122a6c0 __libc_start_main@@GLIBC_2.34 (libc.so.6 + 0x2a6c0)#012#7 0x0000000000401255 _start (d8sh + 0x1255)#012ELF object binary architecture: AMD x86-64
Jul 30 23:16:58 submit26-b9-4 systemd-coredump[677166]: Process 677163 (d8sh) of user 1001 dumped core.#012#012Stack trace of thread 677163:#012#0 0x000000000040132a execute_leaf (d8sh + 0x132a)#012#1 0x00000000004015e3 execute (d8sh + 0x15e3)#012#2 0x00000000004037a8 yyparse (d8sh + 0x37a8)#012#3 0x0000000000401741 main (d8sh + 0x1741)#012#4 0x00007f1592c2a610 __libc_start_call_main (libc.so.6 + 0x2a610)#012#5 0x00007f1592c2a6c0 __libc_start_main@@GLIBC_2.34 (libc.so.6 + 0x2a6c0)#012#6 0x0000000000401255 _start (d8sh + 0x1255)#012ELF object binary architecture: AMD x86-64
Jul 30 23:16:58 submit26-b9-4 systemd-coredump[677175]: Process 677172 (d8sh) of user 1001 dumped core.#012#012Stack trace of thread 677172:#012#0 0x000000000040132a execute_leaf (d8sh + 0x132a)#012#1 0x00000000004015e3 execute (d8sh + 0x15e3)#012#2 0x00000000004037a8 yyparse (d8sh + 0x37a8)#012#3 0x0000000000401741 main (d8sh + 0x1741)#012#4 0x00007f0c91a2a610 __libc_start_call_main (libc.so.6 + 0x2a610)#012#5 0x00007f0c91a2a6c0 __libc_start_main@@GLIBC_2.34 (libc.so.6 + 0x2a6c0)#012#6 0x0000000000401255 _start (d8sh + 0x1255)#012ELF object binary architecture: AMD x86-64
Jul 30 23:16:58 submit26-b9-4 systemd-coredump[677188]: Process 677186 (d8sh) of user 1001 dumped core.#012#012Stack trace of thread 677186:#012#0 0x000000000040132a execute_leaf (d8sh + 0x132a)#012#1 0x00000000004015e3 execute (d8sh + 0x15e3)#012#2 0x00000000004037a8 yyparse (d8sh + 0x37a8)#012#3 0x0000000000401741 main (d8sh + 0x1741)#012#4 0x00007f720202a610 __libc_start_call_main (libc.so.6 + 0x2a610)#012#5 0x00007f720202a6c0 __libc_start_main@@GLIBC_2.34 (libc.so.6 + 0x2a6c0)#012#6 0x0000000000401255 _start (d8sh + 0x1255)#012ELF object binary architecture: AMD x86-64
Jul 30 23:16:58 submit26-b9-4 systemd-coredump[677198]: Process 677195 (d8sh) of user 1001 dumped core.#012#012Stack trace of thread 677195:#012#0 0x000000000040132a execute_leaf (d8sh + 0x132a)#012#1 0x00000000004015e3 execute (d8sh + 0x15e3)#012#2 0x00000000004037a8 yyparse (d8sh + 0x37a8)#012#3 0x0000000000401741 main (d8sh + 0x1741)#012#4 0x00007fbde842a610 __libc_start_call_main (libc.so.6 + 0x2a610)#012#5 0x00007fbde842a6c0 __libc_start_main@@GLIBC_2.34 (libc.so.6 + 0x2a6c0)#012#6 0x0000000000401255 _start (d8sh + 0x1255)#012ELF object binary architecture: AMD x86-64
Jul 30 23:16:58 submit26-b9-4 systemd-coredump[677230]: Process 677227 (d8sh) of user 1001 dumped core.#012#012Stack trace of thread 677227:#012#0 0x000000000040132a execute_leaf (d8sh + 0x132a)#012#1 0x00000000004015e3 execute (d8sh + 0x15e3)#012#2 0x00000000004037a8 yyparse (d8sh + 0x37a8)#012#3 0x0000000000401741 main (d8sh + 0x1741)#012#4 0x00007ffa45c2a610 __libc_start_call_main (libc.so.6 + 0x2a610)#012#5 0x00007ffa45c2a6c0 __libc_start_main@@GLIBC_2.34 (libc.so.6 + 0x2a6c0)#012#6 0x0000000000401255 _start (d8sh + 0x1255)#012ELF object binary architecture: AMD x86-64
Jul 30 23:16:58 submit26-b9-4 systemd-coredump[677239]: Process 677236 (d8sh) of user 1001 dumped core.#012#012Stack trace of thread 677236:#012#0 0x000000000040132a execute_leaf (d8sh + 0x132a)#012#1 0x00000000004015e3 execute (d8sh + 0x15e3)#012#2 0x00000000004015d0 execute (d8sh + 0x15d0)#012#3 0x00000000004037a8 yyparse (d8sh + 0x37a8)#012#4 0x0000000000401741 main (d8sh + 0x1741)#012#5 0x00007f9eb1a2a610 __libc_start_call_main (libc.so.6 + 0x2a610)#012#6 0x00007f9eb1a2a6c0 __libc_start_main@@GLIBC_2.34 (libc.so.6 + 0x2a6c0)#012#7 0x0000000000401255 _start (d8sh + 0x1255)#012ELF object binary architecture: AMD x86-64
Jul 30 23:16:59 submit26-b9-4 systemd-coredump[677248]: Process 677245 (d8sh) of user 1001 dumped core.#012#012Stack trace of thread 677245:#012#0 0x000000000040132a execute_leaf (d8sh + 0x132a)#012#1 0x00000000004015e3 execute (d8sh + 0x15e3)#012#2 0x00000000004037a8 yyparse (d8sh + 0x37a8)#012#3 0x0000000000401741 main (d8sh + 0x1741)#012#4 0x00007f3857e2a610 __libc_start_call_main (libc.so.6 + 0x2a610)#012#5 0x00007f3857e2a6c0 __libc_start_main@@GLIBC_2.34 (libc.so.6 + 0x2a6c0)#012#6 0x0000000000401255 _start (d8sh + 0x1255)#012ELF object binary architecture: AMD x86-64
Jul 30 23:16:59 submit26-b9-4 systemd-coredump[677257]: Process 677254 (d8sh) of user 1001 dumped core.#012#012Stack trace of thread 677254:#012#0 0x000000000040132a execute_leaf (d8sh + 0x132a)#012#1 0x00000000004015e3 execute (d8sh + 0x15e3)#012#2 0x00000000004037a8 yyparse (d8sh + 0x37a8)#012#3 0x0000000000401741 main (d8sh + 0x1741)#012#4 0x00007f9326e2a610 __libc_start_call_main (libc.so.6 + 0x2a610)#012#5 0x00007f9326e2a6c0 __libc_start_main@@GLIBC_2.34 (libc.so.6 + 0x2a6c0)#012#6 0x0000000000401255 _start (d8sh + 0x1255)#012ELF object binary architecture: AMD x86-64
Jul 30 23:24:44 submit26-b9-4 kernel: show_signal_msg: 12 callbacks suppressed [x4]
Jul 30 23:24:44 submit26-b9-4 systemd-coredump[678483]: Process 678480 (d8sh) of user 1001 dumped core.#012#012Stack trace of thread 678480:#012#0 0x000000000040144c execute (d8sh + 0x144c)#012#1 0x00000000004035d3 yyparse (d8sh + 0x35d3)#012#2 0x000000000040156c main (d8sh + 0x156c)#012#3 0x00007fd4eda2a610 __libc_start_call_main (libc.so.6 + 0x2a610)#012#4 0x00007fd4eda2a6c0 __libc_start_main@@GLIBC_2.34 (libc.so.6 + 0x2a6c0)#012#5 0x0000000000401225 _start (d8sh + 0x1225)#012ELF object binary architecture: AMD x86-64
Jul 30 23:24:45 submit26-b9-4 systemd-coredump[678493]: Process 678490 (d8sh) of user 1001 dumped core.#012#012Stack trace of thread 678490:#012#0 0x000000000040144c execute (d8sh + 0x144c)#012#1 0x00000000004035d3 yyparse (d8sh + 0x35d3)#012#2 0x000000000040156c main (d8sh + 0x156c)#012#3 0x00007f439782a610 __libc_start_call_main (libc.so.6 + 0x2a610)#012#4 0x00007f439782a6c0 __libc_start_main@@GLIBC_2.34 (libc.so.6 + 0x2a6c0)#012#5 0x0000000000401225 _start (d8sh + 0x1225)#012ELF object binary architecture: AMD x86-64
Jul 30 23:24:45 submit26-b9-4 systemd-coredump[678503]: Process 678500 (d8sh) of user 1001 dumped core.#012#012Stack trace of thread 678500:#012#0 0x000000000040144c execute (d8sh + 0x144c)#012#1 0x00000000004035d3 yyparse (d8sh + 0x35d3)#012#2 0x000000000040156c main (d8sh + 0x156c)#012#3 0x00007f2acae2a610 __libc_start_call_main (libc.so.6 + 0x2a610)#012#4 0x00007f2acae2a6c0 __libc_start_main@@GLIBC_2.34 (libc.so.6 + 0x2a6c0)#012#5 0x0000000000401225 _start (d8sh + 0x1225)#012ELF object binary architecture: AMD x86-64
Jul 30 23:24:45 submit26-b9-4 systemd-coredump[678529]: Process 678526 (d8sh) of user 1001 dumped core.#012#012Stack trace of thread 678526:#012#0 0x000000000040144c execute (d8sh + 0x144c)#012#1 0x00000000004035d3 yyparse (d8sh + 0x35d3)#012#2 0x000000000040156c main (d8sh + 0x156c)#012#3 0x00007f9a83c2a610 __libc_start_call_main (libc.so.6 + 0x2a610)#012#4 0x00007f9a83c2a6c0 __libc_start_main@@GLIBC_2.34 (libc.so.6 + 0x2a6c0)#012#5 0x0000000000401225 _start (d8sh + 0x1225)#012ELF object binary architecture: AMD x86-64
Jul 30 23:24:45 submit26-b9-4 systemd-coredump[678540]: Process 678537 (d8sh) of user 1001 dumped core.#012#012Stack trace of thread 678537:#012#0 0x000000000040144c execute (d8sh + 0x144c)#012#1 0x0000000000401340 execute (d8sh + 0x1340)#012#2 0x00000000004035d3 yyparse (d8sh + 0x35d3)#012#3 0x000000000040156c main (d8sh + 0x156c)#012#4 0x00007f7c2f62a610 __libc_start_call_main (libc.so.6 + 0x2a610)#012#5 0x00007f7c2f62a6c0 __libc_start_main@@GLIBC_2.34 (libc.so.6 + 0x2a6c0)#012#6 0x0000000000401225 _start (d8sh + 0x1225)#012ELF object binary architecture: AMD x86-64
... 83 more distinct messages not shown
== talkhosts9 (2 distinct, 2 total) ==
Jul 30 23:20:22 talkhosts9 falcon-sensor-bpf[714]: CrowdStrike(4): Could not retrieve DisableProxy value: c0000225
Jul 30 23:20:22 talkhosts9 falcon-sensor-bpf[714]: CrowdStrike(4): ConnectWithProxy: Unable to get application proxy host from CsConfig: c0000225
== teaching-awards (2 distinct, 2 total) ==
Jul 30 23:29:27 teaching-awards falcon-sensor-bpf[782]: CrowdStrike(4): Could not retrieve DisableProxy value: c0000225
Jul 30 23:29:27 teaching-awards falcon-sensor-bpf[782]: CrowdStrike(4): ConnectWithProxy: Unable to get application proxy host from CsConfig: c0000225
== tulgey.cs.umd.edu (2 distinct, 2 total) ==
Jul 30 23:20:52 tulgey.cs.umd.edu falcon-sensor-bpf[1526]: CrowdStrike(4): Could not retrieve DisableProxy value: c0000225
Jul 30 23:20:52 tulgey.cs.umd.edu falcon-sensor-bpf[1526]: CrowdStrike(4): ConnectWithProxy: Unable to get application proxy host from CsConfig: c0000225
== tumtum.cs.umd.edu (2 distinct, 2 total) ==
Jul 30 23:34:40 tumtum.cs.umd.edu falcon-sensor-bpf[1360]: CrowdStrike(4): Could not retrieve DisableProxy value: c0000225
Jul 30 23:34:40 tumtum.cs.umd.edu falcon-sensor-bpf[1360]: CrowdStrike(4): ConnectWithProxy: Unable to get application proxy host from CsConfig: c0000225
== wraith (3 distinct, 3 total) ==
Jul 30 23:16:25 wraith falcon-sensor[917]: CrowdStrike(4): Could not retrieve DisableProxy value: c0000225
Jul 30 23:16:25 wraith falcon-sensor[917]: CrowdStrike(4): ConnectWithProxy: Unable to get application proxy host from CsConfig: c0000225
Jul 31 00:00:01 wraith (nin-node)[882471]: munin-node.service: Referenced but unset environment variable evaluates to an empty string: DAEMON_ARGS
== zwicker-computer (2 distinct, 2 total) ==
Jul 30 23:29:21 zwicker-computer falcon-sensor-bpf[718]: CrowdStrike(4): Could not retrieve DisableProxy value: c0000225
Jul 30 23:29:21 zwicker-computer falcon-sensor-bpf[718]: CrowdStrike(4): ConnectWithProxy: Unable to get application proxy host from CsConfig: c0000225
1
0