Command: /usr/local/sbin/syslog-digest.py
Time : 0.1630s
Status : exited 0
Output :
Syslog digest — 2026-10-07 10:05 EDT
Processed 5,979 lines, filtered 3,216 (53%). 2,763 unknown (631 distinct) from 28 host(s).
== abuse (1 distinct, 348 total) ==
Oct 7 09:05:02 abuse rsyslogd[1033]: imjournal: open() failed for path: '/var/lib/rsyslog/imjournal.state.tmp': Input/output error [v8.2404.0 try https://www.rsyslog.com/e/2433 ] [x348]
== amoeba (26 distinct, 50 total) ==
Oct 7 09:42:31 amoeba upowerd[1032]: treating change event as add on /sys/devices/pci0000:00/0000:00:14.0/usb1/1-10
Oct 7 09:42:32 amoeba upowerd[1032]: treating change event as add on /sys/devices/pci0000:00/0000:00:14.0/usb2/2-5
Oct 7 09:42:33 amoeba firefox[2279349]: Couldn't map window 0x7f8289416160 as subsurface because its parent is not mapped. [x2]
Oct 7 09:42:33 amoeba firefox[2279349]: Couldn't map window 0x7f8289f07240 as subsurface because its parent is not mapped. [x2]
Oct 7 09:42:33 amoeba firefox[2279349]: Couldn't map window 0x7f8293d927a0 as subsurface because its parent is not mapped. [x2]
Oct 7 09:42:33 amoeba firefox[2279349]: Couldn't map window 0x7f8293d92c80 as subsurface because its parent is not mapped. [x2]
Oct 7 09:42:33 amoeba firefox[2279349]: Couldn't map window 0x7f8293d93b20 as subsurface because its parent is not mapped. [x2]
Oct 7 09:42:33 amoeba firefox[2279349]: Couldn't map window 0x7f82902c87e0 as subsurface because its parent is not mapped. [x2]
Oct 7 09:42:33 amoeba firefox[2279349]: Couldn't map window 0x7f8287f5b5c0 as subsurface because its parent is not mapped. [x2]
Oct 7 09:42:33 amoeba firefox[2279349]: Couldn't map window 0x7f8297eef120 as subsurface because its parent is not mapped. [x2]
Oct 7 09:42:33 amoeba firefox[2279349]: Couldn't map window 0x7f8297eef2c0 as subsurface because its parent is not mapped. [x2]
Oct 7 09:42:33 amoeba firefox[2279349]: Couldn't map window 0x7f8297eefe20 as subsurface because its parent is not mapped. [x2]
Oct 7 09:42:33 amoeba firefox[2279349]: Couldn't map window 0x7f8297ef0980 as subsurface because its parent is not mapped. [x2]
Oct 7 09:42:33 amoeba firefox[2279349]: Couldn't map window 0x7f82a80a7640 as subsurface because its parent is not mapped. [x2]
Oct 7 09:42:33 amoeba firefox[2279349]: Couldn't map window 0x7f82a7e5fa60 as subsurface because its parent is not mapped. [x2]
Oct 7 09:42:33 amoeba firefox[2279349]: Couldn't map window 0x7f828e1e2900 as subsurface because its parent is not mapped. [x2]
Oct 7 09:42:33 amoeba firefox[2279349]: Couldn't map window 0x7f828e1e2c40 as subsurface because its parent is not mapped. [x2]
Oct 7 09:42:33 amoeba firefox[2279349]: Couldn't map window 0x7f828e1e3120 as subsurface because its parent is not mapped. [x2]
Oct 7 09:42:33 amoeba firefox[2279349]: Couldn't map window 0x7f8292fb9940 as subsurface because its parent is not mapped. [x2]
Oct 7 09:42:33 amoeba firefox[2279349]: Couldn't map window 0x7f82aaf97300 as subsurface because its parent is not mapped. [x2]
Oct 7 09:42:33 amoeba firefox[2279349]: Couldn't map window 0x7f828f87e280 as subsurface because its parent is not mapped. [x2]
Oct 7 09:42:33 amoeba firefox[2279349]: Couldn't map window 0x7f828e1e3ae0 as subsurface because its parent is not mapped. [x2]
Oct 7 09:42:33 amoeba firefox[2279349]: Couldn't map window 0x7f828e78bc80 as subsurface because its parent is not mapped. [x2]
Oct 7 09:42:33 amoeba firefox[2279349]: Couldn't map window 0x7f828e789720 as subsurface because its parent is not mapped. [x2]
Oct 7 09:42:33 amoeba firefox[2279349]: Couldn't map window 0x7f8289dafa60 as subsurface because its parent is not mapped. [x2]
Oct 7 09:42:33 amoeba firefox[2279349]: Couldn't map window 0x7f8294d10120 as subsurface because its parent is not mapped. [x2]
== b0b02.cs.umd.edu (1 distinct, 1 total) ==
Oct 7 09:17:22 b0b02.cs.umd.edu rustdesk[1185081]: cannot open display:
== biggulp.cs.umd.edu (3 distinct, 4 total) ==
Oct 7 09:13:42 biggulp.cs.umd.edu sshd-session[233582]: pam_access(sshd:auth): access denied for user `psadeghi' from `173.69.166.58'
Oct 7 09:14:48 biggulp.cs.umd.edu sshd-session[233582]: Failed Duo login for 'psadeghi' from 173.69.166.58
Oct 7 10:01:06 biggulp.cs.umd.edu sshd-session[242301]: pam_access(sshd:auth): access denied for user `asriniv1' from `71.244.129.178' [x2]
== borealis (271 distinct, 287 total) ==
Oct 7 09:10:17 borealis goa-identity-se[1241588]: GoaKerberosIdentityManager: Using polling for change notification for credential cache type 'KCM'
Oct 7 09:10:17 borealis vmware-user.desktop[1241729]: vmware-user: could not open /proc/fs/vmblock/dev
Oct 7 09:10:17 borealis gsd-usb-protect[1241685]: Failed to fetch USBGuard parameters: GDBus.Error:org.freedesktop.DBus.Error.ServiceUnknown: The name is not activatable
Oct 7 09:10:19 borealis gsd-sound[1136839]: Error releasing name org.gnome.SettingsDaemon.Sound: The connection is closed
Oct 7 09:10:19 borealis gsd-housekeepin[1136844]: Error releasing name org.gnome.SettingsDaemon.Housekeeping: The connection is closed
Oct 7 09:10:19 borealis gsd-datetime[1136830]: Error releasing name org.gnome.SettingsDaemon.Datetime: The connection is closed
Oct 7 09:10:19 borealis gsd-color[1241639]: failed to connect to device: Failed to connect to missing device /org/freedesktop/ColorManager/devices/xrandr_Dell_Inc__DELL_U2412M_7WFG152E149L_gdm_42
Oct 7 09:10:19 borealis gsd-color[1241639]: failed to connect to device: Failed to connect to missing device /org/freedesktop/ColorManager/devices/xrandr_Dell_Inc__DELL_U2412M_4V35D7133HNU_gdm_42
Oct 7 09:10:20 borealis gnome-software[1241737]: Only 0 apps for recent list, hiding [x3]
Oct 7 09:12:09 borealis packagekitd[1241609]: Failed to get cache filename for firefox [x2]
Oct 7 09:12:09 borealis packagekitd[1241609]: Failed to get cache filename for cockpit-storaged [x2]
Oct 7 09:12:09 borealis packagekitd[1241609]: Failed to get cache filename for cockpit [x2]
Oct 7 09:12:09 borealis packagekitd[1241609]: Failed to get cache filename for chromium [x2]
Oct 7 09:12:09 borealis packagekitd[1241609]: Failed to get cache filename for gstreamer1-plugins-base [x2]
Oct 7 09:12:11 borealis packagekitd[1241609]: Failed to get cache filename for ImageMagick
Oct 7 09:12:11 borealis packagekitd[1241609]: Failed to get cache filename for ImageMagick-libs
Oct 7 09:12:11 borealis packagekitd[1241609]: Failed to get cache filename for chromium-common
Oct 7 09:12:11 borealis packagekitd[1241609]: Failed to get cache filename for libavcodec-free
Oct 7 09:12:11 borealis packagekitd[1241609]: Failed to get cache filename for libavformat-free
Oct 7 09:12:11 borealis packagekitd[1241609]: Failed to get cache filename for libavutil-free
Oct 7 09:12:11 borealis packagekitd[1241609]: Failed to get cache filename for libdav1d
Oct 7 09:12:11 borealis packagekitd[1241609]: Failed to get cache filename for libswresample-free
Oct 7 09:12:11 borealis packagekitd[1241609]: Failed to get cache filename for openbao
Oct 7 09:12:11 borealis packagekitd[1241609]: Failed to get cache filename for svt-av1-libs
Oct 7 09:12:11 borealis packagekitd[1241609]: Failed to get cache filename for gum
Oct 7 09:12:11 borealis packagekitd[1241609]: Failed to get cache filename for vault
Oct 7 09:12:11 borealis packagekitd[1241609]: Failed to get cache filename for egl-wayland
Oct 7 09:12:11 borealis packagekitd[1241609]: Failed to get cache filename for apr-util
Oct 7 09:12:11 borealis packagekitd[1241609]: Failed to get cache filename for apr-util-bdb
Oct 7 09:12:11 borealis packagekitd[1241609]: Failed to get cache filename for apr-util-openssl
... 241 more distinct messages not shown
== borogove.cs.umd.edu (4 distinct, 6 total) ==
Oct 7 09:53:55 borogove.cs.umd.edu systemd-coredump[4060091]: Process 4060083 (podman) of user 981 dumped core.#012#012Stack trace of thread 4060083:#012#0 0x00005574c674246e internal/runtime/syscall/linux.Syscall6 (podman + 0x48c46e)#012#1 0x00005574c6822326 syscall.Syscall (podman + 0x56c326)#012#2 0x00005574c6822ed0 syscall.Syscall.abi0 (podman + 0x56ced0)#012#3 0x00005574c698d36e github.com/containers/podman/vendor/golang.org/x/sys/unix.OpenTree (podman + 0x6d736e)#012#4 0x00005574c6feed6b github.com/containers/podman/vendor/github.com/cyphar/filepath-securejoin/p… (podman + 0xd38d6b)#012#5 0x00005574c6feec74 github.com/containers/podman/vendor/github.com/cyphar/filepath-securejoin/p… (podman + 0xd38c74)#012#6 0x00005574c67d5f8c sync.(*Once).doSlow (podman + 0x51ff8c)#012#7 0x00005574c67d5eb9 sync.(*Once).Do (podman + 0x51feb9)#012#8 0x00005574c6
feebe5 github.com/containers/podman/vendor/github.com/cyphar/filepath-securejoin/p… (podman + 0xd38be5)#012#9 0x00005574c6ff0202 github.com/containers/podman/vendor/github.com/cyphar/filepath-securejoin/p… (podman + 0xd3a202)#012#10 0x00005574c6ff0613 github.com/containers/podman/vendor/github.com/cyphar/filepath-securejoin/p… (podman + 0xd3a613)#012#11 0x00005574c6fef73c github.com/containers/podman/vendor/github.com/cyphar/filepath-securejoin/p… (podman + 0xd3973c)#012#12 0x00005574c6fef178 github.com/containers/podman/vendor/github.com/cyphar/filepath-securejoin/p… (podman + 0xd39178)#012#13 0x00005574c67d5f8c sync.(*Once).doSlow (podman + 0x51ff8c)#012#14 0x00005574c67d5eb9 sync.(*Onc
e).Do (podman + 0x51feb9)#012#15 0x00005574c6fef0e5 github.com/containers/podman/vendor/github.com/cyphar/filepath-securejoin/p… (podman + 0xd390e5)#012#16 0x00005574c6ff05ba github.com/containers/podman/vendor/github.com/cyphar/filepath-securejoin/p… (podman + 0xd3a5ba)#012#17 0x00005574c6ff716e github.com/containers/podman/vendor/github.com/opencontainers/selinux/go-se… (podman + 0xd4116e)#012#18 0x00005574c6ff7658 github.com/containers/podman/vendor/github.com/opencontainers/selinux/go-se… (podman + 0xd41658)#012#19 0x00005574c6ff63ff github.com/containers/podman/vendor/github.com/opencontainers/selinux/go-se… (podman + 0xd403ff)#012#20 0x00005574c6ff6693 github.com/containers/podman/vendor/github.com/opencontainers/selinux/go-se… (podman + 0xd40693)#012#21 0
x00005574c71f06cb github.com/containers/podman/vendor/go.podman.io/common/pkg/config.defaultC… (podman + 0xf3a6cb)#012#22 0x00005574c71f40b2 github.com/containers/podman/vendor/go.podman.io/common/pkg/config.newLocked (podman + 0xf3e0b2)#012#23 0x00005574c71f3da5 github.com/containers/podman/vendor/go.podman.io/common/pkg/config.New (podman + 0xf3dda5)#012#24 0x00005574c7970753 github.com/containers/podman/cmd/podman/registry.newPodmanConfig (podman + 0x16ba753)#012#25 0x00005574c67d5f8c sync.(*Once).doSlow (podman + 0x51ff8c)#012#26 0x00005574c79914d0 github.com/containers/podman/cmd/podman/common.init (podman + 0x16db4d0)#012#27 0x00005574c679baf7 runtime.doInit1 (podman + 0x4e5af7)#012#28 0x00005574c678c030 runtime.main (podman + 0x4d6030)#012#29 0x00005574c67cc061 runtime.goexit.abi0 (podman + 0x516061)#012ELF object binary architecture: AMD x86-64
Oct 7 09:53:56 borogove.cs.umd.edu systemd-coredump[4060108]: Process 4060101 (podman) of user 981 dumped core.#012#012Stack trace of thread 4060101:#012#0 0x00005645cb2dd46e internal/runtime/syscall/linux.Syscall6 (podman + 0x48c46e)#012#1 0x00005645cb3bd326 syscall.Syscall (podman + 0x56c326)#012#2 0x00005645cb3bded0 syscall.Syscall.abi0 (podman + 0x56ced0)#012#3 0x00005645cb52836e github.com/containers/podman/vendor/golang.org/x/sys/unix.OpenTree (podman + 0x6d736e)#012#4 0x00005645cbb89d6b github.com/containers/podman/vendor/github.com/cyphar/filepath-securejoin/p… (podman + 0xd38d6b)#012#5 0x00005645cbb89c74 github.com/containers/podman/vendor/github.com/cyphar/filepath-securejoin/p… (podman + 0xd38c74)#012#6 0x00005645cb370f8c sync.(*Once).doSlow (podman + 0x51ff8c)#012#7 0x00005645cb370eb9 sync.(*Once).Do (podman + 0x51feb9)#012#8 0x00005645cb
b89be5 github.com/containers/podman/vendor/github.com/cyphar/filepath-securejoin/p… (podman + 0xd38be5)#012#9 0x00005645cbb8b202 github.com/containers/podman/vendor/github.com/cyphar/filepath-securejoin/p… (podman + 0xd3a202)#012#10 0x00005645cbb8b613 github.com/containers/podman/vendor/github.com/cyphar/filepath-securejoin/p… (podman + 0xd3a613)#012#11 0x00005645cbb8a73c github.com/containers/podman/vendor/github.com/cyphar/filepath-securejoin/p… (podman + 0xd3973c)#012#12 0x00005645cbb8a178 github.com/containers/podman/vendor/github.com/cyphar/filepath-securejoin/p… (podman + 0xd39178)#012#13 0x00005645cb370f8c sync.(*Once).doSlow (podman + 0x51ff8c)#012#14 0x00005645cb370eb9 sync.(*Onc
e).Do (podman + 0x51feb9)#012#15 0x00005645cbb8a0e5 github.com/containers/podman/vendor/github.com/cyphar/filepath-securejoin/p… (podman + 0xd390e5)#012#16 0x00005645cbb8b5ba github.com/containers/podman/vendor/github.com/cyphar/filepath-securejoin/p… (podman + 0xd3a5ba)#012#17 0x00005645cbb9216e github.com/containers/podman/vendor/github.com/opencontainers/selinux/go-se… (podman + 0xd4116e)#012#18 0x00005645cbb92658 github.com/containers/podman/vendor/github.com/opencontainers/selinux/go-se… (podman + 0xd41658)#012#19 0x00005645cbb913ff github.com/containers/podman/vendor/github.com/opencontainers/selinux/go-se… (podman + 0xd403ff)#012#20 0x00005645cbb91693 github.com/containers/podman/vendor/github.com/opencontainers/selinux/go-se… (podman + 0xd40693)#012#21 0
x00005645cbd8b6cb github.com/containers/podman/vendor/go.podman.io/common/pkg/config.defaultC… (podman + 0xf3a6cb)#012#22 0x00005645cbd8f0b2 github.com/containers/podman/vendor/go.podman.io/common/pkg/config.newLocked (podman + 0xf3e0b2)#012#23 0x00005645cbd8eda5 github.com/containers/podman/vendor/go.podman.io/common/pkg/config.New (podman + 0xf3dda5)#012#24 0x00005645cc50b753 github.com/containers/podman/cmd/podman/registry.newPodmanConfig (podman + 0x16ba753)#012#25 0x00005645cb370f8c sync.(*Once).doSlow (podman + 0x51ff8c)#012#26 0x00005645cc52c4d0 github.com/containers/podman/cmd/podman/common.init (podman + 0x16db4d0)#012#27 0x00005645cb336af7 runtime.doInit1 (podman + 0x4e5af7)#012#28 0x00005645cb327030 runtime.main (podman + 0x4d6030)#012#29 0x00005645cb367061 runtime.goexit.abi0 (podman + 0x516061)#012ELF object binary architecture: AMD x86-64
Oct 7 09:53:56 borogove.cs.umd.edu systemd-coredump[4060129]: Process 4060118 (podman) of user 981 dumped core.#012#012Stack trace of thread 4060118:#012#0 0x000055cfc2c4d46e internal/runtime/syscall/linux.Syscall6 (podman + 0x48c46e)#012#1 0x000055cfc2d2d326 syscall.Syscall (podman + 0x56c326)#012#2 0x000055cfc2d2ded0 syscall.Syscall.abi0 (podman + 0x56ced0)#012#3 0x000055cfc2e9836e github.com/containers/podman/vendor/golang.org/x/sys/unix.OpenTree (podman + 0x6d736e)#012#4 0x000055cfc34f9d6b github.com/containers/podman/vendor/github.com/cyphar/filepath-securejoin/p… (podman + 0xd38d6b)#012#5 0x000055cfc34f9c74 github.com/containers/podman/vendor/github.com/cyphar/filepath-securejoin/p… (podman + 0xd38c74)#012#6 0x000055cfc2ce0f8c sync.(*Once).doSlow (podman + 0x51ff8c)#012#7 0x000055cfc2ce0eb9 sync.(*Once).Do (podman + 0x51feb9)#012#8 0x000055cfc3
4f9be5 github.com/containers/podman/vendor/github.com/cyphar/filepath-securejoin/p… (podman + 0xd38be5)#012#9 0x000055cfc34fb202 github.com/containers/podman/vendor/github.com/cyphar/filepath-securejoin/p… (podman + 0xd3a202)#012#10 0x000055cfc34fb613 github.com/containers/podman/vendor/github.com/cyphar/filepath-securejoin/p… (podman + 0xd3a613)#012#11 0x000055cfc34fa73c github.com/containers/podman/vendor/github.com/cyphar/filepath-securejoin/p… (podman + 0xd3973c)#012#12 0x000055cfc34fa178 github.com/containers/podman/vendor/github.com/cyphar/filepath-securejoin/p… (podman + 0xd39178)#012#13 0x000055cfc2ce0f8c sync.(*Once).doSlow (podman + 0x51ff8c)#012#14 0x000055cfc2ce0eb9 sync.(*Onc
e).Do (podman + 0x51feb9)#012#15 0x000055cfc34fa0e5 github.com/containers/podman/vendor/github.com/cyphar/filepath-securejoin/p… (podman + 0xd390e5)#012#16 0x000055cfc34fb5ba github.com/containers/podman/vendor/github.com/cyphar/filepath-securejoin/p… (podman + 0xd3a5ba)#012#17 0x000055cfc350216e github.com/containers/podman/vendor/github.com/opencontainers/selinux/go-se… (podman + 0xd4116e)#012#18 0x000055cfc3502658 github.com/containers/podman/vendor/github.com/opencontainers/selinux/go-se… (podman + 0xd41658)#012#19 0x000055cfc35013ff github.com/containers/podman/vendor/github.com/opencontainers/selinux/go-se… (podman + 0xd403ff)#012#20 0x000055cfc3501693 github.com/containers/podman/vendor/github.com/opencontainers/selinux/go-se… (podman + 0xd40693)#012#21 0
x000055cfc36fb6cb github.com/containers/podman/vendor/go.podman.io/common/pkg/config.defaultC… (podman + 0xf3a6cb)#012#22 0x000055cfc36ff0b2 github.com/containers/podman/vendor/go.podman.io/common/pkg/config.newLocked (podman + 0xf3e0b2)#012#23 0x000055cfc36feda5 github.com/containers/podman/vendor/go.podman.io/common/pkg/config.New (podman + 0xf3dda5)#012#24 0x000055cfc3e7b753 github.com/containers/podman/cmd/podman/registry.newPodmanConfig (podman + 0x16ba753)#012#25 0x000055cfc2ce0f8c sync.(*Once).doSlow (podman + 0x51ff8c)#012#26 0x000055cfc3e9c4d0 github.com/containers/podman/cmd/podman/common.init (podman + 0x16db4d0)#012#27 0x000055cfc2ca6af7 runtime.doInit1 (podman + 0x4e5af7)#012#28 0x000055cfc2c97030 runtime.main (podman + 0x4d6030)#012#29 0x000055cfc2cd7061 runtime.goexit.abi0 (podman + 0x516061)#012ELF object binary architecture: AMD x86-64
Oct 7 09:53:57 borogove.cs.umd.edu setroubleshoot[4060084]: SELinux is preventing /usr/bin/podman from using the nnp_transition access on a process. For complete SELinux messages run: sealert -l 943607a4-c5d0-476d-aadf-76d13a9d5acf [x3]
== gle-dind04 (3 distinct, 3 total) ==
Oct 7 09:51:45 gle-dind04 falcon-sensor-bpf[1017]: CrowdStrike(4): Could not retrieve DisableProxy value: c0000225
Oct 7 09:51:45 gle-dind04 falcon-sensor-bpf[1017]: CrowdStrike(4): ConnectWithProxy: Unable to get application proxy host from CsConfig: c0000225
Oct 7 09:53:34 gle-dind04 lldpd[1171]: unable to send packet on real device for vethf0090d7: No such device or address
== grosh (47 distinct, 55 total) ==
Oct 7 09:37:48 grosh packagekitd[2066251]: Failed to get cache filename for tailscale
Oct 7 09:37:48 grosh packagekitd[2066251]: Failed to get cache filename for vlc
Oct 7 09:37:48 grosh packagekitd[2066251]: Failed to get cache filename for vlc-cli
Oct 7 09:37:48 grosh packagekitd[2066251]: Failed to get cache filename for vlc-gui-qt
Oct 7 09:37:48 grosh packagekitd[2066251]: Failed to get cache filename for vlc-gui-skins2
Oct 7 09:37:48 grosh packagekitd[2066251]: Failed to get cache filename for vlc-libs
Oct 7 09:37:48 grosh packagekitd[2066251]: Failed to get cache filename for vlc-plugin-gnome
Oct 7 09:37:48 grosh packagekitd[2066251]: Failed to get cache filename for vlc-plugin-lua
Oct 7 09:37:48 grosh packagekitd[2066251]: Failed to get cache filename for vlc-plugin-notify
Oct 7 09:37:48 grosh packagekitd[2066251]: Failed to get cache filename for vlc-plugin-pulseaudio
Oct 7 09:37:48 grosh packagekitd[2066251]: Failed to get cache filename for vlc-plugin-visualization
Oct 7 09:37:48 grosh packagekitd[2066251]: Failed to get cache filename for vlc-plugins-base
Oct 7 09:37:48 grosh packagekitd[2066251]: Failed to get cache filename for vlc-plugins-extra
Oct 7 09:37:48 grosh packagekitd[2066251]: Failed to get cache filename for vlc-plugins-video-out
Oct 7 09:37:48 grosh packagekitd[2066251]: Failed to get cache filename for cosmic-epoch [x3]
Oct 7 09:37:48 grosh packagekitd[2066251]: Failed to get cache filename for amd-ucode-firmware
Oct 7 09:37:48 grosh packagekitd[2066251]: Failed to get cache filename for atheros-firmware
Oct 7 09:37:48 grosh packagekitd[2066251]: Failed to get cache filename for brcmfmac-firmware
Oct 7 09:37:48 grosh packagekitd[2066251]: Failed to get cache filename for cirrus-audio-firmware
Oct 7 09:37:48 grosh packagekitd[2066251]: Failed to get cache filename for cockpit
Oct 7 09:37:48 grosh packagekitd[2066251]: Failed to get cache filename for cockpit-bridge
Oct 7 09:37:48 grosh packagekitd[2066251]: Failed to get cache filename for cockpit-system
Oct 7 09:37:48 grosh packagekitd[2066251]: Failed to get cache filename for intel-audio-firmware
Oct 7 09:37:48 grosh packagekitd[2066251]: Failed to get cache filename for intel-vsc-firmware
Oct 7 09:37:48 grosh packagekitd[2066251]: Failed to get cache filename for iwlwifi-dvm-firmware
Oct 7 09:37:48 grosh packagekitd[2066251]: Failed to get cache filename for iwlwifi-mvm-firmware
Oct 7 09:37:48 grosh packagekitd[2066251]: Failed to get cache filename for libbrotli
Oct 7 09:37:48 grosh packagekitd[2066251]: Failed to get cache filename for libertas-firmware
Oct 7 09:37:48 grosh packagekitd[2066251]: Failed to get cache filename for linux-firmware
Oct 7 09:37:48 grosh packagekitd[2066251]: Failed to get cache filename for linux-firmware-whence
... 17 more distinct messages not shown
== idm00 (1 distinct, 1 total) ==
Oct 7 09:54:41 idm00 named[4166701]: client @0x7f11a93cbc38 10.73.240.42#62109: update '73.10.in-addr.arpa/IN' denied
== idmp0 (1 distinct, 1 total) ==
Oct 7 09:39:33 idmp0 named[1598691]: client @0x7f2d2c011658 10.73.240.43#57589: update '73.10.in-addr.arpa/IN' denied
== irb2156 (19 distinct, 19 total) ==
Oct 7 10:03:08 irb2156 packagekitd[1915914]: Failed to get cache filename for vlc
Oct 7 10:03:08 irb2156 packagekitd[1915914]: Failed to get cache filename for vlc-cli
Oct 7 10:03:08 irb2156 packagekitd[1915914]: Failed to get cache filename for vlc-gui-qt
Oct 7 10:03:08 irb2156 packagekitd[1915914]: Failed to get cache filename for vlc-gui-skins2
Oct 7 10:03:08 irb2156 packagekitd[1915914]: Failed to get cache filename for vlc-libs
Oct 7 10:03:08 irb2156 packagekitd[1915914]: Failed to get cache filename for vlc-plugin-ffmpeg
Oct 7 10:03:08 irb2156 packagekitd[1915914]: Failed to get cache filename for vlc-plugin-gnome
Oct 7 10:03:08 irb2156 packagekitd[1915914]: Failed to get cache filename for vlc-plugin-kde
Oct 7 10:03:08 irb2156 packagekitd[1915914]: Failed to get cache filename for vlc-plugin-lua
Oct 7 10:03:08 irb2156 packagekitd[1915914]: Failed to get cache filename for vlc-plugin-notify
Oct 7 10:03:08 irb2156 packagekitd[1915914]: Failed to get cache filename for vlc-plugin-pulseaudio
Oct 7 10:03:08 irb2156 packagekitd[1915914]: Failed to get cache filename for vlc-plugin-visualization
Oct 7 10:03:08 irb2156 packagekitd[1915914]: Failed to get cache filename for vlc-plugins-base
Oct 7 10:03:08 irb2156 packagekitd[1915914]: Failed to get cache filename for vlc-plugins-extra
Oct 7 10:03:08 irb2156 packagekitd[1915914]: Failed to get cache filename for vlc-plugins-video-out
Oct 7 10:03:08 irb2156 packagekitd[1915914]: Failed to get cache filename for firefox-nightly
Oct 7 10:03:08 irb2156 packagekitd[1915914]: Failed to get cache filename for google-chrome-stable
Oct 7 10:03:08 irb2156 packagekitd[1915914]: Failed to get cache filename for asdcplib
Oct 7 10:03:08 irb2156 packagekitd[1915914]: Failed to get cache filename for xerces-c
== itmon02 (1 distinct, 1 total) ==
Oct 7 10:03:57 itmon02 sshd[805675]: error: beginning MaxStartups throttling
== kadath.cs.umd.edu (9 distinct, 11 total) ==
Oct 7 09:49:04 kadath.cs.umd.edu goa-identity-se[175135]: GoaKerberosIdentityManager: Using polling for change notification for credential cache type 'KCM'
Oct 7 09:49:05 kadath.cs.umd.edu vmware-user.desktop[175315]: vmware-user: could not open /proc/fs/vmblock/dev
Oct 7 09:49:05 kadath.cs.umd.edu gsd-usb-protect[175280]: Failed to fetch USBGuard parameters: GDBus.Error:org.freedesktop.DBus.Error.ServiceUnknown: The name is not activatable
Oct 7 09:49:08 kadath.cs.umd.edu gnome-software[175274]: Only 0 apps for recent list, hiding [x3]
Oct 7 10:03:38 kadath.cs.umd.edu sudo[180902]: pam_unix(sudo:auth): conversation failed
Oct 7 10:03:38 kadath.cs.umd.edu sudo[180902]: pam_unix(sudo:auth): auth could not identify password for [mmarsh]
Oct 7 10:04:54 kadath.cs.umd.edu kernel: process 'grading/follow-up/for_student/target' started with executable stack
Oct 7 10:04:54 kadath.cs.umd.edu falcon-sensor-bpf[950]: CrowdStrike(4): Could not retrieve DisableProxy value: c0000225
Oct 7 10:04:54 kadath.cs.umd.edu falcon-sensor-bpf[950]: CrowdStrike(4): ConnectWithProxy: Unable to get application proxy host from CsConfig: c0000225
== krispykreme.cs.umd.edu (2 distinct, 2 total) ==
Oct 7 09:15:04 krispykreme.cs.umd.edu krb5_child[3022855]: Preauthentication failed
Oct 7 09:15:04 krispykreme.cs.umd.edu sshd-session[3022846]: error: PAM: Authentication failure for psadeghi from 10.206.11.44
== munin (2 distinct, 16 total) ==
Oct 7 09:38:02 munin sudo[1222770]: pam_systemd(sudo:session): Failed to stat() runtime directory '/run/user/0': No such file or directory [x8]
Oct 7 09:38:02 munin sudo[1222770]: pam_systemd(sudo:session): Not setting $XDG_RUNTIME_DIR, as the directory is not in order. [x8]
== netman.cs.umd.edu (1 distinct, 1 total) ==
Oct 7 09:40:02 netman.cs.umd.edu systemd[1]: insights-client.service: Start request repeated too quickly.
== newhonors2 (1 distinct, 24 total) ==
Oct 7 09:13:02 newhonors2 dhcpcd[3684443]: dhcpcd is not running [x24]
== nightingale (106 distinct, 152 total) ==
Oct 7 09:59:54 nightingale goa-identity-se[3641613]: GoaKerberosIdentityManager: Using polling for change notification for credential cache type 'KCM'
Oct 7 09:59:54 nightingale vmware-user.desktop[3641737]: vmware-user: could not open /proc/fs/vmblock/dev
Oct 7 09:59:55 nightingale gsd-usb-protect[3641718]: Failed to fetch USBGuard parameters: GDBus.Error:org.freedesktop.DBus.Error.ServiceUnknown: The name is not activatable
Oct 7 09:59:56 nightingale gsd-color[3641655]: failed to connect to device: Failed to connect to missing device /org/freedesktop/ColorManager/devices/xrandr_Acer_Technologies_B246WL_T1ZAA0012420_gdm_42
Oct 7 09:59:59 nightingale PanGPUI[3641704]: QObject::connect: No such slot PanGPUIWebDialog::onReload()
Oct 7 09:59:59 nightingale PanGPUI[3641704]: Setting a QCompleter on non-editable QComboBox is not allowed.
Oct 7 09:59:59 nightingale PanGPUI[3641704]: QLayout: Attempting to add QLayout "" to ConnectionsTab "", which already has a layout [x5]
Oct 7 09:59:59 nightingale PanGPUI[3641704]: QLayout: Attempting to add QLayout "" to TroubleShootingTab "", which already has a layout
Oct 7 09:59:59 nightingale PanGPUI[3641704]: QLayout: Attempting to add QLayout "" to PanGPUIFedMandateDialog "", which already has a layout
Oct 7 09:59:59 nightingale PanGPUI[3641704]: QLayout: Attempting to add QLayout "" to PanGPUIPreferredGwDialog "", which already has a layout
Oct 7 09:59:59 nightingale PanGPUI[3641704]: QLayout: Attempting to add QLayout "" to PanGPUICertSelectDialog "", which already has a layout
Oct 7 10:00:06 nightingale gnome-software[3641675]: Kind change on net.launchpad.Gnuclad from console-application to desktop-application is not OK
Oct 7 10:00:08 nightingale gnome-software[3641675]: Kind change on io.github.sil_car.SqueezeVid from console-application to desktop-application is not OK
Oct 7 10:00:10 nightingale gnome-software[3641675]: Kind change on net.mkiol.SpeechNote.Addon.amd from addon to runtime is not OK
Oct 7 10:00:10 nightingale gnome-software[3641675]: Kind change on net.mkiol.SpeechNote.Addon.nvidia from addon to runtime is not OK
Oct 7 10:00:10 nightingale gnome-software[3641675]: Kind change on org.videolan.VLC.Plugin.pause_click from addon to runtime is not OK
Oct 7 10:00:13 nightingale gnome-software[3641675]: Kind change on com.github.ilai_deutel.kibi from console-application to desktop-application is not OK
Oct 7 10:00:14 nightingale gnome-software[3641675]: Kind change on dev.paullee.scraterpreter.Scrape from console-application to desktop-application is not OK
Oct 7 10:00:14 nightingale gnome-software[3641675]: Kind change on dev.paullee.scraterpreter.Scrapec from console-application to desktop-application is not OK
Oct 7 10:00:14 nightingale gnome-software[3641675]: Kind change on fr.inria.corese.CoreseCommand from console-application to desktop-application is not OK
Oct 7 10:00:14 nightingale gnome-software[3641675]: Kind change on io.github.coccinelle.coccinelle from console-application to desktop-application is not OK
Oct 7 10:00:14 nightingale gnome-software[3641675]: Kind change on io.github.erkin.ponysay from console-application to desktop-application is not OK
Oct 7 10:00:16 nightingale gnome-software[3641675]: Kind change on net.imaginaryinfinity.Squiid from console-application to desktop-application is not OK
Oct 7 10:00:16 nightingale gnome-software[3641675]: Kind change on org.eu.wabarc.wayback from console-application to desktop-application is not OK
Oct 7 10:00:18 nightingale gnome-software[3641675]: Kind change on com.jeffser.Alpaca.Plugins.AMD from addon to runtime is not OK
Oct 7 10:00:18 nightingale gnome-software[3641675]: Kind change on com.jeffser.Alpaca.Plugins.Ollama from addon to runtime is not OK
Oct 7 10:00:18 nightingale gnome-software[3641675]: Kind change on com.sublimetext.three.DevUtils from addon to runtime is not OK [x4]
Oct 7 10:00:18 nightingale gnome-software[3641675]: Kind change on com.valvesoftware.Steam.Utility.slonfig from addon to runtime is not OK
Oct 7 10:00:23 nightingale gnome-software[3641675]: Kind change on com.valvesoftware.Steam.Utility.InhibitScreensaver from addon to runtime is not OK
Oct 7 10:00:23 nightingale gnome-software[3641675]: Kind change on com.valvesoftware.Steam.Utility.steamtinkerlaunch from addon to runtime is not OK
... 76 more distinct messages not shown
== ntop00 (97 distinct, 97 total) ==
Oct 7 09:05:01 ntop00 nfacctd[1075699]: INFO ( m1/mysql ): *** Purging cache - START (PID: 4642) ***
Oct 7 09:05:01 ntop00 nfacctd[1075699]: INFO ( m1/mysql ): *** Purging cache - END (PID: 4642, QN: 62/62, ET: 0) ***
Oct 7 09:05:09 ntop00 sfacctd[1075592]: INFO ( m1/mysql ): *** Purging cache - END (PID: 4642, QN: 4815/4815, ET: 8) ***
Oct 7 09:08:01 ntop00 sfacctd[1075592]: INFO ( p1/print ): *** Purging cache - START (PID: 4643) ***
Oct 7 09:08:01 ntop00 sfacctd[1075592]: INFO ( p1/print ): *** Purging cache - END (PID: 4643, QN: 4829/4829, ET: 0) ***
Oct 7 09:08:01 ntop00 nfacctd[1075699]: INFO ( p1/print ): *** Purging cache - START (PID: 4643) ***
Oct 7 09:08:01 ntop00 nfacctd[1075699]: INFO ( p1/print ): *** Purging cache - END (PID: 4643, QN: 55/55, ET: 0) ***
Oct 7 09:10:01 ntop00 sfacctd[1075592]: INFO ( m1/mysql ): *** Purging cache - START (PID: 4644) ***
Oct 7 09:10:01 ntop00 nfacctd[1075699]: INFO ( m1/mysql ): *** Purging cache - START (PID: 4644) ***
Oct 7 09:10:01 ntop00 nfacctd[1075699]: INFO ( m1/mysql ): *** Purging cache - END (PID: 4644, QN: 55/55, ET: 0) ***
Oct 7 09:10:09 ntop00 sfacctd[1075592]: INFO ( m1/mysql ): *** Purging cache - END (PID: 4644, QN: 4936/4936, ET: 8) ***
Oct 7 09:13:01 ntop00 sfacctd[1075592]: INFO ( p1/print ): *** Purging cache - START (PID: 4645) ***
Oct 7 09:13:01 ntop00 sfacctd[1075592]: INFO ( p1/print ): *** Purging cache - END (PID: 4645, QN: 4882/4882, ET: 0) ***
Oct 7 09:13:01 ntop00 nfacctd[1075699]: INFO ( p1/print ): *** Purging cache - START (PID: 4645) ***
Oct 7 09:13:01 ntop00 nfacctd[1075699]: INFO ( p1/print ): *** Purging cache - END (PID: 4645, QN: 57/57, ET: 0) ***
Oct 7 09:15:01 ntop00 sfacctd[1075592]: INFO ( m1/mysql ): *** Purging cache - START (PID: 4646) ***
Oct 7 09:15:01 ntop00 nfacctd[1075699]: INFO ( m1/mysql ): *** Purging cache - START (PID: 4646) ***
Oct 7 09:15:02 ntop00 nfacctd[1075699]: INFO ( m1/mysql ): *** Purging cache - END (PID: 4646, QN: 57/57, ET: 1) ***
Oct 7 09:15:08 ntop00 sfacctd[1075592]: INFO ( m1/mysql ): *** Purging cache - END (PID: 4646, QN: 5050/5050, ET: 7) ***
Oct 7 09:18:01 ntop00 sfacctd[1075592]: INFO ( p1/print ): *** Purging cache - START (PID: 4647) ***
Oct 7 09:18:01 ntop00 sfacctd[1075592]: INFO ( p1/print ): *** Purging cache - END (PID: 4647, QN: 4963/4963, ET: 0) ***
Oct 7 09:18:02 ntop00 nfacctd[1075699]: INFO ( p1/print ): *** Purging cache - START (PID: 4647) ***
Oct 7 09:18:02 ntop00 nfacctd[1075699]: INFO ( p1/print ): *** Purging cache - END (PID: 4647, QN: 56/56, ET: 0) ***
Oct 7 09:20:01 ntop00 sfacctd[1075592]: INFO ( m1/mysql ): *** Purging cache - START (PID: 4648) ***
Oct 7 09:20:02 ntop00 nfacctd[1075699]: INFO ( m1/mysql ): *** Purging cache - START (PID: 4648) ***
Oct 7 09:20:02 ntop00 nfacctd[1075699]: INFO ( m1/mysql ): *** Purging cache - END (PID: 4648, QN: 53/53, ET: 0) ***
Oct 7 09:20:08 ntop00 sfacctd[1075592]: INFO ( m1/mysql ): *** Purging cache - END (PID: 4648, QN: 4848/4848, ET: 7) ***
Oct 7 09:23:01 ntop00 sfacctd[1075592]: INFO ( p1/print ): *** Purging cache - START (PID: 4649) ***
Oct 7 09:23:01 ntop00 sfacctd[1075592]: INFO ( p1/print ): *** Purging cache - END (PID: 4649, QN: 4859/4859, ET: 0) ***
Oct 7 09:23:01 ntop00 nfacctd[1075699]: INFO ( p1/print ): *** Purging cache - START (PID: 4649) ***
... 67 more distinct messages not shown
== outbound00.cs.umd.edu (1 distinct, 6 total) ==
Oct 7 09:09:09 outbound00.cs.umd.edu python3[236182]: ldapdb [x6]
== outbound01.cs.umd.edu (1 distinct, 6 total) ==
Oct 7 09:13:06 outbound01.cs.umd.edu python3[1695822]: ldapdb [x6]
== portal (1 distinct, 71 total) ==
Oct 7 09:05:28 portal setroubleshoot[1751394]: SELinux is preventing /usr/local/bin/traefik from connectto access on the unix_stream_socket /run/podman/podman.sock. For complete SELinux messages run: sealert -l e0a307a3-2c22-4320-8f9d-6a166c45222d [x71]
== strawberry (7 distinct, 38 total) ==
Oct 7 09:07:03 strawberry kernel: I/O error, dev sda, sector 206848 op 0x0:(READ) flags 0x80700 phys_seg 1 prio class 2 [x6]
Oct 7 09:07:03 strawberry kernel: I/O error, dev sda, sector 206848 op 0x0:(READ) flags 0x0 phys_seg 1 prio class 2 [x6]
Oct 7 09:07:03 strawberry kernel: Buffer I/O error on dev sda2, logical block 0, async page read [x6]
Oct 7 09:07:03 strawberry kernel: I/O error, dev sda, sector 2048 op 0x0:(READ) flags 0x80700 phys_seg 1 prio class 2 [x6]
Oct 7 09:07:03 strawberry kernel: I/O error, dev sda, sector 2048 op 0x0:(READ) flags 0x0 phys_seg 1 prio class 2 [x6]
Oct 7 09:07:03 strawberry kernel: Buffer I/O error on dev sda1, logical block 0, async page read [x6]
Oct 7 09:34:42 strawberry smartd[5314]: Device: /dev/sda [SAT], failed to read SMART Attribute Data [x2]
== submit10-cln25 (5 distinct, 1539 total) ==
Oct 7 09:05:22 submit10-cln25 rsyslogd: file '/var/log/messages': open error: Input/output error [v8.24.0-57.el7_9.3 try http://www.rsyslog.com/e/2433 ] [x1200]
Oct 7 09:05:22 submit10-cln25 rsyslogd: imjournal: fopen() failed for path: '/var/lib/rsyslog/imjournal.state.tmp': Input/output error [v8.24.0-57.el7_9.3 try http://www.rsyslog.com/e/2013 ] [x334]
Oct 7 09:25:00 submit10-cln25 systemd: Failed at step USER spawning /usr/libexec/pcp/bin/pmlogger_check: Input/output error [x2]
Oct 7 09:28:00 submit10-cln25 systemd: Failed at step USER spawning /usr/libexec/pcp/bin/pmie_check: Input/output error [x2]
Oct 7 09:30:00 submit10-cln25 systemd: Failed at step USER spawning /usr/libexec/pcp/bin/pmlogger_daily: Input/output error
== submit26-b9-3 (1 distinct, 4 total) ==
Sep 9 07:43:02 submit26-b9-3 systemd[1]: user(a)1001.service: Main process exited, code=killed, status=9/KILL [x4]
== submit26-b9-f1 (1 distinct, 2 total) ==
Oct 7 09:40:06 submit26-b9-f1 systemd[1]: user(a)1001.service: Main process exited, code=killed, status=9/KILL [x2]
== submit26-b9-f3 (9 distinct, 9 total) ==
Oct 7 09:06:49 submit26-b9-f3 setroubleshoot[1917136]: SELinux is preventing /usr/bin/python3.9 from create access on the directory /(null). For complete SELinux messages run: sealert -l a653b772-cbcd-438b-bae5-23c3dc69b31b
Oct 7 09:06:49 submit26-b9-f3 setroubleshoot[1917136]: SELinux is preventing /usr/bin/python3.9 from add_name access on the directory /(null). For complete SELinux messages run: sealert -l 3e904634-6caa-4202-8c92-f139db798859
Oct 7 09:06:49 submit26-b9-f3 setroubleshoot[1917136]: SELinux is preventing /usr/bin/python3.9 from create access on the file /(null). For complete SELinux messages run: sealert -l 580b20e4-ec2c-433d-905c-5bd417fba033
Oct 7 09:06:49 submit26-b9-f3 setroubleshoot[1917136]: SELinux is preventing /usr/bin/python3.9 from open access on the file /tmp/libdnf.XfQ7VR/repodata/repomd.xml. For complete SELinux messages run: sealert -l 27f29d48-5e7c-4db7-b051-8ac055737d6f
Oct 7 09:06:49 submit26-b9-f3 setroubleshoot[1917136]: SELinux is preventing /usr/bin/python3.9 from setattr access on the file repomd.xml. For complete SELinux messages run: sealert -l bff72452-d40a-430b-9060-dd0a48f5b6ba
Oct 7 09:06:49 submit26-b9-f3 setroubleshoot[1917136]: SELinux is preventing /usr/bin/python3.9 from read access on the directory libdnf.XfQ7VR. For complete SELinux messages run: sealert -l 9638d396-8ce5-4e6a-ae47-45cd3985e1cd
Oct 7 09:06:49 submit26-b9-f3 setroubleshoot[1917136]: SELinux is preventing /usr/bin/python3.9 from remove_name access on the directory repomd.xml. For complete SELinux messages run: sealert -l 6da64b94-7024-45a9-b8c2-3b9812517407
Oct 7 09:06:49 submit26-b9-f3 setroubleshoot[1917136]: SELinux is preventing /usr/bin/python3.9 from unlink access on the file repomd.xml. For complete SELinux messages run: sealert -l 64cbe179-abf1-4d5a-bade-bb164897ee65
Oct 7 09:06:49 submit26-b9-f3 setroubleshoot[1917136]: SELinux is preventing /usr/bin/python3.9 from rmdir access on the directory repodata. For complete SELinux messages run: sealert -l d2e35b1a-e27c-4f91-9217-2bb1204e1e68
== submit26-b9-f4 (9 distinct, 9 total) ==
Oct 7 09:24:53 submit26-b9-f4 setroubleshoot[202454]: SELinux is preventing /usr/bin/python3.9 from create access on the directory /(null). For complete SELinux messages run: sealert -l ee160f23-b161-4f4a-9985-c4edfd3a5beb
Oct 7 09:24:53 submit26-b9-f4 setroubleshoot[202454]: SELinux is preventing /usr/bin/python3.9 from add_name access on the directory /(null). For complete SELinux messages run: sealert -l 89a83821-4b24-4081-9973-0a79ca6ed5b4
Oct 7 09:24:54 submit26-b9-f4 setroubleshoot[202454]: SELinux is preventing /usr/bin/python3.9 from create access on the file /(null). For complete SELinux messages run: sealert -l f73955d6-1416-45f9-bab6-ff1f3ea07e9d
Oct 7 09:24:54 submit26-b9-f4 setroubleshoot[202454]: SELinux is preventing /usr/bin/python3.9 from open access on the file /tmp/libdnf.FzhOM7/repodata/repomd.xml. For complete SELinux messages run: sealert -l 9f8f24a0-8fb6-454d-a103-31a8f7a6efa0
Oct 7 09:24:54 submit26-b9-f4 setroubleshoot[202454]: SELinux is preventing /usr/bin/python3.9 from setattr access on the file repomd.xml. For complete SELinux messages run: sealert -l 20293136-86a3-40ba-a651-cff48d36059e
Oct 7 09:24:54 submit26-b9-f4 setroubleshoot[202454]: SELinux is preventing /usr/bin/python3.9 from read access on the directory libdnf.FzhOM7. For complete SELinux messages run: sealert -l 25f86b49-4ee7-4f60-ad1c-73a70032560c
Oct 7 09:24:54 submit26-b9-f4 setroubleshoot[202454]: SELinux is preventing /usr/bin/python3.9 from remove_name access on the directory repomd.xml. For complete SELinux messages run: sealert -l eec250fb-073f-456d-93bc-f98776fd476d
Oct 7 09:24:54 submit26-b9-f4 setroubleshoot[202454]: SELinux is preventing /usr/bin/python3.9 from unlink access on the file repomd.xml. For complete SELinux messages run: sealert -l c9209e04-a349-43d5-8cb2-3e303e48df74
Oct 7 09:24:54 submit26-b9-f4 setroubleshoot[202454]: SELinux is preventing /usr/bin/python3.9 from rmdir access on the directory repodata. For complete SELinux messages run: sealert -l 3178d5f5-80e9-404b-92b7-9bef397a8915
1
0
Command: /usr/local/sbin/syslog-digest.py
Time : 0.3068s
Status : exited 0
Output :
Syslog digest — 2026-10-07 09:05 EDT
Processed 10,505 lines, filtered 3,011 (28%). 7,494 unknown (225 distinct) from 22 host(s).
== abuse (1 distinct, 345 total) ==
Oct 7 08:05:25 abuse rsyslogd[1033]: imjournal: open() failed for path: '/var/lib/rsyslog/imjournal.state.tmp': Input/output error [v8.2404.0 try https://www.rsyslog.com/e/2433 ] [x345]
== amoeba (2 distinct, 5222 total) ==
Oct 7 08:05:01 amoeba packagekitd[2509360]: failed to parse public key for /etc/pki/rpm-gpg/RPM-GPG-KEY-PQC-redhat-release [x5221]
Oct 7 08:30:13 amoeba systemd-coredump[2545560]: Process 2509360 (packagekitd) of user 0 dumped core.#012#012Stack trace of thread 2545557:#012#0 0x00007f4e9f08d38c n/a (n/a + 0x0)#012ELF object binary architecture: AMD x86-64
== b0b02.cs.umd.edu (1 distinct, 1 total) ==
Oct 7 08:17:18 b0b02.cs.umd.edu rustdesk[1170004]: cannot open display:
== bachata (10 distinct, 10 total) ==
Oct 7 08:48:35 bachata smbd[34550]: [2026/10/07 08:48:35.265627, 0] ../../source3/smbd/smb2_service.c:117(chdir_current_service)
Oct 7 08:48:35 bachata smbd[34550]: chdir_current_service: vfs_ChDir(/fs/junkfood/nelson) failed: Permission denied. Current token: uid=20608, gid=20608, 19 groups: 20608 31006 30043 319050000 30736 30871 25274 15248 15206 25025 15294 15228 319000009 30872 25057 30742 25200 25038 25195
Oct 7 08:48:35 bachata smbd[34550]: [2026/10/07 08:48:35.267609, 0] ../../source3/smbd/smbXsrv_tcon.c:914(smbXsrv_tcon_disconnect)
Oct 7 08:48:35 bachata smbd[34550]: smbXsrv_tcon_disconnect: disconnect(0x2fba78d7, 'nelson'): chdir_current_service() failed: NT_STATUS_INTERNAL_ERROR
Oct 7 08:48:35 bachata smbd[34550]: [2026/10/07 08:48:35.268954, 0] ../../source3/smbd/smbXsrv_tcon.c:1028(smbXsrv_tcon_disconnect_all)
Oct 7 08:48:35 bachata smbd[34550]: smbXsrv_tcon_disconnect_all: count[3] errors[1] first[NT_STATUS_INTERNAL_ERROR]
Oct 7 08:48:35 bachata smbd[34550]: [2026/10/07 08:48:35.269046, 0] ../../source3/smbd/smbXsrv_session.c:1901(smbXsrv_session_logoff)
Oct 7 08:48:35 bachata smbd[34550]: smbXsrv_session_logoff: smbXsrv_session_logoff(0x35f5a2fd): smb2srv_tcon_disconnect_all() failed: NT_STATUS_INTERNAL_ERROR
Oct 7 08:48:35 bachata smbd[34550]: [2026/10/07 08:48:35.269138, 0] ../../source3/smbd/smbXsrv_session.c:1729(smbXsrv_session_remove_channel_done)
Oct 7 08:48:35 bachata smbd[34550]: smbXsrv_session_remove_channel_done: smbXsrv_session_logoff(905290493) failed: NT_STATUS_INTERNAL_ERROR
== biggulp.cs.umd.edu (6 distinct, 6 total) ==
Oct 7 08:36:29 biggulp.cs.umd.edu sshd-session[227663]: error: kex_protocol_error: type 20 seq 2 [preauth]
Oct 7 08:36:29 biggulp.cs.umd.edu sshd-session[227663]: error: kex_protocol_error: type 30 seq 3 [preauth]
Oct 7 08:36:31 biggulp.cs.umd.edu sshd-session[227663]: error: kex_protocol_error: type 20 seq 4 [preauth]
Oct 7 08:36:31 biggulp.cs.umd.edu sshd-session[227663]: error: kex_protocol_error: type 30 seq 5 [preauth]
Oct 7 08:36:34 biggulp.cs.umd.edu sshd-session[227663]: error: kex_protocol_error: type 20 seq 6 [preauth]
Oct 7 08:36:34 biggulp.cs.umd.edu sshd-session[227663]: error: kex_protocol_error: type 30 seq 7 [preauth]
== cheezit.cs.umd.edu (8 distinct, 12 total) ==
Oct 7 08:31:25 cheezit.cs.umd.edu kernel: Warning: Deprecated Driver is detected: nft_compat will not be maintained in a future major release and may be disabled
Oct 7 08:31:25 cheezit.cs.umd.edu kernel: Warning: Deprecated Driver is detected: nft_compat_module_init will not be maintained in a future major release and may be disabled
Oct 7 08:36:21 cheezit.cs.umd.edu sshd-session[304952]: error: kex_protocol_error: type 20 seq 2 [preauth] [x2]
Oct 7 08:36:21 cheezit.cs.umd.edu sshd-session[304952]: error: kex_protocol_error: type 30 seq 3 [preauth] [x2]
Oct 7 08:36:23 cheezit.cs.umd.edu sshd-session[304952]: error: kex_protocol_error: type 20 seq 4 [preauth] [x2]
Oct 7 08:36:23 cheezit.cs.umd.edu sshd-session[304952]: error: kex_protocol_error: type 30 seq 5 [preauth] [x2]
Oct 7 08:36:25 cheezit.cs.umd.edu sshd-session[304952]: error: kex_protocol_error: type 20 seq 6 [preauth]
Oct 7 08:36:25 cheezit.cs.umd.edu sshd-session[304952]: error: kex_protocol_error: type 30 seq 7 [preauth]
== emaar (1 distinct, 1 total) ==
Oct 7 08:43:16 emaar puppet-agent[3062161]: (Facter) invalid or malformed lldp data: MalformedDataError: no lldp interface data found
== hackerman (1 distinct, 1 total) ==
Oct 7 08:53:48 hackerman systemd[1]: insights-client.service: Start request repeated too quickly.
== idm00 (1 distinct, 1 total) ==
Oct 7 08:54:41 idm00 named[4166701]: client @0x7f119854a418 10.73.240.42#49654: update '73.10.in-addr.arpa/IN' denied
== idmp0 (1 distinct, 1 total) ==
Oct 7 08:39:33 idmp0 named[1598691]: client @0x7f2d3c056268 10.73.240.43#52826: update '73.10.in-addr.arpa/IN' denied
== itmon02 (1 distinct, 5 total) ==
Oct 7 08:17:57 itmon02 sshd[805675]: error: beginning MaxStartups throttling [x5]
== jubjub.cs.umd.edu (63 distinct, 83 total) ==
Oct 7 09:03:39 jubjub.cs.umd.edu puppet-agent[574105]: : transaction-actions, product-id, search-disabled-repos,
Oct 7 09:03:39 jubjub.cs.umd.edu puppet-agent[574105]: : subscription-manager, versionlock
Oct 7 09:03:39 jubjub.cs.umd.edu puppet-agent[574105]: [x11]
Oct 7 09:03:39 jubjub.cs.umd.edu puppet-agent[574105]: Could not retrieve mirrorlist http://cdn.remirepo.net/enterprise/7/php84/mirror error was
Oct 7 09:03:39 jubjub.cs.umd.edu puppet-agent[574105]: 14: HTTP Error 403 - Forbidden
Oct 7 09:03:39 jubjub.cs.umd.edu puppet-agent[574105]: One of the configured repositories failed (Unknown),
Oct 7 09:03:39 jubjub.cs.umd.edu puppet-agent[574105]: 1. Contact the upstream for the repository and get them to fix the problem.
Oct 7 09:03:39 jubjub.cs.umd.edu puppet-agent[574105]: 2. Reconfigure the baseurl/etc. for the repository, to point to a working
Oct 7 09:03:39 jubjub.cs.umd.edu puppet-agent[574105]: upstream. This is most often useful if you are using a newer
Oct 7 09:03:39 jubjub.cs.umd.edu puppet-agent[574105]: distribution release than is supported by the repository (and the
Oct 7 09:03:39 jubjub.cs.umd.edu puppet-agent[574105]: packages for the previous distribution release still work).
Oct 7 09:03:39 jubjub.cs.umd.edu puppet-agent[574105]: 3. Run the command with the repository temporarily disabled
Oct 7 09:03:39 jubjub.cs.umd.edu puppet-agent[574105]: will then just ignore the repository until you permanently enable it
Oct 7 09:03:39 jubjub.cs.umd.edu puppet-agent[574105]: again or use --enablerepo for temporary usage:
Oct 7 09:03:39 jubjub.cs.umd.edu puppet-agent[574105]: or
Oct 7 09:03:39 jubjub.cs.umd.edu puppet-agent[574105]: subscription-manager repos --disable=<repoid>
Oct 7 09:03:39 jubjub.cs.umd.edu puppet-agent[574105]: 5. Configure the failing repository to be skipped, if it is unavailable.
Oct 7 09:03:39 jubjub.cs.umd.edu puppet-agent[574105]: slower). If it is a very temporary problem though, this is often a nice
Oct 7 09:03:39 jubjub.cs.umd.edu puppet-agent[574105]: compromise:
Oct 7 09:03:39 jubjub.cs.umd.edu puppet-agent[574105]: Cannot find a valid baseurl for repo: remi-php84
Oct 7 09:03:39 jubjub.cs.umd.edu puppet-agent[574105]: Uploading Enabled Repositories Report
Oct 7 09:03:39 jubjub.cs.umd.edu puppet-agent[574105]: Unable to upload Enabled Repositories Report
Oct 7 09:03:39 jubjub.cs.umd.edu puppet-agent[574105]: (/Stage[main]/Puppet::Agent::Install/Package[openvox-agent]/ensure) : transaction-actions, product-id, search-disabled-repos,
Oct 7 09:03:39 jubjub.cs.umd.edu puppet-agent[574105]: (/Stage[main]/Puppet::Agent::Install/Package[openvox-agent]/ensure) : subscription-manager, versionlock
Oct 7 09:03:39 jubjub.cs.umd.edu puppet-agent[574105]: (/Stage[main]/Puppet::Agent::Install/Package[openvox-agent]/ensure) [x11]
Oct 7 09:03:39 jubjub.cs.umd.edu puppet-agent[574105]: (/Stage[main]/Puppet::Agent::Install/Package[openvox-agent]/ensure) Could not retrieve mirrorlist http://cdn.remirepo.net/enterprise/7/php84/mirror error was
Oct 7 09:03:39 jubjub.cs.umd.edu puppet-agent[574105]: (/Stage[main]/Puppet::Agent::Install/Package[openvox-agent]/ensure) 14: HTTP Error 403 - Forbidden
Oct 7 09:03:39 jubjub.cs.umd.edu puppet-agent[574105]: (/Stage[main]/Puppet::Agent::Install/Package[openvox-agent]/ensure) One of the configured repositories failed (Unknown),
Oct 7 09:03:39 jubjub.cs.umd.edu puppet-agent[574105]: (/Stage[main]/Puppet::Agent::Install/Package[openvox-agent]/ensure) 1. Contact the upstream for the repository and get them to fix the problem.
Oct 7 09:03:39 jubjub.cs.umd.edu puppet-agent[574105]: (/Stage[main]/Puppet::Agent::Install/Package[openvox-agent]/ensure) 2. Reconfigure the baseurl/etc. for the repository, to point to a working
... 33 more distinct messages not shown
== krispykreme.cs.umd.edu (6 distinct, 10 total) ==
Oct 7 08:36:20 krispykreme.cs.umd.edu sshd-session[3012538]: error: kex_protocol_error: type 20 seq 2 [preauth] [x2]
Oct 7 08:36:20 krispykreme.cs.umd.edu sshd-session[3012538]: error: kex_protocol_error: type 30 seq 3 [preauth] [x2]
Oct 7 08:36:21 krispykreme.cs.umd.edu sshd-session[3012538]: error: kex_protocol_error: type 20 seq 4 [preauth] [x2]
Oct 7 08:36:21 krispykreme.cs.umd.edu sshd-session[3012538]: error: kex_protocol_error: type 30 seq 5 [preauth] [x2]
Oct 7 08:36:23 krispykreme.cs.umd.edu sshd-session[3012538]: error: kex_protocol_error: type 20 seq 6 [preauth]
Oct 7 08:36:23 krispykreme.cs.umd.edu sshd-session[3012538]: error: kex_protocol_error: type 30 seq 7 [preauth]
== newhonors2 (1 distinct, 24 total) ==
Oct 7 08:13:03 newhonors2 dhcpcd[3682594]: dhcpcd is not running [x24]
== ntop00 (96 distinct, 96 total) ==
Oct 7 08:05:01 ntop00 nfacctd[1075699]: INFO ( m1/mysql ): *** Purging cache - START (PID: 4618) ***
Oct 7 08:05:01 ntop00 nfacctd[1075699]: INFO ( m1/mysql ): *** Purging cache - END (PID: 4618, QN: 58/58, ET: 0) ***
Oct 7 08:05:09 ntop00 sfacctd[1075592]: INFO ( m1/mysql ): *** Purging cache - END (PID: 4618, QN: 5359/5359, ET: 8) ***
Oct 7 08:08:01 ntop00 sfacctd[1075592]: INFO ( p1/print ): *** Purging cache - START (PID: 4619) ***
Oct 7 08:08:01 ntop00 sfacctd[1075592]: INFO ( p1/print ): *** Purging cache - END (PID: 4619, QN: 5517/5517, ET: 0) ***
Oct 7 08:08:01 ntop00 nfacctd[1075699]: INFO ( p1/print ): *** Purging cache - START (PID: 4619) ***
Oct 7 08:08:01 ntop00 nfacctd[1075699]: INFO ( p1/print ): *** Purging cache - END (PID: 4619, QN: 68/68, ET: 0) ***
Oct 7 08:10:01 ntop00 sfacctd[1075592]: INFO ( m1/mysql ): *** Purging cache - START (PID: 4620) ***
Oct 7 08:10:01 ntop00 nfacctd[1075699]: INFO ( m1/mysql ): *** Purging cache - START (PID: 4620) ***
Oct 7 08:10:02 ntop00 nfacctd[1075699]: INFO ( m1/mysql ): *** Purging cache - END (PID: 4620, QN: 71/71, ET: 1) ***
Oct 7 08:10:10 ntop00 sfacctd[1075592]: INFO ( m1/mysql ): *** Purging cache - END (PID: 4620, QN: 5427/5427, ET: 9) ***
Oct 7 08:13:01 ntop00 sfacctd[1075592]: INFO ( p1/print ): *** Purging cache - START (PID: 4621) ***
Oct 7 08:13:01 ntop00 sfacctd[1075592]: INFO ( p1/print ): *** Purging cache - END (PID: 4621, QN: 5340/5340, ET: 0) ***
Oct 7 08:13:01 ntop00 nfacctd[1075699]: INFO ( p1/print ): *** Purging cache - START (PID: 4621) ***
Oct 7 08:13:01 ntop00 nfacctd[1075699]: INFO ( p1/print ): *** Purging cache - END (PID: 4621, QN: 69/69, ET: 0) ***
Oct 7 08:15:01 ntop00 sfacctd[1075592]: INFO ( m1/mysql ): *** Purging cache - START (PID: 4622) ***
Oct 7 08:15:01 ntop00 nfacctd[1075699]: INFO ( m1/mysql ): *** Purging cache - START (PID: 4622) ***
Oct 7 08:15:02 ntop00 nfacctd[1075699]: INFO ( m1/mysql ): *** Purging cache - END (PID: 4622, QN: 66/66, ET: 1) ***
Oct 7 08:15:10 ntop00 sfacctd[1075592]: INFO ( m1/mysql ): *** Purging cache - END (PID: 4622, QN: 5378/5378, ET: 9) ***
Oct 7 08:18:01 ntop00 nfacctd[1075699]: INFO ( p1/print ): *** Purging cache - START (PID: 4623) ***
Oct 7 08:18:01 ntop00 nfacctd[1075699]: INFO ( p1/print ): *** Purging cache - END (PID: 4623, QN: 58/58, ET: 0) ***
Oct 7 08:18:01 ntop00 sfacctd[1075592]: INFO ( p1/print ): *** Purging cache - START (PID: 4623) ***
Oct 7 08:18:01 ntop00 sfacctd[1075592]: INFO ( p1/print ): *** Purging cache - END (PID: 4623, QN: 5633/5633, ET: 0) ***
Oct 7 08:20:01 ntop00 sfacctd[1075592]: INFO ( m1/mysql ): *** Purging cache - START (PID: 4624) ***
Oct 7 08:20:01 ntop00 nfacctd[1075699]: INFO ( m1/mysql ): *** Purging cache - START (PID: 4624) ***
Oct 7 08:20:01 ntop00 nfacctd[1075699]: INFO ( m1/mysql ): *** Purging cache - END (PID: 4624, QN: 51/51, ET: 0) ***
Oct 7 08:20:11 ntop00 sfacctd[1075592]: INFO ( m1/mysql ): *** Purging cache - END (PID: 4624, QN: 5960/5960, ET: 10) ***
Oct 7 08:23:01 ntop00 sfacctd[1075592]: INFO ( p1/print ): *** Purging cache - START (PID: 4625) ***
Oct 7 08:23:01 ntop00 sfacctd[1075592]: INFO ( p1/print ): *** Purging cache - END (PID: 4625, QN: 6124/6124, ET: 0) ***
Oct 7 08:23:01 ntop00 nfacctd[1075699]: INFO ( p1/print ): *** Purging cache - START (PID: 4625) ***
... 66 more distinct messages not shown
== outbound00.cs.umd.edu (2 distinct, 7 total) ==
Oct 7 08:09:08 outbound00.cs.umd.edu python3[222406]: ldapdb [x6]
Oct 7 08:55:35 outbound00.cs.umd.edu sshd-session[233447]: fatal: userauth_pubkey: parse publickey packet: incomplete message [preauth]
== outbound01.cs.umd.edu (1 distinct, 6 total) ==
Oct 7 08:13:06 outbound01.cs.umd.edu python3[1681909]: ldapdb [x6]
== portal (1 distinct, 76 total) ==
Oct 7 08:05:59 portal setroubleshoot[1738385]: SELinux is preventing /usr/local/bin/traefik from connectto access on the unix_stream_socket /run/podman/podman.sock. For complete SELinux messages run: sealert -l e0a307a3-2c22-4320-8f9d-6a166c45222d [x76]
== smokeping-slave (1 distinct, 1 total) ==
Oct 7 08:58:18 smokeping-slave nologin[3922188]: Attempted login by UNKNOWN (UID: 65534) on UNKNOWN
== strawberry (7 distinct, 38 total) ==
Oct 7 08:07:03 strawberry kernel: I/O error, dev sda, sector 206848 op 0x0:(READ) flags 0x80700 phys_seg 1 prio class 2 [x6]
Oct 7 08:07:03 strawberry kernel: I/O error, dev sda, sector 206848 op 0x0:(READ) flags 0x0 phys_seg 1 prio class 2 [x6]
Oct 7 08:07:03 strawberry kernel: Buffer I/O error on dev sda2, logical block 0, async page read [x6]
Oct 7 08:07:03 strawberry kernel: I/O error, dev sda, sector 2048 op 0x0:(READ) flags 0x80700 phys_seg 1 prio class 2 [x6]
Oct 7 08:07:03 strawberry kernel: I/O error, dev sda, sector 2048 op 0x0:(READ) flags 0x0 phys_seg 1 prio class 2 [x6]
Oct 7 08:07:03 strawberry kernel: Buffer I/O error on dev sda1, logical block 0, async page read [x6]
Oct 7 08:34:42 strawberry smartd[5314]: Device: /dev/sda [SAT], failed to read SMART Attribute Data [x2]
== submit10-cln25 (5 distinct, 1539 total) ==
Oct 7 08:05:22 submit10-cln25 rsyslogd: imjournal: fopen() failed for path: '/var/lib/rsyslog/imjournal.state.tmp': Input/output error [v8.24.0-57.el7_9.3 try http://www.rsyslog.com/e/2013 ] [x334]
Oct 7 08:05:22 submit10-cln25 rsyslogd: file '/var/log/messages': open error: Input/output error [v8.24.0-57.el7_9.3 try http://www.rsyslog.com/e/2433 ] [x1200]
Oct 7 08:25:00 submit10-cln25 systemd: Failed at step USER spawning /usr/libexec/pcp/bin/pmlogger_check: Input/output error [x2]
Oct 7 08:28:00 submit10-cln25 systemd: Failed at step USER spawning /usr/libexec/pcp/bin/pmie_check: Input/output error [x2]
Oct 7 08:30:00 submit10-cln25 systemd: Failed at step USER spawning /usr/libexec/pcp/bin/pmlogger_daily: Input/output error
== submit26-b9-fclone (9 distinct, 9 total) ==
Oct 7 08:22:04 submit26-b9-fclone setroubleshoot[1161669]: SELinux is preventing /usr/bin/python3.9 from create access on the directory /(null). For complete SELinux messages run: sealert -l 9355d9d9-a311-48d2-bd37-6c0f6947dfff
Oct 7 08:22:04 submit26-b9-fclone setroubleshoot[1161669]: SELinux is preventing /usr/bin/python3.9 from add_name access on the directory /(null). For complete SELinux messages run: sealert -l cc4658d7-9db1-405d-9eee-de0ccee5857f
Oct 7 08:22:04 submit26-b9-fclone setroubleshoot[1161669]: SELinux is preventing /usr/bin/python3.9 from create access on the file /(null). For complete SELinux messages run: sealert -l 568a2429-0b1b-49df-af41-49b5cd298ae8
Oct 7 08:22:04 submit26-b9-fclone setroubleshoot[1161669]: SELinux is preventing /usr/bin/python3.9 from open access on the file /tmp/libdnf.Y0V3fN/repodata/repomd.xml. For complete SELinux messages run: sealert -l 03e2f521-0e7c-481f-8e92-0602c6adeedc
Oct 7 08:22:04 submit26-b9-fclone setroubleshoot[1161669]: SELinux is preventing /usr/bin/python3.9 from setattr access on the file repomd.xml. For complete SELinux messages run: sealert -l 0d6b7b1f-ebe3-4beb-915a-b06b63bf2566
Oct 7 08:22:04 submit26-b9-fclone setroubleshoot[1161669]: SELinux is preventing /usr/bin/python3.9 from read access on the directory libdnf.Y0V3fN. For complete SELinux messages run: sealert -l 887adbf9-2bb9-4009-b800-36ddf9ba0db5
Oct 7 08:22:04 submit26-b9-fclone setroubleshoot[1161669]: SELinux is preventing /usr/bin/python3.9 from remove_name access on the directory repomd.xml. For complete SELinux messages run: sealert -l 092e0644-8373-4017-b77f-1afa6c6da4ac
Oct 7 08:22:04 submit26-b9-fclone setroubleshoot[1161669]: SELinux is preventing /usr/bin/python3.9 from unlink access on the file repomd.xml. For complete SELinux messages run: sealert -l ce429a92-56de-4de1-b859-cbfb69ae123c
Oct 7 08:22:05 submit26-b9-fclone setroubleshoot[1161669]: SELinux is preventing /usr/bin/python3.9 from rmdir access on the directory repodata. For complete SELinux messages run: sealert -l 99b886eb-497b-406d-8206-afe76a1086b4
1
0
Command: /usr/local/sbin/syslog-digest.py
Time : 0.5323s
Status : exited 0
Output :
Syslog digest — 2026-10-07 08:05 EDT
Processed 17,850 lines, filtered 2,906 (16%). 14,944 unknown (203 distinct) from 23 host(s).
== abuse (1 distinct, 347 total) ==
Oct 7 07:05:25 abuse rsyslogd[1033]: imjournal: open() failed for path: '/var/lib/rsyslog/imjournal.state.tmp': Input/output error [v8.2404.0 try https://www.rsyslog.com/e/2433 ] [x347]
== amoeba (1 distinct, 12662 total) ==
Oct 7 07:05:01 amoeba packagekitd[2509360]: failed to parse public key for /etc/pki/rpm-gpg/RPM-GPG-KEY-PQC-redhat-release [x12662]
== b0b02.cs.umd.edu (1 distinct, 1 total) ==
Oct 7 07:17:14 b0b02.cs.umd.edu rustdesk[1154712]: cannot open display:
== biggulp.cs.umd.edu (4 distinct, 4 total) ==
Oct 7 07:47:16 biggulp.cs.umd.edu sshd-session[218664]: pam_access(sshd:auth): access denied for user `admin' from `34.140.141.27'
Oct 7 07:47:17 biggulp.cs.umd.edu krb5_child[218666]: Client 'admin(a)UMD.EDU' not found in Kerberos database
Oct 7 07:47:17 biggulp.cs.umd.edu sshd-session[218662]: error: PAM: System error for admin from 34.140.141.27
Oct 7 07:47:19 biggulp.cs.umd.edu sshd-session[218669]: error: Protocol major versions differ: 2 vs. 1
== cheezit.cs.umd.edu (1 distinct, 1 total) ==
Oct 7 07:22:50 cheezit.cs.umd.edu systemd[1]: insights-client.service: Start request repeated too quickly.
== emaar (1 distinct, 1 total) ==
Oct 7 07:52:45 emaar systemd[1]: insights-client.service: Start request repeated too quickly.
== gle-dind04 (2 distinct, 2 total) ==
Oct 7 07:47:23 gle-dind04 falcon-sensor-bpf[1017]: CrowdStrike(4): Could not retrieve DisableProxy value: c0000225
Oct 7 07:47:23 gle-dind04 falcon-sensor-bpf[1017]: CrowdStrike(4): ConnectWithProxy: Unable to get application proxy host from CsConfig: c0000225
== hazfs.cs.umd.edu (11 distinct, 66 total) ==
Oct 7 07:31:59 hazfs.cs.umd.edu snmpd[1431]: send response: Failure in sendto [x6]
Oct 7 07:31:59 hazfs.cs.umd.edu snmpd[1431]: -- NET-SNMP-EXTEND-MIB::nsExtendStatus."userweb" [x6]
Oct 7 07:31:59 hazfs.cs.umd.edu snmpd[1431]: -- NET-SNMP-EXTEND-MIB::nsExtendStatus."zfslist" [x6]
Oct 7 07:31:59 hazfs.cs.umd.edu snmpd[1431]: -- NET-SNMP-EXTEND-MIB::nsExtendStatus."userhome" [x6]
Oct 7 07:31:59 hazfs.cs.umd.edu snmpd[1431]: -- NET-SNMP-EXTEND-MIB::nsExtendOutput1Line."userweb" [x6]
Oct 7 07:31:59 hazfs.cs.umd.edu snmpd[1431]: -- NET-SNMP-EXTEND-MIB::nsExtendOutput1Line."zfslist" [x6]
Oct 7 07:31:59 hazfs.cs.umd.edu snmpd[1431]: -- NET-SNMP-EXTEND-MIB::nsExtendOutput1Line."userhome" [x6]
Oct 7 07:31:59 hazfs.cs.umd.edu snmpd[1431]: -- NET-SNMP-EXTEND-MIB::nsExtendOutputFull."userweb" [x6]
Oct 7 07:31:59 hazfs.cs.umd.edu snmpd[1431]: -- NET-SNMP-EXTEND-MIB::nsExtendOutputFull."zfslist" [x6]
Oct 7 07:31:59 hazfs.cs.umd.edu snmpd[1431]: -- NET-SNMP-EXTEND-MIB::nsExtendOutputFull."userhome" [x6]
Oct 7 07:31:59 hazfs.cs.umd.edu snmpd[1431]: -- NET-SNMP-EXTEND-MIB::nsExtendOutNumLines."userweb" [x6]
== idm00 (1 distinct, 1 total) ==
Oct 7 07:54:41 idm00 named[4166701]: client @0x7f11a4068068 10.73.240.42#60337: update '73.10.in-addr.arpa/IN' denied
== idmp0 (1 distinct, 1 total) ==
Oct 7 07:39:22 idmp0 named[1598691]: client @0x7f2d4460f198 10.73.240.43#65434: update '73.10.in-addr.arpa/IN' denied
== inbound01.cs.umd.edu (1 distinct, 1 total) ==
Oct 7 07:36:16 inbound01.cs.umd.edu krb5_child[1798795]: Client 'admin(a)UMD.EDU' not found in Kerberos database
== irb2156 (3 distinct, 3 total) ==
Oct 7 07:29:47 irb2156 systemd-resolved[3579]: Using degraded feature set UDP instead of UDP+EDNS0 for DNS server 128.8.74.3.
Oct 7 07:30:02 irb2156 systemd-resolved[3579]: Using degraded feature set UDP instead of UDP+EDNS0 for DNS server 128.8.76.3.
Oct 7 07:30:18 irb2156 systemd-resolved[3579]: Using degraded feature set TCP instead of UDP for DNS server 128.8.74.3.
== itmon02 (1 distinct, 4 total) ==
Oct 7 07:08:42 itmon02 sshd[805675]: error: beginning MaxStartups throttling [x4]
== newhonors2 (1 distinct, 24 total) ==
Oct 7 07:13:03 newhonors2 dhcpcd[3680749]: dhcpcd is not running [x24]
== ntop00 (96 distinct, 96 total) ==
Oct 7 07:05:01 ntop00 nfacctd[1075699]: INFO ( m1/mysql ): *** Purging cache - START (PID: 4594) ***
Oct 7 07:05:01 ntop00 nfacctd[1075699]: INFO ( m1/mysql ): *** Purging cache - END (PID: 4594, QN: 49/49, ET: 0) ***
Oct 7 07:05:09 ntop00 sfacctd[1075592]: INFO ( m1/mysql ): *** Purging cache - END (PID: 4594, QN: 5019/5019, ET: 8) ***
Oct 7 07:08:01 ntop00 sfacctd[1075592]: INFO ( p1/print ): *** Purging cache - START (PID: 4595) ***
Oct 7 07:08:01 ntop00 sfacctd[1075592]: INFO ( p1/print ): *** Purging cache - END (PID: 4595, QN: 5565/5565, ET: 0) ***
Oct 7 07:08:01 ntop00 nfacctd[1075699]: INFO ( p1/print ): *** Purging cache - START (PID: 4595) ***
Oct 7 07:08:01 ntop00 nfacctd[1075699]: INFO ( p1/print ): *** Purging cache - END (PID: 4595, QN: 49/49, ET: 0) ***
Oct 7 07:10:01 ntop00 sfacctd[1075592]: INFO ( m1/mysql ): *** Purging cache - START (PID: 4596) ***
Oct 7 07:10:01 ntop00 nfacctd[1075699]: INFO ( m1/mysql ): *** Purging cache - START (PID: 4596) ***
Oct 7 07:10:02 ntop00 nfacctd[1075699]: INFO ( m1/mysql ): *** Purging cache - END (PID: 4596, QN: 62/62, ET: 1) ***
Oct 7 07:10:09 ntop00 sfacctd[1075592]: INFO ( m1/mysql ): *** Purging cache - END (PID: 4596, QN: 5439/5439, ET: 8) ***
Oct 7 07:13:01 ntop00 sfacctd[1075592]: INFO ( p1/print ): *** Purging cache - START (PID: 4597) ***
Oct 7 07:13:01 ntop00 sfacctd[1075592]: INFO ( p1/print ): *** Purging cache - END (PID: 4597, QN: 4940/4940, ET: 0) ***
Oct 7 07:13:01 ntop00 nfacctd[1075699]: INFO ( p1/print ): *** Purging cache - START (PID: 4597) ***
Oct 7 07:13:01 ntop00 nfacctd[1075699]: INFO ( p1/print ): *** Purging cache - END (PID: 4597, QN: 72/72, ET: 0) ***
Oct 7 07:15:01 ntop00 sfacctd[1075592]: INFO ( m1/mysql ): *** Purging cache - START (PID: 4598) ***
Oct 7 07:15:02 ntop00 nfacctd[1075699]: INFO ( m1/mysql ): *** Purging cache - START (PID: 4598) ***
Oct 7 07:15:02 ntop00 nfacctd[1075699]: INFO ( m1/mysql ): *** Purging cache - END (PID: 4598, QN: 69/69, ET: 0) ***
Oct 7 07:15:08 ntop00 sfacctd[1075592]: INFO ( m1/mysql ): *** Purging cache - END (PID: 4598, QN: 4932/4932, ET: 7) ***
Oct 7 07:18:01 ntop00 nfacctd[1075699]: INFO ( p1/print ): *** Purging cache - START (PID: 4599) ***
Oct 7 07:18:01 ntop00 nfacctd[1075699]: INFO ( p1/print ): *** Purging cache - END (PID: 4599, QN: 69/69, ET: 0) ***
Oct 7 07:18:01 ntop00 sfacctd[1075592]: INFO ( p1/print ): *** Purging cache - START (PID: 4599) ***
Oct 7 07:18:01 ntop00 sfacctd[1075592]: INFO ( p1/print ): *** Purging cache - END (PID: 4599, QN: 4542/4542, ET: 0) ***
Oct 7 07:20:01 ntop00 nfacctd[1075699]: INFO ( m1/mysql ): *** Purging cache - START (PID: 4600) ***
Oct 7 07:20:01 ntop00 sfacctd[1075592]: INFO ( m1/mysql ): *** Purging cache - START (PID: 4600) ***
Oct 7 07:20:01 ntop00 nfacctd[1075699]: INFO ( m1/mysql ): *** Purging cache - END (PID: 4600, QN: 68/68, ET: 0) ***
Oct 7 07:20:08 ntop00 sfacctd[1075592]: INFO ( m1/mysql ): *** Purging cache - END (PID: 4600, QN: 4386/4386, ET: 7) ***
Oct 7 07:23:01 ntop00 nfacctd[1075699]: INFO ( p1/print ): *** Purging cache - START (PID: 4601) ***
Oct 7 07:23:01 ntop00 nfacctd[1075699]: INFO ( p1/print ): *** Purging cache - END (PID: 4601, QN: 65/65, ET: 0) ***
Oct 7 07:23:01 ntop00 sfacctd[1075592]: INFO ( p1/print ): *** Purging cache - START (PID: 4601) ***
... 66 more distinct messages not shown
== outbound00.cs.umd.edu (1 distinct, 6 total) ==
Oct 7 07:09:09 outbound00.cs.umd.edu python3[208717]: ldapdb [x6]
== outbound01.cs.umd.edu (1 distinct, 6 total) ==
Oct 7 07:13:06 outbound01.cs.umd.edu python3[1667990]: ldapdb [x6]
== portal (1 distinct, 73 total) ==
Oct 7 07:05:37 portal setroubleshoot[1725514]: SELinux is preventing /usr/local/bin/traefik from connectto access on the unix_stream_socket /run/podman/podman.sock. For complete SELinux messages run: sealert -l e0a307a3-2c22-4320-8f9d-6a166c45222d [x73]
== quiss (59 distinct, 65 total) ==
Oct 7 07:08:40 quiss gnome-software[191719]: failed to get featured apps: no apps to show
Oct 7 07:08:40 quiss gnome-software[191719]: Only 0 apps for curated list, hiding
Oct 7 07:08:40 quiss gnome-software[191719]: Only 0 apps for recent list, hiding
Oct 7 07:08:50 quiss packagekitd[3673684]: Failed to get cache filename for vlc-libs
Oct 7 07:08:50 quiss packagekitd[3673684]: Failed to get cache filename for vlc-plugin-ffmpeg
Oct 7 07:08:50 quiss packagekitd[3673684]: Failed to get cache filename for vlc-plugin-pulseaudio
Oct 7 07:08:50 quiss packagekitd[3673684]: Failed to get cache filename for vlc-plugins-base
Oct 7 07:08:50 quiss packagekitd[3673684]: Failed to get cache filename for vlc-plugins-video-out
Oct 7 07:08:50 quiss packagekitd[3673684]: Failed to get cache filename for amd-gpu-firmware
Oct 7 07:08:50 quiss packagekitd[3673684]: Failed to get cache filename for cockpit-storaged
Oct 7 07:08:50 quiss packagekitd[3673684]: Failed to get cache filename for gnome-control-center
Oct 7 07:08:50 quiss packagekitd[3673684]: Failed to get cache filename for gnome-control-center-filesystem [x3]
Oct 7 07:08:50 quiss packagekitd[3673684]: Failed to get cache filename for gtk4
Oct 7 07:08:50 quiss packagekitd[3673684]: Failed to get cache filename for insights-core
Oct 7 07:08:50 quiss packagekitd[3673684]: Failed to get cache filename for insights-core-selinux
Oct 7 07:08:50 quiss packagekitd[3673684]: Failed to get cache filename for intel-gpu-firmware
Oct 7 07:08:50 quiss packagekitd[3673684]: Failed to get cache filename for kernel-headers
Oct 7 07:08:50 quiss packagekitd[3673684]: Failed to get cache filename for nvidia-gpu-firmware
Oct 7 07:08:50 quiss packagekitd[3673684]: Failed to get cache filename for passt
Oct 7 07:08:50 quiss packagekitd[3673684]: Failed to get cache filename for passt-selinux
Oct 7 07:08:50 quiss packagekitd[3673684]: Failed to get cache filename for perl [x3]
Oct 7 07:08:50 quiss packagekitd[3673684]: Failed to get cache filename for perl-DBI
Oct 7 07:08:50 quiss packagekitd[3673684]: Failed to get cache filename for python3-perf
Oct 7 07:08:50 quiss packagekitd[3673684]: Failed to get cache filename for sequoia-sq
Oct 7 07:08:50 quiss packagekitd[3673684]: Failed to get cache filename for amd-ucode-firmware
Oct 7 07:08:50 quiss packagekitd[3673684]: Failed to get cache filename for atheros-firmware
Oct 7 07:08:50 quiss packagekitd[3673684]: Failed to get cache filename for brcmfmac-firmware
Oct 7 07:08:50 quiss packagekitd[3673684]: Failed to get cache filename for cirrus-audio-firmware
Oct 7 07:08:50 quiss packagekitd[3673684]: Failed to get cache filename for cockpit
Oct 7 07:08:50 quiss packagekitd[3673684]: Failed to get cache filename for cockpit-bridge
... 29 more distinct messages not shown
== soul (1 distinct, 1 total) ==
Oct 7 07:58:50 soul krb5_child[3450612]: Client 'admin(a)UMD.EDU' not found in Kerberos database
== strawberry (7 distinct, 38 total) ==
Oct 7 07:07:04 strawberry kernel: I/O error, dev sda, sector 206848 op 0x0:(READ) flags 0x80700 phys_seg 1 prio class 2 [x6]
Oct 7 07:07:04 strawberry kernel: I/O error, dev sda, sector 206848 op 0x0:(READ) flags 0x0 phys_seg 1 prio class 2 [x6]
Oct 7 07:07:04 strawberry kernel: Buffer I/O error on dev sda2, logical block 0, async page read [x6]
Oct 7 07:07:04 strawberry kernel: I/O error, dev sda, sector 2048 op 0x0:(READ) flags 0x80700 phys_seg 1 prio class 2 [x6]
Oct 7 07:07:04 strawberry kernel: I/O error, dev sda, sector 2048 op 0x0:(READ) flags 0x0 phys_seg 1 prio class 2 [x6]
Oct 7 07:07:04 strawberry kernel: Buffer I/O error on dev sda1, logical block 0, async page read [x6]
Oct 7 07:34:42 strawberry smartd[5314]: Device: /dev/sda [SAT], failed to read SMART Attribute Data [x2]
== submit10-cln25 (6 distinct, 1540 total) ==
Oct 7 07:05:22 submit10-cln25 rsyslogd: file '/var/log/messages': open error: Input/output error [v8.24.0-57.el7_9.3 try http://www.rsyslog.com/e/2433 ] [x1200]
Oct 7 07:05:22 submit10-cln25 rsyslogd: imjournal: fopen() failed for path: '/var/lib/rsyslog/imjournal.state.tmp': Input/output error [v8.24.0-57.el7_9.3 try http://www.rsyslog.com/e/2013 ] [x334]
Oct 7 07:25:01 submit10-cln25 systemd: Failed at step USER spawning /usr/libexec/pcp/bin/pmlogger_check: Input/output error [x2]
Oct 7 07:28:01 submit10-cln25 systemd: Failed at step USER spawning /usr/libexec/pcp/bin/pmie_check: Input/output error [x2]
Oct 7 07:30:00 submit10-cln25 systemd: Failed at step USER spawning /usr/libexec/pcp/bin/pmlogger_daily: Input/output error
Oct 7 07:37:00 submit10-cln25 systemd: Failed at step EXEC spawning /usr/local/bin/cronjob: No such file or directory
== syslog01 (1 distinct, 1 total) ==
Oct 7 07:43:00 syslog01 kernel: hrtimer: interrupt took 4756 ns
1
0
Command: /usr/local/sbin/syslog-digest.py
Time : 0.2806s
Status : exited 0
Output :
Syslog digest — 2026-10-07 07:05 EDT
Processed 10,493 lines, filtered 3,279 (31%). 7,214 unknown (447 distinct) from 25 host(s).
== abadi-computer (2 distinct, 2 total) ==
Oct 7 06:15:00 abadi-computer nologin[3831576]: Attempted login by UNKNOWN (UID: 65534) on UNKNOWN
Oct 7 06:15:00 abadi-computer pipewire[3831574]: mod.jackdbus-detect: Failed to receive jackdbus reply: org.freedesktop.DBus.Error.ServiceUnknown: The name org.jackaudio.service was not provided by any .service files
== abuse (1 distinct, 347 total) ==
Oct 7 06:05:25 abuse rsyslogd[1033]: imjournal: open() failed for path: '/var/lib/rsyslog/imjournal.state.tmp': Input/output error [v8.2404.0 try https://www.rsyslog.com/e/2433 ] [x347]
== amoeba (2 distinct, 1846 total) ==
Oct 7 06:56:15 amoeba gnome-software[2241521]: Only 0 apps for recent list, hiding
Oct 7 06:56:21 amoeba packagekitd[2509360]: failed to parse public key for /etc/pki/rpm-gpg/RPM-GPG-KEY-PQC-redhat-release [x1845]
== b0b02.cs.umd.edu (2 distinct, 2 total) ==
Oct 7 06:17:10 b0b02.cs.umd.edu rustdesk[1138644]: cannot open display:
Oct 7 06:50:48 b0b02.cs.umd.edu systemd[1]: insights-client.service: Start request repeated too quickly.
== idm00 (1 distinct, 1 total) ==
Oct 7 06:54:41 idm00 named[4166701]: client @0x7f11a0005288 10.73.240.42#64129: update '73.10.in-addr.arpa/IN' denied
== idmp0 (1 distinct, 1 total) ==
Oct 7 06:39:22 idmp0 named[1598691]: client @0x7f2d480322f8 10.73.240.43#60312: update '73.10.in-addr.arpa/IN' denied
== inbound00.cs.umd.edu (1 distinct, 1 total) ==
Oct 7 06:07:35 inbound00.cs.umd.edu systemd[1]: Configuration file /usr/lib/systemd/system/authentication_milter.service is marked executable. Please remove executable permission bits. Proceeding anyway.
== inbound01.cs.umd.edu (1 distinct, 1 total) ==
Oct 7 06:18:59 inbound01.cs.umd.edu systemd[1]: Configuration file /usr/lib/systemd/system/authentication_milter.service is marked executable. Please remove executable permission bits. Proceeding anyway.
== irb2156 (1 distinct, 1 total) ==
Oct 7 06:42:46 irb2156 systemd[1]: insights-client.service: Start request repeated too quickly.
== itmon02 (1 distinct, 4 total) ==
Oct 7 06:13:04 itmon02 sshd[805675]: error: beginning MaxStartups throttling [x4]
== librenms (1 distinct, 1 total) ==
Oct 7 06:48:25 librenms puppet-agent[2121434]: The directory '/opt/librenms/rrd' contains 16523 entries, which exceeds the default soft limit 1000 and may cause excessive resource consumption and degraded performance. To remove this warning set a value for `max_files` parameter or consider using an alternate method to manage large directory trees
== mashie (269 distinct, 3142 total) ==
Oct 7 06:40:16 mashie kernel: EXT4-fs error (device vda1): ext4_journal_check_start:83: comm find: Detected aborted journal [x1316]
Oct 7 06:40:16 mashie kernel: EXT4-fs (vda1): Remounting filesystem read-only [x1439]
Oct 7 06:40:21 mashie kernel: EXT4-fs error: 1222 callbacks suppressed
Oct 7 06:40:21 mashie kernel: EXT4-fs: 1222 callbacks suppressed
Oct 7 06:40:26 mashie kernel: EXT4-fs error: 2114 callbacks suppressed
Oct 7 06:40:26 mashie kernel: EXT4-fs: 2114 callbacks suppressed
Oct 7 06:40:31 mashie kernel: EXT4-fs error: 1865 callbacks suppressed
Oct 7 06:40:31 mashie kernel: EXT4-fs: 1865 callbacks suppressed
Oct 7 06:40:36 mashie kernel: EXT4-fs error: 2116 callbacks suppressed
Oct 7 06:40:36 mashie kernel: EXT4-fs: 2116 callbacks suppressed
Oct 7 06:40:41 mashie kernel: EXT4-fs error: 1397 callbacks suppressed
Oct 7 06:40:41 mashie kernel: EXT4-fs: 1397 callbacks suppressed
Oct 7 06:40:46 mashie kernel: EXT4-fs error: 2305 callbacks suppressed
Oct 7 06:40:46 mashie kernel: EXT4-fs: 2305 callbacks suppressed
Oct 7 06:40:51 mashie kernel: EXT4-fs error: 2462 callbacks suppressed
Oct 7 06:40:51 mashie kernel: EXT4-fs: 2462 callbacks suppressed
Oct 7 06:40:56 mashie kernel: EXT4-fs error: 2640 callbacks suppressed
Oct 7 06:40:56 mashie kernel: EXT4-fs: 2640 callbacks suppressed
Oct 7 06:41:01 mashie kernel: EXT4-fs error: 1422 callbacks suppressed
Oct 7 06:41:01 mashie kernel: EXT4-fs: 1422 callbacks suppressed
Oct 7 06:41:06 mashie kernel: EXT4-fs error: 982 callbacks suppressed
Oct 7 06:41:06 mashie kernel: EXT4-fs: 982 callbacks suppressed
Oct 7 06:41:11 mashie kernel: EXT4-fs error: 793 callbacks suppressed
Oct 7 06:41:11 mashie kernel: EXT4-fs: 793 callbacks suppressed
Oct 7 06:41:16 mashie kernel: EXT4-fs error: 744 callbacks suppressed [x2]
Oct 7 06:41:16 mashie kernel: EXT4-fs: 744 callbacks suppressed [x2]
Oct 7 06:41:21 mashie kernel: EXT4-fs error: 614 callbacks suppressed
Oct 7 06:41:21 mashie kernel: EXT4-fs: 614 callbacks suppressed
Oct 7 06:41:26 mashie kernel: EXT4-fs error: 1138 callbacks suppressed
Oct 7 06:41:26 mashie kernel: EXT4-fs: 1138 callbacks suppressed
... 239 more distinct messages not shown
== munin (2 distinct, 20 total) ==
Oct 7 06:08:33 munin sudo[1146516]: pam_systemd(sudo:session): Failed to stat() runtime directory '/run/user/0': No such file or directory [x10]
Oct 7 06:08:33 munin sudo[1146516]: pam_systemd(sudo:session): Not setting $XDG_RUNTIME_DIR, as the directory is not in order. [x10]
== neodontcare.cs.umd.edu (22 distinct, 23 total) ==
Oct 7 06:14:49 neodontcare.cs.umd.edu gnome-software[10171]: Only 0 apps for recent list, hiding
Oct 7 06:14:58 neodontcare.cs.umd.edu packagekitd[1859472]: Failed to get cache filename for gnu-free-mono-fonts
Oct 7 06:14:58 neodontcare.cs.umd.edu packagekitd[1859472]: Failed to get cache filename for gnu-free-serif-fonts
Oct 7 06:14:58 neodontcare.cs.umd.edu packagekitd[1859472]: Failed to get cache filename for vlc
Oct 7 06:14:58 neodontcare.cs.umd.edu packagekitd[1859472]: Failed to get cache filename for vlc-cli
Oct 7 06:14:58 neodontcare.cs.umd.edu packagekitd[1859472]: Failed to get cache filename for vlc-gui-qt
Oct 7 06:14:58 neodontcare.cs.umd.edu packagekitd[1859472]: Failed to get cache filename for vlc-gui-skins2
Oct 7 06:14:58 neodontcare.cs.umd.edu packagekitd[1859472]: Failed to get cache filename for vlc-libs
Oct 7 06:14:58 neodontcare.cs.umd.edu packagekitd[1859472]: Failed to get cache filename for vlc-plugin-ffmpeg
Oct 7 06:14:58 neodontcare.cs.umd.edu packagekitd[1859472]: Failed to get cache filename for vlc-plugin-gnome
Oct 7 06:14:58 neodontcare.cs.umd.edu packagekitd[1859472]: Failed to get cache filename for vlc-plugin-kde
Oct 7 06:14:58 neodontcare.cs.umd.edu packagekitd[1859472]: Failed to get cache filename for vlc-plugin-lua
Oct 7 06:14:58 neodontcare.cs.umd.edu packagekitd[1859472]: Failed to get cache filename for vlc-plugin-notify
Oct 7 06:14:58 neodontcare.cs.umd.edu packagekitd[1859472]: Failed to get cache filename for vlc-plugin-pulseaudio
Oct 7 06:14:58 neodontcare.cs.umd.edu packagekitd[1859472]: Failed to get cache filename for vlc-plugin-visualization
Oct 7 06:14:58 neodontcare.cs.umd.edu packagekitd[1859472]: Failed to get cache filename for vlc-plugins-base
Oct 7 06:14:58 neodontcare.cs.umd.edu packagekitd[1859472]: Failed to get cache filename for vlc-plugins-extra
Oct 7 06:14:58 neodontcare.cs.umd.edu packagekitd[1859472]: Failed to get cache filename for vlc-plugins-video-out
Oct 7 06:14:58 neodontcare.cs.umd.edu packagekitd[1859472]: Failed to get cache filename for google-chrome-stable
Oct 7 06:14:58 neodontcare.cs.umd.edu packagekitd[1859472]: Failed to get cache filename for ffmpeg5-libpostproc-free
Oct 7 06:14:58 neodontcare.cs.umd.edu packagekitd[1859472]: Failed to get cache filename for ffmpeg5-libswscale-free
Oct 7 06:15:05 neodontcare.cs.umd.edu packagekitd[1859472]: failed to parse public key for /etc/pki/rpm-gpg/RPM-GPG-KEY-PQC-redhat-release [x2]
== newhonors2 (1 distinct, 24 total) ==
Oct 7 06:13:03 newhonors2 dhcpcd[3673881]: dhcpcd is not running [x24]
== ntop00 (96 distinct, 96 total) ==
Oct 7 06:05:01 ntop00 nfacctd[1075699]: INFO ( m1/mysql ): *** Purging cache - START (PID: 4570) ***
Oct 7 06:05:02 ntop00 nfacctd[1075699]: INFO ( m1/mysql ): *** Purging cache - END (PID: 4570, QN: 39/39, ET: 1) ***
Oct 7 06:05:08 ntop00 sfacctd[1075592]: INFO ( m1/mysql ): *** Purging cache - END (PID: 4570, QN: 4599/4599, ET: 7) ***
Oct 7 06:08:01 ntop00 nfacctd[1075699]: INFO ( p1/print ): *** Purging cache - START (PID: 4571) ***
Oct 7 06:08:01 ntop00 nfacctd[1075699]: INFO ( p1/print ): *** Purging cache - END (PID: 4571, QN: 48/48, ET: 0) ***
Oct 7 06:08:01 ntop00 sfacctd[1075592]: INFO ( p1/print ): *** Purging cache - START (PID: 4571) ***
Oct 7 06:08:01 ntop00 sfacctd[1075592]: INFO ( p1/print ): *** Purging cache - END (PID: 4571, QN: 4757/4757, ET: 0) ***
Oct 7 06:10:01 ntop00 sfacctd[1075592]: INFO ( m1/mysql ): *** Purging cache - START (PID: 4572) ***
Oct 7 06:10:01 ntop00 nfacctd[1075699]: INFO ( m1/mysql ): *** Purging cache - START (PID: 4572) ***
Oct 7 06:10:02 ntop00 nfacctd[1075699]: INFO ( m1/mysql ): *** Purging cache - END (PID: 4572, QN: 67/67, ET: 1) ***
Oct 7 06:10:08 ntop00 sfacctd[1075592]: INFO ( m1/mysql ): *** Purging cache - END (PID: 4572, QN: 4684/4684, ET: 7) ***
Oct 7 06:13:01 ntop00 nfacctd[1075699]: INFO ( p1/print ): *** Purging cache - START (PID: 4573) ***
Oct 7 06:13:01 ntop00 nfacctd[1075699]: INFO ( p1/print ): *** Purging cache - END (PID: 4573, QN: 67/67, ET: 0) ***
Oct 7 06:13:01 ntop00 sfacctd[1075592]: INFO ( p1/print ): *** Purging cache - START (PID: 4573) ***
Oct 7 06:13:01 ntop00 sfacctd[1075592]: INFO ( p1/print ): *** Purging cache - END (PID: 4573, QN: 4803/4803, ET: 0) ***
Oct 7 06:15:01 ntop00 nfacctd[1075699]: INFO ( m1/mysql ): *** Purging cache - START (PID: 4574) ***
Oct 7 06:15:01 ntop00 sfacctd[1075592]: INFO ( m1/mysql ): *** Purging cache - START (PID: 4574) ***
Oct 7 06:15:01 ntop00 nfacctd[1075699]: INFO ( m1/mysql ): *** Purging cache - END (PID: 4574, QN: 70/70, ET: 0) ***
Oct 7 06:15:10 ntop00 sfacctd[1075592]: INFO ( m1/mysql ): *** Purging cache - END (PID: 4574, QN: 5452/5452, ET: 9) ***
Oct 7 06:18:01 ntop00 sfacctd[1075592]: INFO ( p1/print ): *** Purging cache - START (PID: 4575) ***
Oct 7 06:18:01 ntop00 sfacctd[1075592]: INFO ( p1/print ): *** Purging cache - END (PID: 4575, QN: 6198/6198, ET: 0) ***
Oct 7 06:18:01 ntop00 nfacctd[1075699]: INFO ( p1/print ): *** Purging cache - START (PID: 4575) ***
Oct 7 06:18:01 ntop00 nfacctd[1075699]: INFO ( p1/print ): *** Purging cache - END (PID: 4575, QN: 56/56, ET: 0) ***
Oct 7 06:20:01 ntop00 nfacctd[1075699]: INFO ( m1/mysql ): *** Purging cache - START (PID: 4576) ***
Oct 7 06:20:01 ntop00 nfacctd[1075699]: INFO ( m1/mysql ): *** Purging cache - END (PID: 4576, QN: 44/44, ET: 0) ***
Oct 7 06:20:01 ntop00 sfacctd[1075592]: INFO ( m1/mysql ): *** Purging cache - START (PID: 4576) ***
Oct 7 06:20:12 ntop00 sfacctd[1075592]: INFO ( m1/mysql ): *** Purging cache - END (PID: 4576, QN: 5978/5978, ET: 11) ***
Oct 7 06:23:01 ntop00 sfacctd[1075592]: INFO ( p1/print ): *** Purging cache - START (PID: 4577) ***
Oct 7 06:23:01 ntop00 sfacctd[1075592]: INFO ( p1/print ): *** Purging cache - END (PID: 4577, QN: 5415/5415, ET: 0) ***
Oct 7 06:23:01 ntop00 nfacctd[1075699]: INFO ( p1/print ): *** Purging cache - START (PID: 4577) ***
... 66 more distinct messages not shown
== orchids (6 distinct, 7 total) ==
Oct 7 06:11:31 orchids gnome-software[1516991]: Only 0 apps for recent list, hiding
Oct 7 06:11:38 orchids packagekitd[4106808]: Failed to get cache filename for google-chrome-stable
Oct 7 06:11:38 orchids packagekitd[4106808]: Failed to get cache filename for libreoffice
Oct 7 06:11:38 orchids packagekitd[4106808]: Failed to get cache filename for cups-filesystem
Oct 7 06:11:38 orchids packagekitd[4106808]: Failed to get cache filename for kernel
Oct 7 06:11:42 orchids packagekitd[4106808]: failed to parse public key for /etc/pki/rpm-gpg/RPM-GPG-KEY-PQC-redhat-release [x2]
== outbound00.cs.umd.edu (1 distinct, 6 total) ==
Oct 7 06:09:08 outbound00.cs.umd.edu python3[194872]: ldapdb [x6]
== outbound01.cs.umd.edu (1 distinct, 6 total) ==
Oct 7 06:13:06 outbound01.cs.umd.edu python3[1654090]: ldapdb [x6]
== portal (1 distinct, 79 total) ==
Oct 7 06:05:05 portal setroubleshoot[1712781]: SELinux is preventing /usr/local/bin/traefik from connectto access on the unix_stream_socket /run/podman/podman.sock. For complete SELinux messages run: sealert -l e0a307a3-2c22-4320-8f9d-6a166c45222d [x79]
== strawberry (10 distinct, 47 total) ==
Oct 7 06:07:04 strawberry kernel: I/O error, dev sda, sector 206848 op 0x0:(READ) flags 0x80700 phys_seg 1 prio class 2 [x7]
Oct 7 06:07:04 strawberry kernel: I/O error, dev sda, sector 206848 op 0x0:(READ) flags 0x0 phys_seg 1 prio class 2 [x7]
Oct 7 06:07:04 strawberry kernel: Buffer I/O error on dev sda2, logical block 0, async page read [x7]
Oct 7 06:07:04 strawberry kernel: I/O error, dev sda, sector 2048 op 0x0:(READ) flags 0x80700 phys_seg 1 prio class 2 [x7]
Oct 7 06:07:04 strawberry kernel: I/O error, dev sda, sector 2048 op 0x0:(READ) flags 0x0 phys_seg 1 prio class 2 [x7]
Oct 7 06:07:04 strawberry kernel: Buffer I/O error on dev sda1, logical block 0, async page read [x7]
Oct 7 06:31:04 strawberry nologin[332129]: Attempted login by UNKNOWN (UID: 65534) on UNKNOWN
Oct 7 06:31:04 strawberry pipewire[332128]: mod.jackdbus-detect: Failed to receive jackdbus reply: org.freedesktop.DBus.Error.ServiceUnknown: The name org.jackaudio.service was not provided by any .service files
Oct 7 06:31:04 strawberry kernel: kauditd_printk_skb: 2 callbacks suppressed
Oct 7 06:34:42 strawberry smartd[5314]: Device: /dev/sda [SAT], failed to read SMART Attribute Data [x2]
== submit10-cln25 (5 distinct, 1538 total) ==
Oct 7 06:05:22 submit10-cln25 rsyslogd: file '/var/log/messages': open error: Input/output error [v8.24.0-57.el7_9.3 try http://www.rsyslog.com/e/2433 ] [x1200]
Oct 7 06:05:22 submit10-cln25 rsyslogd: imjournal: fopen() failed for path: '/var/lib/rsyslog/imjournal.state.tmp': Input/output error [v8.24.0-57.el7_9.3 try http://www.rsyslog.com/e/2013 ] [x333]
Oct 7 06:25:00 submit10-cln25 systemd: Failed at step USER spawning /usr/libexec/pcp/bin/pmlogger_check: Input/output error [x2]
Oct 7 06:28:00 submit10-cln25 systemd: Failed at step USER spawning /usr/libexec/pcp/bin/pmie_check: Input/output error [x2]
Oct 7 06:30:00 submit10-cln25 systemd: Failed at step USER spawning /usr/libexec/pcp/bin/pmlogger_daily: Input/output error
== submit26-b9-f1 (9 distinct, 9 total) ==
Oct 7 06:26:01 submit26-b9-f1 setroubleshoot[1613792]: SELinux is preventing /usr/bin/python3.9 from create access on the directory /(null). For complete SELinux messages run: sealert -l 3ef7d677-731f-46bf-9c34-c2c55fea665c
Oct 7 06:26:01 submit26-b9-f1 setroubleshoot[1613792]: SELinux is preventing /usr/bin/python3.9 from add_name access on the directory /(null). For complete SELinux messages run: sealert -l aa60e26f-72e1-45f1-bc12-aa8b3b669e36
Oct 7 06:26:01 submit26-b9-f1 setroubleshoot[1613792]: SELinux is preventing /usr/bin/python3.9 from create access on the file /(null). For complete SELinux messages run: sealert -l d088fb43-23ee-4ae8-ae6a-5d1c041ee2d6
Oct 7 06:26:01 submit26-b9-f1 setroubleshoot[1613792]: SELinux is preventing /usr/bin/python3.9 from open access on the file /tmp/libdnf.Rr4vCM/repodata/repomd.xml. For complete SELinux messages run: sealert -l 3b0d8c9a-6637-4d6e-a864-f1dd7c00377d
Oct 7 06:26:01 submit26-b9-f1 setroubleshoot[1613792]: SELinux is preventing /usr/bin/python3.9 from setattr access on the file repomd.xml. For complete SELinux messages run: sealert -l 0fd3339f-3ef2-45f3-9e58-65a58b42f3ee
Oct 7 06:26:01 submit26-b9-f1 setroubleshoot[1613792]: SELinux is preventing /usr/bin/python3.9 from read access on the directory libdnf.Rr4vCM. For complete SELinux messages run: sealert -l 0d661d88-dc9e-469d-986b-52e29b353aa8
Oct 7 06:26:01 submit26-b9-f1 setroubleshoot[1613792]: SELinux is preventing /usr/bin/python3.9 from remove_name access on the directory repomd.xml. For complete SELinux messages run: sealert -l 405a8556-cf9f-4ef4-8525-0dca18d4259d
Oct 7 06:26:01 submit26-b9-f1 setroubleshoot[1613792]: SELinux is preventing /usr/bin/python3.9 from unlink access on the file repomd.xml. For complete SELinux messages run: sealert -l 3c38e23e-3631-4cb5-81c7-992675c836d9
Oct 7 06:26:01 submit26-b9-f1 setroubleshoot[1613792]: SELinux is preventing /usr/bin/python3.9 from rmdir access on the directory repodata. For complete SELinux messages run: sealert -l a070e9b5-2867-47d6-b2e3-3b7d99725848
== submit26-b9-f2 (9 distinct, 9 total) ==
Oct 7 06:06:55 submit26-b9-f2 setroubleshoot[710882]: SELinux is preventing /usr/bin/python3.9 from create access on the directory /(null). For complete SELinux messages run: sealert -l 0659d546-3107-4f75-b00f-008c85f41dc6
Oct 7 06:06:55 submit26-b9-f2 setroubleshoot[710882]: SELinux is preventing /usr/bin/python3.9 from add_name access on the directory /(null). For complete SELinux messages run: sealert -l 156d9270-3466-4356-b86f-1a128825961a
Oct 7 06:06:55 submit26-b9-f2 setroubleshoot[710882]: SELinux is preventing /usr/bin/python3.9 from create access on the file /(null). For complete SELinux messages run: sealert -l c8a40bf5-2fc4-46b3-b813-8592b3523339
Oct 7 06:06:55 submit26-b9-f2 setroubleshoot[710882]: SELinux is preventing /usr/bin/python3.9 from open access on the file /tmp/libdnf.yWS6sY/repodata/repomd.xml. For complete SELinux messages run: sealert -l 7f4c3a8e-0f99-47c4-9baf-e1336fe24876
Oct 7 06:06:55 submit26-b9-f2 setroubleshoot[710882]: SELinux is preventing /usr/bin/python3.9 from setattr access on the file repomd.xml. For complete SELinux messages run: sealert -l 988123da-b724-4e6a-900c-33a2723fdaf1
Oct 7 06:06:55 submit26-b9-f2 setroubleshoot[710882]: SELinux is preventing /usr/bin/python3.9 from read access on the directory libdnf.yWS6sY. For complete SELinux messages run: sealert -l ca585e2b-d50f-4264-8127-6b3fa04070c8
Oct 7 06:06:55 submit26-b9-f2 setroubleshoot[710882]: SELinux is preventing /usr/bin/python3.9 from remove_name access on the directory repomd.xml. For complete SELinux messages run: sealert -l 3a749560-1cec-40ca-a4dc-596841be3885
Oct 7 06:06:55 submit26-b9-f2 setroubleshoot[710882]: SELinux is preventing /usr/bin/python3.9 from unlink access on the file repomd.xml. For complete SELinux messages run: sealert -l 0aa52f08-94f8-474e-96d8-e818846941af
Oct 7 06:06:55 submit26-b9-f2 setroubleshoot[710882]: SELinux is preventing /usr/bin/python3.9 from rmdir access on the directory repodata. For complete SELinux messages run: sealert -l de019dc4-408f-439c-902a-676d18dfe8e7
== tlsrpt (1 distinct, 1 total) ==
Oct 7 06:38:03 tlsrpt (httpd)[3756814]: httpd.service: Referenced but unset environment variable evaluates to an empty string: OPTIONS
1
0
Command: /usr/local/sbin/syslog-digest.py
Time : 0.1462s
Status : exited 0
Output :
Syslog digest — 2026-10-07 06:05 EDT
Processed 5,147 lines, filtered 2,934 (57%). 2,213 unknown (151 distinct) from 18 host(s).
== abuse (1 distinct, 347 total) ==
Oct 7 05:05:25 abuse rsyslogd[1033]: imjournal: open() failed for path: '/var/lib/rsyslog/imjournal.state.tmp': Input/output error [v8.2404.0 try https://www.rsyslog.com/e/2433 ] [x347]
== b0b02.cs.umd.edu (1 distinct, 1 total) ==
Oct 7 05:17:09 b0b02.cs.umd.edu rustdesk[1123542]: cannot open display:
== grades01.cs.umd.edu (1 distinct, 1 total) ==
Oct 7 05:48:57 grades01.cs.umd.edu puppet-agent[4445]: The directory '/srv/grades' contains 2471 entries, which exceeds the default soft limit 1000 and may cause excessive resource consumption and degraded performance. To remove this warning set a value for `max_files` parameter or consider using an alternate method to manage large directory trees
== idm00 (1 distinct, 1 total) ==
Oct 7 05:54:41 idm00 named[4166701]: client @0x7f119804e448 10.73.240.42#65223: update '73.10.in-addr.arpa/IN' denied
== idmp0 (1 distinct, 1 total) ==
Oct 7 05:39:23 idmp0 named[1598691]: client @0x7f2d20000cc8 10.73.240.43#59416: update '73.10.in-addr.arpa/IN' denied
== inbound01.cs.umd.edu (1 distinct, 1 total) ==
Oct 7 05:09:42 inbound01.cs.umd.edu sshd-session[1763315]: fatal: userauth_pubkey: parse publickey packet: incomplete message [preauth]
== itmon02 (1 distinct, 2 total) ==
Oct 7 05:33:08 itmon02 sshd[805675]: error: beginning MaxStartups throttling [x2]
== matrix (12 distinct, 14 total) ==
Oct 7 05:58:56 matrix systemd[1]: networkd-dispatcher.service: Got notification message from PID 315191, but reception only permitted for main PID 720
Oct 7 05:58:56 matrix systemd[1]: networkd-dispatcher.service: Got notification message from PID 315200, but reception only permitted for main PID 720
Oct 7 05:59:05 matrix systemd[1]: networkd-dispatcher.service: Got notification message from PID 315290, but reception only permitted for main PID 720
Oct 7 05:59:05 matrix systemd[1]: networkd-dispatcher.service: Got notification message from PID 315296, but reception only permitted for main PID 720
Oct 7 05:59:05 matrix networkctl[315306]: Interface "vethf2d70ba" not found.
Oct 7 05:59:05 matrix systemd[1]: networkd-dispatcher.service: Got notification message from PID 315306, but reception only permitted for main PID 720 [x2]
Oct 7 05:59:05 matrix systemd[1]: networkd-dispatcher.service: Got notification message from PID 315368, but reception only permitted for main PID 720
Oct 7 05:59:05 matrix systemd[1]: networkd-dispatcher.service: Got notification message from PID 315380, but reception only permitted for main PID 720
Oct 7 06:02:30 matrix systemd[1]: networkd-dispatcher.service: Got notification message from PID 318194, but reception only permitted for main PID 720
Oct 7 06:02:30 matrix systemd[1]: networkd-dispatcher.service: Got notification message from PID 318201, but reception only permitted for main PID 720
Oct 7 06:02:30 matrix networkctl[318213]: Interface "veth2fb0f2c" not found.
Oct 7 06:02:30 matrix systemd[1]: networkd-dispatcher.service: Got notification message from PID 318213, but reception only permitted for main PID 720 [x2]
== munin (2 distinct, 32 total) ==
Oct 7 05:08:28 munin sudo[1124721]: pam_systemd(sudo:session): Failed to stat() runtime directory '/run/user/0': No such file or directory [x16]
Oct 7 05:08:28 munin sudo[1124721]: pam_systemd(sudo:session): Not setting $XDG_RUNTIME_DIR, as the directory is not in order. [x16]
== newhonors2 (1 distinct, 24 total) ==
Oct 7 05:13:02 newhonors2 dhcpcd[3672040]: dhcpcd is not running [x24]
== ntop00 (94 distinct, 94 total) ==
Oct 7 05:05:09 ntop00 sfacctd[1075592]: INFO ( m1/mysql ): *** Purging cache - END (PID: 4546, QN: 4464/4464, ET: 8) ***
Oct 7 05:08:01 ntop00 nfacctd[1075699]: INFO ( p1/print ): *** Purging cache - START (PID: 4547) ***
Oct 7 05:08:01 ntop00 nfacctd[1075699]: INFO ( p1/print ): *** Purging cache - END (PID: 4547, QN: 42/42, ET: 0) ***
Oct 7 05:08:01 ntop00 sfacctd[1075592]: INFO ( p1/print ): *** Purging cache - START (PID: 4547) ***
Oct 7 05:08:01 ntop00 sfacctd[1075592]: INFO ( p1/print ): *** Purging cache - END (PID: 4547, QN: 4279/4279, ET: 0) ***
Oct 7 05:10:01 ntop00 nfacctd[1075699]: INFO ( m1/mysql ): *** Purging cache - START (PID: 4548) ***
Oct 7 05:10:01 ntop00 sfacctd[1075592]: INFO ( m1/mysql ): *** Purging cache - START (PID: 4548) ***
Oct 7 05:10:01 ntop00 nfacctd[1075699]: INFO ( m1/mysql ): *** Purging cache - END (PID: 4548, QN: 33/33, ET: 0) ***
Oct 7 05:10:08 ntop00 sfacctd[1075592]: INFO ( m1/mysql ): *** Purging cache - END (PID: 4548, QN: 4306/4306, ET: 7) ***
Oct 7 05:13:01 ntop00 sfacctd[1075592]: INFO ( p1/print ): *** Purging cache - START (PID: 4549) ***
Oct 7 05:13:01 ntop00 sfacctd[1075592]: INFO ( p1/print ): *** Purging cache - END (PID: 4549, QN: 4370/4370, ET: 0) ***
Oct 7 05:13:01 ntop00 nfacctd[1075699]: INFO ( p1/print ): *** Purging cache - START (PID: 4549) ***
Oct 7 05:13:01 ntop00 nfacctd[1075699]: INFO ( p1/print ): *** Purging cache - END (PID: 4549, QN: 56/56, ET: 0) ***
Oct 7 05:15:01 ntop00 nfacctd[1075699]: INFO ( m1/mysql ): *** Purging cache - START (PID: 4550) ***
Oct 7 05:15:01 ntop00 nfacctd[1075699]: INFO ( m1/mysql ): *** Purging cache - END (PID: 4550, QN: 59/59, ET: 0) ***
Oct 7 05:15:01 ntop00 sfacctd[1075592]: INFO ( m1/mysql ): *** Purging cache - START (PID: 4550) ***
Oct 7 05:15:08 ntop00 sfacctd[1075592]: INFO ( m1/mysql ): *** Purging cache - END (PID: 4550, QN: 4315/4315, ET: 7) ***
Oct 7 05:18:01 ntop00 sfacctd[1075592]: INFO ( p1/print ): *** Purging cache - START (PID: 4551) ***
Oct 7 05:18:01 ntop00 sfacctd[1075592]: INFO ( p1/print ): *** Purging cache - END (PID: 4551, QN: 4060/4060, ET: 0) ***
Oct 7 05:18:01 ntop00 nfacctd[1075699]: INFO ( p1/print ): *** Purging cache - START (PID: 4551) ***
Oct 7 05:18:01 ntop00 nfacctd[1075699]: INFO ( p1/print ): *** Purging cache - END (PID: 4551, QN: 41/41, ET: 0) ***
Oct 7 05:20:01 ntop00 sfacctd[1075592]: INFO ( m1/mysql ): *** Purging cache - START (PID: 4552) ***
Oct 7 05:20:01 ntop00 nfacctd[1075699]: INFO ( m1/mysql ): *** Purging cache - START (PID: 4552) ***
Oct 7 05:20:01 ntop00 nfacctd[1075699]: INFO ( m1/mysql ): *** Purging cache - END (PID: 4552, QN: 39/39, ET: 0) ***
Oct 7 05:20:07 ntop00 sfacctd[1075592]: INFO ( m1/mysql ): *** Purging cache - END (PID: 4552, QN: 3945/3945, ET: 6) ***
Oct 7 05:23:01 ntop00 sfacctd[1075592]: INFO ( p1/print ): *** Purging cache - START (PID: 4553) ***
Oct 7 05:23:01 ntop00 sfacctd[1075592]: INFO ( p1/print ): *** Purging cache - END (PID: 4553, QN: 3820/3820, ET: 0) ***
Oct 7 05:23:01 ntop00 nfacctd[1075699]: INFO ( p1/print ): *** Purging cache - START (PID: 4553) ***
Oct 7 05:23:01 ntop00 nfacctd[1075699]: INFO ( p1/print ): *** Purging cache - END (PID: 4553, QN: 56/56, ET: 0) ***
Oct 7 05:25:01 ntop00 sfacctd[1075592]: INFO ( m1/mysql ): *** Purging cache - START (PID: 4554) ***
... 64 more distinct messages not shown
== outbound00.cs.umd.edu (1 distinct, 6 total) ==
Oct 7 05:09:09 outbound00.cs.umd.edu python3[181153]: ldapdb [x6]
== outbound01.cs.umd.edu (2 distinct, 8 total) ==
Oct 7 05:08:11 outbound01.cs.umd.edu python3[1638347]: ldapdb [x7]
Oct 7 05:09:18 outbound01.cs.umd.edu systemd[1]: Configuration file /usr/lib/systemd/system/authentication_milter.service is marked executable. Please remove executable permission bits. Proceeding anyway.
== portal (1 distinct, 81 total) ==
Oct 7 05:05:10 portal setroubleshoot[1699213]: SELinux is preventing /usr/local/bin/traefik from connectto access on the unix_stream_socket /run/podman/podman.sock. For complete SELinux messages run: sealert -l e0a307a3-2c22-4320-8f9d-6a166c45222d [x81]
== strawberry (7 distinct, 38 total) ==
Oct 7 05:07:03 strawberry kernel: I/O error, dev sda, sector 206848 op 0x0:(READ) flags 0x80700 phys_seg 1 prio class 2 [x6]
Oct 7 05:07:03 strawberry kernel: I/O error, dev sda, sector 206848 op 0x0:(READ) flags 0x0 phys_seg 1 prio class 2 [x6]
Oct 7 05:07:03 strawberry kernel: Buffer I/O error on dev sda2, logical block 0, async page read [x6]
Oct 7 05:07:03 strawberry kernel: I/O error, dev sda, sector 2048 op 0x0:(READ) flags 0x80700 phys_seg 1 prio class 2 [x6]
Oct 7 05:07:03 strawberry kernel: I/O error, dev sda, sector 2048 op 0x0:(READ) flags 0x0 phys_seg 1 prio class 2 [x6]
Oct 7 05:07:03 strawberry kernel: Buffer I/O error on dev sda1, logical block 0, async page read [x6]
Oct 7 05:34:42 strawberry smartd[5314]: Device: /dev/sda [SAT], failed to read SMART Attribute Data [x2]
== submit10-cln25 (5 distinct, 1539 total) ==
Oct 7 05:05:22 submit10-cln25 rsyslogd: file '/var/log/messages': open error: Input/output error [v8.24.0-57.el7_9.3 try http://www.rsyslog.com/e/2433 ] [x1200]
Oct 7 05:05:22 submit10-cln25 rsyslogd: imjournal: fopen() failed for path: '/var/lib/rsyslog/imjournal.state.tmp': Input/output error [v8.24.0-57.el7_9.3 try http://www.rsyslog.com/e/2013 ] [x334]
Oct 7 05:25:00 submit10-cln25 systemd: Failed at step USER spawning /usr/libexec/pcp/bin/pmlogger_check: Input/output error [x2]
Oct 7 05:28:00 submit10-cln25 systemd: Failed at step USER spawning /usr/libexec/pcp/bin/pmie_check: Input/output error [x2]
Oct 7 05:30:00 submit10-cln25 systemd: Failed at step USER spawning /usr/libexec/pcp/bin/pmlogger_daily: Input/output error
== submit26-b9-f3 (9 distinct, 9 total) ==
Oct 7 05:06:49 submit26-b9-f3 setroubleshoot[1906825]: SELinux is preventing /usr/bin/python3.9 from create access on the directory /(null). For complete SELinux messages run: sealert -l a653b772-cbcd-438b-bae5-23c3dc69b31b
Oct 7 05:06:49 submit26-b9-f3 setroubleshoot[1906825]: SELinux is preventing /usr/bin/python3.9 from add_name access on the directory /(null). For complete SELinux messages run: sealert -l 3e904634-6caa-4202-8c92-f139db798859
Oct 7 05:06:49 submit26-b9-f3 setroubleshoot[1906825]: SELinux is preventing /usr/bin/python3.9 from create access on the file /(null). For complete SELinux messages run: sealert -l 580b20e4-ec2c-433d-905c-5bd417fba033
Oct 7 05:06:49 submit26-b9-f3 setroubleshoot[1906825]: SELinux is preventing /usr/bin/python3.9 from open access on the file /tmp/libdnf.Zavu3q/repodata/repomd.xml. For complete SELinux messages run: sealert -l 27f29d48-5e7c-4db7-b051-8ac055737d6f
Oct 7 05:06:49 submit26-b9-f3 setroubleshoot[1906825]: SELinux is preventing /usr/bin/python3.9 from setattr access on the file repomd.xml. For complete SELinux messages run: sealert -l bff72452-d40a-430b-9060-dd0a48f5b6ba
Oct 7 05:06:49 submit26-b9-f3 setroubleshoot[1906825]: SELinux is preventing /usr/bin/python3.9 from read access on the directory libdnf.Zavu3q. For complete SELinux messages run: sealert -l 9638d396-8ce5-4e6a-ae47-45cd3985e1cd
Oct 7 05:06:49 submit26-b9-f3 setroubleshoot[1906825]: SELinux is preventing /usr/bin/python3.9 from remove_name access on the directory repomd.xml. For complete SELinux messages run: sealert -l 6da64b94-7024-45a9-b8c2-3b9812517407
Oct 7 05:06:49 submit26-b9-f3 setroubleshoot[1906825]: SELinux is preventing /usr/bin/python3.9 from unlink access on the file repomd.xml. For complete SELinux messages run: sealert -l 64cbe179-abf1-4d5a-bade-bb164897ee65
Oct 7 05:06:49 submit26-b9-f3 setroubleshoot[1906825]: SELinux is preventing /usr/bin/python3.9 from rmdir access on the directory repodata. For complete SELinux messages run: sealert -l d2e35b1a-e27c-4f91-9217-2bb1204e1e68
== submit26-b9-f4 (10 distinct, 14 total) ==
Oct 7 05:24:55 submit26-b9-f4 setroubleshoot[193068]: SELinux is preventing /usr/bin/python3.9 from create access on the directory /(null). For complete SELinux messages run: sealert -l ee160f23-b161-4f4a-9985-c4edfd3a5beb [x2]
Oct 7 05:24:55 submit26-b9-f4 setroubleshoot[193068]: SELinux is preventing /usr/bin/python3.9 from add_name access on the directory /(null). For complete SELinux messages run: sealert -l 89a83821-4b24-4081-9973-0a79ca6ed5b4 [x2]
Oct 7 05:24:55 submit26-b9-f4 setroubleshoot[193068]: SELinux is preventing /usr/bin/python3.9 from create access on the file /(null). For complete SELinux messages run: sealert -l f73955d6-1416-45f9-bab6-ff1f3ea07e9d
Oct 7 05:24:55 submit26-b9-f4 setroubleshoot[193068]: SELinux is preventing /usr/bin/python3.9 from open access on the file /tmp/libdnf.kk2Rtk/repodata/repomd.xml. For complete SELinux messages run: sealert -l 9f8f24a0-8fb6-454d-a103-31a8f7a6efa0
Oct 7 05:24:55 submit26-b9-f4 setroubleshoot[193068]: SELinux is preventing /usr/bin/python3.9 from setattr access on the file repomd.xml. For complete SELinux messages run: sealert -l 20293136-86a3-40ba-a651-cff48d36059e
Oct 7 05:24:55 submit26-b9-f4 setroubleshoot[193068]: SELinux is preventing /usr/bin/python3.9 from read access on the directory libdnf.kk2Rtk. For complete SELinux messages run: sealert -l 25f86b49-4ee7-4f60-ad1c-73a70032560c
Oct 7 05:24:56 submit26-b9-f4 setroubleshoot[193068]: SELinux is preventing /usr/bin/python3.9 from remove_name access on the directory repomd.xml. For complete SELinux messages run: sealert -l eec250fb-073f-456d-93bc-f98776fd476d [x2]
Oct 7 05:24:56 submit26-b9-f4 setroubleshoot[193068]: SELinux is preventing /usr/bin/python3.9 from unlink access on the file repomd.xml. For complete SELinux messages run: sealert -l c9209e04-a349-43d5-8cb2-3e303e48df74
Oct 7 05:24:56 submit26-b9-f4 setroubleshoot[193068]: SELinux is preventing /usr/bin/python3.9 from rmdir access on the directory repodata. For complete SELinux messages run: sealert -l 3178d5f5-80e9-404b-92b7-9bef397a8915 [x2]
Oct 7 05:24:56 submit26-b9-f4 setroubleshoot[193068]: SELinux is preventing /usr/bin/python3.9 from read access on the directory libdnf.yNtg8m. For complete SELinux messages run: sealert -l 25f86b49-4ee7-4f60-ad1c-73a70032560c
1
0
Command: /usr/local/sbin/syslog-digest.py
Time : 0.1442s
Status : exited 0
Output :
Syslog digest — 2026-10-07 05:05 EDT
Processed 5,121 lines, filtered 2,902 (56%). 2,219 unknown (167 distinct) from 20 host(s).
== abuse (1 distinct, 347 total) ==
Oct 7 04:05:20 abuse rsyslogd[1033]: imjournal: open() failed for path: '/var/lib/rsyslog/imjournal.state.tmp': Input/output error [v8.2404.0 try https://www.rsyslog.com/e/2433 ] [x347]
== b0b02.cs.umd.edu (1 distinct, 1 total) ==
Oct 7 04:17:07 b0b02.cs.umd.edu rustdesk[1108389]: cannot open display:
== forge00 (1 distinct, 1 total) ==
Oct 7 04:09:03 forge00 (httpd)[2819392]: httpd.service: Referenced but unset environment variable evaluates to an empty string: OPTIONS
== galax (31 distinct, 31 total) ==
Oct 7 04:21:21 galax puppet-agent[3386671]: Could not update: Execution of '/usr/bin/apt-get -q -y -o DPkg::Options::=--force-confold --force-yes install choria=0.29.4+resolute' returned 100: W: --force-yes is deprecated, use one of the options starting with --allow instead.
Oct 7 04:21:21 galax puppet-agent[3386671]: E: dpkg was interrupted, you must manually run 'dpkg --configure -a' to correct the problem.
Oct 7 04:21:21 galax puppet-agent[3386671]: (/Stage[main]/Choria::Install/Package[choria]/ensure) change from 'absent' to '0.29.4+resolute' failed: Could not update: Execution of '/usr/bin/apt-get -q -y -o DPkg::Options::=--force-confold --force-yes install choria=0.29.4+resolute' returned 100: W: --force-yes is deprecated, use one of the options starting with --allow instead.
Oct 7 04:21:21 galax puppet-agent[3386671]: (/Stage[main]/Choria::Install/Package[choria]/ensure) E: dpkg was interrupted, you must manually run 'dpkg --configure -a' to correct the problem. (corrective)
Oct 7 04:21:21 galax puppet-agent[3386671]: (/Stage[main]/Choria::Config/File[/etc/choria]) Skipping because of failed dependencies
Oct 7 04:21:21 galax puppet-agent[3386671]: (/Stage[main]/Choria::Config/File[/etc/choria/policies]) Skipping because of failed dependencies
Oct 7 04:21:21 galax puppet-agent[3386671]: (/Stage[main]/Choria::Config/File[/etc/choria/policies/rego]) Skipping because of failed dependencies
Oct 7 04:21:21 galax puppet-agent[3386671]: (/Stage[main]/Choria::Config/File[/etc/choria/plugin.d]) Skipping because of failed dependencies
Oct 7 04:21:21 galax puppet-agent[3386671]: (/Stage[main]/Choria::Config/File[/etc/choria/overrides.json]) Skipping because of failed dependencies
Oct 7 04:21:21 galax puppet-agent[3386671]: (/Stage[main]/Choria::Config/File[/etc/choria/machine]) Skipping because of failed dependencies
Oct 7 04:21:21 galax puppet-agent[3386671]: (/Stage[main]/Choria::Config/File[/usr/bin/choria_mcollective_agent_compat.rb]) Skipping because of failed dependencies
Oct 7 04:21:21 galax puppet-agent[3386671]: (/Stage[main]/Choria::Config/File[/etc/choria/server.conf]) Skipping because of failed dependencies
Oct 7 04:21:21 galax puppet-agent[3386671]: (/Stage[main]/Mcollective::Config/File[/etc/choria/server.cfg]) Skipping because of failed dependencies
Oct 7 04:21:21 galax puppet-agent[3386671]: (/Stage[main]/Mcollective::Config/File[/etc/choria/client.cfg]) Skipping because of failed dependencies
Oct 7 04:21:21 galax puppet-agent[3386671]: (/Stage[main]/Mcollective::Config/File[/etc/choria/policies/choria_util.policy]) Skipping because of failed dependencies
Oct 7 04:21:21 galax puppet-agent[3386671]: (/Stage[main]/Mcollective::Config/File[/etc/choria/policies/rpcutil.policy]) Skipping because of failed dependencies
Oct 7 04:21:21 galax puppet-agent[3386671]: (/Stage[main]/Mcollective::Config/File[/etc/choria/policies/scout.policy]) Skipping because of failed dependencies
Oct 7 04:21:21 galax puppet-agent[3386671]: (/Stage[main]/Mcollective::Config/File[/etc/choria/policies/rego/default.rego]) Skipping because of failed dependencies
Oct 7 04:21:22 galax puppet-agent[3386671]: (/Stage[main]/Choria::Config/Concat[/etc/choria/policies/groups]/Concat_file[/etc/choria/policies/groups]) Skipping because of failed dependencies
Oct 7 04:21:22 galax puppet-agent[3386671]: (/Stage[main]/Choria::Config/Concat[/etc/choria/policies/groups]/File[/etc/choria/policies/groups]) Skipping because of failed dependencies
Oct 7 04:21:22 galax puppet-agent[3386671]: (/Stage[main]/Mcollective::Config/Mcollective::Config_file[/etc/choria/client.conf]/File[/etc/choria/client.conf]) Skipping because of failed dependencies
Oct 7 04:21:22 galax puppet-agent[3386671]: (/Stage[main]/Mcollective::Config/Mcollective::Config_file[/etc/choria/choria-shim.cfg]/File[/etc/choria/choria-shim.cfg]) Skipping because of failed dependencies
Oct 7 04:21:22 galax puppet-agent[3386671]: (/Stage[main]/Mcollective::Facts/Exec[mcollective_facts_yaml_refresh]) Skipping because of failed dependencies
Oct 7 04:21:23 galax puppet-agent[3386671]: (/Stage[main]/Mcollective_agent_puppet/Mcollective::Module_plugin[mcollective_agent_puppet]/File[/etc/choria/policies/puppet.policy]) Skipping because of failed dependencies
Oct 7 04:21:23 galax puppet-agent[3386671]: (/Stage[main]/Mcollective_agent_service/Mcollective::Module_plugin[mcollective_agent_service]/File[/etc/choria/policies/service.policy]) Skipping because of failed dependencies
Oct 7 04:21:23 galax puppet-agent[3386671]: (/Stage[main]/Mcollective_agent_package/Mcollective::Module_plugin[mcollective_agent_package]/File[/etc/choria/policies/package.policy]) Skipping because of failed dependencies
Oct 7 04:21:23 galax puppet-agent[3386671]: (/Stage[main]/Mcollective_agent_filemgr/Mcollective::Module_plugin[mcollective_agent_filemgr]/File[/etc/choria/policies/filemgr.policy]) Skipping because of failed dependencies
Oct 7 04:21:23 galax puppet-agent[3386671]: (/Stage[main]/Mcollective_choria/Mcollective::Module_plugin[mcollective_choria]/Mcollective::Config_file[/etc/choria/plugin.d/choria.cfg]/File[/etc/choria/plugin.d/choria.cfg]) Skipping because of failed dependencies
Oct 7 04:21:23 galax puppet-agent[3386671]: (/Stage[main]/Mcollective_agent_puppet/Mcollective::Module_plugin[mcollective_agent_puppet]/Mcollective::Config_file[/etc/choria/plugin.d/puppet.cfg]/File[/etc/choria/plugin.d/puppet.cfg]) Skipping because of failed dependencies
Oct 7 04:21:23 galax puppet-agent[3386671]: (/Stage[main]/Mcollective_util_actionpolicy/Mcollective::Module_plugin[mcollective_util_actionpolicy]/Mcollective::Config_file[/etc/choria/plugin.d/actionpolicy.cfg]/File[/etc/choria/plugin.d/actionpolicy.cfg]) Skipping because of failed dependencies
... 1 more distinct messages not shown
== gle-dind04 (1 distinct, 1 total) ==
Oct 7 04:12:37 gle-dind04 lldpd[1171]: unable to send packet on real device for veth2c98a17: No such device or address
== idm00 (1 distinct, 1 total) ==
Oct 7 04:54:41 idm00 named[4166701]: client @0x7f11a0005288 10.73.240.42#54216: update '73.10.in-addr.arpa/IN' denied
== idmp0 (1 distinct, 1 total) ==
Oct 7 04:39:23 idmp0 named[1598691]: client @0x7f2d09240c38 10.73.240.43#57017: update '73.10.in-addr.arpa/IN' denied
== itmon02 (1 distinct, 3 total) ==
Oct 7 04:08:07 itmon02 sshd[805675]: error: beginning MaxStartups throttling [x3]
== munin (2 distinct, 28 total) ==
Oct 7 04:32:59 munin sudo[1111990]: pam_systemd(sudo:session): Failed to stat() runtime directory '/run/user/0': No such file or directory [x14]
Oct 7 04:32:59 munin sudo[1111990]: pam_systemd(sudo:session): Not setting $XDG_RUNTIME_DIR, as the directory is not in order. [x14]
== netman.cs.umd.edu (1 distinct, 2 total) ==
Oct 7 04:06:33 netman.cs.umd.edu krb5_child[202405]: Client 'admin(a)UMD.EDU' not found in Kerberos database [x2]
== newhonors2 (1 distinct, 24 total) ==
Oct 7 04:13:03 newhonors2 dhcpcd[3670169]: dhcpcd is not running [x24]
== ntop00 (96 distinct, 96 total) ==
Oct 7 04:05:06 ntop00 sfacctd[1075592]: INFO ( m1/mysql ): *** Purging cache - END (PID: 4522, QN: 3580/3580, ET: 5) ***
Oct 7 04:08:01 ntop00 sfacctd[1075592]: INFO ( p1/print ): *** Purging cache - START (PID: 4523) ***
Oct 7 04:08:01 ntop00 sfacctd[1075592]: INFO ( p1/print ): *** Purging cache - END (PID: 4523, QN: 3957/3957, ET: 0) ***
Oct 7 04:08:01 ntop00 nfacctd[1075699]: INFO ( p1/print ): *** Purging cache - START (PID: 4523) ***
Oct 7 04:08:01 ntop00 nfacctd[1075699]: INFO ( p1/print ): *** Purging cache - END (PID: 4523, QN: 72/72, ET: 0) ***
Oct 7 04:10:01 ntop00 sfacctd[1075592]: INFO ( m1/mysql ): *** Purging cache - START (PID: 4524) ***
Oct 7 04:10:01 ntop00 nfacctd[1075699]: INFO ( m1/mysql ): *** Purging cache - START (PID: 4524) ***
Oct 7 04:10:01 ntop00 nfacctd[1075699]: INFO ( m1/mysql ): *** Purging cache - END (PID: 4524, QN: 68/68, ET: 0) ***
Oct 7 04:10:07 ntop00 sfacctd[1075592]: INFO ( m1/mysql ): *** Purging cache - END (PID: 4524, QN: 3987/3987, ET: 6) ***
Oct 7 04:13:01 ntop00 nfacctd[1075699]: INFO ( p1/print ): *** Purging cache - START (PID: 4525) ***
Oct 7 04:13:01 ntop00 nfacctd[1075699]: INFO ( p1/print ): *** Purging cache - END (PID: 4525, QN: 51/51, ET: 0) ***
Oct 7 04:13:01 ntop00 sfacctd[1075592]: INFO ( p1/print ): *** Purging cache - START (PID: 4525) ***
Oct 7 04:13:01 ntop00 sfacctd[1075592]: INFO ( p1/print ): *** Purging cache - END (PID: 4525, QN: 3430/3430, ET: 0) ***
Oct 7 04:15:01 ntop00 sfacctd[1075592]: INFO ( m1/mysql ): *** Purging cache - START (PID: 4526) ***
Oct 7 04:15:01 ntop00 nfacctd[1075699]: INFO ( m1/mysql ): *** Purging cache - START (PID: 4526) ***
Oct 7 04:15:01 ntop00 nfacctd[1075699]: INFO ( m1/mysql ): *** Purging cache - END (PID: 4526, QN: 44/44, ET: 0) ***
Oct 7 04:15:06 ntop00 sfacctd[1075592]: INFO ( m1/mysql ): *** Purging cache - END (PID: 4526, QN: 3238/3238, ET: 5) ***
Oct 7 04:18:01 ntop00 sfacctd[1075592]: INFO ( p1/print ): *** Purging cache - START (PID: 4527) ***
Oct 7 04:18:01 ntop00 sfacctd[1075592]: INFO ( p1/print ): *** Purging cache - END (PID: 4527, QN: 3653/3653, ET: 0) ***
Oct 7 04:18:01 ntop00 nfacctd[1075699]: INFO ( p1/print ): *** Purging cache - START (PID: 4527) ***
Oct 7 04:18:01 ntop00 nfacctd[1075699]: INFO ( p1/print ): *** Purging cache - END (PID: 4527, QN: 46/46, ET: 0) ***
Oct 7 04:20:01 ntop00 sfacctd[1075592]: INFO ( m1/mysql ): *** Purging cache - START (PID: 4528) ***
Oct 7 04:20:01 ntop00 nfacctd[1075699]: INFO ( m1/mysql ): *** Purging cache - START (PID: 4528) ***
Oct 7 04:20:01 ntop00 nfacctd[1075699]: INFO ( m1/mysql ): *** Purging cache - END (PID: 4528, QN: 47/47, ET: 0) ***
Oct 7 04:20:07 ntop00 sfacctd[1075592]: INFO ( m1/mysql ): *** Purging cache - END (PID: 4528, QN: 3870/3870, ET: 6) ***
Oct 7 04:23:01 ntop00 sfacctd[1075592]: INFO ( p1/print ): *** Purging cache - START (PID: 4529) ***
Oct 7 04:23:01 ntop00 sfacctd[1075592]: INFO ( p1/print ): *** Purging cache - END (PID: 4529, QN: 3840/3840, ET: 0) ***
Oct 7 04:23:01 ntop00 nfacctd[1075699]: INFO ( p1/print ): *** Purging cache - START (PID: 4529) ***
Oct 7 04:23:01 ntop00 nfacctd[1075699]: INFO ( p1/print ): *** Purging cache - END (PID: 4529, QN: 65/65, ET: 0) ***
Oct 7 04:25:01 ntop00 sfacctd[1075592]: INFO ( m1/mysql ): *** Purging cache - START (PID: 4530) ***
... 66 more distinct messages not shown
== outbound00.cs.umd.edu (1 distinct, 6 total) ==
Oct 7 04:09:09 outbound00.cs.umd.edu python3[167431]: ldapdb [x6]
== outbound01.cs.umd.edu (1 distinct, 6 total) ==
Oct 7 04:13:06 outbound01.cs.umd.edu python3[1625294]: ldapdb [x6]
== portal (1 distinct, 76 total) ==
Oct 7 04:05:10 portal setroubleshoot[1686673]: SELinux is preventing /usr/local/bin/traefik from connectto access on the unix_stream_socket /run/podman/podman.sock. For complete SELinux messages run: sealert -l e0a307a3-2c22-4320-8f9d-6a166c45222d [x76]
== strawberry (7 distinct, 38 total) ==
Oct 7 04:07:03 strawberry kernel: I/O error, dev sda, sector 206848 op 0x0:(READ) flags 0x80700 phys_seg 1 prio class 2 [x6]
Oct 7 04:07:03 strawberry kernel: I/O error, dev sda, sector 206848 op 0x0:(READ) flags 0x0 phys_seg 1 prio class 2 [x6]
Oct 7 04:07:03 strawberry kernel: Buffer I/O error on dev sda2, logical block 0, async page read [x6]
Oct 7 04:07:03 strawberry kernel: I/O error, dev sda, sector 2048 op 0x0:(READ) flags 0x80700 phys_seg 1 prio class 2 [x6]
Oct 7 04:07:03 strawberry kernel: I/O error, dev sda, sector 2048 op 0x0:(READ) flags 0x0 phys_seg 1 prio class 2 [x6]
Oct 7 04:07:03 strawberry kernel: Buffer I/O error on dev sda1, logical block 0, async page read [x6]
Oct 7 04:34:42 strawberry smartd[5314]: Device: /dev/sda [SAT], failed to read SMART Attribute Data [x2]
== submit10-cln25 (5 distinct, 1539 total) ==
Oct 7 04:05:22 submit10-cln25 rsyslogd: file '/var/log/messages': open error: Input/output error [v8.24.0-57.el7_9.3 try http://www.rsyslog.com/e/2433 ] [x1200]
Oct 7 04:05:22 submit10-cln25 rsyslogd: imjournal: fopen() failed for path: '/var/lib/rsyslog/imjournal.state.tmp': Input/output error [v8.24.0-57.el7_9.3 try http://www.rsyslog.com/e/2013 ] [x334]
Oct 7 04:25:00 submit10-cln25 systemd: Failed at step USER spawning /usr/libexec/pcp/bin/pmlogger_check: Input/output error [x2]
Oct 7 04:28:00 submit10-cln25 systemd: Failed at step USER spawning /usr/libexec/pcp/bin/pmie_check: Input/output error [x2]
Oct 7 04:30:00 submit10-cln25 systemd: Failed at step USER spawning /usr/libexec/pcp/bin/pmlogger_daily: Input/output error
== submit26-b9-fclone (10 distinct, 14 total) ==
Oct 7 04:22:04 submit26-b9-fclone setroubleshoot[1151966]: SELinux is preventing /usr/bin/python3.9 from create access on the directory /(null). For complete SELinux messages run: sealert -l 9355d9d9-a311-48d2-bd37-6c0f6947dfff [x2]
Oct 7 04:22:04 submit26-b9-fclone setroubleshoot[1151966]: SELinux is preventing /usr/bin/python3.9 from add_name access on the directory /(null). For complete SELinux messages run: sealert -l cc4658d7-9db1-405d-9eee-de0ccee5857f [x2]
Oct 7 04:22:04 submit26-b9-fclone setroubleshoot[1151966]: SELinux is preventing /usr/bin/python3.9 from create access on the file /(null). For complete SELinux messages run: sealert -l 568a2429-0b1b-49df-af41-49b5cd298ae8
Oct 7 04:22:04 submit26-b9-fclone setroubleshoot[1151966]: SELinux is preventing /usr/bin/python3.9 from open access on the file /tmp/libdnf.zm81Yd/repodata/repomd.xml. For complete SELinux messages run: sealert -l 03e2f521-0e7c-481f-8e92-0602c6adeedc
Oct 7 04:22:04 submit26-b9-fclone setroubleshoot[1151966]: SELinux is preventing /usr/bin/python3.9 from setattr access on the file repomd.xml. For complete SELinux messages run: sealert -l 0d6b7b1f-ebe3-4beb-915a-b06b63bf2566
Oct 7 04:22:04 submit26-b9-fclone setroubleshoot[1151966]: SELinux is preventing /usr/bin/python3.9 from read access on the directory libdnf.zm81Yd. For complete SELinux messages run: sealert -l 887adbf9-2bb9-4009-b800-36ddf9ba0db5
Oct 7 04:22:04 submit26-b9-fclone setroubleshoot[1151966]: SELinux is preventing /usr/bin/python3.9 from remove_name access on the directory repomd.xml. For complete SELinux messages run: sealert -l 092e0644-8373-4017-b77f-1afa6c6da4ac [x2]
Oct 7 04:22:04 submit26-b9-fclone setroubleshoot[1151966]: SELinux is preventing /usr/bin/python3.9 from unlink access on the file repomd.xml. For complete SELinux messages run: sealert -l ce429a92-56de-4de1-b859-cbfb69ae123c
Oct 7 04:22:04 submit26-b9-fclone setroubleshoot[1151966]: SELinux is preventing /usr/bin/python3.9 from rmdir access on the directory repodata. For complete SELinux messages run: sealert -l 99b886eb-497b-406d-8206-afe76a1086b4 [x2]
Oct 7 04:22:04 submit26-b9-fclone setroubleshoot[1151966]: SELinux is preventing /usr/bin/python3.9 from read access on the directory libdnf.MFyMhH. For complete SELinux messages run: sealert -l 887adbf9-2bb9-4009-b800-36ddf9ba0db5
== teaching-awards (2 distinct, 2 total) ==
Oct 7 04:05:58 teaching-awards krb5_child[33594]: Client 'admin(a)UMD.EDU' not found in Kerberos database
Oct 7 04:06:12 teaching-awards sshd-session[33603]: error: Protocol major versions differ: 2 vs. 1
== wraith (2 distinct, 2 total) ==
Oct 7 04:10:24 wraith kernel: workqueue: i915_hpd_poll_init_work [i915] hogged CPU for >10000us 4099 times, consider switching to WQ_UNBOUND
Oct 7 04:11:47 wraith kernel: workqueue: output_poll_execute hogged CPU for >10000us 4099 times, consider switching to WQ_UNBOUND
1
0
Command: /usr/local/sbin/syslog-digest.py
Time : 0.1428s
Status : exited 0
Output :
Syslog digest — 2026-10-07 04:05 EDT
Processed 5,318 lines, filtered 3,151 (59%). 2,167 unknown (138 distinct) from 19 host(s).
== abuse (1 distinct, 346 total) ==
Oct 7 03:05:25 abuse rsyslogd[1033]: imjournal: open() failed for path: '/var/lib/rsyslog/imjournal.state.tmp': Input/output error [v8.2404.0 try https://www.rsyslog.com/e/2433 ] [x346]
== b0b02.cs.umd.edu (1 distinct, 1 total) ==
Oct 7 03:17:03 b0b02.cs.umd.edu rustdesk[1093127]: cannot open display:
== gle-dind04 (3 distinct, 3 total) ==
Oct 7 03:36:38 gle-dind04 falcon-sensor-bpf[1017]: CrowdStrike(4): Could not retrieve DisableProxy value: c0000225
Oct 7 03:36:38 gle-dind04 falcon-sensor-bpf[1017]: CrowdStrike(4): ConnectWithProxy: Unable to get application proxy host from CsConfig: c0000225
Oct 7 03:37:33 gle-dind04 lldpd[1171]: unable to send packet on real device for veth851aac5: No such device or address
== idm00 (1 distinct, 1 total) ==
Oct 7 03:54:41 idm00 named[4166701]: client @0x7f11a0064678 10.73.240.42#53781: update '73.10.in-addr.arpa/IN' denied
== idmp0 (1 distinct, 1 total) ==
Oct 7 03:39:23 idmp0 named[1598691]: client @0x7f2d2001fbb8 10.73.240.43#52502: update '73.10.in-addr.arpa/IN' denied
== itmon02 (2 distinct, 6 total) ==
Oct 7 03:08:14 itmon02 sshd[805675]: error: beginning MaxStartups throttling [x5]
Oct 7 03:15:02 itmon02 (httpd)[378381]: httpd.service: Referenced but unset environment variable evaluates to an empty string: OPTIONS
== kadath.cs.umd.edu (1 distinct, 1 total) ==
Oct 7 03:47:12 kadath.cs.umd.edu puppet-agent[114945]: (Facter) invalid or malformed lldp data: MalformedDataError: no lldp interface data found
== librenms (1 distinct, 1 total) ==
Oct 7 03:47:02 librenms (httpd)[1964809]: httpd.service: Referenced but unset environment variable evaluates to an empty string: OPTIONS
== munin (2 distinct, 4 total) ==
Oct 7 03:08:15 munin sudo[1081368]: pam_systemd(sudo:session): Failed to stat() runtime directory '/run/user/0': No such file or directory [x2]
Oct 7 03:08:15 munin sudo[1081368]: pam_systemd(sudo:session): Not setting $XDG_RUNTIME_DIR, as the directory is not in order. [x2]
== neoavion (3 distinct, 3 total) ==
Oct 7 03:34:38 neoavion (smartd)[86183]: smartmontools.service: Referenced but unset environment variable evaluates to an empty string: smartd_opts
Oct 7 03:34:38 neoavion (nin-node)[86195]: munin-node.service: Referenced but unset environment variable evaluates to an empty string: DAEMON_ARGS
Oct 7 03:34:39 neoavion systemd[1]: resmon.service: Supervising process 86418 which is not our child. We'll most likely not notice when it exits.
== netbox (1 distinct, 1 total) ==
Oct 7 03:08:02 netbox (httpd)[2240930]: httpd.service: Referenced but unset environment variable evaluates to an empty string: OPTIONS
== netman.cs.umd.edu (5 distinct, 11 total) ==
Oct 7 03:23:34 netman.cs.umd.edu krb5_child[189376]: Client 'admin(a)UMD.EDU' not found in Kerberos database [x6]
Oct 7 03:23:41 netman.cs.umd.edu sshd[189373]: error: PAM: Authentication failure for admin from 35.240.108.120
Oct 7 03:23:54 netman.cs.umd.edu sshd[189393]: error: Protocol major versions differ: 2 vs. 1
Oct 7 03:36:16 netman.cs.umd.edu systemd[1]: cgroup compatibility translation between legacy and unified hierarchy settings activated. See cgroup-compat debug messages for details.
Oct 7 04:03:10 netman.cs.umd.edu krb5_child[201146]: Preauthentication failed [x2]
== newhonors2 (1 distinct, 24 total) ==
Oct 7 03:13:03 newhonors2 dhcpcd[3668340]: dhcpcd is not running [x24]
== ntop00 (99 distinct, 99 total) ==
Oct 7 03:05:01 ntop00 sfacctd[1075592]: INFO ( m1/mysql ): *** Purging cache - START (PID: 4498) ***
Oct 7 03:05:01 ntop00 nfacctd[1075699]: INFO ( m1/mysql ): *** Purging cache - START (PID: 4498) ***
Oct 7 03:05:01 ntop00 nfacctd[1075699]: INFO ( m1/mysql ): *** Purging cache - END (PID: 4498, QN: 57/57, ET: 0) ***
Oct 7 03:05:09 ntop00 sfacctd[1075592]: INFO ( m1/mysql ): *** Purging cache - END (PID: 4498, QN: 4540/4540, ET: 8) ***
Oct 7 03:08:01 ntop00 sfacctd[1075592]: INFO ( p1/print ): *** Purging cache - START (PID: 4499) ***
Oct 7 03:08:01 ntop00 sfacctd[1075592]: INFO ( p1/print ): *** Purging cache - END (PID: 4499, QN: 4393/4393, ET: 0) ***
Oct 7 03:08:01 ntop00 nfacctd[1075699]: INFO ( p1/print ): *** Purging cache - START (PID: 4499) ***
Oct 7 03:08:01 ntop00 nfacctd[1075699]: INFO ( p1/print ): *** Purging cache - END (PID: 4499, QN: 62/62, ET: 0) ***
Oct 7 03:10:01 ntop00 sfacctd[1075592]: INFO ( m1/mysql ): *** Purging cache - START (PID: 4500) ***
Oct 7 03:10:01 ntop00 nfacctd[1075699]: INFO ( m1/mysql ): *** Purging cache - START (PID: 4500) ***
Oct 7 03:10:01 ntop00 nfacctd[1075699]: INFO ( m1/mysql ): *** Purging cache - END (PID: 4500, QN: 52/52, ET: 0) ***
Oct 7 03:10:08 ntop00 sfacctd[1075592]: INFO ( m1/mysql ): *** Purging cache - END (PID: 4500, QN: 4268/4268, ET: 7) ***
Oct 7 03:13:01 ntop00 sfacctd[1075592]: INFO ( p1/print ): *** Purging cache - START (PID: 4501) ***
Oct 7 03:13:01 ntop00 sfacctd[1075592]: INFO ( p1/print ): *** Purging cache - END (PID: 4501, QN: 5061/5061, ET: 0) ***
Oct 7 03:13:01 ntop00 nfacctd[1075699]: INFO ( p1/print ): *** Purging cache - START (PID: 4501) ***
Oct 7 03:13:01 ntop00 nfacctd[1075699]: INFO ( p1/print ): *** Purging cache - END (PID: 4501, QN: 43/43, ET: 0) ***
Oct 7 03:15:01 ntop00 nfacctd[1075699]: INFO ( m1/mysql ): *** Purging cache - START (PID: 4502) ***
Oct 7 03:15:01 ntop00 sfacctd[1075592]: INFO ( m1/mysql ): *** Purging cache - START (PID: 4502) ***
Oct 7 03:15:01 ntop00 nfacctd[1075699]: INFO ( m1/mysql ): *** Purging cache - END (PID: 4502, QN: 50/50, ET: 0) ***
Oct 7 03:15:09 ntop00 sfacctd[1075592]: INFO ( m1/mysql ): *** Purging cache - END (PID: 4502, QN: 5006/5006, ET: 8) ***
Oct 7 03:18:01 ntop00 sfacctd[1075592]: INFO ( p1/print ): *** Purging cache - START (PID: 4503) ***
Oct 7 03:18:01 ntop00 sfacctd[1075592]: INFO ( p1/print ): *** Purging cache - END (PID: 4503, QN: 4011/4011, ET: 0) ***
Oct 7 03:18:01 ntop00 nfacctd[1075699]: INFO ( p1/print ): *** Purging cache - START (PID: 4503) ***
Oct 7 03:18:01 ntop00 nfacctd[1075699]: INFO ( p1/print ): *** Purging cache - END (PID: 4503, QN: 42/42, ET: 0) ***
Oct 7 03:20:01 ntop00 sfacctd[1075592]: INFO ( m1/mysql ): *** Purging cache - START (PID: 4504) ***
Oct 7 03:20:01 ntop00 nfacctd[1075699]: INFO ( m1/mysql ): *** Purging cache - START (PID: 4504) ***
Oct 7 03:20:01 ntop00 nfacctd[1075699]: INFO ( m1/mysql ): *** Purging cache - END (PID: 4504, QN: 47/47, ET: 0) ***
Oct 7 03:20:07 ntop00 sfacctd[1075592]: INFO ( m1/mysql ): *** Purging cache - END (PID: 4504, QN: 3804/3804, ET: 6) ***
Oct 7 03:23:01 ntop00 sfacctd[1075592]: INFO ( p1/print ): *** Purging cache - START (PID: 4505) ***
Oct 7 03:23:01 ntop00 sfacctd[1075592]: INFO ( p1/print ): *** Purging cache - END (PID: 4505, QN: 3845/3845, ET: 0) ***
... 69 more distinct messages not shown
== outbound00.cs.umd.edu (2 distinct, 8 total) ==
Oct 7 03:09:09 outbound00.cs.umd.edu python3[152981]: ldapdb [x7]
Oct 7 03:24:20 outbound00.cs.umd.edu systemd[1]: Configuration file /usr/lib/systemd/system/authentication_milter.service is marked executable. Please remove executable permission bits. Proceeding anyway.
== outbound01.cs.umd.edu (1 distinct, 6 total) ==
Oct 7 03:13:06 outbound01.cs.umd.edu python3[1611443]: ldapdb [x6]
== portal (1 distinct, 74 total) ==
Oct 7 03:05:21 portal setroubleshoot[1674476]: SELinux is preventing /usr/local/bin/traefik from connectto access on the unix_stream_socket /run/podman/podman.sock. For complete SELinux messages run: sealert -l e0a307a3-2c22-4320-8f9d-6a166c45222d [x74]
== strawberry (7 distinct, 38 total) ==
Oct 7 03:07:03 strawberry kernel: I/O error, dev sda, sector 206848 op 0x0:(READ) flags 0x80700 phys_seg 1 prio class 2 [x6]
Oct 7 03:07:03 strawberry kernel: I/O error, dev sda, sector 206848 op 0x0:(READ) flags 0x0 phys_seg 1 prio class 2 [x6]
Oct 7 03:07:03 strawberry kernel: Buffer I/O error on dev sda2, logical block 0, async page read [x6]
Oct 7 03:07:03 strawberry kernel: I/O error, dev sda, sector 2048 op 0x0:(READ) flags 0x80700 phys_seg 1 prio class 2 [x6]
Oct 7 03:07:03 strawberry kernel: I/O error, dev sda, sector 2048 op 0x0:(READ) flags 0x0 phys_seg 1 prio class 2 [x6]
Oct 7 03:07:03 strawberry kernel: Buffer I/O error on dev sda1, logical block 0, async page read [x6]
Oct 7 03:34:42 strawberry smartd[5314]: Device: /dev/sda [SAT], failed to read SMART Attribute Data [x2]
== submit10-cln25 (5 distinct, 1539 total) ==
Oct 7 03:05:22 submit10-cln25 rsyslogd: file '/var/log/messages': open error: Input/output error [v8.24.0-57.el7_9.3 try http://www.rsyslog.com/e/2433 ] [x1200]
Oct 7 03:05:22 submit10-cln25 rsyslogd: imjournal: fopen() failed for path: '/var/lib/rsyslog/imjournal.state.tmp': Input/output error [v8.24.0-57.el7_9.3 try http://www.rsyslog.com/e/2013 ] [x334]
Oct 7 03:25:01 submit10-cln25 systemd: Failed at step USER spawning /usr/libexec/pcp/bin/pmlogger_check: Input/output error [x2]
Oct 7 03:28:01 submit10-cln25 systemd: Failed at step USER spawning /usr/libexec/pcp/bin/pmie_check: Input/output error [x2]
Oct 7 03:30:01 submit10-cln25 systemd: Failed at step USER spawning /usr/libexec/pcp/bin/pmlogger_daily: Input/output error
1
0
Command: /usr/local/sbin/syslog-digest.py
Time : 0.1459s
Status : exited 0
Output :
Syslog digest — 2026-10-07 03:05 EDT
Processed 5,729 lines, filtered 3,536 (61%). 2,193 unknown (146 distinct) from 20 host(s).
== abuse (1 distinct, 347 total) ==
Oct 7 02:05:25 abuse rsyslogd[1033]: imjournal: open() failed for path: '/var/lib/rsyslog/imjournal.state.tmp': Input/output error [v8.2404.0 try https://www.rsyslog.com/e/2433 ] [x347]
== b0b02.cs.umd.edu (1 distinct, 1 total) ==
Oct 7 02:17:00 b0b02.cs.umd.edu rustdesk[1078048]: cannot open display:
== gle-dind00.cs.umd.edu (4 distinct, 4 total) ==
Oct 7 02:12:47 gle-dind00.cs.umd.edu systemd-udevd[2717302]: Could not generate persistent MAC address for veth092a59c: No such file or directory
Oct 7 02:12:47 gle-dind00.cs.umd.edu systemd-udevd[2717303]: Could not generate persistent MAC address for veth8a7cc61: No such file or directory
Oct 7 02:13:09 gle-dind00.cs.umd.edu systemd-udevd[2717442]: Could not generate persistent MAC address for vethc9ade61: No such file or directory
Oct 7 02:13:09 gle-dind00.cs.umd.edu systemd-udevd[2717441]: Could not generate persistent MAC address for veth3c39830: No such file or directory
== gle-dind04 (1 distinct, 1 total) ==
Oct 7 02:11:09 gle-dind04 lldpd[1171]: unable to send packet on real device for vethb7517f1: No such device or address
== idm00 (1 distinct, 1 total) ==
Oct 7 02:54:41 idm00 named[4166701]: client @0x7f11a40736b8 10.73.240.42#51762: update '73.10.in-addr.arpa/IN' denied
== idmp0 (1 distinct, 1 total) ==
Oct 7 02:39:23 idmp0 named[1598691]: client @0x7f2d3400d5c8 10.73.240.43#49244: update '73.10.in-addr.arpa/IN' denied
== itmon02 (1 distinct, 1 total) ==
Oct 7 02:43:38 itmon02 sshd[805675]: error: beginning MaxStartups throttling
== munin (2 distinct, 28 total) ==
Oct 7 02:43:41 munin sudo[1072082]: pam_systemd(sudo:session): Failed to stat() runtime directory '/run/user/0': No such file or directory [x14]
Oct 7 02:43:41 munin sudo[1072082]: pam_systemd(sudo:session): Not setting $XDG_RUNTIME_DIR, as the directory is not in order. [x14]
== newhonors2 (1 distinct, 24 total) ==
Oct 7 02:13:03 newhonors2 dhcpcd[3665896]: dhcpcd is not running [x24]
== ntop00 (95 distinct, 95 total) ==
Oct 7 02:05:01 ntop00 nfacctd[1075699]: INFO ( m1/mysql ): *** Purging cache - START (PID: 4474) ***
Oct 7 02:05:01 ntop00 nfacctd[1075699]: INFO ( m1/mysql ): *** Purging cache - END (PID: 4474, QN: 60/60, ET: 0) ***
Oct 7 02:05:08 ntop00 sfacctd[1075592]: INFO ( m1/mysql ): *** Purging cache - END (PID: 4474, QN: 4198/4198, ET: 7) ***
Oct 7 02:08:01 ntop00 sfacctd[1075592]: INFO ( p1/print ): *** Purging cache - START (PID: 4475) ***
Oct 7 02:08:01 ntop00 sfacctd[1075592]: INFO ( p1/print ): *** Purging cache - END (PID: 4475, QN: 4868/4868, ET: 0) ***
Oct 7 02:08:01 ntop00 nfacctd[1075699]: INFO ( p1/print ): *** Purging cache - START (PID: 4475) ***
Oct 7 02:08:01 ntop00 nfacctd[1075699]: INFO ( p1/print ): *** Purging cache - END (PID: 4475, QN: 73/73, ET: 0) ***
Oct 7 02:10:01 ntop00 sfacctd[1075592]: INFO ( m1/mysql ): *** Purging cache - START (PID: 4476) ***
Oct 7 02:10:01 ntop00 nfacctd[1075699]: INFO ( m1/mysql ): *** Purging cache - START (PID: 4476) ***
Oct 7 02:10:01 ntop00 nfacctd[1075699]: INFO ( m1/mysql ): *** Purging cache - END (PID: 4476, QN: 64/64, ET: 0) ***
Oct 7 02:10:10 ntop00 sfacctd[1075592]: INFO ( m1/mysql ): *** Purging cache - END (PID: 4476, QN: 5160/5160, ET: 9) ***
Oct 7 02:13:01 ntop00 sfacctd[1075592]: INFO ( p1/print ): *** Purging cache - START (PID: 4477) ***
Oct 7 02:13:01 ntop00 sfacctd[1075592]: INFO ( p1/print ): *** Purging cache - END (PID: 4477, QN: 4994/4994, ET: 0) ***
Oct 7 02:13:01 ntop00 nfacctd[1075699]: INFO ( p1/print ): *** Purging cache - START (PID: 4477) ***
Oct 7 02:13:01 ntop00 nfacctd[1075699]: INFO ( p1/print ): *** Purging cache - END (PID: 4477, QN: 47/47, ET: 0) ***
Oct 7 02:15:01 ntop00 sfacctd[1075592]: INFO ( m1/mysql ): *** Purging cache - START (PID: 4478) ***
Oct 7 02:15:01 ntop00 nfacctd[1075699]: INFO ( m1/mysql ): *** Purging cache - START (PID: 4478) ***
Oct 7 02:15:01 ntop00 nfacctd[1075699]: INFO ( m1/mysql ): *** Purging cache - END (PID: 4478, QN: 51/51, ET: 0) ***
Oct 7 02:15:09 ntop00 sfacctd[1075592]: INFO ( m1/mysql ): *** Purging cache - END (PID: 4478, QN: 4819/4819, ET: 8) ***
Oct 7 02:18:01 ntop00 sfacctd[1075592]: INFO ( p1/print ): *** Purging cache - START (PID: 4479) ***
Oct 7 02:18:01 ntop00 sfacctd[1075592]: INFO ( p1/print ): *** Purging cache - END (PID: 4479, QN: 4962/4962, ET: 0) ***
Oct 7 02:18:01 ntop00 nfacctd[1075699]: INFO ( p1/print ): *** Purging cache - START (PID: 4479) ***
Oct 7 02:18:01 ntop00 nfacctd[1075699]: INFO ( p1/print ): *** Purging cache - END (PID: 4479, QN: 62/62, ET: 0) ***
Oct 7 02:20:01 ntop00 sfacctd[1075592]: INFO ( m1/mysql ): *** Purging cache - START (PID: 4480) ***
Oct 7 02:20:01 ntop00 nfacctd[1075699]: INFO ( m1/mysql ): *** Purging cache - START (PID: 4480) ***
Oct 7 02:20:01 ntop00 nfacctd[1075699]: INFO ( m1/mysql ): *** Purging cache - END (PID: 4480, QN: 72/72, ET: 0) ***
Oct 7 02:20:10 ntop00 sfacctd[1075592]: INFO ( m1/mysql ): *** Purging cache - END (PID: 4480, QN: 4994/4994, ET: 9) ***
Oct 7 02:23:01 ntop00 sfacctd[1075592]: INFO ( p1/print ): *** Purging cache - START (PID: 4481) ***
Oct 7 02:23:01 ntop00 sfacctd[1075592]: INFO ( p1/print ): *** Purging cache - END (PID: 4481, QN: 5217/5217, ET: 0) ***
Oct 7 02:23:01 ntop00 nfacctd[1075699]: INFO ( p1/print ): *** Purging cache - START (PID: 4481) ***
... 65 more distinct messages not shown
== outbound00.cs.umd.edu (1 distinct, 6 total) ==
Oct 7 02:09:09 outbound00.cs.umd.edu python3[139078]: ldapdb [x6]
== outbound01.cs.umd.edu (1 distinct, 6 total) ==
Oct 7 02:13:06 outbound01.cs.umd.edu python3[1597537]: ldapdb [x6]
== portal (1 distinct, 74 total) ==
Oct 7 02:05:27 portal setroubleshoot[1661678]: SELinux is preventing /usr/local/bin/traefik from connectto access on the unix_stream_socket /run/podman/podman.sock. For complete SELinux messages run: sealert -l e0a307a3-2c22-4320-8f9d-6a166c45222d [x74]
== strawberry (7 distinct, 38 total) ==
Oct 7 02:07:03 strawberry kernel: I/O error, dev sda, sector 206848 op 0x0:(READ) flags 0x80700 phys_seg 1 prio class 2 [x6]
Oct 7 02:07:03 strawberry kernel: I/O error, dev sda, sector 206848 op 0x0:(READ) flags 0x0 phys_seg 1 prio class 2 [x6]
Oct 7 02:07:03 strawberry kernel: Buffer I/O error on dev sda2, logical block 0, async page read [x6]
Oct 7 02:07:03 strawberry kernel: I/O error, dev sda, sector 2048 op 0x0:(READ) flags 0x80700 phys_seg 1 prio class 2 [x6]
Oct 7 02:07:03 strawberry kernel: I/O error, dev sda, sector 2048 op 0x0:(READ) flags 0x0 phys_seg 1 prio class 2 [x6]
Oct 7 02:07:03 strawberry kernel: Buffer I/O error on dev sda1, logical block 0, async page read [x6]
Oct 7 02:34:42 strawberry smartd[5314]: Device: /dev/sda [SAT], failed to read SMART Attribute Data [x2]
== submit10-cln25 (5 distinct, 1539 total) ==
Oct 7 02:05:22 submit10-cln25 rsyslogd: file '/var/log/messages': open error: Input/output error [v8.24.0-57.el7_9.3 try http://www.rsyslog.com/e/2433 ] [x1200]
Oct 7 02:05:22 submit10-cln25 rsyslogd: imjournal: fopen() failed for path: '/var/lib/rsyslog/imjournal.state.tmp': Input/output error [v8.24.0-57.el7_9.3 try http://www.rsyslog.com/e/2013 ] [x334]
Oct 7 02:25:01 submit10-cln25 systemd: Failed at step USER spawning /usr/libexec/pcp/bin/pmlogger_check: Input/output error [x2]
Oct 7 02:28:01 submit10-cln25 systemd: Failed at step USER spawning /usr/libexec/pcp/bin/pmie_check: Input/output error [x2]
Oct 7 02:30:01 submit10-cln25 systemd: Failed at step USER spawning /usr/libexec/pcp/bin/pmlogger_daily: Input/output error
== submit26-b9-3 (1 distinct, 4 total) ==
Sep 8 23:58:26 submit26-b9-3 systemd[1]: user(a)1001.service: Main process exited, code=killed, status=9/KILL [x4]
== submit26-b9-f1 (10 distinct, 10 total) ==
Oct 7 02:13:08 submit26-b9-f1 systemd[1]: user(a)1001.service: Main process exited, code=killed, status=9/KILL
Oct 7 02:26:01 submit26-b9-f1 setroubleshoot[1602933]: SELinux is preventing /usr/bin/python3.9 from create access on the directory /(null). For complete SELinux messages run: sealert -l 3ef7d677-731f-46bf-9c34-c2c55fea665c
Oct 7 02:26:01 submit26-b9-f1 setroubleshoot[1602933]: SELinux is preventing /usr/bin/python3.9 from add_name access on the directory /(null). For complete SELinux messages run: sealert -l aa60e26f-72e1-45f1-bc12-aa8b3b669e36
Oct 7 02:26:01 submit26-b9-f1 setroubleshoot[1602933]: SELinux is preventing /usr/bin/python3.9 from create access on the file /(null). For complete SELinux messages run: sealert -l d088fb43-23ee-4ae8-ae6a-5d1c041ee2d6
Oct 7 02:26:01 submit26-b9-f1 setroubleshoot[1602933]: SELinux is preventing /usr/bin/python3.9 from open access on the file /tmp/libdnf.9yIiju/repodata/repomd.xml. For complete SELinux messages run: sealert -l 3b0d8c9a-6637-4d6e-a864-f1dd7c00377d
Oct 7 02:26:01 submit26-b9-f1 setroubleshoot[1602933]: SELinux is preventing /usr/bin/python3.9 from setattr access on the file repomd.xml. For complete SELinux messages run: sealert -l 0fd3339f-3ef2-45f3-9e58-65a58b42f3ee
Oct 7 02:26:01 submit26-b9-f1 setroubleshoot[1602933]: SELinux is preventing /usr/bin/python3.9 from read access on the directory libdnf.9yIiju. For complete SELinux messages run: sealert -l 0d661d88-dc9e-469d-986b-52e29b353aa8
Oct 7 02:26:01 submit26-b9-f1 setroubleshoot[1602933]: SELinux is preventing /usr/bin/python3.9 from remove_name access on the directory repomd.xml. For complete SELinux messages run: sealert -l 405a8556-cf9f-4ef4-8525-0dca18d4259d
Oct 7 02:26:01 submit26-b9-f1 setroubleshoot[1602933]: SELinux is preventing /usr/bin/python3.9 from unlink access on the file repomd.xml. For complete SELinux messages run: sealert -l 3c38e23e-3631-4cb5-81c7-992675c836d9
Oct 7 02:26:01 submit26-b9-f1 setroubleshoot[1602933]: SELinux is preventing /usr/bin/python3.9 from rmdir access on the directory repodata. For complete SELinux messages run: sealert -l a070e9b5-2867-47d6-b2e3-3b7d99725848
== submit26-b9-f2 (10 distinct, 10 total) ==
Oct 7 02:06:55 submit26-b9-f2 setroubleshoot[699856]: SELinux is preventing /usr/bin/python3.9 from create access on the directory /(null). For complete SELinux messages run: sealert -l 0659d546-3107-4f75-b00f-008c85f41dc6
Oct 7 02:06:55 submit26-b9-f2 setroubleshoot[699856]: SELinux is preventing /usr/bin/python3.9 from add_name access on the directory /(null). For complete SELinux messages run: sealert -l 156d9270-3466-4356-b86f-1a128825961a
Oct 7 02:06:55 submit26-b9-f2 setroubleshoot[699856]: SELinux is preventing /usr/bin/python3.9 from create access on the file /(null). For complete SELinux messages run: sealert -l c8a40bf5-2fc4-46b3-b813-8592b3523339
Oct 7 02:06:55 submit26-b9-f2 setroubleshoot[699856]: SELinux is preventing /usr/bin/python3.9 from open access on the file /tmp/libdnf.UaEOa7/repodata/repomd.xml. For complete SELinux messages run: sealert -l 7f4c3a8e-0f99-47c4-9baf-e1336fe24876
Oct 7 02:06:55 submit26-b9-f2 setroubleshoot[699856]: SELinux is preventing /usr/bin/python3.9 from setattr access on the file repomd.xml. For complete SELinux messages run: sealert -l 988123da-b724-4e6a-900c-33a2723fdaf1
Oct 7 02:06:55 submit26-b9-f2 setroubleshoot[699856]: SELinux is preventing /usr/bin/python3.9 from read access on the directory libdnf.UaEOa7. For complete SELinux messages run: sealert -l ca585e2b-d50f-4264-8127-6b3fa04070c8
Oct 7 02:06:55 submit26-b9-f2 setroubleshoot[699856]: SELinux is preventing /usr/bin/python3.9 from remove_name access on the directory repomd.xml. For complete SELinux messages run: sealert -l 3a749560-1cec-40ca-a4dc-596841be3885
Oct 7 02:06:55 submit26-b9-f2 setroubleshoot[699856]: SELinux is preventing /usr/bin/python3.9 from unlink access on the file repomd.xml. For complete SELinux messages run: sealert -l 0aa52f08-94f8-474e-96d8-e818846941af
Oct 7 02:06:55 submit26-b9-f2 setroubleshoot[699856]: SELinux is preventing /usr/bin/python3.9 from rmdir access on the directory repodata. For complete SELinux messages run: sealert -l de019dc4-408f-439c-902a-676d18dfe8e7
Oct 7 02:13:11 submit26-b9-f2 systemd[1]: user(a)1001.service: Main process exited, code=killed, status=9/KILL
== submit26-b9-f3 (1 distinct, 2 total) ==
Oct 7 02:10:05 submit26-b9-f3 systemd[1]: user(a)1001.service: Main process exited, code=killed, status=9/KILL [x2]
== tma-0 (1 distinct, 1 total) ==
Oct 7 02:24:15 tma-0 sshd[9718]: error: PAM: Authentication failure for admin from 69.201.38.34.bc.googleusercontent.com
1
0
Command: /usr/local/sbin/syslog-digest.py
Time : 0.1675s
Status : exited 0
Output :
Syslog digest — 2026-10-07 02:05 EDT
Processed 6,347 lines, filtered 3,839 (60%). 2,508 unknown (350 distinct) from 29 host(s).
== abuse (1 distinct, 346 total) ==
Oct 7 01:05:25 abuse rsyslogd[1033]: imjournal: open() failed for path: '/var/lib/rsyslog/imjournal.state.tmp': Input/output error [v8.2404.0 try https://www.rsyslog.com/e/2433 ] [x346]
== b0b02.cs.umd.edu (1 distinct, 1 total) ==
Oct 7 01:16:56 b0b02.cs.umd.edu rustdesk[1062927]: cannot open display:
== cheezit.cs.umd.edu (4 distinct, 4 total) ==
Oct 7 01:22:30 cheezit.cs.umd.edu systemd[1]: cgroup compatibility translation between legacy and unified hierarchy settings activated. See cgroup-compat debug messages for details.
Oct 7 01:57:02 cheezit.cs.umd.edu sshd-session[205457]: pam_access(sshd:auth): access denied for user `admin' from `35.205.187.128'
Oct 7 01:57:02 cheezit.cs.umd.edu krb5_child[205459]: Client 'admin(a)UMD.EDU' not found in Kerberos database
Oct 7 01:57:02 cheezit.cs.umd.edu sshd-session[205455]: error: PAM: System error for admin from 35.205.187.128
== galax (1 distinct, 1 total) ==
Oct 7 02:01:23 galax kernel: rtw89_8922ae 0000:06:00.0: failed to wait RF DACK
== gle-dind00.cs.umd.edu (18 distinct, 18 total) ==
Oct 7 02:02:43 gle-dind00.cs.umd.edu systemd-udevd[2713512]: Could not generate persistent MAC address for vethf09fadb: No such file or directory
Oct 7 02:02:43 gle-dind00.cs.umd.edu systemd-udevd[2713511]: Could not generate persistent MAC address for veth4196631: No such file or directory
Oct 7 02:02:44 gle-dind00.cs.umd.edu systemd-udevd[2713633]: Could not generate persistent MAC address for veth2bcc55a: No such file or directory
Oct 7 02:02:44 gle-dind00.cs.umd.edu systemd-udevd[2713634]: Could not generate persistent MAC address for vethd46b365: No such file or directory
Oct 7 02:02:45 gle-dind00.cs.umd.edu systemd-udevd[2713731]: Could not generate persistent MAC address for veth5a21944: No such file or directory
Oct 7 02:02:45 gle-dind00.cs.umd.edu systemd-udevd[2713732]: Could not generate persistent MAC address for veth24ed5d9: No such file or directory
Oct 7 02:02:46 gle-dind00.cs.umd.edu systemd-udevd[2713833]: Could not generate persistent MAC address for veth2a661de: No such file or directory
Oct 7 02:02:46 gle-dind00.cs.umd.edu systemd-udevd[2713834]: Could not generate persistent MAC address for vethf824992: No such file or directory
Oct 7 02:02:47 gle-dind00.cs.umd.edu systemd-udevd[2713924]: Could not generate persistent MAC address for veth1f4e3f1: No such file or directory
Oct 7 02:02:47 gle-dind00.cs.umd.edu systemd-udevd[2713923]: Could not generate persistent MAC address for veth0ec2995: No such file or directory
Oct 7 02:03:05 gle-dind00.cs.umd.edu systemd-udevd[2714435]: Could not generate persistent MAC address for veth216aa53: No such file or directory
Oct 7 02:03:05 gle-dind00.cs.umd.edu systemd-udevd[2714436]: Could not generate persistent MAC address for vethe28f46f: No such file or directory
Oct 7 02:03:05 gle-dind00.cs.umd.edu systemd-udevd[2714542]: Could not generate persistent MAC address for veth8058cdc: No such file or directory
Oct 7 02:03:05 gle-dind00.cs.umd.edu systemd-udevd[2714543]: Could not generate persistent MAC address for veth7e4a15f: No such file or directory
Oct 7 02:03:07 gle-dind00.cs.umd.edu systemd-udevd[2714723]: Could not generate persistent MAC address for vethc69f599: No such file or directory
Oct 7 02:03:07 gle-dind00.cs.umd.edu systemd-udevd[2714724]: Could not generate persistent MAC address for vethb545200: No such file or directory
Oct 7 02:03:08 gle-dind00.cs.umd.edu systemd-udevd[2714831]: Could not generate persistent MAC address for veth9de2a2e: No such file or directory
Oct 7 02:03:08 gle-dind00.cs.umd.edu systemd-udevd[2714832]: Could not generate persistent MAC address for veth6d7576c: No such file or directory
== gle-dind01 (39 distinct, 47 total) ==
Oct 7 01:10:00 gle-dind01 puppet-agent[207880]: Red Hat Enterprise Linux 10 for x86_64 - AppStr 79 kB/s | 4.1 kB 00:00
Oct 7 01:10:00 gle-dind01 puppet-agent[207880]: Red Hat Enterprise Linux 10 for x86_64 - BaseOS 88 kB/s | 4.1 kB 00:00
Oct 7 01:10:00 gle-dind01 puppet-agent[207880]: Dependencies resolved.
Oct 7 01:10:00 gle-dind01 puppet-agent[207880]: ================================================================================ [x3]
Oct 7 01:10:00 gle-dind01 puppet-agent[207880]: Package Arch Version Repository Size
Oct 7 01:10:00 gle-dind01 puppet-agent[207880]: Upgrading:
Oct 7 01:10:00 gle-dind01 puppet-agent[207880]: gitlab-runner x86_64 19.2.6-1 runner_gitlab-runner 29 M
Oct 7 01:10:00 gle-dind01 puppet-agent[207880]: gitlab-runner-helper-images noarch 19.2.6-1 runner_gitlab-runner 513 M
Oct 7 01:10:00 gle-dind01 puppet-agent[207880]: [x3]
Oct 7 01:10:00 gle-dind01 puppet-agent[207880]: Transaction Summary
Oct 7 01:10:00 gle-dind01 puppet-agent[207880]: Upgrade 2 Packages
Oct 7 01:10:00 gle-dind01 puppet-agent[207880]: Total download size: 542 M
Oct 7 01:10:00 gle-dind01 puppet-agent[207880]: Downloading Packages:
Oct 7 01:10:00 gle-dind01 puppet-agent[207880]: (1/2): gitlab-runner-19.2.6-1.x86_64.rpm 24 MB/s | 29 MB 00:01
Oct 7 01:10:00 gle-dind01 puppet-agent[207880]: [MIRROR] gitlab-runner-helper-images-19.2.6-1.noarch.rpm: Curl error (23): Failed writing received data to disk/application for https://storage.googleapis.com/packages-ops/artifact/c5/8feea0a1c266e7da6a2…
0335aed3ad3b125e5cb2524e6f6a069d4ca4f8ec962dc88360dbf5b5154c6aadf2ebea5dae65d9605fe7fd1c34bb273ff8ddc7c033c6f78a7e317c8864bd6903820a9cea0bd0d6c8df2bdb [Failure writing output to destination, passed 16366 returned 0]
Oct 7 01:10:00 gle-dind01 puppet-agent[207880]: [FAILED] gitlab-runner-helper-images-19.2.6-1.noarch.rpm: Curl error (23): Failed writing received data to disk/application for https://storage.googleapis.com/packages-ops/artifact/c5/8feea0a1c266e7da6a2…
0335aed3ad3b125e5cb2524e6f6a069d4ca4f8ec962dc88360dbf5b5154c6aadf2ebea5dae65d9605fe7fd1c34bb273ff8ddc7c033c6f78a7e317c8864bd6903820a9cea0bd0d6c8df2bdb [Failure writing output to destination, passed 16366 returned 0]
Oct 7 01:10:00 gle-dind01 puppet-agent[207880]: The downloaded packages were saved in cache until the next successful transaction.
Oct 7 01:10:00 gle-dind01 puppet-agent[207880]: Error: Error downloading packages:
Oct 7 01:10:00 gle-dind01 puppet-agent[207880]: gitlab-runner-helper-images-19.2.6-1.noarch: Download failed: Curl error (23): Failed writing received data to disk/application for https://storage.googleapis.com/packages-ops/artifact/c5/8feea0a1c266e7da6a2…
383600335aed3ad3b125e5cb2524e6f6a069d4ca4f8ec962dc88360dbf5b5154c6aadf2ebea5dae65d9605fe7fd1c34bb273ff8ddc7c033c6f78a7e317c8864bd6903820a9cea0bd0d6c8df2bdb [Failure writing output to destination, passed 16366 returned 0]
Oct 7 01:10:00 gle-dind01 puppet-agent[207880]: (/Stage[main]/Profile::Gitlab_enterprise::Runner_dind/Package[gitlab-runner]/ensure) Red Hat Enterprise Linux 10 for x86_64 - AppStr 79 kB/s | 4.1 kB 00:00
Oct 7 01:10:00 gle-dind01 puppet-agent[207880]: (/Stage[main]/Profile::Gitlab_enterprise::Runner_dind/Package[gitlab-runner]/ensure) Red Hat Enterprise Linux 10 for x86_64 - BaseOS 88 kB/s | 4.1 kB 00:00
Oct 7 01:10:00 gle-dind01 puppet-agent[207880]: (/Stage[main]/Profile::Gitlab_enterprise::Runner_dind/Package[gitlab-runner]/ensure) Dependencies resolved.
Oct 7 01:10:00 gle-dind01 puppet-agent[207880]: (/Stage[main]/Profile::Gitlab_enterprise::Runner_dind/Package[gitlab-runner]/ensure) ================================================================================ [x3]
Oct 7 01:10:00 gle-dind01 puppet-agent[207880]: (/Stage[main]/Profile::Gitlab_enterprise::Runner_dind/Package[gitlab-runner]/ensure) Package Arch Version Repository Size
Oct 7 01:10:00 gle-dind01 puppet-agent[207880]: (/Stage[main]/Profile::Gitlab_enterprise::Runner_dind/Package[gitlab-runner]/ensure) Upgrading:
Oct 7 01:10:00 gle-dind01 puppet-agent[207880]: (/Stage[main]/Profile::Gitlab_enterprise::Runner_dind/Package[gitlab-runner]/ensure) gitlab-runner x86_64 19.2.6-1 runner_gitlab-runner 29 M
Oct 7 01:10:00 gle-dind01 puppet-agent[207880]: (/Stage[main]/Profile::Gitlab_enterprise::Runner_dind/Package[gitlab-runner]/ensure) gitlab-runner-helper-images noarch 19.2.6-1 runner_gitlab-runner 513 M
Oct 7 01:10:00 gle-dind01 puppet-agent[207880]: (/Stage[main]/Profile::Gitlab_enterprise::Runner_dind/Package[gitlab-runner]/ensure) [x3]
Oct 7 01:10:00 gle-dind01 puppet-agent[207880]: (/Stage[main]/Profile::Gitlab_enterprise::Runner_dind/Package[gitlab-runner]/ensure) Transaction Summary
Oct 7 01:10:00 gle-dind01 puppet-agent[207880]: (/Stage[main]/Profile::Gitlab_enterprise::Runner_dind/Package[gitlab-runner]/ensure) Upgrade 2 Packages
... 9 more distinct messages not shown
== gle-dind02.cs.umd.edu (61 distinct, 69 total) ==
Oct 7 01:10:51 gle-dind02.cs.umd.edu puppet-agent[1575824]: Red Hat Enterprise Linux 8 for x86_64 - AppStre 44 kB/s | 4.5 kB 00:00
Oct 7 01:10:51 gle-dind02.cs.umd.edu puppet-agent[1575824]: Red Hat CodeReady Linux Builder for RHEL 8 x86_ 88 kB/s | 4.5 kB 00:00
Oct 7 01:10:51 gle-dind02.cs.umd.edu puppet-agent[1575824]: Red Hat Enterprise Linux 8 for x86_64 - BaseOS 58 kB/s | 4.1 kB 00:00
Oct 7 01:10:51 gle-dind02.cs.umd.edu puppet-agent[1575824]: Dependencies resolved.
Oct 7 01:10:51 gle-dind02.cs.umd.edu puppet-agent[1575824]: ================================================================================ [x3]
Oct 7 01:10:51 gle-dind02.cs.umd.edu puppet-agent[1575824]: Package Arch Version Repository Size
Oct 7 01:10:51 gle-dind02.cs.umd.edu puppet-agent[1575824]: Upgrading:
Oct 7 01:10:51 gle-dind02.cs.umd.edu puppet-agent[1575824]: gitlab-runner x86_64 19.2.6-1 runner_gitlab-runner 29 M
Oct 7 01:10:51 gle-dind02.cs.umd.edu puppet-agent[1575824]: gitlab-runner-helper-images noarch 19.2.6-1 runner_gitlab-runner 513 M
Oct 7 01:10:51 gle-dind02.cs.umd.edu puppet-agent[1575824]: [x3]
Oct 7 01:10:51 gle-dind02.cs.umd.edu puppet-agent[1575824]: Transaction Summary
Oct 7 01:10:51 gle-dind02.cs.umd.edu puppet-agent[1575824]: Upgrade 2 Packages
Oct 7 01:10:51 gle-dind02.cs.umd.edu puppet-agent[1575824]: Total download size: 542 M
Oct 7 01:10:51 gle-dind02.cs.umd.edu puppet-agent[1575824]: Downloading Packages:
Oct 7 01:10:51 gle-dind02.cs.umd.edu puppet-agent[1575824]: [MIRROR] gitlab-runner-19.2.6-1.x86_64.rpm: Curl error (23): Failed writing received data to disk/application for https://storage.googleapis.com/packages-ops/artifact/37/bc9862e8616d49bca9b…
0f4d64c07f3e1a072aba91832e532156cf2920c09c9b5545476c382bad73b1fffb942092a0abbda76432f6ab17cc5245045d5d1267907e741cecb808224aacc04066ef [Failed writing body (4096 != 16384)]
Oct 7 01:10:51 gle-dind02.cs.umd.edu puppet-agent[1575824]: [FAILED] gitlab-runner-19.2.6-1.x86_64.rpm: Curl error (23): Failed writing received data to disk/application for https://storage.googleapis.com/packages-ops/artifact/37/bc9862e8616d49bca9b…
0f4d64c07f3e1a072aba91832e532156cf2920c09c9b5545476c382bad73b1fffb942092a0abbda76432f6ab17cc5245045d5d1267907e741cecb808224aacc04066ef [Failed writing body (4096 != 16384)]
Oct 7 01:10:51 gle-dind02.cs.umd.edu puppet-agent[1575824]: The downloaded packages were saved in cache until the next successful transaction.
Oct 7 01:10:51 gle-dind02.cs.umd.edu puppet-agent[1575824]: Error: Error downloading packages:
Oct 7 01:10:51 gle-dind02.cs.umd.edu puppet-agent[1575824]: gitlab-runner-19.2.6-1.x86_64: Download failed: Curl error (23): Failed writing received data to disk/application for https://storage.googleapis.com/packages-ops/artifact/37/bc9862e8616d49bca9b…
5e9680f4d64c07f3e1a072aba91832e532156cf2920c09c9b5545476c382bad73b1fffb942092a0abbda76432f6ab17cc5245045d5d1267907e741cecb808224aacc04066ef [Failed writing body (4096 != 16384)]
Oct 7 01:10:51 gle-dind02.cs.umd.edu puppet-agent[1575824]: (/Stage[main]/Profile::Gitlab_enterprise::Runner_dind/Package[gitlab-runner]/ensure) Red Hat Enterprise Linux 8 for x86_64 - AppStre 44 kB/s | 4.5 kB 00:00
Oct 7 01:10:51 gle-dind02.cs.umd.edu puppet-agent[1575824]: (/Stage[main]/Profile::Gitlab_enterprise::Runner_dind/Package[gitlab-runner]/ensure) Red Hat CodeReady Linux Builder for RHEL 8 x86_ 88 kB/s | 4.5 kB 00:00
Oct 7 01:10:51 gle-dind02.cs.umd.edu puppet-agent[1575824]: (/Stage[main]/Profile::Gitlab_enterprise::Runner_dind/Package[gitlab-runner]/ensure) Red Hat Enterprise Linux 8 for x86_64 - BaseOS 58 kB/s | 4.1 kB 00:00
Oct 7 01:10:51 gle-dind02.cs.umd.edu puppet-agent[1575824]: (/Stage[main]/Profile::Gitlab_enterprise::Runner_dind/Package[gitlab-runner]/ensure) Dependencies resolved.
Oct 7 01:10:51 gle-dind02.cs.umd.edu puppet-agent[1575824]: (/Stage[main]/Profile::Gitlab_enterprise::Runner_dind/Package[gitlab-runner]/ensure) ================================================================================ [x3]
Oct 7 01:10:51 gle-dind02.cs.umd.edu puppet-agent[1575824]: (/Stage[main]/Profile::Gitlab_enterprise::Runner_dind/Package[gitlab-runner]/ensure) Package Arch Version Repository Size
Oct 7 01:10:51 gle-dind02.cs.umd.edu puppet-agent[1575824]: (/Stage[main]/Profile::Gitlab_enterprise::Runner_dind/Package[gitlab-runner]/ensure) Upgrading:
Oct 7 01:10:51 gle-dind02.cs.umd.edu puppet-agent[1575824]: (/Stage[main]/Profile::Gitlab_enterprise::Runner_dind/Package[gitlab-runner]/ensure) gitlab-runner x86_64 19.2.6-1 runner_gitlab-runner 29 M
Oct 7 01:10:51 gle-dind02.cs.umd.edu puppet-agent[1575824]: (/Stage[main]/Profile::Gitlab_enterprise::Runner_dind/Package[gitlab-runner]/ensure) gitlab-runner-helper-images noarch 19.2.6-1 runner_gitlab-runner 513 M
Oct 7 01:10:51 gle-dind02.cs.umd.edu puppet-agent[1575824]: (/Stage[main]/Profile::Gitlab_enterprise::Runner_dind/Package[gitlab-runner]/ensure) [x3]
Oct 7 01:10:51 gle-dind02.cs.umd.edu puppet-agent[1575824]: (/Stage[main]/Profile::Gitlab_enterprise::Runner_dind/Package[gitlab-runner]/ensure) Transaction Summary
... 31 more distinct messages not shown
== gle-dind04 (6 distinct, 6 total) ==
Oct 7 01:30:47 gle-dind04 falcon-sensor-bpf[1017]: CrowdStrike(4): Could not retrieve DisableProxy value: c0000225
Oct 7 01:30:47 gle-dind04 falcon-sensor-bpf[1017]: CrowdStrike(4): ConnectWithProxy: Unable to get application proxy host from CsConfig: c0000225
Oct 7 01:31:24 gle-dind04 lldpd[1171]: unable to send packet on real device for veth00bbed0: No such device or address
Oct 7 02:01:24 gle-dind04 lldpd[1171]: unable to send packet on real device for vethfcbd2e1: No such device or address
Oct 7 02:01:47 gle-dind04 lldpd[1171]: unable to send packet on real device for veth5706041: No such device or address
Oct 7 02:02:06 gle-dind04 lldpd[1171]: unable to send packet on real device for vethc22c89f: No such device or address
== gle-omnibus00.cs.umd.edu (2 distinct, 2 total) ==
Oct 7 01:09:06 gle-omnibus00.cs.umd.edu falcon-sensor-bpf[933]: CrowdStrike(4): Could not retrieve DisableProxy value: c0000225
Oct 7 01:09:06 gle-omnibus00.cs.umd.edu falcon-sensor-bpf[933]: CrowdStrike(4): ConnectWithProxy: Unable to get application proxy host from CsConfig: c0000225
== hazfs.cs.umd.edu (11 distinct, 66 total) ==
Oct 7 01:32:26 hazfs.cs.umd.edu snmpd[1431]: send response: Failure in sendto [x6]
Oct 7 01:32:26 hazfs.cs.umd.edu snmpd[1431]: -- NET-SNMP-EXTEND-MIB::nsExtendStatus."userweb" [x6]
Oct 7 01:32:26 hazfs.cs.umd.edu snmpd[1431]: -- NET-SNMP-EXTEND-MIB::nsExtendStatus."zfslist" [x6]
Oct 7 01:32:26 hazfs.cs.umd.edu snmpd[1431]: -- NET-SNMP-EXTEND-MIB::nsExtendStatus."userhome" [x6]
Oct 7 01:32:26 hazfs.cs.umd.edu snmpd[1431]: -- NET-SNMP-EXTEND-MIB::nsExtendOutput1Line."userweb" [x6]
Oct 7 01:32:26 hazfs.cs.umd.edu snmpd[1431]: -- NET-SNMP-EXTEND-MIB::nsExtendOutput1Line."zfslist" [x6]
Oct 7 01:32:26 hazfs.cs.umd.edu snmpd[1431]: -- NET-SNMP-EXTEND-MIB::nsExtendOutput1Line."userhome" [x6]
Oct 7 01:32:26 hazfs.cs.umd.edu snmpd[1431]: -- NET-SNMP-EXTEND-MIB::nsExtendOutputFull."userweb" [x6]
Oct 7 01:32:26 hazfs.cs.umd.edu snmpd[1431]: -- NET-SNMP-EXTEND-MIB::nsExtendOutputFull."zfslist" [x6]
Oct 7 01:32:26 hazfs.cs.umd.edu snmpd[1431]: -- NET-SNMP-EXTEND-MIB::nsExtendOutputFull."userhome" [x6]
Oct 7 01:32:26 hazfs.cs.umd.edu snmpd[1431]: -- NET-SNMP-EXTEND-MIB::nsExtendOutNumLines."userweb" [x6]
== idm00 (1 distinct, 1 total) ==
Oct 7 01:54:41 idm00 named[4166701]: client @0x7f119804d6e8 10.73.240.42#56088: update '73.10.in-addr.arpa/IN' denied
== idmp0 (1 distinct, 1 total) ==
Oct 7 01:39:23 idmp0 named[1598691]: client @0x7f2d3c062278 10.73.240.43#60437: update '73.10.in-addr.arpa/IN' denied
== itmon02 (1 distinct, 1 total) ==
Oct 7 01:13:19 itmon02 sshd[805675]: error: beginning MaxStartups throttling
== jubjub.cs.umd.edu (63 distinct, 83 total) ==
Oct 7 01:14:13 jubjub.cs.umd.edu puppet-agent[476365]: : transaction-actions, product-id, search-disabled-repos,
Oct 7 01:14:13 jubjub.cs.umd.edu puppet-agent[476365]: : subscription-manager, versionlock
Oct 7 01:14:13 jubjub.cs.umd.edu puppet-agent[476365]: [x11]
Oct 7 01:14:13 jubjub.cs.umd.edu puppet-agent[476365]: Could not retrieve mirrorlist http://cdn.remirepo.net/enterprise/7/php84/mirror error was
Oct 7 01:14:13 jubjub.cs.umd.edu puppet-agent[476365]: 14: HTTP Error 403 - Forbidden
Oct 7 01:14:13 jubjub.cs.umd.edu puppet-agent[476365]: One of the configured repositories failed (Unknown),
Oct 7 01:14:13 jubjub.cs.umd.edu puppet-agent[476365]: 1. Contact the upstream for the repository and get them to fix the problem.
Oct 7 01:14:13 jubjub.cs.umd.edu puppet-agent[476365]: 2. Reconfigure the baseurl/etc. for the repository, to point to a working
Oct 7 01:14:13 jubjub.cs.umd.edu puppet-agent[476365]: upstream. This is most often useful if you are using a newer
Oct 7 01:14:13 jubjub.cs.umd.edu puppet-agent[476365]: distribution release than is supported by the repository (and the
Oct 7 01:14:13 jubjub.cs.umd.edu puppet-agent[476365]: packages for the previous distribution release still work).
Oct 7 01:14:13 jubjub.cs.umd.edu puppet-agent[476365]: 3. Run the command with the repository temporarily disabled
Oct 7 01:14:13 jubjub.cs.umd.edu puppet-agent[476365]: will then just ignore the repository until you permanently enable it
Oct 7 01:14:13 jubjub.cs.umd.edu puppet-agent[476365]: again or use --enablerepo for temporary usage:
Oct 7 01:14:13 jubjub.cs.umd.edu puppet-agent[476365]: or
Oct 7 01:14:13 jubjub.cs.umd.edu puppet-agent[476365]: subscription-manager repos --disable=<repoid>
Oct 7 01:14:13 jubjub.cs.umd.edu puppet-agent[476365]: 5. Configure the failing repository to be skipped, if it is unavailable.
Oct 7 01:14:13 jubjub.cs.umd.edu puppet-agent[476365]: slower). If it is a very temporary problem though, this is often a nice
Oct 7 01:14:13 jubjub.cs.umd.edu puppet-agent[476365]: compromise:
Oct 7 01:14:13 jubjub.cs.umd.edu puppet-agent[476365]: Cannot find a valid baseurl for repo: remi-php84
Oct 7 01:14:13 jubjub.cs.umd.edu puppet-agent[476365]: Uploading Enabled Repositories Report
Oct 7 01:14:13 jubjub.cs.umd.edu puppet-agent[476365]: Unable to upload Enabled Repositories Report
Oct 7 01:14:13 jubjub.cs.umd.edu puppet-agent[476365]: (/Stage[main]/Puppet::Agent::Install/Package[openvox-agent]/ensure) : transaction-actions, product-id, search-disabled-repos,
Oct 7 01:14:13 jubjub.cs.umd.edu puppet-agent[476365]: (/Stage[main]/Puppet::Agent::Install/Package[openvox-agent]/ensure) : subscription-manager, versionlock
Oct 7 01:14:13 jubjub.cs.umd.edu puppet-agent[476365]: (/Stage[main]/Puppet::Agent::Install/Package[openvox-agent]/ensure) [x11]
Oct 7 01:14:13 jubjub.cs.umd.edu puppet-agent[476365]: (/Stage[main]/Puppet::Agent::Install/Package[openvox-agent]/ensure) Could not retrieve mirrorlist http://cdn.remirepo.net/enterprise/7/php84/mirror error was
Oct 7 01:14:13 jubjub.cs.umd.edu puppet-agent[476365]: (/Stage[main]/Puppet::Agent::Install/Package[openvox-agent]/ensure) 14: HTTP Error 403 - Forbidden
Oct 7 01:14:13 jubjub.cs.umd.edu puppet-agent[476365]: (/Stage[main]/Puppet::Agent::Install/Package[openvox-agent]/ensure) One of the configured repositories failed (Unknown),
Oct 7 01:14:13 jubjub.cs.umd.edu puppet-agent[476365]: (/Stage[main]/Puppet::Agent::Install/Package[openvox-agent]/ensure) 1. Contact the upstream for the repository and get them to fix the problem.
Oct 7 01:14:13 jubjub.cs.umd.edu puppet-agent[476365]: (/Stage[main]/Puppet::Agent::Install/Package[openvox-agent]/ensure) 2. Reconfigure the baseurl/etc. for the repository, to point to a working
... 33 more distinct messages not shown
== munin (2 distinct, 38 total) ==
Oct 7 01:08:32 munin sudo[1038070]: pam_systemd(sudo:session): Failed to stat() runtime directory '/run/user/0': No such file or directory [x19]
Oct 7 01:08:32 munin sudo[1038070]: pam_systemd(sudo:session): Not setting $XDG_RUNTIME_DIR, as the directory is not in order. [x19]
== newhonors2 (1 distinct, 24 total) ==
Oct 7 01:13:02 newhonors2 dhcpcd[3664044]: dhcpcd is not running [x24]
== ntop00 (96 distinct, 96 total) ==
Oct 7 01:05:01 ntop00 nfacctd[1075699]: INFO ( m1/mysql ): *** Purging cache - START (PID: 4450) ***
Oct 7 01:05:01 ntop00 nfacctd[1075699]: INFO ( m1/mysql ): *** Purging cache - END (PID: 4450, QN: 52/52, ET: 0) ***
Oct 7 01:05:05 ntop00 sfacctd[1075592]: INFO ( m1/mysql ): *** Purging cache - END (PID: 4450, QN: 2407/2407, ET: 4) ***
Oct 7 01:08:01 ntop00 sfacctd[1075592]: INFO ( p1/print ): *** Purging cache - START (PID: 4451) ***
Oct 7 01:08:01 ntop00 sfacctd[1075592]: INFO ( p1/print ): *** Purging cache - END (PID: 4451, QN: 2556/2556, ET: 0) ***
Oct 7 01:08:01 ntop00 nfacctd[1075699]: INFO ( p1/print ): *** Purging cache - START (PID: 4451) ***
Oct 7 01:08:01 ntop00 nfacctd[1075699]: INFO ( p1/print ): *** Purging cache - END (PID: 4451, QN: 61/61, ET: 0) ***
Oct 7 01:10:01 ntop00 sfacctd[1075592]: INFO ( m1/mysql ): *** Purging cache - START (PID: 4452) ***
Oct 7 01:10:01 ntop00 nfacctd[1075699]: INFO ( m1/mysql ): *** Purging cache - START (PID: 4452) ***
Oct 7 01:10:01 ntop00 nfacctd[1075699]: INFO ( m1/mysql ): *** Purging cache - END (PID: 4452, QN: 56/56, ET: 0) ***
Oct 7 01:10:05 ntop00 sfacctd[1075592]: INFO ( m1/mysql ): *** Purging cache - END (PID: 4452, QN: 2607/2607, ET: 4) ***
Oct 7 01:13:01 ntop00 sfacctd[1075592]: INFO ( p1/print ): *** Purging cache - START (PID: 4453) ***
Oct 7 01:13:01 ntop00 sfacctd[1075592]: INFO ( p1/print ): *** Purging cache - END (PID: 4453, QN: 3057/3057, ET: 0) ***
Oct 7 01:13:01 ntop00 nfacctd[1075699]: INFO ( p1/print ): *** Purging cache - START (PID: 4453) ***
Oct 7 01:13:01 ntop00 nfacctd[1075699]: INFO ( p1/print ): *** Purging cache - END (PID: 4453, QN: 57/57, ET: 0) ***
Oct 7 01:15:01 ntop00 sfacctd[1075592]: INFO ( m1/mysql ): *** Purging cache - START (PID: 4454) ***
Oct 7 01:15:01 ntop00 nfacctd[1075699]: INFO ( m1/mysql ): *** Purging cache - START (PID: 4454) ***
Oct 7 01:15:01 ntop00 nfacctd[1075699]: INFO ( m1/mysql ): *** Purging cache - END (PID: 4454, QN: 58/58, ET: 0) ***
Oct 7 01:15:05 ntop00 sfacctd[1075592]: INFO ( m1/mysql ): *** Purging cache - END (PID: 4454, QN: 3059/3059, ET: 4) ***
Oct 7 01:18:01 ntop00 sfacctd[1075592]: INFO ( p1/print ): *** Purging cache - START (PID: 4455) ***
Oct 7 01:18:01 ntop00 sfacctd[1075592]: INFO ( p1/print ): *** Purging cache - END (PID: 4455, QN: 2498/2498, ET: 0) ***
Oct 7 01:18:01 ntop00 nfacctd[1075699]: INFO ( p1/print ): *** Purging cache - START (PID: 4455) ***
Oct 7 01:18:01 ntop00 nfacctd[1075699]: INFO ( p1/print ): *** Purging cache - END (PID: 4455, QN: 52/52, ET: 0) ***
Oct 7 01:20:01 ntop00 sfacctd[1075592]: INFO ( m1/mysql ): *** Purging cache - START (PID: 4456) ***
Oct 7 01:20:01 ntop00 nfacctd[1075699]: INFO ( m1/mysql ): *** Purging cache - START (PID: 4456) ***
Oct 7 01:20:01 ntop00 nfacctd[1075699]: INFO ( m1/mysql ): *** Purging cache - END (PID: 4456, QN: 54/54, ET: 0) ***
Oct 7 01:20:04 ntop00 sfacctd[1075592]: INFO ( m1/mysql ): *** Purging cache - END (PID: 4456, QN: 2358/2358, ET: 3) ***
Oct 7 01:23:01 ntop00 sfacctd[1075592]: INFO ( p1/print ): *** Purging cache - START (PID: 4457) ***
Oct 7 01:23:01 ntop00 sfacctd[1075592]: INFO ( p1/print ): *** Purging cache - END (PID: 4457, QN: 2618/2618, ET: 0) ***
Oct 7 01:23:01 ntop00 nfacctd[1075699]: INFO ( p1/print ): *** Purging cache - START (PID: 4457) ***
... 66 more distinct messages not shown
== openvox08-cmp0 (2 distinct, 3 total) ==
Oct 7 01:11:14 openvox08-cmp0 setroubleshoot[123699]: failed to retrieve rpm info for path '/dev/pts/1':
Oct 7 01:11:18 openvox08-cmp0 setroubleshoot[123699]: SELinux is preventing /usr/bin/who from getattr access on the chr_file /dev/pts/1. For complete SELinux messages run: sealert -l 3339fa05-becf-48e4-be60-ae2e0c9ae2fb [x2]
== outbound00.cs.umd.edu (1 distinct, 6 total) ==
Oct 7 01:09:09 outbound00.cs.umd.edu python3[125411]: ldapdb [x6]
== outbound01.cs.umd.edu (2 distinct, 7 total) ==
Oct 7 01:13:06 outbound01.cs.umd.edu python3[1583505]: ldapdb [x6]
Oct 7 01:52:03 outbound01.cs.umd.edu krb5_child[1592317]: Client 'admin(a)UMD.EDU' not found in Kerberos database
== portal (1 distinct, 78 total) ==
Oct 7 01:05:26 portal setroubleshoot[1649515]: SELinux is preventing /usr/local/bin/traefik from connectto access on the unix_stream_socket /run/podman/podman.sock. For complete SELinux messages run: sealert -l e0a307a3-2c22-4320-8f9d-6a166c45222d [x78]
== strawberry (7 distinct, 38 total) ==
Oct 7 01:07:04 strawberry kernel: I/O error, dev sda, sector 206848 op 0x0:(READ) flags 0x80700 phys_seg 1 prio class 2 [x6]
Oct 7 01:07:04 strawberry kernel: I/O error, dev sda, sector 206848 op 0x0:(READ) flags 0x0 phys_seg 1 prio class 2 [x6]
Oct 7 01:07:04 strawberry kernel: Buffer I/O error on dev sda2, logical block 0, async page read [x6]
Oct 7 01:07:04 strawberry kernel: I/O error, dev sda, sector 2048 op 0x0:(READ) flags 0x80700 phys_seg 1 prio class 2 [x6]
Oct 7 01:07:04 strawberry kernel: I/O error, dev sda, sector 2048 op 0x0:(READ) flags 0x0 phys_seg 1 prio class 2 [x6]
Oct 7 01:07:04 strawberry kernel: Buffer I/O error on dev sda1, logical block 0, async page read [x6]
Oct 7 01:34:42 strawberry smartd[5314]: Device: /dev/sda [SAT], failed to read SMART Attribute Data [x2]
== submit10-cln25 (5 distinct, 1539 total) ==
Oct 7 01:05:22 submit10-cln25 rsyslogd: file '/var/log/messages': open error: Input/output error [v8.24.0-57.el7_9.3 try http://www.rsyslog.com/e/2433 ] [x1200]
Oct 7 01:05:22 submit10-cln25 rsyslogd: imjournal: fopen() failed for path: '/var/lib/rsyslog/imjournal.state.tmp': Input/output error [v8.24.0-57.el7_9.3 try http://www.rsyslog.com/e/2013 ] [x334]
Oct 7 01:25:00 submit10-cln25 systemd: Failed at step USER spawning /usr/libexec/pcp/bin/pmlogger_check: Input/output error [x2]
Oct 7 01:28:00 submit10-cln25 systemd: Failed at step USER spawning /usr/libexec/pcp/bin/pmie_check: Input/output error [x2]
Oct 7 01:30:00 submit10-cln25 systemd: Failed at step USER spawning /usr/libexec/pcp/bin/pmlogger_daily: Input/output error
== submit26-b9-3 (1 distinct, 5 total) ==
Sep 8 23:19:21 submit26-b9-3 systemd[1]: user(a)1001.service: Main process exited, code=killed, status=9/KILL [x5]
== submit26-b9-f1 (1 distinct, 2 total) ==
Oct 7 01:31:03 submit26-b9-f1 systemd[1]: user(a)1001.service: Main process exited, code=killed, status=9/KILL [x2]
== submit26-b9-f2 (1 distinct, 2 total) ==
Oct 7 01:45:12 submit26-b9-f2 systemd[1]: user(a)1001.service: Main process exited, code=killed, status=9/KILL [x2]
== submit26-b9-f3 (10 distinct, 11 total) ==
Oct 7 01:06:48 submit26-b9-f3 setroubleshoot[1893610]: SELinux is preventing /usr/bin/python3.9 from create access on the directory /(null). For complete SELinux messages run: sealert -l a653b772-cbcd-438b-bae5-23c3dc69b31b
Oct 7 01:06:48 submit26-b9-f3 setroubleshoot[1893610]: SELinux is preventing /usr/bin/python3.9 from add_name access on the directory /(null). For complete SELinux messages run: sealert -l 3e904634-6caa-4202-8c92-f139db798859
Oct 7 01:06:49 submit26-b9-f3 setroubleshoot[1893610]: SELinux is preventing /usr/bin/python3.9 from create access on the file /(null). For complete SELinux messages run: sealert -l 580b20e4-ec2c-433d-905c-5bd417fba033
Oct 7 01:06:49 submit26-b9-f3 setroubleshoot[1893610]: SELinux is preventing /usr/bin/python3.9 from open access on the file /tmp/libdnf.45nP6L/repodata/repomd.xml. For complete SELinux messages run: sealert -l 27f29d48-5e7c-4db7-b051-8ac055737d6f
Oct 7 01:06:49 submit26-b9-f3 setroubleshoot[1893610]: SELinux is preventing /usr/bin/python3.9 from setattr access on the file repomd.xml. For complete SELinux messages run: sealert -l bff72452-d40a-430b-9060-dd0a48f5b6ba
Oct 7 01:06:49 submit26-b9-f3 setroubleshoot[1893610]: SELinux is preventing /usr/bin/python3.9 from read access on the directory libdnf.45nP6L. For complete SELinux messages run: sealert -l 9638d396-8ce5-4e6a-ae47-45cd3985e1cd
Oct 7 01:06:49 submit26-b9-f3 setroubleshoot[1893610]: SELinux is preventing /usr/bin/python3.9 from remove_name access on the directory repomd.xml. For complete SELinux messages run: sealert -l 6da64b94-7024-45a9-b8c2-3b9812517407
Oct 7 01:06:49 submit26-b9-f3 setroubleshoot[1893610]: SELinux is preventing /usr/bin/python3.9 from unlink access on the file repomd.xml. For complete SELinux messages run: sealert -l 64cbe179-abf1-4d5a-bade-bb164897ee65
Oct 7 01:06:49 submit26-b9-f3 setroubleshoot[1893610]: SELinux is preventing /usr/bin/python3.9 from rmdir access on the directory repodata. For complete SELinux messages run: sealert -l d2e35b1a-e27c-4f91-9217-2bb1204e1e68
Oct 7 01:35:55 submit26-b9-f3 systemd[1]: user(a)1001.service: Main process exited, code=killed, status=9/KILL [x2]
== submit26-b9-f4 (9 distinct, 12 total) ==
Oct 7 01:24:54 submit26-b9-f4 setroubleshoot[182475]: SELinux is preventing /usr/bin/python3.9 from create access on the directory /(null). For complete SELinux messages run: sealert -l ee160f23-b161-4f4a-9985-c4edfd3a5beb
Oct 7 01:24:54 submit26-b9-f4 setroubleshoot[182475]: SELinux is preventing /usr/bin/python3.9 from add_name access on the directory /(null). For complete SELinux messages run: sealert -l 89a83821-4b24-4081-9973-0a79ca6ed5b4
Oct 7 01:24:54 submit26-b9-f4 setroubleshoot[182475]: SELinux is preventing /usr/bin/python3.9 from create access on the file /(null). For complete SELinux messages run: sealert -l f73955d6-1416-45f9-bab6-ff1f3ea07e9d [x2]
Oct 7 01:24:54 submit26-b9-f4 setroubleshoot[182475]: SELinux is preventing /usr/bin/python3.9 from open access on the file /tmp/libdnf.p5zTge/repodata/repomd.xml. For complete SELinux messages run: sealert -l 9f8f24a0-8fb6-454d-a103-31a8f7a6efa0 [x2]
Oct 7 01:24:54 submit26-b9-f4 setroubleshoot[182475]: SELinux is preventing /usr/bin/python3.9 from setattr access on the file repomd.xml. For complete SELinux messages run: sealert -l 20293136-86a3-40ba-a651-cff48d36059e [x2]
Oct 7 01:24:54 submit26-b9-f4 setroubleshoot[182475]: SELinux is preventing /usr/bin/python3.9 from read access on the directory libdnf.p5zTge. For complete SELinux messages run: sealert -l 25f86b49-4ee7-4f60-ad1c-73a70032560c
Oct 7 01:24:54 submit26-b9-f4 setroubleshoot[182475]: SELinux is preventing /usr/bin/python3.9 from remove_name access on the directory repomd.xml. For complete SELinux messages run: sealert -l eec250fb-073f-456d-93bc-f98776fd476d
Oct 7 01:24:54 submit26-b9-f4 setroubleshoot[182475]: SELinux is preventing /usr/bin/python3.9 from unlink access on the file repomd.xml. For complete SELinux messages run: sealert -l c9209e04-a349-43d5-8cb2-3e303e48df74
Oct 7 01:24:54 submit26-b9-f4 setroubleshoot[182475]: SELinux is preventing /usr/bin/python3.9 from rmdir access on the directory repodata. For complete SELinux messages run: sealert -l 3178d5f5-80e9-404b-92b7-9bef397a8915
== syslog01 (1 distinct, 1 total) ==
Oct 7 01:45:39 syslog01 rsyslogd: imrelp[2514]: error 'error when receiving data, session broken', object 'lstn 2514: conn to clt 10.73.237.31/submit26-b9-3.cs.umd.edu' - input may not work as intended [v8.2510.0-5.el10 try https://www.rsyslog.com/e/2353 ]
1
0
Command: /usr/local/sbin/syslog-digest.py
Time : 0.2081s
Status : exited 0
Output :
Syslog digest — 2026-10-07 01:05 EDT
Processed 7,778 lines, filtered 4,141 (53%). 3,637 unknown (671 distinct) from 39 host(s).
== abuse (1 distinct, 348 total) ==
Oct 7 00:05:25 abuse rsyslogd[1033]: imjournal: open() failed for path: '/var/lib/rsyslog/imjournal.state.tmp': Input/output error [v8.2404.0 try https://www.rsyslog.com/e/2433 ] [x348]
== atif01.cs.umd.edu (1 distinct, 1 total) ==
Oct 7 01:01:39 atif01.cs.umd.edu kernel: net_ratelimit: 11 callbacks suppressed
== b0b02.cs.umd.edu (1 distinct, 1 total) ==
Oct 7 00:16:52 b0b02.cs.umd.edu rustdesk[1047790]: cannot open display:
== bachata (1 distinct, 1 total) ==
Oct 7 00:05:18 bachata kernel: clocksource: timekeeping watchdog on CPU0: kvm-clock retried 1 times before success
== biggulp.cs.umd.edu (1 distinct, 1 total) ==
Oct 7 00:25:36 biggulp.cs.umd.edu pcp[94905]: pmlogger_daily failed - see /var/log/pcp/pmlogger/pmlogger_daily-K.log
== cheezit.cs.umd.edu (1 distinct, 1 total) ==
Oct 7 00:25:27 cheezit.cs.umd.edu pcp[129563]: pmlogger_daily failed - see /var/log/pcp/pmlogger/pmlogger_daily-K.log
== cmsc436-0101-redis (3 distinct, 3 total) ==
Oct 7 00:43:57 cmsc436-0101-redis krb5_child[54162]: Client 'admin(a)UMD.EDU' not found in Kerberos database
Oct 7 00:43:59 cmsc436-0101-redis sshd-session[54158]: error: PAM: Authentication failure for admin from 34.38.237.125
Oct 7 00:44:28 cmsc436-0101-redis sshd-session[54169]: error: Protocol major versions differ: 2 vs. 1
== gle-dind00.cs.umd.edu (4 distinct, 4 total) ==
Oct 7 00:09:06 gle-dind00.cs.umd.edu systemd-udevd[2684618]: Could not generate persistent MAC address for vethafd079b: No such file or directory
Oct 7 00:09:06 gle-dind00.cs.umd.edu systemd-udevd[2684619]: Could not generate persistent MAC address for veth97d0592: No such file or directory
Oct 7 00:09:40 gle-dind00.cs.umd.edu systemd-udevd[2684777]: Could not generate persistent MAC address for vethb98d92b: No such file or directory
Oct 7 00:09:40 gle-dind00.cs.umd.edu systemd-udevd[2684778]: Could not generate persistent MAC address for vetha53e833: No such file or directory
== gle-omnibus00.cs.umd.edu (23 distinct, 31 total) ==
Oct 7 00:08:37 gle-omnibus00.cs.umd.edu falcon-sensor-bpf[935]: CrowdStrike(4): Could not retrieve DisableProxy value: c0000225 [x3]
Oct 7 00:08:37 gle-omnibus00.cs.umd.edu falcon-sensor-bpf[935]: CrowdStrike(4): ConnectWithProxy: Unable to get application proxy host from CsConfig: c0000225 [x3]
Oct 7 00:24:24 gle-omnibus00.cs.umd.edu sshd-session[1018549]: error: mm_reap: preauth child terminated by signal 15 [x4]
Oct 7 00:24:24 gle-omnibus00.cs.umd.edu kernel: sda1: Can't mount, would change RO state
Oct 7 00:24:25 gle-omnibus00.cs.umd.edu falcon-sensor-bpf[935]: CrowdStrike(4): SSLSocket Disconnected from Cloud. [x2]
Oct 7 00:24:47 gle-omnibus00.cs.umd.edu sshd-session[1436085]: pam_systemd(sshd:session): Failed to create session: Transaction for session-3198.scope/start is destructive (user.slice has 'stop' job queued, but 'start' is included in transaction).
Oct 7 00:25:44 gle-omnibus00.cs.umd.edu kernel: shpchp 0000:05:01.0: pci_hp_register failed with error -16
Oct 7 00:25:44 gle-omnibus00.cs.umd.edu kernel: shpchp 0000:05:01.0: Slot initialization failed
Oct 7 00:25:44 gle-omnibus00.cs.umd.edu kernel: shpchp 0000:05:02.0: pci_hp_register failed with error -16
Oct 7 00:25:44 gle-omnibus00.cs.umd.edu kernel: shpchp 0000:05:02.0: Slot initialization failed
Oct 7 00:25:44 gle-omnibus00.cs.umd.edu kernel: shpchp 0000:05:03.0: pci_hp_register failed with error -16
Oct 7 00:25:44 gle-omnibus00.cs.umd.edu kernel: shpchp 0000:05:03.0: Slot initialization failed
Oct 7 00:25:44 gle-omnibus00.cs.umd.edu kernel: shpchp 0000:05:04.0: pci_hp_register failed with error -16
Oct 7 00:25:44 gle-omnibus00.cs.umd.edu kernel: shpchp 0000:05:04.0: Slot initialization failed
Oct 7 00:25:45 gle-omnibus00.cs.umd.edu kernel: device-mapper: core: CONFIG_IMA_DISABLE_HTABLE is disabled. Duplicate IMA measurements will not be recorded in the IMA log.
Oct 7 00:25:45 gle-omnibus00.cs.umd.edu kernel: sd 1:0:0:1: Power-on or device reset occurred
Oct 7 00:25:45 gle-omnibus00.cs.umd.edu kernel: sd 0:0:0:0: Power-on or device reset occurred
Oct 7 00:25:47 gle-omnibus00.cs.umd.edu lvm[897]: PV /dev/sda2 online, VG rhel_gle-omnibus01 is complete.
Oct 7 00:25:48 gle-omnibus00.cs.umd.edu kernel: snd_hda_intel 0000:00:1b.0: no codecs found!
Oct 7 00:25:54 gle-omnibus00.cs.umd.edu kernel: block dm-0: the capability attribute has been deprecated.
Oct 7 00:29:25 gle-omnibus00.cs.umd.edu puppet-agent[8304]: Connection to https://openvox08-cmp2.cs.umd.edu:8140/puppet/v3 failed, trying next route: Request to https://openvox08-cmp2.cs.umd.edu:8140/puppet/v3 failed after 0.002 seconds: Failed to open TCP connection to openvox08-cmp2.cs.umd.edu:8140 (Connection refused - connect(2) for "openvox08-cmp2.cs.umd.edu" port 8140)
Oct 7 00:29:25 gle-omnibus00.cs.umd.edu puppet-agent[8304]: Wrapped exception:
Oct 7 00:29:25 gle-omnibus00.cs.umd.edu puppet-agent[8304]: Failed to open TCP connection to openvox08-cmp2.cs.umd.edu:8140 (Connection refused - connect(2) for "openvox08-cmp2.cs.umd.edu" port 8140)
== grades01.cs.umd.edu (3 distinct, 4 total) ==
Oct 7 00:10:13 grades01.cs.umd.edu systemd[1]: New main PID 29411 does not belong to service, and PID file is not owned by root. Refusing. [x2]
Oct 7 00:10:34 grades01.cs.umd.edu systemd[1]: Daemon never wrote its PID file. Failing.
Oct 7 00:10:49 grades01.cs.umd.edu systemd[1]: pmlogger.service: Supervising process 4408 which is not our child. We'll most likely not notice when it exits.
== idm00 (2 distinct, 2 total) ==
Oct 7 00:52:13 idm00 named[4166701]: client @0x7f11a4046478 10.73.245.12#55479: update '73.10.in-addr.arpa/IN' denied
Oct 7 00:54:41 idm00 named[4166701]: client @0x7f11a006bce8 10.73.240.42#54058: update '73.10.in-addr.arpa/IN' denied
== idmp0 (1 distinct, 1 total) ==
Oct 7 00:39:23 idmp0 named[1598691]: client @0x7f2d2c035088 10.73.240.43#55790: update '73.10.in-addr.arpa/IN' denied
== inbound01.cs.umd.edu (1 distinct, 1 total) ==
Oct 7 00:30:28 inbound01.cs.umd.edu krb5_child[1698322]: Client 'admin(a)UMD.EDU' not found in Kerberos database
== itmon02 (1 distinct, 6 total) ==
Oct 7 00:13:51 itmon02 sshd[805675]: error: beginning MaxStartups throttling [x6]
== jubjub.cs.umd.edu (3 distinct, 4 total) ==
Oct 7 00:10:11 jubjub.cs.umd.edu systemd[1]: New main PID 456813 does not belong to service, and PID file is not owned by root. Refusing. [x2]
Oct 7 00:10:31 jubjub.cs.umd.edu systemd[1]: Daemon never wrote its PID file. Failing.
Oct 7 00:10:39 jubjub.cs.umd.edu systemd[1]: pmlogger.service: Supervising process 464150 which is not our child. We'll most likely not notice when it exits.
== mashie (406 distinct, 928 total) ==
Oct 7 00:40:09 mashie kernel: blk_print_req_error: 16 callbacks suppressed
Oct 7 00:40:09 mashie kernel: I/O error, dev vda, sector 3170896128 op 0x0:(READ) flags 0x3000 phys_seg 1 prio class 0 [x4]
Oct 7 00:40:09 mashie kernel: EXT4-fs error: 3910 callbacks suppressed
Oct 7 00:40:09 mashie kernel: EXT4-fs error (device vda1): __ext4_get_inode_loc_noinmem:4810: inode #99283969: block 396361760: comm find: unable to read itable block [x10]
Oct 7 00:40:09 mashie kernel: I/O error, dev vda, sector 2048 op 0x1:(WRITE) flags 0x3800 phys_seg 1 prio class 0 [x61]
Oct 7 00:40:09 mashie kernel: buffer_io_error: 3910 callbacks suppressed
Oct 7 00:40:09 mashie kernel: Buffer I/O error on dev vda1, logical block 0, lost sync page write [x152]
Oct 7 00:40:09 mashie kernel: EXT4-fs: 7830 callbacks suppressed
Oct 7 00:40:09 mashie kernel: EXT4-fs (vda1): I/O error while writing superblock [x123]
Oct 7 00:40:09 mashie kernel: EXT4-fs warning: 603 callbacks suppressed
Oct 7 00:40:09 mashie kernel: EXT4-fs warning (device vda1): htree_dirblock_to_tree:1084: inode #17729319: lblock 0: comm find: error -5 reading directory block
Oct 7 00:40:09 mashie kernel: EXT4-fs warning (device vda1): htree_dirblock_to_tree:1084: inode #17729329: lblock 0: comm find: error -5 reading directory block
Oct 7 00:40:09 mashie kernel: EXT4-fs warning (device vda1): htree_dirblock_to_tree:1084: inode #17729331: lblock 0: comm find: error -5 reading directory block
Oct 7 00:40:09 mashie kernel: EXT4-fs warning (device vda1): htree_dirblock_to_tree:1084: inode #17729330: lblock 0: comm find: error -5 reading directory block
Oct 7 00:40:09 mashie kernel: EXT4-fs warning (device vda1): htree_dirblock_to_tree:1084: inode #17729327: lblock 0: comm find: error -5 reading directory block
Oct 7 00:40:09 mashie kernel: EXT4-fs warning (device vda1): htree_dirblock_to_tree:1084: inode #17729324: lblock 0: comm find: error -5 reading directory block
Oct 7 00:40:09 mashie kernel: EXT4-fs warning (device vda1): htree_dirblock_to_tree:1084: inode #17729325: lblock 0: comm find: error -5 reading directory block
Oct 7 00:40:09 mashie kernel: EXT4-fs warning (device vda1): htree_dirblock_to_tree:1084: inode #17729322: lblock 0: comm find: error -5 reading directory block
Oct 7 00:40:09 mashie kernel: EXT4-fs warning (device vda1): htree_dirblock_to_tree:1084: inode #17729323: lblock 0: comm find: error -5 reading directory block
Oct 7 00:40:09 mashie kernel: EXT4-fs warning (device vda1): htree_dirblock_to_tree:1084: inode #17729296: lblock 0: comm find: error -5 reading directory block
Oct 7 00:40:14 mashie kernel: blk_print_req_error: 229244 callbacks suppressed
Oct 7 00:40:14 mashie kernel: I/O error, dev vda, sector 3896519016 op 0x0:(READ) flags 0x80700 phys_seg 1 prio class 0 [x2]
Oct 7 00:40:14 mashie kernel: I/O error, dev vda, sector 3896519024 op 0x0:(READ) flags 0x3000 phys_seg 1 prio class 0 [x2]
Oct 7 00:40:14 mashie kernel: I/O error, dev vda, sector 3896519184 op 0x0:(READ) flags 0x80700 phys_seg 1 prio class 0
Oct 7 00:40:14 mashie kernel: EXT4-fs error: 34118 callbacks suppressed
Oct 7 00:40:14 mashie kernel: EXT4-fs error (device vda1): __ext4_get_inode_loc_noinmem:4810: inode #122020326: block 487064622: comm find: unable to read itable block [x2]
Oct 7 00:40:14 mashie kernel: buffer_io_error: 34117 callbacks suppressed
Oct 7 00:40:14 mashie kernel: EXT4-fs: 34926 callbacks suppressed
Oct 7 00:40:14 mashie kernel: I/O error, dev vda, sector 3896518928 op 0x0:(READ) flags 0x80700 phys_seg 9 prio class 0
Oct 7 00:40:14 mashie kernel: I/O error, dev vda, sector 3896519032 op 0x0:(READ) flags 0x80700 phys_seg 2 prio class 0
... 376 more distinct messages not shown
== mcstic (3 distinct, 6 total) ==
Oct 7 00:54:56 mcstic krb5_child[1629846]: Client 'admin(a)UMD.EDU' not found in Kerberos database [x4]
Oct 7 00:55:00 mcstic sshd[1629841]: error: PAM: Authentication failure for admin from 34.78.103.39
Oct 7 00:56:00 mcstic sshd[1630073]: error: Protocol major versions differ: 2 vs. 1
== misty.cs.umd.edu (3 distinct, 4 total) ==
Oct 7 00:10:15 misty.cs.umd.edu systemd[1]: New main PID 40586 does not belong to service, and PID file is not owned by root. Refusing. [x2]
Oct 7 00:10:35 misty.cs.umd.edu systemd[1]: Daemon never wrote its PID file. Failing.
Oct 7 00:10:50 misty.cs.umd.edu systemd[1]: pmlogger.service: Supervising process 7751 which is not our child. We'll most likely not notice when it exits.
== munin (2 distinct, 52 total) ==
Oct 7 00:08:03 munin sudo[1016601]: pam_systemd(sudo:session): Failed to stat() runtime directory '/run/user/0': No such file or directory [x26]
Oct 7 00:08:03 munin sudo[1016601]: pam_systemd(sudo:session): Not setting $XDG_RUNTIME_DIR, as the directory is not in order. [x26]
== newhonors2 (1 distinct, 24 total) ==
Oct 7 00:13:03 newhonors2 dhcpcd[3662203]: dhcpcd is not running [x24]
== ntop00 (96 distinct, 96 total) ==
Oct 7 00:05:01 ntop00 nfacctd[1075699]: INFO ( m1/mysql ): *** Purging cache - START (PID: 4426) ***
Oct 7 00:05:01 ntop00 nfacctd[1075699]: INFO ( m1/mysql ): *** Purging cache - END (PID: 4426, QN: 62/62, ET: 0) ***
Oct 7 00:05:04 ntop00 sfacctd[1075592]: INFO ( m1/mysql ): *** Purging cache - END (PID: 4426, QN: 2225/2225, ET: 3) ***
Oct 7 00:08:01 ntop00 nfacctd[1075699]: INFO ( p1/print ): *** Purging cache - START (PID: 4427) ***
Oct 7 00:08:01 ntop00 nfacctd[1075699]: INFO ( p1/print ): *** Purging cache - END (PID: 4427, QN: 66/66, ET: 0) ***
Oct 7 00:08:01 ntop00 sfacctd[1075592]: INFO ( p1/print ): *** Purging cache - START (PID: 4427) ***
Oct 7 00:08:01 ntop00 sfacctd[1075592]: INFO ( p1/print ): *** Purging cache - END (PID: 4427, QN: 2524/2524, ET: 0) ***
Oct 7 00:10:01 ntop00 sfacctd[1075592]: INFO ( m1/mysql ): *** Purging cache - START (PID: 4428) ***
Oct 7 00:10:01 ntop00 nfacctd[1075699]: INFO ( m1/mysql ): *** Purging cache - START (PID: 4428) ***
Oct 7 00:10:02 ntop00 nfacctd[1075699]: INFO ( m1/mysql ): *** Purging cache - END (PID: 4428, QN: 56/56, ET: 1) ***
Oct 7 00:10:05 ntop00 sfacctd[1075592]: INFO ( m1/mysql ): *** Purging cache - END (PID: 4428, QN: 2695/2695, ET: 4) ***
Oct 7 00:13:01 ntop00 sfacctd[1075592]: INFO ( p1/print ): *** Purging cache - START (PID: 4429) ***
Oct 7 00:13:01 ntop00 sfacctd[1075592]: INFO ( p1/print ): *** Purging cache - END (PID: 4429, QN: 2409/2409, ET: 0) ***
Oct 7 00:13:01 ntop00 nfacctd[1075699]: INFO ( p1/print ): *** Purging cache - START (PID: 4429) ***
Oct 7 00:13:01 ntop00 nfacctd[1075699]: INFO ( p1/print ): *** Purging cache - END (PID: 4429, QN: 58/58, ET: 0) ***
Oct 7 00:15:01 ntop00 sfacctd[1075592]: INFO ( m1/mysql ): *** Purging cache - START (PID: 4430) ***
Oct 7 00:15:01 ntop00 nfacctd[1075699]: INFO ( m1/mysql ): *** Purging cache - START (PID: 4430) ***
Oct 7 00:15:01 ntop00 nfacctd[1075699]: INFO ( m1/mysql ): *** Purging cache - END (PID: 4430, QN: 54/54, ET: 0) ***
Oct 7 00:15:04 ntop00 sfacctd[1075592]: INFO ( m1/mysql ): *** Purging cache - END (PID: 4430, QN: 2253/2253, ET: 3) ***
Oct 7 00:18:01 ntop00 sfacctd[1075592]: INFO ( p1/print ): *** Purging cache - START (PID: 4431) ***
Oct 7 00:18:01 ntop00 sfacctd[1075592]: INFO ( p1/print ): *** Purging cache - END (PID: 4431, QN: 2304/2304, ET: 0) ***
Oct 7 00:18:01 ntop00 nfacctd[1075699]: INFO ( p1/print ): *** Purging cache - START (PID: 4431) ***
Oct 7 00:18:01 ntop00 nfacctd[1075699]: INFO ( p1/print ): *** Purging cache - END (PID: 4431, QN: 53/53, ET: 0) ***
Oct 7 00:20:01 ntop00 sfacctd[1075592]: INFO ( m1/mysql ): *** Purging cache - START (PID: 4432) ***
Oct 7 00:20:01 ntop00 nfacctd[1075699]: INFO ( m1/mysql ): *** Purging cache - START (PID: 4432) ***
Oct 7 00:20:01 ntop00 nfacctd[1075699]: INFO ( m1/mysql ): *** Purging cache - END (PID: 4432, QN: 50/50, ET: 0) ***
Oct 7 00:20:04 ntop00 sfacctd[1075592]: INFO ( m1/mysql ): *** Purging cache - END (PID: 4432, QN: 2240/2240, ET: 3) ***
Oct 7 00:23:01 ntop00 sfacctd[1075592]: INFO ( p1/print ): *** Purging cache - START (PID: 4433) ***
Oct 7 00:23:01 ntop00 sfacctd[1075592]: INFO ( p1/print ): *** Purging cache - END (PID: 4433, QN: 2146/2146, ET: 0) ***
Oct 7 00:23:01 ntop00 nfacctd[1075699]: INFO ( p1/print ): *** Purging cache - START (PID: 4433) ***
... 66 more distinct messages not shown
== openrepo (1 distinct, 1 total) ==
Oct 7 00:34:27 openrepo (nin-node)[1119344]: munin-node.service: Referenced but unset environment variable evaluates to an empty string: DAEMON_ARGS
== openvox08-cmp2 (29 distinct, 369 total) ==
Oct 7 00:05:01 openvox08-cmp2 rsyslogd[983]: imjournal: open() failed for path: '/var/lib/rsyslog/imjournal.state.tmp': Input/output error [v8.2510.0-5.el10 try https://www.rsyslog.com/e/2433 ] [x335]
Oct 7 00:07:01 openvox08-cmp2 systemd[1]: plocate-updatedb.service: Failed to spawn 'start' task: Input/output error
Oct 7 00:28:56 openvox08-cmp2 sshd[3409265]: fatal: rexec of /usr/libexec/openssh/sshd-session failed: Input/output error [x3]
Oct 7 00:28:56 openvox08-cmp2 sshd[2602237]: error: ssh_msg_send: write: Broken pipe [x3]
Oct 7 00:28:56 openvox08-cmp2 sshd[2602237]: error: send_rexec_state: ssh_msg_send failed [x3]
Oct 7 00:28:56 openvox08-cmp2 rsyslogd[983]: file '/var/log/secure'[16] write error - see https://www.rsyslog.com/solving-rsyslog-write-errors/ for help OS error: Input/output error [v8.2510.0-5.el10 try https://www.rsyslog.com/e/2027 ]
Oct 7 00:28:56 openvox08-cmp2 rsyslogd[983]: file '/var/log/secure': open error: Input/output error [v8.2510.0-5.el10 try https://www.rsyslog.com/e/2433 ]
Oct 7 01:02:35 openvox08-cmp2 kernel: shpchp 0000:05:01.0: pci_hp_register failed with error -16
Oct 7 01:02:35 openvox08-cmp2 kernel: shpchp 0000:05:01.0: Slot initialization failed
Oct 7 01:02:35 openvox08-cmp2 kernel: shpchp 0000:05:02.0: pci_hp_register failed with error -16
Oct 7 01:02:35 openvox08-cmp2 kernel: shpchp 0000:05:02.0: Slot initialization failed
Oct 7 01:02:35 openvox08-cmp2 kernel: shpchp 0000:05:03.0: pci_hp_register failed with error -16
Oct 7 01:02:35 openvox08-cmp2 kernel: shpchp 0000:05:03.0: Slot initialization failed
Oct 7 01:02:35 openvox08-cmp2 kernel: shpchp 0000:05:04.0: pci_hp_register failed with error -16
Oct 7 01:02:35 openvox08-cmp2 kernel: shpchp 0000:05:04.0: Slot initialization failed
Oct 7 01:02:36 openvox08-cmp2 kernel: device-mapper: core: CONFIG_IMA_DISABLE_HTABLE is disabled. Duplicate IMA measurements will not be recorded in the IMA log.
Oct 7 01:02:36 openvox08-cmp2 kernel: sd 0:0:0:0: Power-on or device reset occurred
Oct 7 01:02:39 openvox08-cmp2 lvm[827]: PV /dev/sda3 online, VG rhel_openvox08-cmp00 is complete.
Oct 7 01:02:39 openvox08-cmp2 kernel: snd_hda_intel 0000:00:1b.0: no codecs found!
Oct 7 01:02:40 openvox08-cmp2 (lldpd)[936]: lldpd.service: Referenced but unset environment variable evaluates to an empty string: DAEMON_ARGS
Oct 7 01:02:42 openvox08-cmp2 kernel: block dm-0: the capability attribute has been deprecated.
Oct 7 01:02:50 openvox08-cmp2 irqbalance[909]: Cannot change IRQ 35 affinity: Permission denied
Oct 7 01:02:50 openvox08-cmp2 irqbalance[909]: IRQ 35 affinity is now unmanaged
Oct 7 01:02:50 openvox08-cmp2 irqbalance[909]: Cannot change IRQ 33 affinity: Permission denied
Oct 7 01:02:50 openvox08-cmp2 irqbalance[909]: IRQ 33 affinity is now unmanaged
Oct 7 01:02:50 openvox08-cmp2 irqbalance[909]: Cannot change IRQ 36 affinity: Permission denied
Oct 7 01:02:50 openvox08-cmp2 irqbalance[909]: IRQ 36 affinity is now unmanaged
Oct 7 01:04:40 openvox08-cmp2 irqbalance[909]: Cannot change IRQ 34 affinity: Permission denied
Oct 7 01:04:40 openvox08-cmp2 irqbalance[909]: IRQ 34 affinity is now unmanaged
== outbound00.cs.umd.edu (1 distinct, 6 total) ==
Oct 7 00:09:09 outbound00.cs.umd.edu python3[108795]: ldapdb [x6]
== outbound01.cs.umd.edu (1 distinct, 6 total) ==
Oct 7 00:13:07 outbound01.cs.umd.edu python3[1569587]: ldapdb [x6]
== portal (1 distinct, 80 total) ==
Oct 7 00:05:04 portal setroubleshoot[1636763]: SELinux is preventing /usr/local/bin/traefik from connectto access on the unix_stream_socket /run/podman/podman.sock. For complete SELinux messages run: sealert -l e0a307a3-2c22-4320-8f9d-6a166c45222d [x80]
== sebatinsky.cs.umd.edu (1 distinct, 1 total) ==
Oct 7 00:25:33 sebatinsky.cs.umd.edu kernel: hpet1: lost 12 rtc interrupts
== soul (2 distinct, 2 total) ==
Oct 7 00:45:25 soul krb5_child[3381284]: Client 'admin(a)UMD.EDU' not found in Kerberos database
Oct 7 00:45:46 soul sshd-session[3381424]: error: Protocol major versions differ: 2 vs. 1
== splunkforwarder.cs.umd.edu (38 distinct, 38 total) ==
Oct 7 00:50:15 splunkforwarder.cs.umd.edu kernel: ACPI: RSDP 00000000000f52b0 00014 (v00 BOCHS )
Oct 7 00:50:15 splunkforwarder.cs.umd.edu kernel: ACPI: RSDT 000000007ffe3b52 00034 (v01 BOCHS BXPC 00000001 BXPC 00000001)
Oct 7 00:50:15 splunkforwarder.cs.umd.edu kernel: ACPI: FACP 000000007ffe396c 00074 (v01 BOCHS BXPC 00000001 BXPC 00000001)
Oct 7 00:50:15 splunkforwarder.cs.umd.edu kernel: ACPI: DSDT 000000007ffdf040 0492C (v01 BOCHS BXPC 00000001 BXPC 00000001)
Oct 7 00:50:15 splunkforwarder.cs.umd.edu kernel: ACPI: FACS 000000007ffdf000 00040
Oct 7 00:50:15 splunkforwarder.cs.umd.edu kernel: ACPI: APIC 000000007ffe39e0 00080 (v03 BOCHS BXPC 00000001 BXPC 00000001)
Oct 7 00:50:15 splunkforwarder.cs.umd.edu kernel: ACPI: SSDT 000000007ffe3a60 000CA (v01 BOCHS VMGENID 00000001 BXPC 00000001)
Oct 7 00:50:15 splunkforwarder.cs.umd.edu kernel: ACPI: WAET 000000007ffe3b2a 00028 (v01 BOCHS BXPC 00000001 BXPC 00000001)
Oct 7 00:50:15 splunkforwarder.cs.umd.edu kernel: Zone ranges:
Oct 7 00:50:15 splunkforwarder.cs.umd.edu kernel: DMA [mem 0x00001000-0x00ffffff]
Oct 7 00:50:15 splunkforwarder.cs.umd.edu kernel: DMA32 [mem 0x01000000-0xffffffff]
Oct 7 00:50:15 splunkforwarder.cs.umd.edu kernel: Normal empty
Oct 7 00:50:15 splunkforwarder.cs.umd.edu kernel: Movable zone start for each node
Oct 7 00:50:15 splunkforwarder.cs.umd.edu kernel: Early memory node ranges
Oct 7 00:50:15 splunkforwarder.cs.umd.edu kernel: node 0: [mem 0x00001000-0x0009efff]
Oct 7 00:50:15 splunkforwarder.cs.umd.edu kernel: node 0: [mem 0x00100000-0x7ffd9fff]
Oct 7 00:50:15 splunkforwarder.cs.umd.edu kernel: Built 1 zonelists in Node order, mobility grouping on. Total pages: 515939
Oct 7 00:50:15 splunkforwarder.cs.umd.edu kernel: Policy zone: DMA32
Oct 7 00:50:15 splunkforwarder.cs.umd.edu kernel: ACPI: All ACPI Tables successfully acquired
Oct 7 00:50:15 splunkforwarder.cs.umd.edu kernel: ACPI: Enabled 3 GPEs in block 00 to 0F
Oct 7 00:50:15 splunkforwarder.cs.umd.edu kernel: acpi PNP0A03:00: fail to add MMCONFIG information, can't access extended PCI configuration space under this bridge.
Oct 7 00:50:15 splunkforwarder.cs.umd.edu kernel: ACPI: PCI Interrupt Link [LNKD] enabled at IRQ 11
Oct 7 00:50:15 splunkforwarder.cs.umd.edu kernel: Dquot-cache hash table entries: 512 (order 0, 4096 bytes)
Oct 7 00:50:16 splunkforwarder.cs.umd.edu kernel: ACPI: PCI Interrupt Link [LNKC] enabled at IRQ 10
Oct 7 00:50:16 splunkforwarder.cs.umd.edu kernel: ACPI: PCI Interrupt Link [LNKB] enabled at IRQ 10
Oct 7 00:50:16 splunkforwarder.cs.umd.edu kernel: ACPI: PCI Interrupt Link [LNKA] enabled at IRQ 11
Oct 7 00:50:22 splunkforwarder.cs.umd.edu systemd[1]: [/usr/lib/systemd/system/lldpd.service:16] Unknown lvalue 'ProtectKernelTunables' in section 'Service'
Oct 7 00:50:22 splunkforwarder.cs.umd.edu systemd[1]: [/usr/lib/systemd/system/lldpd.service:17] Unknown lvalue 'ProtectControlGroups' in section 'Service'
Oct 7 00:50:22 splunkforwarder.cs.umd.edu systemd[1]: [/usr/lib/systemd/system/lldpd.service:18] Unknown lvalue 'ProtectKernelModules' in section 'Service'
Oct 7 00:50:22 splunkforwarder.cs.umd.edu systemd[1]: Cannot add dependency job for unit mcollective.service, ignoring: Unit not found.
... 8 more distinct messages not shown
== strawberry (8 distinct, 39 total) ==
Oct 7 00:07:04 strawberry kernel: I/O error, dev sda, sector 206848 op 0x0:(READ) flags 0x80700 phys_seg 1 prio class 2 [x6]
Oct 7 00:07:04 strawberry kernel: I/O error, dev sda, sector 206848 op 0x0:(READ) flags 0x0 phys_seg 1 prio class 2 [x6]
Oct 7 00:07:04 strawberry kernel: Buffer I/O error on dev sda2, logical block 0, async page read [x6]
Oct 7 00:07:04 strawberry kernel: I/O error, dev sda, sector 2048 op 0x0:(READ) flags 0x80700 phys_seg 1 prio class 2 [x6]
Oct 7 00:07:04 strawberry kernel: I/O error, dev sda, sector 2048 op 0x0:(READ) flags 0x0 phys_seg 1 prio class 2 [x6]
Oct 7 00:07:04 strawberry kernel: Buffer I/O error on dev sda1, logical block 0, async page read [x6]
Oct 7 00:34:42 strawberry smartd[5314]: Device: /dev/sda [SAT], failed to read SMART Attribute Data [x2]
Oct 7 01:04:42 strawberry smartd[5314]: Device: /dev/sda [SAT], not capable of Offline or Self-Testing.
== submit10-cln25 (6 distinct, 1543 total) ==
Oct 7 00:05:22 submit10-cln25 rsyslogd: imjournal: fopen() failed for path: '/var/lib/rsyslog/imjournal.state.tmp': Input/output error [v8.24.0-57.el7_9.3 try http://www.rsyslog.com/e/2013 ] [x336]
Oct 7 00:05:22 submit10-cln25 rsyslogd: file '/var/log/messages': open error: Input/output error [v8.24.0-57.el7_9.3 try http://www.rsyslog.com/e/2433 ] [x1200]
Oct 7 00:08:00 submit10-cln25 systemd: Failed at step USER spawning /usr/libexec/pcp/bin/pmie_daily: Input/output error
Oct 7 00:10:00 submit10-cln25 systemd: Failed at step USER spawning /usr/libexec/pcp/bin/pmlogger_daily: Input/output error [x2]
Oct 7 00:25:00 submit10-cln25 systemd: Failed at step USER spawning /usr/libexec/pcp/bin/pmlogger_check: Input/output error [x2]
Oct 7 00:28:00 submit10-cln25 systemd: Failed at step USER spawning /usr/libexec/pcp/bin/pmie_check: Input/output error [x2]
== submit26-b9-f2 (1 distinct, 1 total) ==
Oct 7 00:23:12 submit26-b9-f2 systemd[1]: user(a)1001.service: Main process exited, code=killed, status=9/KILL
== submit26-b9-f3 (1 distinct, 1 total) ==
Oct 7 00:23:09 submit26-b9-f3 systemd[1]: user(a)1001.service: Main process exited, code=killed, status=9/KILL
== submit26-b9-f4 (1 distinct, 1 total) ==
Oct 7 00:15:07 submit26-b9-f4 systemd[1]: user(a)1001.service: Main process exited, code=killed, status=9/KILL
== submit26-b9-fclone (10 distinct, 14 total) ==
Oct 7 00:22:04 submit26-b9-fclone setroubleshoot[1142171]: SELinux is preventing /usr/bin/python3.9 from create access on the directory /(null). For complete SELinux messages run: sealert -l 9355d9d9-a311-48d2-bd37-6c0f6947dfff [x2]
Oct 7 00:22:04 submit26-b9-fclone setroubleshoot[1142171]: SELinux is preventing /usr/bin/python3.9 from add_name access on the directory /(null). For complete SELinux messages run: sealert -l cc4658d7-9db1-405d-9eee-de0ccee5857f [x2]
Oct 7 00:22:04 submit26-b9-fclone setroubleshoot[1142171]: SELinux is preventing /usr/bin/python3.9 from create access on the file /(null). For complete SELinux messages run: sealert -l 568a2429-0b1b-49df-af41-49b5cd298ae8
Oct 7 00:22:04 submit26-b9-fclone setroubleshoot[1142171]: SELinux is preventing /usr/bin/python3.9 from open access on the file /tmp/libdnf.dj5n8b/repodata/repomd.xml. For complete SELinux messages run: sealert -l 03e2f521-0e7c-481f-8e92-0602c6adeedc
Oct 7 00:22:04 submit26-b9-fclone setroubleshoot[1142171]: SELinux is preventing /usr/bin/python3.9 from setattr access on the file repomd.xml. For complete SELinux messages run: sealert -l 0d6b7b1f-ebe3-4beb-915a-b06b63bf2566
Oct 7 00:22:04 submit26-b9-fclone setroubleshoot[1142171]: SELinux is preventing /usr/bin/python3.9 from read access on the directory libdnf.dj5n8b. For complete SELinux messages run: sealert -l 887adbf9-2bb9-4009-b800-36ddf9ba0db5
Oct 7 00:22:04 submit26-b9-fclone setroubleshoot[1142171]: SELinux is preventing /usr/bin/python3.9 from remove_name access on the directory repomd.xml. For complete SELinux messages run: sealert -l 092e0644-8373-4017-b77f-1afa6c6da4ac [x2]
Oct 7 00:22:04 submit26-b9-fclone setroubleshoot[1142171]: SELinux is preventing /usr/bin/python3.9 from unlink access on the file repomd.xml. For complete SELinux messages run: sealert -l ce429a92-56de-4de1-b859-cbfb69ae123c
Oct 7 00:22:04 submit26-b9-fclone setroubleshoot[1142171]: SELinux is preventing /usr/bin/python3.9 from rmdir access on the directory repodata. For complete SELinux messages run: sealert -l 99b886eb-497b-406d-8206-afe76a1086b4 [x2]
Oct 7 00:22:04 submit26-b9-fclone setroubleshoot[1142171]: SELinux is preventing /usr/bin/python3.9 from read access on the directory libdnf.GJa92o. For complete SELinux messages run: sealert -l 887adbf9-2bb9-4009-b800-36ddf9ba0db5
== tma-0 (3 distinct, 4 total) ==
Oct 7 00:10:13 tma-0 systemd[1]: New main PID 7511 does not belong to service, and PID file is not owned by root. Refusing. [x2]
Oct 7 00:10:31 tma-0 systemd[1]: Daemon never wrote its PID file. Failing.
Oct 7 00:10:38 tma-0 systemd[1]: pmlogger.service: Supervising process 15130 which is not our child. We'll most likely not notice when it exits.
== uffish.cs.umd.edu (3 distinct, 4 total) ==
Oct 7 00:10:14 uffish.cs.umd.edu systemd[1]: New main PID 2729860 does not belong to service, and PID file is not owned by root. Refusing. [x2]
Oct 7 00:10:41 uffish.cs.umd.edu systemd[1]: Daemon never wrote its PID file. Failing.
Oct 7 00:10:56 uffish.cs.umd.edu systemd[1]: pmlogger.service: Supervising process 2737556 which is not our child. We'll most likely not notice when it exits.
== vacuum.cs.umd.edu (3 distinct, 4 total) ==
Oct 7 00:10:14 vacuum.cs.umd.edu systemd[1]: New main PID 20171 does not belong to service, and PID file is not owned by root. Refusing. [x2]
Oct 7 00:10:33 vacuum.cs.umd.edu systemd[1]: Daemon never wrote its PID file. Failing.
Oct 7 00:10:44 vacuum.cs.umd.edu systemd[1]: pmlogger.service: Supervising process 27283 which is not our child. We'll most likely not notice when it exits.
== whiffle.cs.umd.edu (3 distinct, 4 total) ==
Oct 7 00:10:12 whiffle.cs.umd.edu systemd[1]: New main PID 2213002 does not belong to service, and PID file is not owned by root. Refusing. [x2]
Oct 7 00:10:38 whiffle.cs.umd.edu systemd[1]: Daemon never wrote its PID file. Failing.
Oct 7 00:10:51 whiffle.cs.umd.edu systemd[1]: pmlogger.service: Supervising process 2220703 which is not our child. We'll most likely not notice when it exits.
1
0